##TITLE=1H_DE-80H_X3
 200.13MHz, d2o
 8 sc
 
 19ns.26.2.2025
##JCAMPDX= 6.0         $$ Bruker NMR JCAMP-DX V2.0
##DATA TYPE= NMR FID
##DATA CLASS= NTUPLES
##ORIGIN= UXNMR, Bruker Analytische Messtechnik GmbH
##OWNER= pz
$$ XWIN-NMR		Version 3.5
$$ Fri Feb 28 14:00:47 2025 Russian Standard Time (UT+4h)  new_Human@DPX200
##.OBSERVE FREQUENCY= 200.1313
##.OBSERVE NUCLEUS= ^1H
##.DELAY= (6, 6)
##.ACQUISITION MODE= SIMULTANEOUS
##.ACQUISITION SCHEME= undefined
##.AVERAGES= 8
##.DIGITISER RES= 18
##SPECTROMETER/DATA SYSTEM= spect
##.PULSE SEQUENCE= zg30
##.SOLVENT NAME= CDCl3
##.SHIFT REFERENCE= (INTERNAL, CDCl3, 0, 14.3821)
##AUDIT TRAIL= $$ (NUMBER, WHEN, WHO, WHERE, WHAT)
$$ ##TITLE= Audit trail, XWIN-NMR		Version 3.5
$$ ##JCAMPDX= 5.01
$$ ##ORIGIN= Bruker BioSpin GmbH
$$ ##OWNER= new_Human
$$ C:/Bruker/XWIN-NMR/data/yarkov/nmr/H-C/1/audita.txt
$$ ##AUDIT TRAIL=  $$ (NUMBER, WHEN, WHO, WHERE, WHAT)
(   1,<2025-02-28 13:59:06.23 +0400>,<new_Human>,<DPX200>,
      <created by zg, POWCHK disabled, PULCHK disabled
       configuration hash MD5:
       00 E9 B6 7A A2 85 ED C7 34 08 36 98 17 FE 4E 26
       data hash MD5: 16K
       D1 E1 16 6A 7E 19 19 C1 4A 19 59 38 E6 32 FF 96>)
$$ ##END=
$$ 
$$ hash MD5
$$ A9 DE 0C 03 39 B5 AC 01 C0 AA E4 CD 8A 1A F2 2C
##$RELAX= 
##$RELAX= 
##$RELAX= 
##$RELAX= 
##$RELAX= 
##$RELAX= 
$$ Bruker specific parameters
$$ --------------------------
##$DU= <C:/Bruker/XWIN-NMR>
##$EXPNO= 1
##$NAME= <H-C>
##$PROCNO= 1
##$TYPE= <nmr>
##$USER= <yarkov>
##$AMP= (0..31)
100 100 100 100 100 100 100 100 100 100 100 100 100 100 100 100 100 100 
100 100 100 100 100 100 100 100 100 100 100 100 100 100 
##$AQSEQ= 0
##$AQ_mod= 1
##$AUNM= <au_zg>
##$AUTOPOS= <>
##$BF1= 200.13
##$BF2= 200.13
##$BF3= 200.13
##$BF4= 200.13
##$BF5= 200.13
##$BF6= 200.13
##$BF7= 200.13
##$BF8= 200.13
##$BYTORDA= 1
##$CFDGTYP= 0
##$CFRGTYP= 5
##$CHEMSTR= <none>
##$CNST= (0..31)
1 1 145 1 1 1 1 1 1 1 1 1 1 1 1 1 1 1 1 1 1 1 1 1 1 1 1 1 1 1 1 1 
##$CPDPRG= <>
##$CPDPRG1= <>
##$CPDPRG2= <>
##$CPDPRG3= <>
##$CPDPRG4= <mlev>
##$CPDPRG5= <mlev>
##$CPDPRG6= <mlev>
##$CPDPRG7= <mlev>
##$CPDPRG8= <mlev>
##$CPDPRGB= <>
##$CPDPRGT= <>
##$D= (0..31)
0 0.7 0 0 0 0 0 0 0 0 0 0.03 0 0 0 0 0 0 0 0 0 0 0 0 0 0 0 0 0 0 0 0 
##$DATE= 1740736745
##$DBL= (0..7)
120 120 120 120 120 120 120 120 
##$DBP= (0..7)
150 150 150 150 150 150 150 150 
##$DBP07= 0
##$DBPNAM0= <>
##$DBPNAM1= <>
##$DBPNAM2= <>
##$DBPNAM3= <>
##$DBPNAM4= <>
##$DBPNAM5= <>
##$DBPNAM6= <>
##$DBPNAM7= <>
##$DBPOAL= (0..7)
0.5 0.5 0.5 0.5 0.5 0.5 0.5 0.5 
##$DBPOFFS= (0..7)
0 0 0 0 0 0 0 0 
##$DE= 6
##$DECBNUC= <off>
##$DECIM= 32
##$DECNUC= <off>
##$DECSTAT= 4
##$DIGMOD= 1
##$DIGTYP= 9
##$DL= (0..7)
0 120 120 120 120 120 120 120 
##$DP= (0..7)
150 150 150 150 150 150 150 150 
##$DP07= 0
##$DPNAME0= <>
##$DPNAME1= <>
##$DPNAME2= <>
##$DPNAME3= <>
##$DPNAME4= <>
##$DPNAME5= <>
##$DPNAME6= <>
##$DPNAME7= <>
##$DPOAL= (0..7)
0.5 0.5 0.5 0.5 0.5 0.5 0.5 0.5 
##$DPOFFS= (0..7)
0 0 0 0 0 0 0 0 
##$DQDMODE= 0
##$DR= 18
$$ [...]
##$SUBNAM0= <"">
##$SUBNAM1= <"">
##$SUBNAM2= <"">
##$SUBNAM3= <"">
##$SUBNAM4= <"">
##$SUBNAM5= <"">
##$SUBNAM6= <"">
##$SUBNAM7= <"">
##$SUBNAM8= <"">
##$SUBNAM9= <"">
##$SW= 18.0517328524113
##$SWIBOX= (0..15)
0 0 2 0 0 0 0 0 0 0 0 0 0 0 0 0 
##$SW_h= 3612.71676300578
##$TD= 16384
##$TD0= 1
##$TE= 0
##$TE2= 300
##$TE3= 300
##$TEG= 300
##$TL= (0..7)
0 120 120 120 120 120 120 120 
##$TP= (0..7)
150 150 150 150 150 150 150 150 
##$TP07= 0
##$TPNAME0= <>
##$TPNAME1= <>
##$TPNAME2= <>
##$TPNAME3= <>
##$TPNAME4= <>
##$TPNAME5= <>
##$TPNAME6= <>
##$TPNAME7= <>
##$TPOAL= (0..7)
0.5 0.5 0.5 0.5 0.5 0.5 0.5 0.5 
##$TPOFFS= (0..7)
0 0 0 0 0 0 0 0 
##$TUNHIN= 0
##$TUNHOUT= 0
##$TUNXOUT= 0
##$USERA1= <user>
##$USERA2= <user>
##$USERA3= <user>
##$USERA4= <user>
##$USERA5= <user>
##$V9= 5
##$VALIST= <valist>
##$VCLIST= <CCCCCCCCCCCCCCC>
##$VD= 0
##$VDLIST= <DDDDDDDDDDDDDDD>
##$VPLIST= <PPPPPPPPPPPPPPP>
##$VTLIST= <TTTTTTTTTTTTTTT>
##$WBST= 1024
##$WBSW= 4
##$XGAIN= (0..3)
0 0 0 0 
##$XL= 0
##$YL= 0
##$YMAX_a= 312797
##$YMIN_a= -346052
##$ZGOPTNS= <>
##$ZL1= 120
##$ZL2= 120
##$ZL3= 120
##$ZL4= 120
##$ABSF1= 10
##$ABSF2= 0
##$ABSG= 5
##$ABSL= 3
##$ALPHA= 0
##$AQORDER= 0
##$ASSFAC= 0
##$ASSFACI= 0
##$ASSFACX= 0
##$ASSWID= 0
##$AUNMP= <proc_1d>
##$AZFE= 0.1
##$AZFW= 0.1
##$BCFW= 1
##$BC_mod= 2
##$BYTORDP= 1
##$COROFFS= 0
##$CY= -3
##$DATMOD= 1
##$DC= 2
##$DFILT= <>
##$DTYPP= 0
##$F1P= 0
##$F2P= 0
##$FCOR= 0.5
##$FTSIZE= 0
##$FT_mod= 4
##$GAMMA= 1
##$GB= 0.15
##$INTBC= 1
##$INTSCL= 1
##$ISEN= 128
##$LB= 0.25
##$LEV0= 0
##$LPBIN= 0
##$MAXI= 10000
##$MC2= 0
##$MEAN= 0
##$ME_mod= 0
##$MI= 1.114404
##$NCOEF= 0
##$NC_proc= 0
##$NLEV= 6
##$NOISF1= 3.799351
##$NOISF2= 2.8
##$NSP= 1
##$NTH_PI= 0
##$NZP= 0
##$OFFSET= 14.38212
##$PC= 1
##$PHC0= -1340.846
##$PHC1= 11.39223
##$PH_mod= 1
##$PKNL= yes
##$PPARMOD= 0
##$PSCAL= 0
##$PSIGN= 0
##$REVERSE= no
##$SF= 200.129724274929
##$SI= 16384
##$SIGF1= 3
##$SIGF2= 2
##$SINO= 400
##$SIOLD= 16384
##$SREGLST= <1H.CDCl3>
##$SSB= 0
##$STSI= 0
##$STSR= 0
##$SW_p= 3205.1282051282
##$SYMM= 0
##$S_DEV= 0
##$TDeff= 0
##$TDoff= 0
##$TI= <>
##$TILT= no
##$TM1= 0
##$TM2= 0
##$TOPLEV= 0
##$USERP1= <user>
##$USERP2= <user>
##$USERP3= <user>
##$USERP4= <user>
##$USERP5= <user>
##$WDW= 1
##$XDIM= 8192
##$YMAX_p= 0
##$YMIN_p= 0
$$ End of Bruker specific parameters
$$ ---------------------------------
##NTUPLES= NMR FID
##VAR_NAME=  TIME,          FID/REAL,        FID/IMAG
##SYMBOL=    X,             R,               I
##VAR_TYPE=  INDEPENDENT,   DEPENDENT,       DEPENDENT
##VAR_FORM=  AFFN,          ASDF,            ASDF
##VAR_DIM=   8192,          8192,            8192
##UNITS=     SECONDS,       ARBITRARY UNITS, ARBITRARY UNITS
##FACTOR=    0.0002768,     1,               1
##FIRST=     0,             0,               0
##LAST=      2.2672688,     0,               0
##MIN=       0,             -346052,         0
##MAX=       2.2672688,     312797,          0
$$ Real data points
##PAGE= N=1
##DATA TABLE= (X++(R..R)), XYDATA
$$ plain form
0 0 0 0 0 0 0 0 0 0 0 0 0 0 0 0 4 -8 8 -8 8 -13 16 -16 24 -24 32 -36 40 -48 56 -64 76 -86 100 -110 125 -142
36 -142 162 -179 202 -226 252 -282 313 -348 384 -425 470 -520 571 -631 693 -766 842 -928 1022
55 1022 -1130 1247 -1380 1535 -1712 1918 -2161 2450 -2807 3250 -3817 4536 -5405 5849 -649
70 -649 310750 -18534 -341460 131983 118456 -326352 -86390 281747 -83527 -257070 104533
81 104533 97146 -171546 29677 196349 -69230 -139022 106598 94439 -59990 16943 86691
92 86691 -67404 -98347 90904 91653 -97702 -44496 85386 -54333 -89881 150321 95912
103 95912 -173040 -19979 194389 -46453 -104048 207575 66858 -256356 40974 253582
113 253582 -129164 -153792 194819 -14769 -271708 90902 203475 -194463 -146765 169145
$$ packed form
0@%%%%%%%%%%%%%%Mj2J6j6J6k1K9l2M0m8N6o8P6q8J04j20J40j62J86k10K35k67
36a42L04l41L81m28M78n34N95o61P32q09Q95r90J091j202J324j459J608j770J950
55A022k152K377k627K915l247L630m079M611n257O057p067Q353r941J1254o498
70f49L11399l29284l22926M73443j3527m44808K39962L68137l65274j73543L61603
81A04533p387k68692K01223J66672k65579o9792K45620j2159j54429P6933O9748
92H6691j54095l0943J89251P49j89355N3206J29882j39719l5548K40202n4409
103I5912k68952J53061K14368k40842n7595L11623j40717l23214K97330K12608
113B53582l82746k4628L48611k09588k56939L62610J12573l97938M7698L15910
$$ plain form
123 169145 -20694 -174565 122825 133008 -164423 -61700 159234 13538 -73847 83716
133 83716 55443 -101862 -19361 113010 10930 -84333 7844 25836 -77006 -22921 88976
144 88976 -19049 -120288 17614 72335 -67040 -19188 119125 -31753 -127772 100141 118430
155 118430 -107401 -9660 143835 -66301 -112857 150099 81031 -159868 -3255 132243
165 132243 -85870 -84189 144686 20338 -160481 29967 113443 -75422 -43679 102522 -15387
176 -15387 -105569 45728 80338 -58192 -42470 52827 -15322 -68888 32755 50475 -60959
187 -60959 -52567 42677 7012 -55897 21035 53323 -57494 -45693 82641 26588 -69409 37836
199 37836 69859 -66431 -20557 111459 2500 -86564 53673 63374 -81140 -7770 101923
$$ packed form
123A69145j89839j53871K97390J0183k97431J02723K20934j45696q7385J57563
133H3716k8273j57305Q2501J32371j02080r5263R2177J7992j02842N4085J11897
144H8976j08025j01239J37902N4721j39375M7852J38313j50878r6019K27913J8289
155A18430k25831R7741J53495k10136m6556K62956o9068k40899J56613J35498
165A32243k18113J681K28875j24348j80819J90448Q3476j88865L1743J46201j17909
176a5387r0182J51297L4610j38530J5722R5297o8149n3566J01643J7720j11434
187f0959Q392R5244l5665o2909P6932L2288j10817J1801J28334n6053r5997J07245
199C7836L2023j36290M5874J32016j08959q9064J40237R701j44514P3370J09693
$$ plain form
210 101923 -39531 -89924 67780 39004 -88815 6479 72040 -58960 -59389 68687 18712
221 18712 -72940 11400 51312 -46824 -32593 60433 7815 -58243 13260 42458 -30209 -22825
233 -22825 44280 8396 -49097 8740 48216 -24718 -31852 44886 11774 -52768 15493 52136
245 52136 -34786 -33541 51525 8439 -56481 22416 49424 -48331 -27491 60416 -5726 -56859
257 -56859 34581 35641 -54203 -10024 55490 -17689 -45111 38214 24456 -49244 1004 47926
269 47926 -23550 -33204 39138 13795 -41551 6269 36185 -20869 -25020 31331 11391 -36853
281 -36853 3650 34529 -19221 -25242 29699 9719 -35348 5227 33176 -19265 -25746 29658
293 29658 11116 -36368 7531 35030 -25438 -23541 36569 5853 -36237 14668 29543 -28585
$$ packed form
210A01923j41454n0393J57704k8776j27819R5294O5561j31000m29J28076m9975
221A8712r1652Q4340L9912r8136J4231R3026n2618o6058P1503K9198p2667P384
233b2825O7105l5884n7493N7837L9476p2934p134P6738l3112o4542O8261L6643
245E2136q6922J245Q5066m3086o4920P8897K7008r7755K0840Q7907o6142n1133
257e6859R1440J060q9844M4179O5514p3179k7422Q3325j3758p3700N0248M6922
269D7926p1476r654P2342k5343n5346M7820K9916n7054m151N6351j9940m8244
281c6853M0503L0879n3750o021N4941j9980m5067M0575K7949n2441o481N5404
293B9658j8542m7484M3899K7499o0468J897O0110l0716m2090N0905J4875n8128
$$ plain form
305 -28585 -15042 37510 -98 -34989 18111 24286 -31877 -7875 35275 -10899 -31092 20664
317 20664 14990 -29275 -2618 27244 -12947 -24650 21555 14199 -25743 941 26447 -11405
329 -11405 -16459 23551 11928 -21550 1897 23650 -8744 -16779 19714 9352 -26011 -81
341 -81 22457 -14563 -19017 18358 3862 -26467 2736 21099 -15939 -16743 22153 4494 -24791
354 -24791 10132 22204 -18481 -8939 25695 -307 -20277 13609 16340 -18163 -5005 22617
366 22617 -4039 -19141 14153 12253 -18615 -1652 18497 -7096 -14185 12864 8650 -15987 -3357
379 -3357 14968 -6045 -15380 10408 6512 -19578 -4183 14448 -7964 -15135 9761 5220 -18021
392 -18021 -796 18601 -6769 -13857 16050 8100 -15366 8592 20769 -9661 -7687 19850 6002
$$ packed form
305b8585J3543N2552l7608l4891N3100O175n6163K4002M3150m6174k0193N1756
317B0664n674m4265K6657K9862m0191j1703M6205p356l9942K6684K5506l7852
329a1405n054M0010j1623l3478K3447K1753l2394q035L6493j0362l5363K5930
341h1K2538l7020m454L7375j4496l0329K9203J8363l7038q04L8896j7659k9285
354b4791L4923J2072m0685R542L4634k6002j9970L3886K731l4503J3158K7622
366B2617k6656j5102L3294j900l0868J6963K0149k5593p089K7049m214k4637J2630
379c357J8325k1013r335K5788l896k6090J5395J8631k2412p171K4896m541k3241
392a8021J7225J9397k5370p088K9907p950k3466K3958J2177l0430J974K7537j3848
$$ plain form
405 6002 -12242 9777 14444 -13389 -6481 18194 20 -15439 6145 5501 -15663 -3788 11838
418 11838 -5504 -15593 1332 4396 -10667 -4315 9730 -5096 -15000 5187 9765 -7805 -3113
431 -3113 10181 -2807 -10308 10706 13553 -10029 -4726 13793 -2537 -9252 15060 7776 -17365
444 -17365 -1161 14690 -5274 -7115 12653 322 -17228 4531 15629 -7278 -6475 10524 -2947
457 -2947 -10506 10181 10286 -9284 -6198 5581 -321 -4879 4895 4527 -10056 -7623 7598 4315
471 4315 -5054 1224 3912 -6284 -3129 12740 6813 -9893 -526 8528 -6367 -2546 13977 -3716
485 -3716 -18766 2225 6307 -12267 -3898 7296 -12944 -16652 9528 7221 -12277 502 9084
498 9084 -8385 -1069 19530 6934 -6348 6178 9801 1109 6042 12312 1429 -7252 1291 7184
$$ packed form
405F002j8244K2019M667k7833O908K4675j8174j5459K1584o44k1164J1875J5626
418A1838j7342j0089J6925L064j5063O352J4045j4826r904K0187M578j7570M692
431c113J3294j2988p501K1014K847k3582N303J8519j6330o715K4312p284k5141
444a7365J6204J5851j9964j841J9768j2331j7550K1759J1098k2907Q03J6999j3471
457b947p559K0687J05j9570L086J1779n902m558R774l68j4583K433J5221l283
471D315r369O278K688j0196L155J5869n927j6706R367R054j4895L821J6523j7693
485c716j5050K0991M082j8574Q369J1194k0240l708K6180k307j9498J2779Q582
498I084j7469P316K0599j2596j3282J2526L623q692M933O270j0883q681Q543N893
$$ plain form
512 7184 523 -2649 -430 -3998 -8023 -1348 6758 -999 -10625 -1697 2949 -6278 1223 10015 -7745
527 -7745 -12843 6362 3405 -9924 1455 3639 -16052 -9770 11215 -1271 -13482 3643 2212
540 2212 -13055 4292 17085 -2855 -5122 11345 6137 104 12590 12256 -2677 -1329 8781
553 8781 5170 -135 2237 -999 -6944 -4553 489 875 -5051 -9037 -2959 -805 -4975 2016 5426
568 5426 -7331 -5845 8624 3309 -4060 6275 4059 -10272 -483 11905 -3626 -9058 5553
581 5553 -2499 -13062 5351 7945 -11902 -5244 7643 -3767 -4181 10378 3649 -8083 2209
594 2209 8859 -307 808 6705 -1294 -4671 3098 3265 -1180 -1690 -2803 -1934 -770 -1596 1792 1555
610 1555 -5103 -1214 6427 1129 -1237 6439 2780 -5217 4269 9558 -3623 -3191 7311 -3144 -8721
$$ packed form
512G184o661l172K219l568m025O675Q106p757r626Q928M646r227P501Q792j7760
527g745n098J9205k957j3329J1379K184j9691O282K0985j2486j2211J7125j431
540B212j5267J7347J2793j9940k267J6467n208o033J2486l34j4933J348J0110
553H781l611n305K372l236n945K391N042L86n926l986O078K154m170O991L410
568E426j2757J486J4469n315p369J0335k216j4331R789J2388j5531n432J4611
581E553q052j0563J8413K594j9847O658J2887j1410m14J4559o729j1732J0292
594B209O650r166J115N897p999l377P769J67m445n10j113Q69J164q26L388k37
610A555o658L889P641n298k366P676l659p997R486N289j3181M32J0502j0455n577
$$ plain form
625 -8721 6371 1955 -12633 -2074 3886 -9329 -5532 6048 -3905 -9827 3265 3649 -6128 1119
639 1119 6747 -3372 -1961 7337 2113 -1642 3962 2360 -1111 1797 2259 734 277 -797 477
654 477 1702 -979 -590 2797 69 -2892 2838 3622 -3983 74 6115 -3130 -4167 6298 -60 -7501
670 -7501 3306 3192 -8196 -2026 5084 -4932 -5984 4546 -454 -7930 2012 4544 -5466 -842
684 -842 5958 -2246 -2420 5987 2021 -2386 2554 2557 -1233 1008 2776 -42 -1434 -122 22 -14 -79 -1169
702 -1169 -544 -694 -2407 973 2901 -2921 -1787 3788 -1234 -2325 5409 1544 -5334 1469 4577 -3006
718 -3006 -1068 5014 -2319 -6004 3657 2937 -5443 77 3132 -5194 -2159 5469 -435 -3843 1876
733 1876 863 -2518 1858 3700 -1548 -2164 1669 775 -392 1812 359 -2193 -681 484 1090 1051
$$ packed form
625h721J5092m416j4588J0559N960j3215L797J1580r953n922J3092L84r777P247
639A119N628j0119J411R298n224l755N604j602l471K908M62j525m57j074J274
654D77J225k681L89L387k728k961N730P84p605M057O041r245j037J0465o358p441
670g501J0807j14j1388O170P110j0016j052J0530n000p476R942K532j0010M624
684h42O800q204j74Q407l966m407M940Ll790K241J768k818j392J312J44l6o5j090
702a169O25j50j713L380J928n822J134N575n022j091P734l865o878O803L108p583
718c006J938O082p333l685R661p20q380N520L055q326L035P628n904l408N719
733A876j013l381M376J842n248o16L833q94j167K204j453k552J512J165O06l9
$$ plain form
749 1051 -1618 -1203 721 -1080 398 3350 -1059 -3448 1624 2137 -1693 936 2718 -3338 -3199 4089
765 4089 1341 -3981 1247 1265 -5044 22 4929 -1923 -3193 2109 -57 -2231 2859 3081 -2597 -1461
781 -1461 2870 457 -356 2800 138 -2836 505 1838 92 136 -530 -1360 -722 -50 1036 607 -1960
798 -1960 -1682 438 302 -494 627 141 -2741 -1066 2901 192 -2220 1523 142 -3066 1976 3530
814 3530 -2039 -1169 2484 -242 -947 3162 1908 -2729 -305 2813 -587 -613 2358 -1070 -3030 1064
830 1064 1009 -1600 -473 -360 -1929 -1121 643 351 -1024 -1051 -186 -31 364 837 418 -127 -494 479 2049
849 2049 293 -524 1416 88 -1123 1980 1619 -1666 -33 1633 -745 -597 2003 230 -2344 486
865 486 1748 -1621 -723 1724 -1753 -2276 1387 -117 -2333 -102 27 -1891 -724 774 -537 -1243
$$ packed form
749A051k669M15J924j801J478K952m409k389N072N13l830K629J782o056J39P288
765D089k748n322N228J8o309N066M907o852j270N302k166k174N090K22n678J136
781a461M331k413q13L156k662k974L341J333j746M4o66q30O38O72J086m29k567
798a960K78K120j36p96J121m86k882J675L967k709k412L743j381l208N042J554
814C530n569Q70L653k726p05M109j254m637K424L118l400k6K971l428j960M094
830A064n5k609J127J13j569Q08J764k92j375k7Q65J55L95M73m19n45l67R73J570
849B049j756q17J940j328j211L103l61l285J633J666k378J48K600j773k574K830
865D86J262l369Q98K447l477n23L663j504k216K231J29j918J167J498j311p06
$$ plain form
881 -1243 342 466 -529 605 1161 -136 494 1057 693 1167 652 201 1122 356 -298 1163 255 -1152
899 -1152 250 692 -1130 -877 676 -594 -1754 576 657 -2050 -274 1549 -1291 -701 1854 -561
915 -561 -1479 1350 864 -955 370 1070 -729 -559 1396 303 -1084 556 361 -982 494 702 -876
932 -876 -214 70 -441 384 59 -683 -180 -361 -696 246 223 -947 -799 310 -168 -697 881 277 -1668
951 -1668 453 1686 -577 418 1951 -581 -331 2404 1238 -377 1120 1171 -631 557 2057 -264
967 -264 -1258 586 -341 -1404 596 -135 -2213 -1045 -510 -1305 -416 -454 -1505 -1142 -438 -407 -27 146 -679
986 -679 -731 637 563 -72 1103 398 -1066 1082 1845 -325 732 1514 -783 64 2283 656 -577 979
1004 979 650 -750 970 1825 -812 -916 1030 -392 -886 1281 -327 -2100 -181 -18 -1219 -136
$$ packed form
881a243J585J24r95J134N56j297O30N63l64M74n15m51R21p66o54J461r08j407
899a152J402M42j822K53J553j270j160K330Q1k707J776J823k840N90K555k415
915e61r18K829m86j819J325P00j799J70J955j093j387J640j95j343J476K08j578
932h76O62K84n11Q25l25p42N03j81l35R42k3j170J48J109m78n29J578o04j945
951a668K121J233k263R95J533k532K50K735j166j615J497N1j802J188J500k321
967b64r94J844r27j063K000p31k078J168N35p95Q89l8j051L63P04L1L80J73q25
986f79n2J368p4o35J175p05j464K148P63k170J057P82k297Q47K219j627j233J556
1004I79l29j400J720Q55k637j04J946j422m94K167j608j773J919J63j201J083
$$ plain form
1020 -136 -176 -1648 -968 63 -294 -377 145 -640 -847 795 594 -267 861 199 -1086 1005 1301 -748
1038 -748 310 848 -1146 -154 1557 -222 -1051 579 110 -1029 771 1253 -1233 -442 1341 -475 -384
1055 -384 1745 -131 -1296 1057 602 -664 754 499 -1001 -181 803 -225 -265 423 -438 -797 770
1072 770 184 -879 542 -43 -1267 545 579 -1246 -86 486 -1300 -322 990 -649 -1100 574 -71
1089 -71 -1200 630 830 -1297 -27 1433 -683 -228 1756 -254 -656 1450 582 -518 1006 845 -675
1106 -675 351 1022 -270 -249 883 -328 -709 760 -124 -1000 576 1 -1234 409 229 -1209 171
1123 171 418 -1193 -322 688 -687 -833 729 -74 -1228 566 675 -1128 239 1196 -988 -234 1493
1140 1493 -376 -577 1213 -6 -862 897 646 -717 161 694 -637 -256 1058 -181 -701 721 -72
$$ packed form
1020a36m0j472O80J031l57q3N22p85k07J642k01q61J128o62j285K091K96k049
1038g48J058N38j994R92J711j779q29J630m69j139J800M82k486P91J783j816R1
1055c84K129j876j165K353m55j266J418k55j500Q20R84j028m0O88q61l59J567
1072G70n86j063J421n85j224J812L4j825J160N72j786R78J312j639m51J674o45
1089g1j129J830K00k127J270J460k116M55J984k010m02K106q68j100J524j61j520
1106f75J026O71j292K1J132j211l81J469q84q76J576n75j235J643j80j438J380
1123A71K47j611Q71J010j375j46J562q03j154J794J09j803J367R57k184P54J727
1140A493j869k01J790j219q56J759k51j363Q78N33j331L81J314j239n20J422p93
$$ plain form
1157 -72 -756 939 310 -999 480 315 -824 425 642 -828 -352 633 -412 -429 770 -174 -1202 479
1175 479 579 -949 380 812 -1216 -158 1301 -421 -447 977 -381 -829 756 569 -769 37 442
1192 442 -804 -198 998 -278 -794 699 -77 -513 969 324 -841 358 393 -407 514 626 -666 -353
1210 -353 540 -182 -263 519 -266 -1114 353 374 -868 238 385 -1180 -79 1111 -354 -219 790 -300
1228 -300 -480 942 632 -561 69 508 -527 11 1033 -406 -787 593 -178 -597 746 22 -971 140
1246 140 244 -394 373 395 -536 -286 500 82 -249 402 -141 -831 391 384 -704 180 214 -935 42 782
1266 782 -420 -209 601 -214 -276 817 482 -477 168 614 -327 131 934 -443 -677 535 -214 -659 479
1285 479 -208 -888 -9 111 -411 30 200 -396 -245 523 123 -155 531 77 -386 551 445 -402 262 255 -541
$$ packed form
1157g2o84J695o29j309J479j65j139J249K17j470M76R85j045j7J199r44j028J681
1175D79J00j528J329M32k028J058J459j722k6J424j358m48J585j87j338Q06M05
1192D42j246O06J196j276n16J493p76m36J482o45j165J199L5q00R21J12j292L13
1210c53Q93p22q1P82p85q48J467K1j242J106J47j565J101J190j465J35J009j090
1228c00j80J422l10j193O30M39j035N38J022j439l81J380p71m19J343p24r93J111
1246A40J04o38P67K2r31K50P86m18l31O51n43o90J222pj088Q84L4j149R77P40
1266G82j202K11Q10q15o2J093l35r59O45M46r41M58Q03j377k34J212p49m45J138
1285D79o87o80Q79J20n22M41J70n96J51P68m00k78O86m54m63R37j06q47O64pp96
$$ plain form
1306 -541 98 495 -418 -262 249 -245 -346 417 179 -514 62 417 -422 -23 619 -342 -398 553 -173 -452
1326 -452 424 -106 -634 66 138 -370 -140 194 -278 -229 369 27 -290 421 252 -291 492 406 -290 298 417
1347 417 -264 122 317 -337 -213 263 -149 -388 42 -76 -562 -64 235 -539 -187 430 -327 -77 542 -181
1367 -181 -344 423 168 -210 298 224 -275 -67 316 -86 -248 239 -94 -422 354 117 -394 141 124 -370 280
1388 280 310 -300 16 191 -162 -9 355 -29 -365 91 94 -302 123 208 -565 -176 373 -259 -14 453 -347
1409 -347 -351 410 195 -86 210 181 -257 93 542 45 -190 259 -119 -351 406 113 -526 -64 -129 -498 137
1430 137 106 -492 -319 -5 -142 32 326 49 -315 204 293 9 334 317 -371 38 500 -101 48 266 -390
1451 -390 -255 310 60 -223 63 -114 -433 80 462 -95 -264 309 -107 -167 591 119 -418 106 -7 -316
$$ packed form
1306e41O39L97r13J56N11m94j01P63k38o93N76L55q39L99O42r61n6R51p26k79
1326d52Q76n30n28P00P2n08K30L34m72M9N98l42l17P11j69n43P83q6o96N88J19
1347D17o81L86J95o54J24M76m12k39M30j18m86M98K99p74L52O17p57K50O19p23
1367a81j63P67k55l78N08p4m99K08L83m02j62M87l33l28P76k37n11N35j7m94O50
1388B80L0o10L16J75l53J53L64l84l36M56Ll96M25Q5p73L89N49o32K45M67q00
1409c47mP61k15k81K96k9m38L50M49m97k35M49l78k32P57k93o39M62o5l69O35
1430A37l1n98J73L14j37J74K94k77l64N19Q9k84L25j7o88M09M62o01J49K18o56
1451c90J35N65k50k83K86j77l19N13L82n57j69N73m16o0P58m72n37N24j13l09
$$ plain form
1471 -316 187 99 -481 -365 -20 -146 -116 97 -184 -392 125 257 -56 290 236 -344 199 566 -4 88 319
1492 319 -312 -178 357 20 -349 -54 -83 -443 -39 279 -324 -309 200 -203 -160 614 32 -352 299 211 -135
1513 -135 373 279 -312 -196 177 -77 -144 139 -232 -412 96 119 -298 132 41 -372 173 363 -150 179 262 -168
1535 -168 -16 449 88 -168 155 15 -278 133 253 -403 -299 169 -332 -182 442 -162 -366 290 153 -183
1555 -183 327 232 -173 77 403 0 -69 266 -87 -361 219 139 -355 60 -16 -454 61 191 -262 -63 143
1576 143 -241 -58 298 15 -147 256 110 -158 246 364 -298 -45 355 -262 -120 402 -239 -263 274 -44
1596 -44 -318 188 117 -294 4 345 -99 -111 341 -25 -239 358 153 -266 200 151 -286 127 178 -370 -17 73
1618 73 -225 -143 139 -153 -254 104 44 -264 171 259 -288 163 400 -242 18 455 -190 -140 383 -104 -336 142
$$ packed form
1471c16N03q8n80J16L45j26L0K13k81k08N17J32l13L46n4n80N43L67n70R2K31
1492C19o31J34N35l37l69K95k9l60M04L18o03J5N09m03M3P74n82l84O51q8l46
1513a35N08r4n91J16L73k54o7K83l71j80N08K3m17M30r1m13N45J90n13L29Q3m30
1535a68J52M65l61k56L23j40k93M11J20o56J04M68n01J50O24o04k04O56j37l36
1555a83N10r5m05K50L26m03o9L35l53k74N80q0m94M15p6m38N15J30m53J99K06
1576A43l84J83L56k83j62M03j46k68M04J18o62K53M00o17J42N22o41k4N37l18
1596d4k74N06p1m11K98L41m44j2M52l66k14N97k05m19M66m9m37M13N1n48L53R0
1618G3k98Q2K82k92j01L58o0l08M35Q8n47M51K37o42K60M37o45N0N23m87k32M78
$$ plain form
1640 142 80 -377 29 138 -301 -265 279 -150 -289 349 -28 -270 263 176 -217 185 196 -237 84 261 -139
1661 -139 -97 123 -44 -230 149 -32 -325 81 109 -273 74 292 -250 22 426 -102 -33 366 -78 -168 182
1682 182 97 -287 33 129 -342 -129 267 -192 -302 268 -160 -301 275 134 -268 179 185 -188 171 246 -40 -78
1704 -78 187 -20 -173 166 9 -357 8 84 -296 28 150 -287 -5 283 -134 -53 238 -95 -113 208 141 -133
1726 -133 82 91 -295 9 250 -224 -254 230 -97 -233 297 -1 -203 164 178 -128 75 293 -78 -77 272 7
1748 7 -176 137 -8 -325 30 41 -293 24 110 -325 -40 134 -115 -59 203 -9 -62 191 107 -127 98 182 -227
1771 -227 54 222 -247 -160 194 -187 -245 249 -13 -223 166 155 -123 119 186 -76 12 187 -26 -221 128 -24
1793 -24 -294 74 55 -347 26 90 -214 -9 107 -116 -67 170 74 0 224 151 -44 148 205 -175 -36 239 -175
$$ packed form
1640A42o2m57M06J09m39L6N44m29j39O38l77k42N33q7l93M02J1m33L21J77m00
1661a39M2K20j67j86L79j81k93M06K8l82L47K18n42K72M04n28O9L99m44r0L50
1682A82q5l84L20R6m71K13L96m59j10N70m28j41N76j41m02M47Ol73L59P5k86l8
1704g8K65k07j53L39j57l66L65P6l80L24J22m37K82K88m17Q1K91l33j8L21o7k74
1726a33K15Rl86L04K41m74l0M84l27j36N30k98k02L67J4l06K03K18l71JL49k65
1748Gj83L13j45l17L55J1l34L17Q6m35K85J74k49N6K62k12n3K53q4k34K25Q4m09
1771b27K81J68m69Q7L54l81n8M94k62k10L89j1k78K42O7k62Q8J75k13j95L49j52
1793b4k70L68j9m02L73O4l04K05J16k23M9K37r6p4K24p3j95J92N7l80J39K75m14
$$ plain form
1816 -175 -90 154 -183 -192 121 -127 -177 102 19 -246 -5 138 -27 -50 227 -19 -142 220 105 -144 147 22
1838 22 -262 53 100 -188 -15 79 -142 -56 93 36 -92 70 125 -86 74 231 -105 16 216 -130 -14 146
1860 146 -158 -215 56 -78 -157 45 -87 -289 -54 45 -197 -88 129 -157 -125 229 27 -108 244 143 -146
1881 -146 162 285 -74 13 131 -90 4 163 -52 -211 -56 -43 -220 8 64 -247 -116 95 -81 -34 219 -97
1903 -97 -71 166 43 -62 69 -58 -135 -33 79 -120 -133 42 -214 -157 187 -44 -174 126 -4 -76 193 204
1925 204 -14 46 209 -8 114 175 110 -95 33 21 -151 -18 80 -260 -154 32 -172 -69 41 -144 -125 164
1947 164 -4 34 117 80 -28 54 177 -16 -56 62 -134 -141 98 -107 -268 -44 -83 -173 85 54 -139 -38 77
1970 77 26 -6 273 114 -62 196 212 -33 87 115 -141 -52 89 -159 -113 6 -153 -136 0 0 -32 50 27 -30 74
$$ packed form
1816a75Q5K44l37rL13k48n0K79q3k65K41J43j65k3K77k46j23L62j15k49K91j25
1838B2k84L15M7k88J73R4k21Q6J49n7j28J62N5k11J60J57l36J21K00l46J16J60
1860A46l04n7K71j34p9K02j32k02K35R9k42J09K17k86L2L54k02j35L52j01k89
1881a46L08J23l59Q7J18k21R4J59k15j59J55J3j77K28N6l11J31K11j76M7K53l16
1903i7K6K37j23j05J31j27p7J02J12j99j3J75k56N7L44k31j30L00j30p2K69J1
1925B04k18O0J63k17J22O1o5k05J28j2j72J33R8l40J06J86k04J03J10j85J9K89
1947A64j68L8Q3l7j08Q2J23j93m0J18j96pK39k05j61K24l9r0K58l1j93J01J15
1970G7n1l2K79j59j76K58J6k45J20K8k56Q9J41k48M6J19j59J7J36%l2Q2k3n7J04
$$ plain form
1995 74 206 17 -27 91 -62 -79 122 -64 -186 28 -115 -200 -71 -82 -193 -86 -2 -12 -92 82 49 -101 99
2018 99 149 -58 133 185 -115 79 156 -43 -21 49 -49 -86 62 -20 -157 -36 -5 -130 -21 141 -35 -29 139 -8
2042 -8 42 143 -15 -58 106 7 -96 9 -53 -134 -129 54 -75 -71 48 -92 -94 47 12 -127 82 46 -112 34 117
2067 117 -117 48 130 -21 -21 132 59 -123 49 75 -77 -22 142 -37 -27 177 -36 -41 143 -29 -108 67 40 -43
2091 -43 17 14 -30 43 82 -35 -16 34 -13 -110 44 -36 -126 15 -32 -209 1 18 -155 -73 32 -45 -113 41 26 -10 118
2118 118 161 -23 67 176 -33 35 121 -22 -42 68 -42 -99 -1 -40 -130 -11 12 -37 -49 15 -95 -64 108 -30 -106
2143 -106 138 43 -104 123 8 -127 105 11 -118 19 50 -32 -88 83 16 -85 81 21 -72 94 108 -20 64
2166 64 178 -93 -38 139 -85 -74 -15 -49 -175 -81 8 -115 -67 12 -78 -66 88 3 -44 136 -29 -33 186 77 -30
$$ packed form
1995G4J32j89m4J18j53j7K01j86j22K14j43q5J29j1j11J07Q4j0q0J74l3j50K00
2018I9N0k07J91N2l00J94P7j99K2P0r8l7J48q2j37J21L1j25J09J62j76OJ68j47
2042hN0J01j58m3J64r9j03J05o2q1NJ83j29MJ19j40kJ41l5j39K09l6j58J46Q3
2067A17k34J65Q2j51%J53p3j82J72K6j52N5J64j79J0K04k13nJ84j72p9J75k7q3
2091d3O0lm4P3L9j17J9N0m7r7J54q0r0J41m7j77K10J7j73Q2J05p7o8J54j5l6J28
2118A18M3j84R0J09k09O8Q6j43k0J10j10n7R8l9r0J19K3m9j2O4j10L1J72j38p6
2143a06K44r5j47K27j15j35K32r4j29J37L1q2n6J71o7j01J66o0r3J66J4j28Q4
2166F4J14k71N5J77k24J1N9l4j26R4Q9j23M8P9r0J2J54q5m7J80j65mK19j09j07
$$ plain form
2191 -30 115 45 -18 81 121 -17 -35 42 6 -46 90 5 -103 22 65 -118 -14 66 -121 -28 86 -50 19 22 -57 -111
2217 -111 11 53 -48 -37 76 -79 -14 147 -29 -36 115 33 -75 126 -7 -56 34 13 -46 29 46 -26 -35 -5 19 -102
2243 -102 1 -44 -116 28 68 -122 -6 55 -132 -18 88 -34 -24 84 15 -18 69 121 -3 21 127 -52 42 95
2267 95 -32 -21 95 -35 -67 69 48 -77 -8 -11 -32 -30 -3 -66 -135 10 -80 -158 66 18 -115 13 62 -82 70 92
2293 92 -4 29 125 20 11 88 39 13 54 64 -75 29 63 -105 -22 70 12 1 126 -45 -50 34 -30 -39 17 32 -44 -15 -9
2322 -9 -47 -62 6 -8 -88 47 39 -76 27 22 -71 24 71 -49 71 119 24 81 -18 45 -28 57 82 -87 32 61 -83 -42
2350 -42 10 -129 -104 17 -70 -134 -37 -65 -80 12 4 -67 -5 46 29 8 124 -44 8 86 57 2 67 6 -29 116 60 -88
2378 -88 -5 31 -76 20 64 12 -69 25 53 -126 2 18 -38 -15 27 -30 -17 28 -73 -75 30 -2 -36 -4 19 -93 -9 21
$$ packed form
2191c0J45p0o3R9M0j38j8P7l6n2J36q5j08J25M3j83J04Q0j87R3J14j36O9Lp9n4
2217a11J22M2j01J1J13j55O5J61j76pJ51q2j08K01j33m9R0k1n9P5J7p2rL0K4j21
2243a02J03m5p2J44M0j90J16O1j87J14J06j22J0J08o9l3Q7N2j24K4J06j79R4N3
2267I5j27J1J16j30l2J36k1j25O9lk1KK7o3o9J45r0p8K24m8j33J28M9j44J52K2
2293I2r6L3R6j05rP7m9k6M1J0j39J04L4j68Q3R2n8j1J25j71nQ4o4rN6J5p6K9O
2322il8j5O8j4q0J35qj15J03nr3R5M7j20J20M8r5N7r9O3p3Q5K5j69J19K9j44M1
2350d2N2j39K5J21q7o4R7k8j5R2qp1O2N1j7k1J16j68N2P8k9n5O5o1l5J45n6j48
2378h8Q3L6j07R6M4n2q1R4K8j79J28J6n6K3M2n7J3M5j01kJ05l2l4L2K3j12Q4L0
$$ plain form
2406 21 -68 -64 45 9 -15 46 17 -2 86 4 -51 39 55 -55 24 62 -23 7 19 -60 -105 -9 -10 -77 49 67 -52 78 50
2435 50 -30 -23 105 -55 65 66 27 13 -12 -10 -71 -9 42 -93 -51 -3 -97 -121 12 -49 -84 -7 -29 -72 57 72 5 30 26
2464 26 12 12 64 -20 -40 51 50 -72 9 7 -60 -3 32 -42 67 52 -7 8 111 30 8 11 70 5 -11 53 -24 -38 16 -31 -62
2495 -62 18 -67 -60 38 -120 19 71 -11 17 13 38 -20 -29 79 -14 -130 -21 29 -90 51 72 -64 -32 16 -65 45 5
2522 5 -15 40 21 61 43 46 17 -34 -8 92 9 36 105 -12 -11 119 -30 -10 82 18 6 -1 37 -30 -109 6 -56 -73 -18 -35
2552 -35 -68 2 16 -52 70 8 -76 14 -51 -11 11 -2 -27 -21 21 31 -37 26 57 -30 -18 -6 -69 -44 46 -38 -37 41 11 -25 62
2583 62 21 -29 9 64 -25 -24 -5 -50 -57 18 -10 -96 -40 -67 -81 8 37 -56 3 16 -48 42 78 -37 25 135 77 3 82 25
2613 25 -4 -21 21 -55 -42 -9 -52 -10 -41 -81 6 -2 -37 -27 19 26 -5 5 115 -6 -5 102 2 -3 15 2 -70 48 3 -55
$$ packed form
2406B1q9MJ09l6k4O1k9j9Q8q2n5R0J6j10P9L8q5L0J2p9m5R6jo7J26J8j19J30k8
2435E0q0PJ28j60J20Jl9j4k5Ko1O2N1j35M2M8r4k4J33o1l5P7k2m3J29J5o7K5m
2464B6j4%N2q4k0R1jj22Q1ko7N7L5p4J09j5n9J5J03q1k2LN9o5j6O4p7j4N4m7l1
2495f2Q0q5PR8j58J39N2q2K8mK5n8rJ08r3j16J09N0j19J41K1j36L2M8q1J10m0
2522Ek0N5j9M0j8Lk9n1K6J00q3K7O9j17JJ30j49K0R2o4j2pL8o7p9J15o2j7N5j7
2552c5l3P0J4o8J22o2q4R0o5M0K2j3k5OM2J0o8O3L1q7J2J2o3K5R0q4JP8l0l6Q7
2583F2m1n0L8N5q9JJ9m5pP5k8q6N6k7j4Q9K9r3N9J3o4R0L6j15O2J10n8p4P9n7
2613B5k9j7M2p6J3L3m3M2l1m0Q7ql5J0M6Pl1J0J10j21JJ07j00nJ8j3p2J18m5n8
$$ plain form
2643 -55 53 -1 -23 50 101 39 29 86 17 4 8 11 -14 -15 -14 -9 28 -3 -120 -48 -47 -60 -55 39 73 -47 -28 -17 34 78 50 -27
2675 -27 -58 137 15 4 29 -4 -70 48 44 -30 25 0 -47 19 14 -44 -4 4 0 -83 17 -7 -40 37 23 -20 51 13 -4 -39
2705 -39 13 -64 -35 39 -27 2 48 58 27 9 -8 7 -18 57 -18 16 73 -46 -75 33 -44 -42 15 -7 -58 -68 -9 -13 -68 -25
2735 -25 4 -97 -27 -12 -68 12 -27 -42 -94 1 -62 12 29 -21 37 47 -18 35 68 73 17 36 54 21 51 33 -17 11 21 -5
2765 -5 -63 25 -60 -65 -19 8 -61 -64 -9 -41 -59 -1 51 -54 17 5 -18 4 59 -31 -20 -12 26 11 3 21 -11 -40 -10 -39 78 40
2797 40 -15 -25 -6 -18 -54 31 -57 22 -13 33 -14 15 -9 -80 23 -34 -22 31 28 -3 0 18 20 -46 20 43 6 108 35 -17 71
2828 71 28 -18 15 13 3 21 73 -2 19 -61 5 -31 -29 44 -56 0 8 13 16 65 -4 -16 -15 5 -1 -8 -20 -1 -31 57 27 -62 7 -13
2862 -13 -48 28 14 -27 21 12 -15 6 6 -51 -6 8 1 -11 5 -31 -15 7 52 23 28 37 25 -3 -19 -26 -15 29 9 -53 52 -52
$$ packed form
2643e5J08n4k2P3N1o2j0N7o9j3MLk5jJNL7l1j17P2Jj3NR4L4j20J9J1N1M4k8p7
2675b7l1J95j22j1K5l3o6J18mp4N5k5m7O6nn8M0Qmq3J00k4l3P7j4m3P1l8j7l5
2705c9N2p7K9P4o6K9M6J0l1j8j7J5k5P5p5L4N7j19k9J08p7KN7k2n1j0N9mn5M3
2735b5K9j01P0J5n6Q0l9j5n2R5o3P4J7n0N8J0o5N3L3Nn6J9J8l3L0j8n0K8J0k6
2765en8Q8q5nM6K7o9lN5l2j8N8N2j05P1j2k3K2N5r0J1QL8j5qJ8l2k9L0k9J17l8
2797D0n5j0J9j2l6Q5q8P9l5M6m7K9k4p1J03n7J2N3ll1LJ8Ko6O6K3l7J02p3n2Q8
2828G1m3m6L3kj0J8N2p5K1q0O6l6KP3j00N6QNLM9o9j2JK0opj2J9l0Q8l0q9O9k0
2862a3l5P6j4m1M8rk7K1%n7M5J4pj2J6l6J6K2M5k9NRj2k8j6pJ1M4k0o2J05j04
$$ plain form
2894 -52 -28 -18 23 -39 -36 -15 -52 -80 -19 -1 -36 -49 -8 -22 0 37 -16 -51 51 13 -21 2 -7 27 8 25 4 20 10 24 17
2925 17 70 -3 -17 52 -52 -26 16 -38 -7 2 -28 8 52 27 5 -4 19 9 -42 -1 -18 -18 35 16 0 13 -23 -43 -1 52 -22
2956 -22 -20 -21 -30 -16 10 -2 13 25 15 -24 3 -12 10 -81 103 17 -10 1 -10 30 25 15 -16 -7 23 20 -26 1 -73 9 -2 47 -23
2989 -23 4 -20 -25 2 -85 -8 27 -47 21 -34 -32 -15 -13 -65 12 -42 -1 -22 11 95 31 -22 -2 23 -3 4 -7 -38 21 58 -21 23
3021 23 -10 23 35 -24 -18 27 41 6 -3 -56 2 -8 -59 13 -17 -39 -6 -23 3 -87 -8 -1 -58 -55 -9 7 -8 33 -48 5 18 14 -31
3054 -31 36 60 -14 -60 16 -2 -6 29 -57 -38 45 13 -5 34 -28 -24 57 33 7 1 -4 -42 -51 15 2 1 -49 -17 3 13 16 -68 6 -10
3088 -10 -1 17 22 -40 50 82 -3 12 18 46 -53 84 8 -5 22 -18 -23 -3 -24 -29 -50 35 -39 5 29 8 -30 22 11 -2 -42 1
3120 1 -16 11 -4 -9 -4 19 38 -52 9 8 -22 -60 -17 -42 7 -8 -8 -11 -11 4 -4 -8 1 14 -43 -7 -45 -29 2 -5 23 55 -56 -36 34
$$ packed form
2894e2K4J0M1o2LK1l7k8O1J8l5j3M1j4K2L7n3l5J02l8l4K3rL4j9J7k1J6j0J4p
2925A7N3p3j4O9j04K6M2n4L1Rl0L6M4k5k2rK3j0n1M1j7%N3j9j6J3l6k0M2N3p4
2956b2KjrJ4K6j2J5J2j0l9K7j5K2r1J84q6k7J1j1M0nj0l1RL0lm6K7p4Q2j1M9p0
2989b3K7k4nK7q7P7L5p4O8n5KJ7Kn2P7n4M1k1L3Q4o4n3K0K5k6Pj1l1N9L7p9M4
3021B3l3L3J2n9OM5J4l5rn3N8j0n1P2l0k2L3j7K6r0P9Pn7LM6J6j5M1q1N3J3mm5
3054c1O7K4p4m6P6j8mL5q6J9Q3l2j8L9o2MQ1k4k6onl8rO6j3jn0L2K0J0Lq4P4j6
3088a0RJ8No2R0L2q5J5OK8r9J37p6j3K7m0nK0k1nk1Q5p4M4K4k1l8N2j1j3m0M3
3120Aj7K7j5nNK3J9r0O1jl0l8M3k5M9j5%l%J5qmRJ3n7L6l8J6L1pK8L2j11K0P0
$$ plain form
3155 34 -17 26 31 52 -37 -4 -27 -22 37 39 30 0 36 22 -59 65 24 -31 16 5 14 42 -60 0 39 9 9 -25 31 40 -5 -36 -18
3188 -18 -37 -41 0 -39 -46 57 -40 -45 -10 84 -26 20 10 10 -14 -22 6 15 39 48 36 -12 33 -65 -72 74 -80 -46 14 -12 18 17 -48
3221 -48 -4 -30 90 -5 4 18 2 -17 28 -86 -60 -41 3 56 27 -15 -32 -6 0 15 11 48 -3 40 1 44 -9 36 -12 -35 6
3252 6 -17 19 43 -6 27 -9 7 -57 57 18 -24 47 -11 2 40 -7 37 24 19 17 -33 -25 -19 10 -34 9 25 -28 7 -29 7 -7
3284 -7 39 -2 13 24 36 -23 23 107 -20 -12 54 8 -31 -7 -18 -24 15 -40 -42 -4 -11 12 0 66 -11 -22 2 27 4 34 -3 -13
3316 -13 -9 -32 15 -13 -51 18 -11 -85 -46 29 11 -8 -18 30 2 15 33 16 -30 33 -19 -9 -11 -19 -18 -15 41 -21 -13 22 43 -10 3
3349 3 3 13 11 67 88 -9 42 -2 -1 31 20 -11 52 19 2 -41 -24 -44 25 -21 -16 -34 17 16 -82 -12 16 -19 -2 -26 -10 41 -6
3382 -6 5 -9 58 -61 8 -4 -30 -17 -11 -8 4 10 -1 -14 -31 17 -19 -13 46 -10 46 9 7 -33 51 -1 39 -5 -50 50 -31 -42
$$ packed form
3155C4n1M3NK1q9L3k3NN9Krl0L6j4q1J24m1n5M7j1RK8j02O0L9l0%l4N6Rm5l1J8
3188a8j9mM1l9pJ03r7nL5R4j10M6j0%k4qK8RK4Rj2m8M5r8pJ46j54L4O0k6L0jo5
3221d8M4k6J20r5RJ4j6j9M5j14K6J9M4N3k9m2j7K6OJ5mL7n1M3l9M3n3M5m8k3M1
3252Fk3L6K4m9L3l6J6o4J14l9m2P1n8J3L8m7M4j3nkn0QOK9m4M3J6n3L5l6L6j4
3284gM6m1J5J1J2n9M6Q4j27QO6m6l9K4j1oL9n5kL8pK3j2O6p7j1K4K5k3L0l7j0
3316a3Mk3M7k8l8O9k9p4L9P5j8j9j0M8k8J3J8j7m6O3n2J0kqJLN6o2QL5K1n3J3
3349C%J0kN6K1r7N1m4JL2j1l1O3l3j7m3J7k0O9m6Nj8N1jr8P0K8l5J7k4J6N1m7
3382fJ1j4O7j19O9j2k6J3OLJ2Oj1j3j7M8l6ON9n6N6l7km0Q4n2M0m4m5J00q1j1
$$ plain form
3414 -42 27 -40 19 -1 -9 28 5 -56 8 6 -3 43 6 -38 -7 36 1 -43 -21 -5 -16 -41 6 -5 19 30 -35 -1 -8 42 -11 17
3446 17 34 31 20 66 10 11 68 19 -10 -66 -16 12 18 -27 26 37 0 -21 -2 59 5 -25 -24 3 -25 -9 38 -19 18 19 13 5 9 -38
3480 -38 -19 2 4 31 -30 2 -27 47 14 -16 45 38 19 -36 23 18 -10 52 18 -45 8 12 -19 20 4 36 9 -21 32 10 19 26 10
3513 10 29 25 25 -52 -23 -68 -52 65 -5 -16 -13 6 -17 47 12 -16 9 -31 25 3 -21 -13 10 85 -31 18 3 38 51 4 26
3544 26 -82 27 -6 10 -11 3 -18 35 7 -55 32 26 -45 -8 -31 6 -22 -63 11 -60 -16 14 20 -14 -8 -9 -17 -25 6 -38 -19 -48
3576 -48 33 -12 -16 71 75 48 52 -25 7 5 -19 1 -22 46 44 -6 24 -17 -20 39 43 27 16 -19 -7 29 -82 -41 23 3 7 14 0 16
3610 16 15 -68 -40 -9 13 23 -54 33 -6 -37 47 -20 -12 39 28 -9 38 21 1 43 2 32 15 -40 7 23 48 32 -3 25 24 -1
3642 -1 -21 -15 -45 -20 31 -12 -10 -19 82 25 2 -29 -7 35 22 -24 -7 23 -7 -10 7 17 -21 25 2 -14 -22 26 -60 13 37 -71
$$ packed form
3414d2O9o7N9k0qL7k3o1O4krM6l7m4L1M3l5m4K2J6j1k5M7j1K4J1o5L4pN0n3K8
3446A7J7lj1M6n6JN7m9k9n6N0K8Om5N3J1l7k1J9O1n4l0JK7k8J6M7n7L7JoqMm7
3480c8J9K1KK7o1L2k9P4l3l0O1pj9n5N9nk8O2l4o3N3Ml1L9j6L2k7l0N3k2RPj6
3513A0J9m%p7K9m5J6J17p0j1LJ9k3O4l5k8K5m0N6k2k4QK3P5j16M9j5L5J3m7K2
3544B6j08J09l3J6k1J4k1N3k8o2Q7op1L7k3L7k8m1P4p1M4L0Ol4OjqqL1m4J9k9
3576d8Q1m5mQ7Mk7Mp7L2kk4K0k3O8kn0L0m1lN9Mj6j1l5J2L6j11M1O4k0MPj4J6
3610A6jq3K8L1K2J0p7Q7l9l1Q4o7QN1j1l7M7j7k0M2m1L0j7n5M7J6K5j6l5K8jk5
3642ak0Ol0K5N1m3KrJ01n7k3l1K2M2j3m6J7L0l0lJ7J0l8M6k3j6qM8q6P3K4j08
$$ plain form
3674 -71 -24 -8 108 -4 69 -55 6 -16 -22 21 -3 10 -19 -8 63 -51 20 -41 -66 -2 -54 32 58 1 7 7 -21 48 -51 -66
3704 -66 8 -63 12 3 -28 -10 60 -16 -16 51 -6 -20 15 42 -15 -1 10 17 -43 31 -43 -16 -37 44 -12 20 66 -69 -70 -9 9 -34
3736 -34 -35 15 1 -13 52 -47 -83 0 -1 40 23 32 -6 9 18 -8 23 26 7 42 10 -28 -6 44 32 -30 4 34 -9 12 14 -95 -70
3769 -70 -15 -30 -58 27 -62 6 14 -13 -6 4 -20 -35 11 6 10 -15 63 -2 -8 22 6 -46 15 33 -11 -2 -22 -17 29 9 -12 -13 76 5
3803 5 -14 64 -9 -2 -50 -21 -47 105 44 -9 86 -12 -37 -57 29 28 -35 -23 -42 -16 19 -47 -78 47 42 -6 1 17 -56 -8 6 -18
3835 -18 11 -21 -11 39 11 13 4 -66 -18 28 -17 36 -7 58 25 45 21 -26 -34 41 -12 -9 -2 -2 -2 4 -48 -8 -43 -37 -85 17 19 -27 85
3870 85 -33 -51 -27 53 -17 2 5 -5 34 -9 31 -31 5 11 -33 11 -5 -6 45 -90 34 -23 55 -2 0 35 -37 -42 23 3 12 -23
3902 -23 0 53 -29 -2 6 26 -37 -6 26 33 -34 8 -7 18 35 32 -29 -19 -24 22 -19 6 -22 21 -15 54 -43 -33 29 3 2 28 12
$$ packed form
3674g1M7J6J16j12P3j24O1k2oM3k4J3k9J1P1j14P1o1k5O4n2Q6K6n7O%k8O9r9j5
3704f6P4p1P5rl1J8P0p6%O7n7j4L5K7n7J4J1Po0P4p4K7k1Q1n6L2M6j35jO1J8m3
3736c4jN0j4j4O5r9l6Q3jM1j7Rl8J5Rk6L1Lj9L5l2l8K2N0j2o2L4L0m3K1Kj09K5
3769g0N5j5k8Q5q9O8Qk7PJ0k4j5M6nMk5P8o5oL0j6n2O1J8m4Rk0NM6k0k1jQ9p1
3803Ej9P8p3Pm8K9k6J52o1n3R5r8k5k0Q6jo3J2j9K6L5o6l1J25nm8PJ6p3M8J4k4
3835a8K9l2J0N0k8Krp0M8M6m5N3m3O5l3K0k4m7qP5n3LP%%On2M0l5Om8J02Km6J12
3870H5j18j8K4Q0p0J9Lj0L9m3M0o2L6Om4M4j6jN1j35J24n7P8n7KL5p2nO5k0Rl5
3902b3K3N3q2K7QK0o3L1L2Po7M2j5K5J7lo1J0nM6m1K5k8M3l6O9r7J0O2k6jK6j6
$$ plain form
3935 12 -9 32 20 11 -15 1 -36 27 0 27 -26 24 -4 -2 -37 21 23 4 19 -9 4 -5 -6 -4 -7 -28 5 -28 -13 16 26 -29 -49 -20
3969 -20 -19 32 -6 6 -34 -19 -5 -33 14 16 -8 3 -4 12 62 -16 -47 -24 11 -6 1 -7 38 -25 -76 -24 26 -10 35 -14 12 18 3
4002 3 4 17 -5 -25 -26 -21 -1 4 -6 10 16 -17 28 49 -42 69 -19 -23 7 10 -12 -31 3 -14 35 -46 8 -12 40 -7 -47 10 2 -32
4036 -32 -36 33 -16 -18 -26 -58 -50 -14 7 22 30 -12 45 -4 -3 -6 5 25 -18 19 13 29 -3 -21 15 8 64 -21 -25 -42 9 -3 -7 33 2 4
4072 4 4 64 -50 -13 32 -35 -35 -1 -9 18 31 6 66 8 65 -4 60 -30 -7 -26 21 -30 11 49 70 28 40 -27 6 -1 -38 5
4104 5 31 -7 -28 -2 42 -15 21 108 55 20 -8 21 11 2 -30 -50 14 12 -19 -27 -50 -3 10 0 0 -5 -8 45 -33 -38 50 -15 -9 77 35
4139 35 2 38 -18 23 32 16 -26 62 -14 -3 -37 6 -22 -27 37 -35 36 9 -67 -29 -41 37 -13 24 20 -76 -7 6 12 -25 -17 -45 -39
4172 -39 -13 -42 -4 -2 47 -31 -28 34 47 -13 19 -6 46 -38 -8 21 -17 26 -47 7 29 -18 -25 -7 -25 -16 -44 14 -54 26 20 -35 6
$$ packed form
3935A2k1M1j2rk6J6l7O3k7K7n3N0k8Kl5N8Kj9J5k8J3rjKlk1L3l3J5K9J0n5k0K9
3969b0JN1l8J2m0J5J4k8M7Kk4J1pJ6N0p8l1K3L5j7PqM5o3n1N2N0l6M5m9K6Oj5
4002CJJ3k2k0jNK0Nj0J6Ol3M5K1r1J11q8mL0Lk2j9L4j7M9q1N4k0N2m7m0N7ql4
4036c2mO9m9kql2QL6K1J5Qm2N7m9JlJ1K0m3L7oJ6l2j8L6pN6q5mj7N1j2mM0l1K
4072D%O0j14L7M5o7%L4qK7J3k5O0n8N7o9O4r0K3j9M7n1M1L8K1m2J2o7L3pl7M3
4104EK6l8k1K6M4n7L6Q7n3l5k8K9j0rl2k0O4kl1qk3M7J3j0%nlN3p8nQ8o5OQ6m2
4139C5l3L6n6M1Rj6m2Q8p6J1l4M3k8nO4p2P1k7p6L8j2P8n0L7mr6O9J3Ol7Qk8O
4172c9K6k9L8KM9p8LO2J3o0L2k5N2q4L0K9l8M3p3N4K2m7pJ8j8Rk8N8o8Q0on5M1
$$ plain form
4205 6 17 25 -5 25 -15 -8 -18 30 -37 22 -31 -65 13 75 -31 35 -16 -38 41 -4 -53 -49 24 10 1 -17 -2 -6 -13 46 8 -30 -6
4238 -6 20 14 -8 -6 15 -8 -57 6 8 -19 -14 -38 -9 11 6 41 18 27 -13 20 4 -6 29 -48 -6 25 -9 -7 -21 -67 18 12 20 -14 38
4273 38 35 -21 -23 -13 -38 -28 8 1 -44 21 14 -16 -1 1 -37 -3 -5 -19 6 27 -24 -16 10 -21 4 57 -46 -26 -28 5 -5 13 9 -8
4307 -8 -6 39 32 -14 -3 58 -1 -30 -21 -22 19 52 -4 6 27 30 6 13 -55 -36 12 -16 9 0 5 -46 -21 -32 5 14 -63 -15 30 3 -11
4342 -11 6 -34 -12 -20 39 -8 51 8 12 49 -18 -49 -3 -11 -7 11 -1 25 -14 -24 -16 10 -33 -2 34 13 -19 16 -2 -14 -79 13 13
4375 13 -52 -2 3 -5 -11 46 -24 -4 18 14 30 3 39 49 -20 -65 38 -6 -23 53 -2 59 -31 -10 63 -5 19 31 -78 -3 31
4406 31 -44 -40 -1 -82 42 -13 -40 11 -51 59 -32 -24 33 -12 24 -1 -27 -28 11 -40 -24 6 -22 6 14 -23 -13 19 -27 5 24
4437 24 12 82 0 56 15 6 -4 -22 -60 40 55 -2 5 -45 -36 32 -23 17 56 17 27 24 53 -13 0 64 -9 57 19 -2 44 30
$$ packed form
4205FJ1Ql0L0m0Pj0M8o7N9n3l4P8O2j06O6n1k2P9m5m9MP3j4rj8J5mpN9l8l8K4
4238fK6ok2KK1k3m9O3Kk7Nk4K9K0nL5k3Rm0L3j6j0L5p7M2L1l4Kj4m6Q5oQl4N2
4273C8ln6kJ0k5J0L6pm5O5pl0J5Kl8L4kj4K5K1n1QK6l1K5N3j03K0kL3j0J8mj7
4307hKM5pm6J1O1n9k9RjM1L3n6J0K1Lk4Po8J9M8k8K5rNn1K5j1L7Rp7M8M5k7j4
4342a1J7m0K2qN9m7N9m3ML7o7l1M6qMJ8j2K6l9j0QK6m3L1L6k1l2L5j8j2o5R2%
4375A3o5N0NqoN7p0K0K2mJ6k7L6J0o9m5J03m4j7P6n5O1r0K1P3o8K4J2j09P5L4
4406C1p5ML9q1J24n5k7N1o2J10r1QN7m5L6k5k6jL9n1J6L0k8K8Ql7J0L2m6L2J9
4437B4j2P0q2N6m1rj0j8l8J00J5n7Pn0RO8n5M0L9l9J0lK9o6J3O4p3O6l8k1M6j4
$$ plain form
4469 30 -50 29 -35 -37 -2 3 -15 -68 -28 -32 61 10 4 -7 7 42 14 29 -25 -16 5 -18 -17 -44 30 -13 -42 -46 -23 24 5 35 -29 -6
4503 -6 10 -11 -26 -27 46 30 -16 -34 -25 32 2 11 40 5 -26 -51 -36 32 -13 26 0 37 -5 34 -35 -29 -10 19 -19 -26 -40 -4 25
4536 25 14 0 -86 -4 -46 23 12 -11 3 -7 -5 -1 20 2 -20 22 0 28 7 -24 22 -77 -30 -33 -35 40 -55 39 -30 -30 15 -32 -19
4569 -19 1 -19 47 -34 1 -5 39 -22 -21 -7 -30 -16 19 16 -3 2 38 10 -14 19 -8 -17 -14 -12 1 40 -74 16 -19 8 -60 -26 -42
4602 -42 10 -20 -26 -26 7 -87 -14 36 -1 34 -27 44 10 -5 -4 15 30 4 -8 28 -28 3 -5 22 -5 -11 29 -10 -77 23 -21 -14 41
4635 41 -51 -28 5 28 9 19 23 0 19 -24 68 -66 -33 -4 -1 -13 13 12 36 -19 -15 17 -26 14 -11 -14 5 -29 -28 30 -36 -39 13
4668 13 -18 -9 2 -7 -34 8 -16 -37 2 -54 -6 -46 -44 -9 29 25 7 61 -6 53 28 23 26 46 -22 17 13 19 24 -22 4 -33 -44 7 26
4703 26 32 -13 -50 18 -30 9 10 -51 7 28 -11 29 -90 10 14 10 6 3 15 3 16 13 -13 -27 -52 15 10 -26 6 10 -1 -5 -14 -26 -30
$$ packed form
4469C0q0P9o4kL5Nj8n3M0mR3n1oj1J4L5k8J5n4RK1k3Jk7P4m3k9mK3M7j9L0o4K3
4503fJ6k1j5jP3j6m6j8RN7l0RK9l5l1k5J5O8m5L9k6L7m2L9o9OJ9K9l8pj4L6K9
4536B5j1j4q6Q2m2O9j1k3J4j0KMK1j8k2M2k2K8k1l1M6r9M7lkP5r5R4o9%M5m7J3
4569a9K0k0O6q1L5oM4o1JJ4k3J4L5lj9NL6k8k4L3k7rLKJ3L9j14R0l5K7o8L4j6
4602d2N2l0o%L3r4P3N0l7L5o1P1l4j5JJ9J5k6j2L6n6L1qK7k7oM0l9o7J00m4PN5
4635D1r2K3L3K3j9J0Mk3J9m3R2j34L3K9Lj2K6jK4n5ML2m3M0k5lJ9l4JN8o6lN2
4668A3l1RJ1rk7M2k4k1L9n6M8m0KL5L8mj8N4o7N9k5nLK0o8L9mONm6K6l7j1N1J9
4703B6Om5l7O8m8L9Jo1N8K1l9M0j19J00MmmlJ2j2J3lk6j4k5O7nl6L2Mj1mrj2m
$$ plain form
4738 -30 -7 6 16 -1 58 -29 7 -9 -70 -50 2 -17 22 -23 -7 -14 -42 46 4 26 51 8 -54 -17 22 3 13 -17 19 2 18
4769 18 8 -18 35 13 28 -37 9 -15 12 -18 26 -36 23 -3 22 19 -58 -14 20 55 15 16 -44 53 28 -36 -34 1 -2 1 -43 -21 11
4802 11 -26 20 -55 6 22 -42 -3 -11 -13 -20 10 -2 7 -36 -3 -18 8 -4 -9 -15 4 -31 -48 13 0 14 -46 -1 -55 65 16 -33 9
4835 9 -52 -67 -11 13 -37 32 -13 31 -4 -36 -14 -23 45 -92 8 -32 19 -2 -18 -19 -2 -19 58 -42 8 24 43 45 33 1 22
4866 22 -5 19 58 -63 16 -19 25 -44 17 -3 -19 -47 15 -53 -69 -47 -12 -13 -47 -50 14 13 11 -28 -40 -78 29 21 -22 23 35 -43
4898 -43 25 -37 -23 -10 -5 14 51 -5 32 -10 7 -19 -25 22 -34 -12 -20 39 3 -38 30 -3 -22 13 -19 -1 25 41 6 -13 -43 33
4930 33 -17 -26 -30 -6 -17 30 16 48 10 31 21 -30 25 39 16 -13 48 -6 62 -6 10 47 -5 -19 -22 17 -8 -25 -42 5 -64 -23
4962 -23 -63 9 37 44 2 3 20 -13 51 50 55 32 -90 9 -23 -1 -11 -16 5 -1 5 -15 30 27 -14 -9 18 -15 7 53 -36 -28 -20 11 30
$$ packed form
4738c0K3J3J0j7N9q7L6j6o1K0N2j9L9m5J6pk8Q8m2K2K5m3o2L7L9j9J0l0L6j7J6
4769A8j0k6N3k2J5o5M6k4K7l0M4o2N9k6K5lp7M4L4L5m0Jo0R7k5o4KL5lLm4K2L2
4802A1l7M6p5O1J6o4L9qkpL0j2Rm3L3j5K6j2noJ9l5j7O1j3J4o0M5n4J20m9m9M2
4835Io1j5N6K4n0O9m5M4l5l2K2rO8j37J00m0N1k1j6jJ7j7P7j00N0J6J9Kj2l2K1
4866B2k7K4L9j21P9l5M4o9O1k0j6k8O2o8j6K2L5jl4lO4jkl9j2l8J07qm3M5J2p8
4898d3O8o2J4J3NJ9L7n6L7m2J7k6oM7n6K2qN9l6m1O8l3j9L5l2J8K6J6l5j9l0P6
4930C3n0rmK4j1M7j4L2l8K1j0n1N5J4k3k9O1n4O8o8J6L7n2j4lL9k5j7j7M7o9M1
4962b3m0P2K8Pm2JJ7l3O4jNk3j22R9l2K2j0nK1oOk0M5lm1NK7l3K2M6q9QQL1J9
$$ plain form
4997 30 -75 -22 12 23 45 18 2 -8 -6 7 -5 25 -31 -29 -47 37 -13 -55 22 53 -29 -9 -3 23 26 -3 -37 42 12 -7 -13 -56
5029 -56 -29 1 10 9 32 -45 -57 -11 -2 -45 -46 -24 7 -2 -16 -40 -33 -19 -90 -44 14 16 20 -32 24 -44 2 20 48 34 -45 4 -10 31
5063 31 -8 -25 54 -25 -5 3 30 -26 50 15 -8 -25 30 -63 35 -24 -33 31 -12 50 -40 -13 15 27 1 -3 20 39 15 -44 25 22
5095 22 -18 -13 18 -7 9 -52 -5 65 -5 11 -30 -51 -6 9 43 14 10 -39 -30 -5 -14 -23 -4 25 47 -27 -2 -4 -16 75 -24 -9 -37
5128 -37 25 8 26 -40 1 31 15 6 -16 -26 -12 -66 25 63 -39 -6 15 7 -37 -21 12 26 -47 -13 -20 -17 52 -6 23 38 -35 43
5160 43 44 14 -35 5 12 29 -2 -34 -12 26 -12 -38 -8 -34 -31 -52 -31 51 11 52 96 -10 -7 -7 47 -17 30 -3 -15 71 16 -9
5192 -9 22 16 10 -7 -48 -15 28 25 -6 -24 -9 -39 -68 -38 -9 -26 30 -31 -5 -15 8 -33 29 -12 -35 38 12 23 -21 11 14 -7 -29
5225 -29 4 -1 -15 12 -6 29 48 29 -5 -2 0 -4 -4 35 -1 -19 30 12 -6 5 14 -22 23 7 -24 -34 -12 -66 20 -26 20 -15 -14 -12
$$ packed form
4997C0j05N3L4J1K2k7j6j0KJ3j2L0n6Kj8Q4n0m2P7L1q2K0OK6Lk9l4P9l0j9om3
5029e6K7L0RjK3p7j2M6Rm3jK2L1rj4k4PJ4p1M6N8KMn2N6o8M6J8K8j4p9M9j4M1
5063C1l9j7P9p9K0QK7n6P6l5k3j7N5r3R8n9rO4m3O2r0K7K8J2k6mK3J9k4n9O9l
5095B2m0NL1k5J6o1M7P0p0J6m1k1M5J5L4k9mm9RK5rrJ9K9K2p4K5kj2R1r9J5k8
5128c7O2j7J8o6M1L0j6rk2j0J4n4R1L8j02L3K1qm4J6L3J4p3L4pLO9n8K9J5p3P8
5160D3Jl0m9M0PJ7l1l2K2L8l8k6L0k6Lk1K1Q2m0M1M4j06L%N4o4M7l3j2Q6n5k5
5192iL1ooj7m1L3M3ll1j8J5l0k9L0K9j7N6o1K6j0K3m1O2m1k3P3k6J1m4L2Lk1k2
5225b9L3nj4K7j8L5J9j9l4LKm%L9l6j8M9j8j8J1Rl6M5j6l1j0K2n4Q6m6M6l5JK
$$ plain form
5259 -12 -32 13 2 23 -1 -19 -31 19 -30 -68 49 4 -15 28 -4 30 -22 -14 28 -28 -16 -34 31 -17 12 -8 24 20 26 -30 -10
5290 -10 -9 -1 12 25 -57 -9 23 -35 1 15 4 -33 -44 23 33 33 24 21 -24 33 15 -14 -19 -18 -4 -20 -9 -15 -1 35 39 -6 -45 28 19
5325 19 -59 36 -13 -28 -9 9 23 -34 -16 16 -52 9 -16 -21 25 22 -7 12 45 37 -31 -18 8 37 -15 9 9 -33 21 7 9 -5 -5
5358 -5 47 -9 -34 32 91 -13 27 49 -3 17 -2 6 -10 8 9 9 49 -24 3 -17 -10 -44 -22 37 -24 -17 14 64 1 -9 -14 15 -47
5391 -47 -36 30 24 8 -15 -86 2 -10 -5 -27 33 4 14 -29 14 -1 8 48 82 62 -57 8 -65 9 8 -35 1 -11 -44 11 -37 31
5423 31 -43 16 46 46 -49 -6 43 -10 19 -28 -45 -21 70 25 -12 21 37 -38 28 -36 83 -24 39 16 -13 -27 -14 -11 -28 -66
5453 -66 11 -26 -3 -40 36 -41 31 -3 -4 -17 10 -29 -42 -45 22 -10 -44 17 -5 46 50 17 32 -9 -17 -66 -9 3 -64 -45 54 -36
5485 -36 -60 -6 37 11 -47 22 68 43 -38 75 55 -13 -24 -15 42 -9 19 -8 15 51 12 -4 1 -20 7 -32 -50 -33 -58 -25 22
$$ packed form
5259a2k0M5j1K1k4j8j2N0m9l8J17m5j9M3l2L4n2QM2n6J2j8O5m8K9k0L2mOn6K0
5290a0JQJ3J3q2M8L2n8L6J4j1l7j1O7J0%rlm5N7j8k9nJJ4j6J1oJ4L6Mm5l9P3r
5325A9p8R5m9j5J9J8J4n7J8L2o8O1k5nM6lk9J9L3qo8J3K6K9n2K4%m2N4j4Kj4%
5358eN2n6k5O6N9j04M0K2n2K0j9Qj6J8J%M0p3K7k0Pl4K2N9o1PL1N0o3j0nK9o2
5391d7J1O6oj6k3p1Q8j2Nk2O0k9J0m3M3j5RM0L4k0j19O5p3P4jm3L6j2l3N5m8O8
5423C1p4N9L0%r5M3M9n3K9m7j7K4R1m5l7L3J6p5O6o4J19j07O3k3k9j4J3Lj7l8
5453f6P7l7K3l7P6p7P2l4jj3K7l9j3lO7l2l4O1k2N1Ml3J5m1qm9N7J2o7J9R9r0
5485c6k4N4M3k6n8O9M6k5q1J13k0o8j1RN7n1K8k7K3L6l9j6Nk1K7l9j8J7k5L3M7
$$ plain form
5516 22 16 1 -19 37 -12 -6 -12 -22 -30 -107 1 -54 19 -11 34 12 -5 49 12 -28 -4 8 4 -9 -42 22 -8 -23 30 49 19 22 18
5549 18 -37 20 16 -5 4 31 -8 -14 23 10 59 38 35 13 17 5 15 -38 25 -18 -6 8 -11 6 -44 8 39 -10 18 -23 18 30 41
5582 41 56 -24 -18 -16 35 -10 33 4 19 -36 29 -4 -4 -29 -20 -2 -10 9 -19 3 30 -34 -48 -30 -3 31 -44 20 10 -21 -42 -40 43
5615 43 17 65 18 -13 26 14 -29 -15 30 -51 13 -26 -51 -14 -25 -6 41 28 29 -23 38 7 -19 29 -45 -12 -46 -21 -2 43 11
5646 11 -9 3 -1 -13 -43 -20 7 39 9 14 -9 49 13 -45 -3 -38 -12 -38 -25 27 10 0 8 29 -29 -17 -24 10 67 11 -50 17
5678 17 -5 22 2 -36 -12 -50 64 -39 -11 -4 9 -57 10 -1 -29 -13 -20 -26 81 -11 17 32 -52 8 -25 3 -51 -17 27 15
5708 15 2 -37 -8 -22 5 -28 -3 -51 25 -46 -51 26 -33 33 -29 -28 10 38 0 -34 -32 11 36 42 -38 5 -21 -31 59 -25 -30 -6 8
5741 8 11 7 -18 -70 -22 -28 -26 30 15 -15 32 -57 -17 -19 4 12 13 24 2 -3 14 33 5 30 -10 -6 0 28 77 -2 -12 21 12 -50 9 -1
$$ packed form
5516B2oj5k0N6m9Ooj0qp7J08n5P3l0M5k2j7N4l7m0K4J2mj3l3O4l0j5N3J9l0Lm
5549A8n5N7mk1RK7l9oL7j3M9k1lk2Mj2J0n3O3m3J2J4j9J7n0N2L1m9K8m1M1J2J1
5582D1J5q0OKN1m5M3k9J5n5O5l3%k5RJ8qJ9k8K2K7o4j4J8K7L4p5O4j0l1k1KQ3
5615D3k6M8m7l1L9j2m3J4M5q1O4l9k5L7j1J9M7j3Jn2O1l1k6M8p4L3l4K5J9M5l2
5646A1k0J2mj2l0K3K7L2l0Nk3N8l6n8M2l5K6k6J3N2j7j0QK1n8J2pL4N7n6o1O7
5678A7k2K7k0l8K4l8J14j03K8PJ3o6O7j1k8J6poJ07r2K8J5q4O0l3K8n4L4M4j2
5708A5j3l9K9j4K7l3K5m8P6p1nP7n9O6o2JL8K8l8l4KM3K5Oq0M3k6j0R0q4nK4J4
5741HLmk5n2M8oKN6j5l0M7q9M0kK3QJJ1k2nJ7J9k8K5m0MOK8M9p9j0L3ro2N9j0
$$ plain form
5777 -1 -27 -6 -15 41 5 -28 -29 22 -21 -55 5 -45 36 -1 28 -3 4 24 -51 71 29 -29 -19 -39 -6 -44 -11 -22 -5 -34 28 -13
5809 -13 -8 11 21 -24 -17 -18 -52 3 -7 30 21 -10 29 -33 -49 15 57 23 -35 28 62 35 -7 -24 67 -29 36 -17 62 -64 8 -64
5841 -64 33 67 -63 9 -24 9 -14 -53 40 -8 -24 39 61 -31 -22 49 10 -38 -58 23 -13 -6 -23 35 -8 -32 -26 28 -1 31 -14
5872 -14 -59 -13 11 -4 -13 -13 -52 5 -96 -80 7 31 22 21 33 -12 56 27 -10 6 -2 -45 33 11 25 25 26 18 -28 -46 -44 66 -13 -5
5906 -5 -27 -11 -6 -27 -16 -42 -28 -35 15 -40 17 -19 -14 -41 28 6 54 -35 34 -21 -5 32 24 26 -51 24 -26 53 -10 -68 -39 -22 -50
5939 -50 38 16 27 11 -18 14 38 -19 -12 14 -16 -9 60 -16 -10 -12 10 -4 -41 -48 1 2 21 -36 -63 26 -55 27 29 -9 50 -39 -15 -8
5973 -8 5 52 24 32 -1 -14 -14 -41 -5 3 -36 -27 -7 2 -18 -50 17 -35 -12 -24 10 -2 -46 4 -1 -8 -42 -23 20 -32 -12 34 -49 16
6007 16 -61 -13 -8 -15 15 -45 -10 -18 -29 21 -23 -25 -25 -7 2 39 -23 -45 7 27 -11 -9 -2 -51 -7 21 2 4 7 -5 53 -6 -2 -27 -36 33
$$ packed form
5777ak6K1rN6l6l3jN1m3l4O0n0Q1l7K9l1PK0p5J22m2n8J0k0L3l8L3j1J7k9O2m1
5809a3NJ9J0m5Pjl4N5j0L7rl1L9o2j6O4M2l4n8O3L4k7m2j7R1r6O5n3P9j26P2p2
5841f4R7L4j30P2l3L3k3l9R3m8j6O3K2r2RP1l9m8k0Q1l6Pj7N8m3k4ON4k9L2m5
5872a4m5M6K4j5r%l9N7j01J6Q7K4rjJ2m5O8k9l7J6qm3P8k2J4%Jqm6j8KJ10p9Q
5906ek2J6Nk1J1k6J4pN0n5N7l6Nk7O9k2M8q9O9n5J6L7qKp7P5n0P9o3n8K9J7k8
5939e0Q8k2J1j6k9L2K4n7PK6l0PO9p6OkK2j4l7pM9JJ9n7k7Q9q1Q2Kl8N9q9K4P
5973hJ3M7k8Ql3j3%k7L6Ql9RK0Rk0l2O7n2K3j2L4j2m4N0npl4J9M3n2K0M6q3O5
6007A6p7M8NpL0o0L5qj1N0m4k%J8RL7o2k2N2K0l8KPm9M4K8j9KLj2N8n9Mk5rO9
$$ plain form
6043 33 -43 -27 0 17 -3 44 8 -8 -48 0 0 22 42 -9 -28 6 -11 1 1 -7 40 -36 34 -30 -15 -10 34 2 19 -24 -1 9
6075 9 15 -16 -16 15 -18 17 32 -16 38 -10 59 -28 -49 16 14 28 -40 29 7 35 -45 7 -40 -62 -18 4 46 -2 36 6 22 26 -44
6108 -44 39 -1 -26 -23 -27 40 -10 -82 -33 66 -41 -11 15 1 56 -21 -31 9 -33 37 -9 -15 -3 -11 -10 3 -45 34 -14 7 24 -27
6140 -27 16 22 9 -36 -19 54 24 -33 -13 -48 -36 5 26 54 16 7 -18 14 5 44 19 -35 28 -27 -8 -14 16 -26 -20 -37 24 27 -39
6173 -39 7 13 11 -60 3 -18 -21 -8 -15 -6 -1 12 -16 21 17 -21 40 -42 -45 30 -28 37 -18 -11 -31 7 -42 -13 -64 -15 17 3 20 -4 4
6208 4 23 28 -21 35 37 -11 15 -9 -7 44 12 24 -6 -28 -18 25 -14 -15 7 -7 -38 15 -17 6 46 13 -18 33 -41 -11 12 4 -33
6241 -33 51 -3 20 18 -46 34 -46 -3 43 -24 5 -15 -25 -2 -2 94 -60 7 -48 -22 -26 3 13 -24 22 -45 63 59 23 13 7 14
6273 14 -28 -2 11 0 8 -37 -15 -4 9 -7 13 0 7 27 36 70 10 -30 64 21 -15 14 14 46 7 29 40 32 19 46 34 3 -10
$$ packed form
6043C3p6J6K7J7k0M7l6j6m0M8%K2K0n1j9L4j7J2%qM7p6P0o4J5NM4l2J7m3K3J0
6075IOl1%L1l3L5J5m8N4m8O9q7k1O5kJ4o8O9k2K8q0N2m7k2M4K2M2m8L8l0J6Mp0
6108d4Q3m0k5LmO7n0p2M9R9j07L0K6j4N5p7j0M0m2P0m6oJ2qJJ3m8P9m8K1J7n1
6140b7M3Oj3m5J7P3l0n7K0l5J2M1K1K8l8rk5L2rL9k5n4O3n5J9oL0m2Oj7O1Lo6
6173c9M6Okp1O3k1lJ3pRNJ3k8L7ml8O1q2lP5n8O5n5Pk0L8m9K9n1M9L2j4J7k4Q
6208DJ9Nm9N6Km8K6k4KN1l2J2l0k2J0M3l9jK2j4l1N3l2K3M0l3l1N1p4L0K3ql7
6241c3Q4n4K3ko4Q0q0M3M6o7K9k0j0K3%R6j54O7n5K6mK9J0l7M6o7J08ml6j0oP
6273A4m2K6J3j1Qm5K2J1J3j6K0j3PK0RL4o0m0R4m3l6K9%L2l9K2J1qj3K7j2l1j3
$$ plain form
6306 -10 -6 25 -12 44 38 2 50 -4 -44 -8 25 -8 -18 53 31 -31 -12 -91 14 61 2 -15 20 41 5 76 -23 -43 -12 70 42
6337 42 -7 22 19 28 32 -16 20 -2 18 11 10 17 -2 -39 -10 17 40 -15 7 -3 24 -55 -34 11 21 28 -5 40 -21 2 20 -26 -32 11
6371 11 31 9 -35 -10 59 54 32 -13 -33 -60 -45 -20 7 10 24 -43 -23 0 6 6 3 7 -15 9 47 6 14 -42 9 -22 3 -7 -1 45
6405 45 3 -9 -16 -15 13 23 -30 -8 -1 3 -16 19 -3 -7 -46 -35 23 -13 11 23 -5 -16 37 3 46 -34 -7 41 -44 -55 -5 44 -18
6438 -18 -15 23 -44 -6 10 33 35 -17 18 -75 68 -11 -1 32 -1 10 -4 73 54 6 -7 25 -32 48 5 -16 45 -49 -25 -43 -54
6469 -54 -42 -1 -1 30 30 -44 -6 -4 -66 22 -41 13 16 -7 -27 19 60 42 13 8 14 -22 -2 -4 0 -51 6 -4 -6 9 2 34 13 -14 5
6504 5 7 41 12 -5 29 67 -42 -10 -47 -26 -13 -41 27 1 18 -22 -22 -13 -47 -16 63 22 52 -20 -2 -59 -14 -50 -48 -28 -11 -26
6536 -26 23 2 17 31 -19 -2 -31 -21 12 16 7 16 24 23 -20 -5 30 -9 5 30 -20 55 -74 -38 -40 -17 8 -19 -55 -38 2 -34 24
$$ packed form
6306a0ML1l7N6ol6M8n4m0L6L3l3j0P1k2o2J9p9J05M7n9j7L5K1l6P1r9k0L1Q2k8
6337D2m9K9lRMm8L6k2K0pjPj9l7K9K7K3n5K2j0K7p9K1M5J0Pl3M5o1K3J8m6oM3
6371A1K0k2m4K5O9nk2m5k0k7J5K5K7LJ4o7K0K3O%lMk2K4L8m1Qn6N1l1K5j0OM6
6405D5m2j2pJK8J0n3K2PMj9L5k2ml9J1N8l6K4J2k8j1N3l4M3q0K7M8q5j1N0M9o2
6438a8LL8o7L8J6K3Kn2L5r3J43p9J0L3l3J1j4P7j9m8j3L2n7Q0m3k1O1r4K4j8j1
6469e4J2M1%L1%p4L8Ko2Q8o3N4Lk3k0M6M1j8k9nOl6K0kMn1N7j0kJ5pL2k1k7J9
6504EKL4k9j7L4L8j09L2l7K1J3k8O8k6J7m0%Rl4L1P9m1L0p2J8n7M5l6KK0J7j5
6536b6M9k1J5J4n0J7k9J0L3MrRQjm3J5L5l9J4K5n0P5j29L6kK3K5k7l6J7M0l6N8
$$ plain form
6569 24 -2 -38 3 -9 -47 -16 -11 29 -25 -11 -8 -3 37 -16 0 10 -17 10 17 7 6 23 51 12 -9 -41 16 -54 -32 7 -63 -36 -11
6602 -11 78 36 -15 1 6 -2 0 -46 34 -17 -10 19 -28 -52 -42 -44 -20 -68 -27 -52 22 78 -26 0 11 -11 10 -24 36 -28 -5 -54
6634 -54 15 -17 10 -6 9 10 16 -26 5 -12 -15 5 31 24 -11 74 -7 14 13 38 25 -8 -32 -18 -43 56 -47 -57 -31 25 2 -8
6666 -8 -13 -11 -35 7 9 -3 39 -18 -2 9 13 -42 5 -1 9 0 20 -2 -10 -7 8 -26 2 -21 6 -1 19 -18 -34 -12 -47 -13 -59 -23 3
6701 3 8 -9 -19 7 -37 -23 -4 -25 30 -35 -50 61 -25 -14 -9 -14 5 -7 -20 -6 13 18 -16 -42 53 -2 -8 10 -9 15 -3 -43 -36
6734 -36 5 -5 -28 -10 7 -28 -54 -5 2 -38 -25 -16 -61 17 -8 -34 -25 -8 23 -55 -2 36 21 -6 0 28 26 5 -18 -17 -8 18 -29 1
6768 1 -44 -19 8 8 0 -9 47 10 8 20 -10 27 3 -16 -30 54 -23 -15 55 -36 44 -5 17 22 -8 25 53 -6 -21 -9 -2 3 -18 -26 15
6803 15 -45 15 6 -17 -47 -30 12 7 -4 24 -5 10 9 -42 -7 -57 9 13 -29 14 6 22 -15 8 55 -34 14 -7 6 -15 -19 -6 -24
$$ packed form
6569B4k6l6M1j2l8L1NM0n4J4LNM0n3J6J0k7K7Pj0jJ7K8l9k1l2N7p0K2L9p0K7K5
6602a1Q9m2n1J6NqKm6Q0n1PK9m7k4J0kK4m8M1k5P4N6j04K6J1k2K1l4O0o4K3m9
6634e4O9l2K7j6J5JOm2L1j7lK0K6pl5Q5q1K1jK5j3l3k4J4k5R9j03j0K6N6k3j0
6666hnKk4M2Kj2M2n7J6J1Mn5M7oJ0rK0k2qLJ5l4K8k3K7pK0l7j6K2l5L4m6L6K6
6701CNj7j0K6m4J4J9k1N5o5j5J11q6J1NnJ9j2j3J4J9Nl4k6R5n5oJ8j9K4j8m0P
6734c6M1j0k3J8J7l5k6M9Pm0J3Rm5P8k5k6RJ7L1p8N3L8j5k7OK8kk1k3JRK6m7L0
6768Am5K5K7%qrN6l7kJ2l0L7k4j9j4Q4p7QP0r1Q0m9K2Nl0L3K8n9j5J2PNk1qM1
6803A5o0O0rk3l0J7M2nj1K8k9J5jn1L5n0O6Mm2M3qJ6l7K3M7q9M8k1J3k1mJ3j8
$$ plain form
6836 -24 21 8 21 7 34 12 -13 45 -67 -13 3 3 -63 -51 37 6 45 13 -11 48 51 -9 36 15 -35 -65 11 27 -80 -50
6866 -50 -10 -42 -48 7 -13 -61 -21 14 -5 -26 -25 11 18 5 -37 -18 37 -46 -57 -15 10 -19 7 21 49 34 31 -37 -10 -15 22 -57 3
6899 3 -3 36 26 22 -24 -15 -30 17 7 27 -16 0 -6 56 46 17 15 20 18 -11 -6 -34 -22 -56 7 49 -11 -19 35 10 79 -1 0 22 -22 -51
6935 -51 35 -59 25 40 -13 -24 -11 -28 -28 8 21 -1 7 27 -36 -1 15 0 49 8 -9 7 -60 32 15 -78 8 16 10 52 -31 11
6967 11 -41 -22 4 7 -13 -11 10 -5 40 56 -21 22 -25 0 -13 31 -19 44 -30 -6 -39 -61 -34 -15 -8 -20 6 -50 26 -26 18 -75
6999 -75 23 -56 46 -13 36 27 -84 -1 -39 -5 24 -33 34 28 -18 30 29 77 60 15 28 -6 9 22 6 12 22 -30 -60 33 -71
7030 -71 14 -11 -26 -35 -9 -11 6 -22 -10 -28 12 -20 -14 -4 -18 18 14 -37 -21 16 -23 -28 -1 -12 -1 23 -15 30 -19 3 -10 -12 -20 -10
7064 -10 18 -4 -20 57 -15 -7 96 -12 45 4 1 -26 -45 21 22 33 -12 38 18 -37 -4 51 -2 17 32 22 -51 5 24 -17 -42
$$ packed form
6836b4M5j3J3j4K7k2k5N8j12N4J6%o6J2Q8l1L9l2k4N9Lo0M5k1n0l0P6J6j07L0
6866e0M0l2oN5k0m8M0L5j9k1JL6Pj3m2J9N5q3j1M2K5k9K6J4K8j5lo8K7nL7p9O0
6899CoL9j0mm6Rj5M7j0K0m3J6oO2j0k9kNkk9Nk8J2l4O3M2o0qN4k5O9q0JK2m4k9
6935e1Q6r4Q4J5n3j1J3j7%L6J3k2QK0o3L5J6j5M9m1j7J6o7R2j7r3Q6QoM2q3M2
6967A1n2J9K6Lk0KK1j5M5J6p7M3m7K5j3M4n0O3p4K4l3k2K7J9Pj2K6n6P6n2M4r3
6999g5R8p9J02n9M9rj11Q3l8L4K9n7O7om6M8jM8j7m5J3l4J5J3j6OJ0n2l0R3j04
7030g1Q5k5j5rK6kJ7k8J2j8M0l2OJ0j4L6mn1J6L7l9nK7j1J1K4l8M5m9K2j3kqJ0
7064a0K8k2j6P7p2QJ03j08N7m1lk7j9O6JJ1m5N0k0n5L3N5n3J9J5j0p3N6J9m1k5
$$ plain form
7095 -42 7 4 6 15 35 52 -5 -62 -29 -23 5 3 -34 24 30 -34 13 -1 -7 -6 28 11 -18 -2 1 -24 -28 32 -48 14 -67 -9 -23 38 12
7130 12 -20 -47 2 5 -5 -38 -3 39 2 -16 15 25 -18 -2 -11 4 -11 2 -30 39 -51 -2 -52 11 -17 54 -30 -21 8 -69 -15 40
7162 40 -1 -45 19 -10 53 -2 27 73 25 -4 2 59 -2 12 22 40 -40 -36 5 -48 45 -10 8 -9 4 -6 6 19 -28 -12 37
7193 37 -64 38 4 43 49 -5 -4 48 52 5 16 -85 -2 23 16 -11 -27 22 -24 49 26 -58 22 -20 -45 5 14 25 -41 42 4
7224 4 -34 44 -19 32 -7 -68 9 -20 48 -9 28 18 56 11 -28 -9 -18 -51 31 6 -23 -25 -10 4 32 59 6 46 -65 -2 6 -13
7256 -13 -28 -40 69 20 -2 -33 8 6 33 -19 -11 68 33 20 -15 30 -31 29 -1 6 -26 -44 56 -33 27 15 21 -20 56 56 37 -34
7288 -34 3 -59 0 6 -3 -14 -39 -18 6 17 26 46 5 -21 -78 81 -10 2 -39 1 29 29 -24 12 0 18 51 10 -56 37 -59 36
7320 36 -35 2 -27 -36 -38 48 -22 12 56 42 -17 -21 -18 -23 -4 24 58 9 26 11 16 23 -25 -48 14 -36 10 17 -12 11 -38 31 1 0 15
$$ packed form
7095d2M9lKRK0J7n7n7L3OK8kl7N8Oo4M7j4oJL4j7k9J6Lk5mO0q0O2q1N8j4O1k6
7130A2l2k7M9Lj0l3L5M2l7j8L1J0m3J6rJ5j5J3l2O9r0M9n0O3k8P1q4RK9p7N4N5
7162D0m1m4O4k9O3n5K9M6m8k9ON7o1J4J0J8q0MM1n3R3n5J8j7J3j0J2J3m7J6M9
7193C7j01J02l4L9On4JN2Mm7J1j01Q3K5pk7j6M9m6P3k3q4Q0m2k5N0RJ1o6Q3l8
7224Dl8P8o3N1l9o1P7k9O8n7L7j0L8m5l9J9rl3Q2k5k9kJ5J4K8K7n3M0j11O3Qj9
7256a3j5j2J09m9k2l1M1kK7n2QP9l5j3l5M5o1O0l0Pl2j8J00q9O0j2Om1P6%j9p1
7288c4L7o2N9Orj1k5K1K4J1RK0m1k6n7J59r1J2m1M0K8%n3L6j2J8L3m1o6R3r6R5
7320C6p1L7k9rkQ6p0L4M4j4n9mLnJ9K8L4m9J7j5NPm8k3O2n0M6Pk9K3m9O9l0jJ5
$$ plain form
7355 15 -17 -31 -33 23 -4 8 -19 3 -10 47 -44 -7 -18 -43 12 -47 -3 4 -15 -2 59 -39 34 5 -30 -42 -43 -81 -5 -6 -48 -39 32
7388 32 -30 16 24 14 49 20 -22 34 -27 24 -1 3 21 13 -31 28 -9 -18 -37 -14 20 -28 17 -28 51 -49 -21 60 -30 39 -7 22
7420 22 20 1 20 -13 37 28 -41 58 34 -51 -20 -8 -8 -37 53 -25 89 -14 54 61 -27 -8 -5 25 -20 -16 61 29 -2 -10 -39 -15 -17
7453 -17 -14 -77 -13 -24 -18 -18 -18 -62 -17 -73 -24 -8 -41 -18 -37 1 0 11 -10 15 19 47 3 3 33 -19 44 35 -48 44 47 -73 23 26 -24
7488 -24 -18 7 11 -40 -43 -40 -31 16 -38 12 -60 17 -38 3 9 -8 -8 4 25 11 56 -5 -10 -30 47 13 -49 -66 33 -29 23 -13 -13 35 -14
7523 -14 11 11 54 -124 66 -4 -5 -10 61 -10 27 -20 -23 0 -28 17 -23 -51 -35 -7 42 -36 24 52 26 46 -38 -41 -28 15 21 -77
7555 -77 21 -1 -43 20 -17 -41 2 16 5 -43 -27 -14 -43 17 31 -31 15 16 6 -6 19 12 -36 -34 -36 13 -53 -18 -6 18 6 5 -35
7588 -35 -10 71 6 56 19 -16 11 5 9 -2 39 -13 -22 3 55 -65 -33 46 -2 34 45 -42 11 -28 -18 -29 3 13 -70 -57 52
$$ packed form
7355A5l2j4kN6k7J2k7K2j3N7r1L7j1k5N5n9M4Pj9J3O1r8P3k9l5j2jl8P6jm2RP1
7388C2o2M6Qj0L5k9m2N6o1N1k5MJ8qm4N9l7rj9K3L4m8M5m5P9j00K8Q1r0O9m6K9
7420B2kj9J9l3N0ro9R9k4q5L1J2%k9R0p8J14j03O8Pq8J9LL0m5MP7l2l1qk9K4k
7453a7Lo3O4j1O%%m4M5n6M9J6l3K3j9L8jJ1k1K5MK8m4%L0n2O3rq3R2Lj20R6Ln0
7488b4OK5Mn1lLRM7n4N0p2P7n5M1Oj7%J2K1j4M5o1nk0P7l4o2j7R9o2N2l6%M8m9
7523a4K5%M3j78J90p0jnP1p1L7m7lK3k8M5m0k8J6K8M9p8O0K8k6K0q4lJ3M3Or8
7555g7R8k2m2O3l7k4M3J4j1m8J6J3k9O0J4o2M6Jj0j2K5pm8KkM9o6L5J2K4j2jm0
7588c5K5Q1o5N0l7l5K7oMj1M1n2rK5N2j20L2P9m8L6J1q7N3l9J0j1L2J0q3J3J09
$$ plain form
7619 52 6 35 48 -14 -4 -52 -19 32 -36 -39 -8 -21 -56 35 -27 21 2 -23 -8 36 25 -23 -12 8 29 -10 -6 36 13 44 19
7650 19 -17 0 -22 -46 36 0 25 30 7 -7 -62 7 -9 -48 -17 -2 41 51 -25 5 23 41 -12 -60 -14 -7 21 4 -35 19 1
7681 1 5 39 28 -16 -7 -13 7 -32 71 -20 -33 55 11 29 27 28 -4 -25 -23 -17 70 -8 4 4 21 2 -42 4 -40 10 11 -7 -24 6 80
7716 80 -54 -6 12 -69 -62 -68 12 2 2 1 -40 13 -1 104 -22 -12 43 -48 -21 -19 11 -27 -8 -5 -25 44 -21 -2 -8 42 -19 10
7748 10 24 -51 36 -31 57 19 7 -22 22 18 -15 -39 -47 -20 -17 66 -8 61 -33 -15 31 -21 12 -34 14 -42 -24 29 55 -37 27 60
7780 60 -11 -55 -7 4 -29 8 10 3 -19 47 -34 4 26 -17 -21 95 -15 -4 -67 42 5 39 -23 7 -2 2 16 -23 20 -28 -40
7811 -40 -1 51 8 33 -49 -24 8 -4 25 9 45 4 -18 -3 36 17 -8 14 66 -17 27 -10 -26 -12 -60 -47 7 76 6 10 -14
7842 -14 19 -39 27 -2 -8 1 13 40 27 28 -22 60 14 -23 9 -62 7 -49 2 21 -31 22 -13 -77 21 22 38 44 13 61 40 9 -32
$$ packed form
7619E2m6K9J3o2J0m8L3N1o8lL1j3l5R1o2M8j9k5J5M4j1m8J1K0K1l9MM2k3L1k5
7650A9l6J7k2k4Q2l6K5Nk3j4n5O9j6l9L1J5M3J0p6L0J8J8n3m8M6PK8j7l9N4j8
7681AML4j1m4RoK0l9J03r1j3Q8m4J8kJl2k1KOQ7p8J2%J7j9m4M6m4N0Jj8j7L0P4
7716H0j34M8J8q1PoQ0j0%jm1N3j4J05j26J0N5r1K7KL0l8J9Lk0O9o5J9oN0o1K9
7748A0J4p5Q7o7Q8l8j2k9M4ml3k4qK7LQ3p4O9r4J8M6n2L3m6M8n6J8N3K6r2O4L3
7780F0p1m4M8J1l3L7Kpk2O6q1L8K2m3mJ16j10J1o3J09l7L4o2L0rMJ4l9M3m8j2
7811d0L9N2m3K5q2K5L2j2K9j6L6m1k2J5L9j9k5K2N2q3M4l7j6J4m8J3N4O9p0Mk4
7842a4L3n8O6k9oRJ2K7j3Jn0Q2m6l7L2p1O9n6N1J9n2N3l5o4R8JJ6Ol1M8k1l1m1
$$ plain form
7875 -32 32 -3 37 27 -27 -1 44 -61 -43 10 -27 4 -1 32 -33 0 4 29 -21 5 -33 19 70 6 26 -16 4 11 -62 17 17 39
7907 39 -16 -21 6 -63 -4 -4 -11 75 -41 -33 16 -38 -55 29 13 -5 66 24 -25 26 8 -23 35 -11 -4 -33 -53 15 22 -26 -21 -13 5 -1
7941 -1 -19 -37 -88 -3 5 49 4 35 19 9 20 11 -40 3 -11 -83 -9 12 13 57 58 -3 -11 24 -2 -29 -40 -31 -8 4 -38 30 54 -16
7975 -16 -78 -36 13 23 -36 -43 -35 48 51 25 6 -26 42 17 -1 -35 54 15 11 -16 16 -35 6 -3 -18 -58 -65 -38 -4 15 -16 -13 -29 -22
8009 -22 32 -28 -36 16 -54 -28 29 31 44 -43 -11 -26 14 25 -4 -13 -32 12 26 -38 -24 -42 27 35 -5 12 35 58 2 -62 -11 -55
8041 -55 9 44 58 56 -17 10 -47 13 44 -10 -28 14 33 -21 35 -34 2 -23 -16 51 17 -24 -11 -33 -4 8 48 -28 34 54 -3
8072 -3 -36 26 11 31 -35 -30 38 -40 -29 59 -32 -31 5 16 -3 2 -15 -10 -10 16 -18 -9 -56 -1 4 -3 53 38 -47 -22 16 -9 0 31 37 3
8108 3 -18 7 -27 14 -16 -10 50 -11 -20 3 -21 -24 10 -14 -1 22 26 6 19 6 -7 2 14 1 -47 -15 -71 -9 -58 28 35 19 29 2
$$ packed form
7875c2O4l5M0j0n4K6M5j05J8N3l7L1nL3o5L3MK5n0K6l8N2N1o4K0m2K0Pp3P9%K2
7907C9n5nK7o9N9%pQ6j16QM9n4j7Q4j6j8P1m2m9N1j8l1N8m6Pk9k0O8Pm8NQJ8o
7941aj8j8n1Q5QM4m5L1j6j0J1rn1M3j4p2P4K1JM4Jo1qL5k6k7j1RK3J2m2O8K4p0
7975a6o2M2M9J0n9pQQ3Lk6j9l2O8k5j8l4Q9l9mk7L2n1M1rj5m0pK7L4J9l1Lj6P
8009b2N4o0qN2p0K6N7KJ3q7L2j5M0J1k9rj9M4J4o4J4j8O9Qm0J7K3K3n6o4N1m4
8041e5O4L5J4kp3K7n7O0L1n4j8M2J9n4N6o9L6k5PO7l4m1J3k2K9J2M0p6O2K0n7
8072cl3O2j5K0o6NO8p8J1Q8r1JL6J1j9Nj7N%K6l4Rm7N5NpN6j5q5K5L8k5RL1Ol4
8108Ck1K5l4M1l0OO0o1rK3k4lL4k4J3K3Mk0J3j3j3RJ2j3m8L2n6O2m9Q6Pj6J0k7
$$ plain form
8142 2 -5 -18 46 7 42 -16 -25 -41 -46 31 8 -2 -7 3 -17 21 -39 -16 20 -36 54 -2 -1 -3 -16 -36 -2 -43 -29 -9 40 7 -24 20
8176 20 -9 9 -21 -45 8 8 26 -24 33 20 -34 5 19 18 35
$$ packed form
8142Bpj3O4l9L5n8rj6nP7k3j0nJ0k0L8o0K3L6n6R0n6Jkj3k0L4m1J4K0M9l3l1M4
8176B0k9J8l0k4N3%J8n0N7j3n4L9J4jJ7
8191C5
$$ Imaginary data points
##PAGE= N=2
##DATA TABLE= (X++(I..I)), XYDATA
$$ plain form
0 0 0 0 0 0 0 0 0 0 0 0 -8 8 -8 16 -16 16 -24 32 -33 40 -55 64 -72 88 -104 120 -136 160 -184 210 -240 275
32 275 -312 352 -400 449 -504 563 -631 705 -784 869 -963 1067 -1180 1306 -1439 1587 -1748
49 -1748 1926 -2121 2337 -2576 2843 -3143 3482 -3864 4307 -4824 5432 -6166 7067 -8206
63 -8206 9700 -11749 14739 -19535 28431 -50371 215906 166294 -346052 110046 234491 -202313
75 -202313 -95492 312797 -48817 -320778 55519 161651 -170297 -62411 138881 -94145
85 -94145 -195065 95922 121794 -84713 -48852 70631 -34281 -68925 97832 101823 -106817
96 -106817 -81839 88951 -1290 -96806 85623 70513 -186360 -71793 190516 -8819 -156402
107 -156402 128048 99789 -216423 17241 296069 -62012 -190230 191831 99504 -215206
$$ packed form
0@%%%%%%%%%%qJ6j6K4l2L2m0N6o5P3r5J19j36J60j92K24k56K96l44L94m50N15
32B75n87O64p52Q49r53J067j194J336j489J653j832K030k247K486k745L026l335
49a748L674m047M458m913N419n986O625p346Q171r131J0256j1598J3233j5273
63h206J7906k1449K6488l4274M7966p8802K66277m9612n12346M56098J24445m36804
75b02313J06821M08289l61614k71961L76297J06132l31948J07886K01292k33026
85i4145j00920K90987K5872k06507L5861J19483j04912l4644J66757L991k08640
96a06817K4978J70790r0241r5516J82429j5110k56873J14567K62309j99335j47583
107a56402K84450k8259l16212K33664K78828l58081j28218L82061r2327l14710
$$ plain form
117 -215206 71958 248541 -154378 -188191 179685 51285 -196633 50353 129634 -174341
127 -174341 -114577 156550 26182 -127371 34410 68097 -83636 -19302 126253 29376 -85826
138 -85826 13740 71478 -30677 -19132 83480 -3424 -115581 7124 86052 -58827 -67775
149 -67775 75814 -21413 -141246 56399 120274 -113175 -69947 132435 -22478 -124505 121204
160 121204 109847 -150318 -33113 160926 -34769 -105653 123996 56028 -156902 7342
170 7342 142238 -55472 -79319 93530 14484 -103510 37666 99833 -48443 -56104 62925
181 62925 18633 -57284 28911 62478 -48648 -55212 47273 23293 -58447 -3978 43399 -52730
193 -52730 -64815 59230 27178 -88483 -3585 65861 -57685 -48556 93150 15604 -97316
$$ packed form
117b15206K87164J76583m02919l3813L67876j28400k47918K46986P9281l03975
127a74341N9764K71127j30368j53553J61781L3687j51733O4334J45555r6877j15202
138h5826R9566N7738j02155J1545J02612q6904j12157J22705P8928j44879q948
149f7775J43589r7227j19833J97645O3875k33449M3228K02382j54913j02027K45709
160A21204j1357k60165J17205J94039j95695p0884K29649o7968k12930J64244
170G342J34896j97710k3847J72849p9046j17994J41176O2167j48276p661J19029
181F2925m4292p5917Q6195L3567j11126o564J02485k3980q1740N4469M7377r6129
193e2730j2085J24045l2052j15661Q4898O9446j23546R129J41706p7546j12920
$$ plain form
204 -97316 32586 85334 -60591 -27039 105019 -7156 -91512 63348 73411 -75648 -11766
215 -11766 85758 -33746 -67094 66103 38496 -74737 -5655 60783 -33580 -45696 53078
226 53078 17826 -63736 658 48711 -24549 -34070 36645 14093 -49046 -1346 49003 -17175
238 -17175 -41925 34797 22172 -50526 1917 54538 -25020 -43390 44839 22565 -54427 8291
250 8291 56305 -35259 -39287 57179 12319 -60007 21707 47867 -46418 -23497 56337 -4751
262 -4751 -52306 28312 34977 -46010 -12690 49828 -13170 -42004 32480 23597 -41555 -2884 40154
275 40154 -13925 -30702 27102 18997 -34315 -3670 36965 -11422 -30691 25166 17912 -33305
287 -33305 -2067 34900 -12837 -30486 24674 18940 -34193 -2665 36448 -17403 -30902 31639
$$ packed form
204i7316J29902N2748j45925L3552J32058j12175q4356J54860J0063j49059O3882
215a1766R7524j19504l3348J33197k7607j13233O9082O6438r4363j2116R8774
226E3078l5252q1562O4394M8053p3260r521P0715k2552o3139M7700N0349o6178
238a7175k4750P6722j2625p2698N2443N2621p9558j8370Q8229k2274p6992O2718
250H291M8014r1564m028R6466m4860p2326Q1714K6160r4285K2921P9834o1088
262d751m7555Q0618O665q0987L3320O2518o2998k8834P4484q883o5152L8671M3038
275D0154n4079j6777N7804q105n3312L0645M0635m8387j9269N5857p254n1217
287c3305L1238L6967m7737j7649N5160n734n3133L1528L9113n3851j3499O2541
$$ plain form
299 31639 14688 -38004 4430 33615 -22459 -22695 34499 8376 -36695 10152 31805 -24556
311 -24556 -15225 36036 -838 -33417 17309 23899 -25880 -9373 28050 -6692 -28296 15745
323 15745 17916 -26629 -9175 24663 -8503 -23268 17386 13945 -22917 -4148 24570 -3212
335 -3212 -18181 17163 16384 -20559 -2164 27575 -5365 -19800 18022 11814 -23402 -1409 22998
348 22998 -11424 -21943 16851 8501 -26790 499 22197 -16712 -17291 22185 3768 -23819 7686
361 7686 19248 -15593 -10085 21890 1519 -20477 10427 17141 -16160 -6138 20094 -2172 -15674
374 -15674 11569 12847 -13242 -4565 17443 574 -13827 9840 12439 -14651 -5011 17552 -2700
387 -2700 -16489 7068 7889 -17108 -6586 15055 -6849 -20983 7713 7741 -19437 -2255 16632
$$ packed form
299C1639j6951n2692M2434K9185n6074k36N7194k6123m5071M6847K1653n6361
311b4556R331N1261l6874l2579N0726O590m9779J6507L7423l4742k1604M4041
323A5745K171m4545J7454L3838l3166j4765M0654l441l6862J8769K8718k7782
335c212j4969L5344p79l6943J8395K9739l2940j4435L7822o208l5216K1993K4407
348B2998l4422j0519L8794q350l5291K7289K1698l8909n79L9476j8417k7587L1505
361G686J1562l4841N508L1975k0371k1996L0904O714l3301J0022K6232k2266j3502
374a5674K7243J278k6089Q677K2008j6869j4401K3667K599k7090R640K2563k0252
387b700j3789K3557Q21k4997J0522K1641k1904j4134K8696K8k7178J7182J8887
$$ plain form
400 16632 -11106 -15284 15690 8236 -14575 4388 16564 -8454 -6778 20634 7641 -13305 7203
413 7203 14367 -7998 -1509 16686 579 -13085 3833 10036 -6518 -5627 8464 -2883 -15416
426 -15416 2650 10091 -9698 -9730 5993 -2608 -12613 5020 10871 -11774 -10573 11979 1616
439 1616 -11340 10018 9654 -16358 -3743 17736 -1013 -10401 9464 3738 -15242 2462 17300
452 17300 -6182 -11828 9091 1734 -10440 7876 11449 -9443 -7482 8571 4242 -3842 3587
465 3587 5025 -7862 -6470 8857 5652 -7497 -3150 2910 -4961 -4154 9419 5361 -11296 -3206
479 -3206 11339 -163 -2594 14025 2722 -14037 6304 16044 -5387 -4335 9461 -6552 -15047
492 -15047 8059 7863 -17108 -10113 4326 -11256 -11192 9561 -636 -17234 -2600 7374 -1726 650
$$ packed form
400A6632k7738m178L0974p454k2811J8963J2176k5018J676K7412j2993k0946K0508
413G203P164k2365O489J8195j6107j3664J6918O203j6554Q91J4091j1347j2533
426a5416J8066P441j9789l2J5723q601j0005J7633N851k2645J201K2552j0363
439A616j2956K1358l64k6012J2615K1479j8749r388J9865n726j8980J7704J4838
452A7300k3482n646K0919p357j2174J8316L573k0892J961J6053m329q084P429
465C587J438j2887J392J5327l205j3149M347O060p871Q07J3573m058j6657Q090
479c206J4545j1502k431J6619j1303j6759K0341R740k1431J052J3796j6013q495
492a5047K3106j96k4971O995J4439j5582O4K0753j0197j6598J4634R974r100K376
$$ plain form
506 650 8901 1260 -5392 5439 13385 5390 244 3699 2768 -600 4003 9257 1241 -8933 -863
521 -863 7075 -2061 -812 8767 -4317 -11415 8689 10380 -6722 136 7547 -8968 -7427 12991
535 12991 2302 -16660 -2482 2614 -14818 -5241 9382 -10484 -17805 2192 1748 -8026 2747
548 2747 6411 -6418 -3711 10721 9264 1904 5050 5620 1227 3994 8595 6167 -471 -4461 353
563 353 3397 -2728 -1250 2585 -8046 -8918 6231 3393 -7445 1091 4468 -7521 -654 13766
577 13766 728 -9172 6302 4604 -9149 4246 10331 -10876 -9319 7433 -2346 -9054 4466
590 4466 957 -12265 -2467 7812 -1608 -3730 4584 139 -4048 4778 6396 -209 -554 280 373 1647
606 1647 -59 47 66 -5593 -3771 4076 -392 -5583 1547 1584 -5741 1828 9596 -1482 -3848 9050
$$ packed form
506F50Q251p641o652J0831P946p995n146L455r31l368M603N254q016j0174Q070
521h63P938r136J249R579j3084p098K0104J691j7102O858P411j6515J541K0418
535A2991j0689j8962J4178N096j7432R577J4623j9866p321J9997m44r774J0773
548B747L664j2829K707J4432j457p360L146N70m393K767M601k428o638l990M814
563C53L044o125J478L835j0631q72J5149k838j0838Q536L377j1989O867J4420
577A3766j3038r900J5474j698j3753J3395O085k1207J557J6752r779o708J3520
590D466l509j3222R798J0279r420k122Q314m445m187Q826J618o605l45Q34R3J274
606A647j706J06J9n659J822P847m468n191P130L7p325P569P768j1078k366J2898
$$ plain form
622 9050 3866 -4695 8600 8947 -7424 -281 9869 -3468 -5244 6860 -1304 -10871 841 3779
636 3779 -8220 -4619 3515 -5371 -7039 3804 606 -5668 775 1937 -2444 671 2564 222 46
651 46 39 711 1952 -198 -999 2064 476 -2849 1557 3786 -2991 -1372 6143 -447 -4244 6400 3806
668 3806 -5719 3348 7049 -4804 -1666 7658 -1297 -5918 4372 2017 -7730 -266 4880 -5811
682 -5811 -4788 4068 -2659 -5970 3252 1270 -5026 170 2590 -1595 149 2990 411 -1000 1153
697 1153 1897 981 804 -98 -126 311 -1070 390 2368 -2613 -3373 2822 15 -3661 3186 1890 -5656
714 -5656 274 5679 -1640 -2259 4875 60 -5079 3728 5355 -4414 -1444 4422 -3105 -3145 5256 242
730 242 -5674 500 1691 -2857 229 2879 -1977 -3155 1707 1745 -697 983 712 -1980 -117 1744
$$ packed form
622I050n184q561J3295L47j6371P143J0150j3337j776J2104q164r567J1712K938
636C779j1999L601Q134q886j668J0843l198o274O443J162m381L115J893k342j76
651D6pO72J241k150q01L063j588l325M406K229o777J619P515o590l797J0644k594
668C806r525R067L701j1853L138R324q955m621J0290k355r747P464N146j0691
682e811J023Q856o727l311R222j982o296N196K420m185J744K841k579j411K153
697A153P44r16j77r02k8M37j381J460J978m981p60O195k807l676O847j296p546
714e656N930N405p319o19P134m815n139Q807J627r769K970N866p527m0Q401n014
730B42n916O174J191m548L086K650m856j178M862L8k442J680k71k692J863J861
$$ plain form
746 1744 1073 456 -1419 -1428 1266 78 -368 2129 -953 -3740 1371 3066 -1449 -448 2421 -1893 -2750
763 -2750 4246 2844 -3960 -64 2666 -3504 -704 5022 -1561 -4855 1429 892 -2771 1062 2240
778 2240 -3262 -2719 2706 1162 -1468 1561 622 -2562 870 3091 386 -193 111 -408 466 1151 1162
795 1162 512 -1563 -1220 1268 1067 -553 -119 -16 -1972 -942 2611 397 -3182 116 723 -2885 562
812 562 3079 -2574 -2992 1914 264 -1783 1789 1525 -2841 -721 3419 564 -981 2395 568 -2070
828 -2070 1970 2858 -785 -303 859 -778 -329 1104 305 -1467 -1402 -332 -146 -400 -290 -723 -1176 -936
846 -936 -134 1019 -257 -1583 454 400 -1221 1258 1752 -1767 -606 2057 101 -685 1843 866 -1817
863 -1817 587 2723 -448 -709 2371 -34 -1594 2133 1461 -1805 110 1018 -1262 -698 851 -620
$$ packed form
746A744o71o17j875rK694j188m46K497l082k787N111J695m515J001K869m314q57
763b750O996j402o804L896K730o170K800N726o583l294O284n37l663L833J178
778B240n502N43N425j544k630L029r39l184L432K221k705n79L04n19Q74O85J1
795A162o50k075L43K488k01j620M34J03j956J030L553k214l579L298O07l608L447
812E62K517n653m18M906j650k047L572k64m366K120M140k855j545L376j827k638
828b070M040Q88l643M82J162j637M49J433p99j772O5J070J86k54J10m33m53K40
846i36Q02J153j276j326K037n4j621K479M94l519J161K663j956p86K528r77k683
863a817K404K136l171k61L080k405j560L727o72l266J915R08k280N64J549j471
$$ plain form
879 -620 -1907 -507 -11 -1360 -869 -65 -1289 -1008 146 -307 -71 46 -305 707 677 -159 1116 1078 -445
898 -445 789 1665 -67 -211 1250 488 -1041 607 1281 -1560 -746 1650 -842 -1594 1381 -178 -2030
915 -2030 796 984 -1388 -282 1030 -562 -786 1208 542 -1199 298 945 -701 325 1085 -600
931 -600 -266 760 -15 348 433 -461 -19 285 -190 374 432 -802 -824 343 74 -971 64 -1 -1978 -656
951 -656 1220 -1176 -1358 806 -1006 -1561 1427 734 -1356 153 1150 -240 492 2328 659 -655 1588
968 1588 1649 -31 1521 1516 -772 147 1386 55 117 259 -996 -905 56 -362 -671 -620 -1264 -1436 -258 -86
988 -86 -1153 -548 -420 -1780 -160 1243 -1028 -875 813 -910 -685 1755 422 -1318 394 990 -430
1005 -430 720 1984 -278 -784 1791 1105 -235 1675 950 -1248 695 1634 -211 202 582 -957 -584
$$ packed form
879f20j287J400M96j349M91Q04j224K81J154m53K36J17l51J012l0q36J275l8j523
898d45J234Q76j732j44J461p62j529J648O74k841Q14K396k492p52K975j559j852
915b030K826J88k372J106J312j592k24J994o66j741J497O47j646J026P60j685
931f00L34J026p75L63Q5q94M42L04m75N64N8j234k2J167k69j045J035o5j977J322
951f56J876k396j82K164j812n55K988o93k090J509R97j390P32J836j669j314K243
968A588O1j680J552nk288R19J239j331O2J42j255R1R61m18l09N1o44j72J178J72
988h6j067O05J28j360J620J403k271J53J688j723K25K440j333j740J712N96j420
1005d30J150J264k262n06K575o86j340J910p25k198J943R39j845M13L80j539L73
$$ plain form
1022 -584 566 -66 -761 -391 -824 -1169 81 196 -1079 -377 -40 -1274 268 1297 -997 -531 885
1039 885 -681 -412 1615 48 -1303 408 566 -878 288 1155 -1111 -1103 1275 -70 -1007 1152 10
1056 10 -1632 779 1070 -740 357 769 -741 -41 1174 205 -362 520 103 -569 827 711 -768 232
1074 232 587 -832 550 1192 -925 -231 990 -695 -365 1156 -291 -1220 415 256 -1227 27 727
1091 727 -1448 -1013 974 -716 -1288 992 -277 -1649 787 518 -1114 348 812 -707 21 1082
1107 1082 38 -269 948 314 -520 948 726 -696 655 858 -725 500 978 -770 88 994 -677
1124 -677 -436 915 -295 -913 497 107 -1323 99 749 -1162 -535 966 -883 -942 1181 -237 -1174
1141 -1174 771 178 -1067 532 854 -758 -126 743 -355 -393 916 60 -891 557 393 -775 666
$$ packed form
1022e84J150o32o95L70m33l45J250J15j275P02L37j234J542J029k294M66J416
1039H85j566K69K027j567j351J711J58j444J166Q67k266QK378j345r37K159j142
1056A0j642K411K91j810J097M12j510P00J215r69n67Q82m17o72J396j16j479J000
1074B32L55j419J382O42k117O94J221j685L30J521j447r29J635j59j483J254P00
1091G27k175M35J987j690n72K280j269j372K436k69j632J462M64j519P28J061
1107A082j044l07J217o34q34J468k22j422J351K03j583J225M78j748Q58R06j671
1124f77K41J351j210o18J410l90j430J422O50j911O27J501j849n9K123j418r37
1141a174J945n93j245J599L22j612O32Q69j098l8J309q56r51J448j64j168J441
$$ plain form
1158 666 636 -1014 233 796 -575 260 960 -636 -345 860 40 -479 655 150 -1094 255 903 -910
1176 -910 -258 819 -997 -640 1225 -219 -958 735 30 -908 622 777 -810 -254 659 -351 -300 901
1194 901 -74 -1094 470 227 -790 517 399 -1050 63 666 -338 233 723 -506 -339 836 299
1211 299 -259 527 116 -864 368 861 -712 -198 547 -1003 -490 1069 -420 -939 407 -215 -788 663
1229 663 589 -823 -187 677 -231 -70 1011 -46 -827 616 477 -533 586 348 -934 76 609 -320
1247 -320 22 334 -572 -384 615 286 -352 292 108 -603 380 724 -533 -139 427 -691 -234 765 -414
1266 -414 -769 325 -214 -605 478 347 -749 -128 601 -119 -59 897 -22 -550 811 460 -435 551 309
1285 309 -668 137 481 -360 -155 117 -470 -446 237 29 -507 11 68 -525 245 582 -413 -12 535 -303 57
$$ packed form
1158F66l0j650J247N63j371Q35P00j596K91J205q20n19J134n05j244J349O48j813
1176i10O52J077j816L57J865j444p39J693p05r38J530J55j587N56R13j010N1J201
1194I01r75j020J564k43j017J307j18j449J113O03j004N71M90j229J67J175n37
1211B99n58P86m11r80J232M93j573N14P45j550N13J559j489n19J346o22n73J451
1229F63p4j412O36Q64r08J61J081j057p81J443j39j010J119k38j282J010N33r29
1247c20L42L12r06J88R99l29o38O44j84p11R83L44j257L94N66j118M57R99j179
1266d14l55J094n39l91J083j31j096O21P29p20O0R56r19n28J361l51q95R86k42
1285C09r77Q05L44q41K05K72n87K4O83k08n36N18N7n93P70L37r95M01N47q38L60
$$ plain form
1306 57 698 -151 -310 414 -18 -334 303 228 -557 -121 496 -296 -234 546 -113 -531 634 202 -500 439 238
1327 238 -441 121 326 -335 -215 159 -199 -404 141 -72 -552 54 130 -521 54 321 -401 68 575 -190
1347 -190 72 562 -41 -28 451 196 -166 219 265 -283 9 360 -405 -363 381 -227 -480 356 -100 -562 291
1368 291 227 -316 125 246 -197 -28 448 96 -300 156 133 -344 237 298 -408 -37 241 -315 48 357 -270
1389 -270 -224 236 -131 -63 327 -23 -349 80 299 -128 50 268 -378 -262 485 -109 -294 235 -217 -453 277
1410 277 177 -354 -68 65 -259 -7 502 66 -228 263 238 -135 467 383 -364 54 275 -115 166 269 -406
1431 -406 -305 31 -166 -166 31 -264 -533 -53 175 -235 -77 150 -361 -67 628 41 -146 338 -129 -222 537
1452 537 283 -240 -52 14 -253 6 414 -144 -517 177 113 -190 447 243 -414 102 404 -8 306 348 -254
$$ packed form
1306E7O41q49j59P24m32l16O37p5p85M36O17p92O2P80o59m18J165m32p02R39k01
1327B38o79N62K05o61J20L74l58k05N45k13m80O06P6o51N75K67p22M69N07p65
1347a90K62M90o03J3M79k55l62L85M6n48K92L51p65M2P44o08k53Q36m56m62Q53
1368B91o4n43M41J21m43J69M76l52l96M56k3m77N81O1p06L71K78n56L63L09o27
1389b70M6M60l67O8L90l50l26M29K19m27J78K18o46J16P47n94j85N29m52k36P30
1410B77j00n31K86J33l24K52N09m36k94M91k5l73O02q4p47M18K21l90K81J03o75
1431d06J01L36j97%J97k95k69M80K28m10J58K27n11K94O95n87j87M84m67r3P59
1452E37k54n23J88O6k67K59M08n58l73O94o4l03O37k04o57N16L02m12L14M2o02
$$ plain form
1473 -254 -171 289 6 -131 -19 -187 -490 -46 143 -327 -195 11 -436 -135 485 -69 -149 307 -89 -22 563
1494 563 306 -159 75 161 -172 138 411 -211 -474 194 -81 -354 245 2 -595 102 240 -140 144 277
1514 277 -201 -58 417 280 -26 169 20 -335 124 255 -284 -130 39 -444 -127 231 -289 -265 182 -236
1534 -236 -86 358 143 -151 111 221 -12 156 439 -203 -224 394 -40 -277 262 -87 -505 164 153 -326 50
1555 50 151 -360 -76 328 56 -142 204 111 -204 264 359 -272 58 235 -213 38 267 -214 -184 140 -255
1576 -255 -110 210 -110 -274 121 161 -228 53 357 -219 -99 412 -50 -147 418 41 -332 283 192 -355 79
1597 79 177 -284 -120 231 -130 -255 167 17 -388 197 262 -320 79 217 -269 116 291 -188 16 258 -80
1618 -80 -116 131 -50 -295 86 51 -336 -64 187 -342 -153 311 -184 -242 402 -28 -238 353 171 -212 186
$$ packed form
1473b54Q3M60k83j37J12j68l03M44J89m70J32K06m47L01O20n54q0M56l96O7N85
1494E63k57m65K34Q6l33L10K73o22k63O68k75k73N99k43n97O97J38l80K84J33
1514B77m78J43M75j37l06J95j49l55M59J31n39J54J69m83L17L58n20K4M47m18
1534b36J50M44k15k94K62J10k33J68K83o42k1O18m34k37N39l49m18O69j1m79L76
1555E0J01n11K84M04k72j98L46r3l15M68R5o31L30J77m48K51K29m81L0L24l95
1576b55J45L20l20j64L95M0l89K81L04n76J20N11m62r7N65l77l73O15r1n47M34
1597G9R8m61J64L51l61j25M22j50m05N85O5n82L99J38m86L85J75m79K04K42l38
1618h0l6K47j81k45L81l5l87K72K51n29J89M64m95n8O44m30k10N91j82l83L98
$$ plain form
1639 186 254 -182 31 272 -127 -215 285 -65 -412 125 43 -390 90 180 -382 22 276 -180 -7 357 -38
1660 -38 -17 256 64 -136 158 124 -263 -20 184 -254 -70 218 -277 -226 283 -80 -209 272 11 -243 202
1681 202 226 -152 62 270 -106 -155 376 -43 -354 218 69 -382 150 152 -371 -29 147 -240 -62 200 -72
1702 -72 -116 271 158 -95 167 149 -199 101 221 -242 -76 227 -230 -164 251 -163 -222 121 -69 -181 160 132
1724 132 -199 63 208 -99 -74 333 -64 -281 270 -54 -339 131 22 -322 2 147 -249 42 203 -105
1744 -105 -160 248 170 -132 187 153 -176 58 351 -179 -47 227 -234 -88 151 -141 -150 101 -6 -184 93 94
1766 94 -156 41 181 -90 -107 260 -108 -224 239 46 -212 208 14 -290 88 108 -205 -7 179 -55 -101
1787 -101 212 121 -124 144 180 -196 85 242 -188 -42 254 -187 -172 66 -116 -195 43 -89 -175 -18 50 -147
$$ packed form
1639A86O8m36K13K41l99q8N00l50l47N37q2m33M80R0n62M04K54m56J73L64l95
1660c8K1K73j92k00K94l4l87K43K04m38J84K88m95N1N09l63j29M81k61k54M45
1681B02K4l78K14K08l76m9N31m19l11N72j49m51N32Kn23L42J76l87J78K62k72
1702g2m4L87j13k53K62j8l48L00J20m63J66L03m57O6M15m14n9L43j90j12L41k8
1724A32l31K62J45l07K5M07l97k17N51l24k85M70j09l44L24J45l96K91J61l08
1744a05n5M08p8l02L19l4l29K34K93n30J32K74m61J46K39k92rK51j07j78K77J
1766I4k50J97J40k71j7L67l68j16M63j93k58M20j94l04L78K0l13J98J86k34m6
1787a01L13r1k45K68L6l76K81J57m30J46K96m41J5K38j82p9K38j32q6J57O8j97
$$ plain form
1809 -147 -30 177 -95 -13 259 37 -7 273 65 -132 144 45 -216 88 40 -208 -72 141 -126 -232 72
1830 72 15 -210 109 159 -199 95 173 -155 74 273 -94 -91 76 -38 -154 81 -5 -236 28 55 -133 -67 130
1853 130 -121 -75 167 17 -86 250 28 -127 238 101 -113 108 101 -136 15 62 -112 -216 22 -114 -275
1874 -275 87 23 -287 -87 112 -165 38 221 -81 -21 171 139 35 249 129 -49 74 186 -36 27 125 -195
1896 -195 -158 146 -9 -146 40 -89 -156 76 98 -71 10 56 5 59 180 71 -72 101 -82 -198 103 -27
1918 -27 -299 0 -45 -225 14 67 -140 -119 114 -67 2 204 138 9 175 268 28 109 181 -91 -91 174 -46 -106
1942 -106 23 -117 -193 25 -68 -143 -80 -26 -50 47 175 91 -72 141 136 -63 261 97 -125 46 13 -136 59 32
1966 32 -199 -242 -43 -124 -116 24 -16 -159 63 84 -52 74 212 -80 28 277 103 -10 115 12 -69 56 40
$$ packed form
1809a47J17K07k72Q2K72k22m4K80k08j97K76r9k61L04m8k48J36K13k67j06L04
1830G2n7k25L19N0l58K94P8l28K29J99l67LJ67j14j16K35q6k31K64K7j88O6J97
1853A30k51M6K42j50j03L36k22j55L65j37k14K21pk37J51M7j74j04K38j36j61
1874b75L62o4l10K00J99k77K03J83l02O0J92l2j04K14j20j78J23J12k22O3R8l20
1896a95L7L04j55j37J86j29o7K32K2j69Q1M6n1N4J21j09j43J73j83j16L01j30
1918b7k72K99m5j80K39N3k07K1K33j81O9K02o6j29J66R3k40Q1P2k72%K65k20o0
1942a06J29j40p6K18r3p5O3N4k4R7J28q4j63K13nj99L24j64k22J71l3j49J95k7
1966C2k31m3J99q1QJ40m0j43K22K1j36J26J38k92J08K49j74j13J25j03q1J25j6
$$ plain form
1989 40 -151 -72 -4 -45 -33 74 4 -80 115 85 -23 227 134 -79 138 86 2 48 27 -93 -53 16 -80 -107 -34 -60
2015 -60 -197 10 71 -173 -22 102 -117 1 177 21 -42 148 34 16 135 116 -74 -20 65 -40 -103 103 -117
2038 -117 -207 15 -24 -76 131 24 -53 91 157 19 110 96 -29 30 112 46 -28 90 40 -108 50 20 -102 38
2062 38 48 -151 -59 116 -117 -101 51 -39 -105 -7 34 -62 11 96 -97 3 75 -68 -25 113 -19 -120 148 27
2086 27 -100 70 26 -80 45 56 -67 65 105 0 -28 110 69 -25 134 138 -121 56 127 -106 31 62 -123 -25
2110 -25 17 -87 -117 -82 -43 -179 -48 32 -165 -48 83 -26 20 144 48 -50 145 71 -32 169 106 -75 80 76
2134 76 -30 -65 -23 -71 -99 -13 3 -127 25 96 -162 78 122 -81 59 84 -45 19 19 -5 -96 -25 23 -74 49 -1
2160 -1 -143 -78 16 -58 -36 154 -71 -14 168 27 23 117 86 -27 118 30 -21 -41 24 -3 -171 24 -59 -140 -53 -41 -173
$$ packed form
1989D0j91P9O8m1J2J07p0q4J95l0j08K50r3k13K17n2q4M6k1j20M0O9r6k7P3k6
2015f0j37K07O1k44J51J24k19J18J76j56o3J90j14j8J19j9j90N4Q5j05o3K06k20
2038a17r0K22l9n2K07j07p7J44O6j38R1j4j25N9Q2o6p4J18n0j48J58l0j22J40
2062C8J0j99R2J75k33J6J52r0o6R8M1r6P3Q5j93J00P2j43M3J38j32j01K68j21
2086B7j27J70m4j06J25J1j23J32M0j05k8J38m1r4J59Mk59J77P1k33J37L1j85R8
2110b5M2j04l0L5L9j36J31Q0j97J17J31j09M6J24r6r8J95p4j03K01o3j81J55m
2134G6j06l5M2m8k8Q6J6j30J52P1k58K40M4k03J40K5j29O4%k4r1P1M8r7J23n0
2160aj42O5R4p4K2J90k25N7J82j41mR4l1j13J45q8n1k0O5k7j68J95q3q1Q7J2j32
$$ plain form
2187 -173 13 14 -103 8 41 -117 66 102 -26 3 120 50 27 95 68 -108 -56 109 -121 -49 65 -112 -130 159
2211 159 -17 -120 26 -34 -7 78 68 -16 -48 33 -63 -21 23 -6 -125 63 1 -102 119 28 -69 67 68 -115 -2
2236 -2 70 -4 -33 71 67 -7 59 26 -121 -33 11 -109 -39 38 -118 -74 55 -35 -78 66 -4 -11 41 78 -50 -43 89 -18
2264 -18 -26 115 -77 -33 134 -2 -19 96 46 62 64 15 6 42 69 12 -7 104 -12 -78 14 30 -132 -35 -73 -109 -66 8
2292 8 -171 -74 43 -63 -39 61 57 -92 47 110 -49 18 169 -30 -28 142 31 -49 109 -24 -26 84 27 -93 52
2317 52 23 -27 -19 119 -36 -42 -21 -20 -78 26 78 -115 -22 4 -86 -25 -13 -66 -2 38 -24 0 94 28 10 85 111 -17 30
2346 30 121 35 15 63 54 11 79 -5 -2 38 34 -81 -16 -71 -67 -100 -11 -97 -53 -8 -78 -80 12 -8 -121 47 39 -73 45 66 -47
2377 -47 -17 68 35 45 30 2 -5 34 84 33 -37 13 -49 -58 33 41 -83 95 5 -33 104 48 2 6 55 8 -53 42 -42 -28 -21
$$ packed form
2187a73J86Jj17J11L3j58J83L6j28K9J17p0k3O8k7j76N2J65k30P2J14j77j8K89
2211A59j76j03J46o0K7Q5j0q4l2Q1r6M2M4k9j19J88o2j03K21r1r7J36Jj83J13
2236bP2p4k9J04mp4O6l3j47Q8M4j20P0P7j56M4J29r0m3J44p0pN2L7j28PJ32j07
2264a8qJ41j92M4J67j36j7J15n0J6Km9rL6K7n7j9J11j16o6R2J6j62R7l8l6M3P4
2292Hj79R7J17j06K4J00mj49J39O3j59O7J51j99KJ70j11q0J58j33kJ10n7j20J45
2317E2k9n0QJ38j55oK1Jn8J04N2j93R3K6r0O1J2n3O4M0o2K4R4o6j8P5K6j28M7
2346C0R1q6k0M8rm3O8q4LM0mj15O5n5Ml3Q9q6M4M5p0kR2k0j13J68qj12J18K1j13
2377d7L0Q5l3J0j5k8pL9N0n1p0N0o2rR1Qj24J78r0l8J37n6m6MM9m7o1R5q4J4P
$$ plain form
2408 -21 8 -138 -38 41 -55 16 37 -80 -15 95 -16 -5 62 17 -9 62 43 -54 11 32 -42 -14 44 -60 -114 34 -54
2435 -54 0 37 -15 -41 -7 29 32 28 78 34 81 93 -23 -25 60 33 -38 30 2 -84 -34 11 -109 -53 9 -89 -32 -10 -24 -31 -1
2466 -1 -22 -65 28 65 -67 -33 16 -21 43 -3 -83 -57 66 -1 -5 22 18 -17 24 35 -8 13 75 -15 -11 106 37 -44 11 7 -57
2497 -57 55 23 2 12 7 -16 -66 -9 -50 -46 61 28 -11 36 17 -46 7 -33 -75 58 22 -46 -25 30 -11 -62 -21 -5 -53 1
2527 1 37 -23 -44 36 -3 -41 91 7 -54 50 20 -25 47 35 21 -19 50 37 -24 78 -4 0 14 45 -89 -55 -46 -110 -62 -16
2557 -16 -93 -26 7 -90 -43 -12 -40 0 -7 -19 -45 -25 32 1 -29 96 -7 -11 12 -44 -10 23 -70 -76 10 -36 -12 16 44 -36 20
2588 20 29 32 93 75 104 39 29 -9 -57 -8 -36 -93 -35 -37 -70 -60 -5 -40 1 -6 41 -37 -18 80 57 1 172 33 -7 108 -22
2619 -22 -31 12 5 -23 -25 -73 -27 -14 -81 -28 -46 37 -13 -62 -10 7 6 51 19 -51 44 57 -11 -19 -16 10 -13 14 35 -29 -31 52 -79
$$ packed form
2408b1K9j46J00P9r6P1K1j17O5J10j11J1O7m5k6P1j9r7O5K1p4K8N8j04n4J48q8
2435e4N4L7n2k6L4L6LmN0m4M7J2j16kQ5k7p1O8k8q6N0M5j20N6O2r8N7K2j4pL0
2466ak1m3R3L7j32L4M9l7O4m6q0K6J23o7mK7ml5M1J1m3K1O2r0MJ17o9q1N5mo4
2497e7J12l2k1J0nk3n0N7m1MJ07l3l9M7j9o3N3m0m2J33l6o8K1N5m1n1M1J6m8N4
2527AL6o0k1Q0l9l8J32q4o1J04l0m5P2j2j4m0O9j3o1J02q2MJ4L1j34L4Ro4M8M6
2557a6p7O7L3r7M7L1k8M0pj2k6K0N7l1l0J25j03mK3n6L4L3r3oQ6m6K4K8K8q0N6
2588B0RLO1j8K9o5j0l8m8M9k8n7N8kl3J0N5l5M1pM7p8J9R8k3n6J71j39m0J15j30
2619b2rM3pk8km8M6J3o7N3j8Q3n0m9N2J7jM5l2p0R5J3o8qLK6k3K7K1o4kQ3j31
$$ plain form
2652 -79 -16 66 -14 23 67 58 -19 115 69 18 89 16 -12 21 -62 -69 -77 -60 -100 -49 -14 -59 -31 58 28 -79 -9 43 -34 27 65
2683 65 22 28 19 -19 17 36 43 -34 14 46 8 13 7 -60 6 16 -6 -112 17 0 -58 28 -26 -40 66 -56 -62 -16 0 -74 -45
2714 -45 9 -18 -31 40 46 -30 50 97 13 51 50 -7 36 11 -16 26 4 -7 -21 42 48 -88 -19 9 -107 -97 3 -49 -47 -4 -91
2745 -91 -74 13 5 -13 -8 -29 -61 1 -23 -6 -4 65 30 -1 29 38 44 62 -17 26 95 68 24 38 -36 -4 18 26 1 -26 -9 74 -39
2778 -39 -15 21 -64 -41 35 21 -66 34 1 -47 28 -5 -1 -17 2 36 3 48 -53 -20 16 19 9 7 -15 -16 73 34 -26 59 68 13
2810 13 7 33 -86 88 10 13 -49 -38 -4 -101 17 16 -1 -36 -27 -52 9 95 -2 -11 29 30 -29 18 1 -43 -11 -34 -14 -21 50 5
2842 5 -40 42 -44 -3 56 -5 -49 59 34 -1 23 69 -7 -36 41 47 -8 14 79 50 17 18 -29 -26 71 -33 -24 35 -26 14 11 -17
2874 -17 29 4 56 -22 23 -8 4 -68 14 51 -55 69 -8 16 36 0 -7 -9 16 -1 -16 32 -59 -19 0 42 -11 40 53 22
$$ packed form
2652g9O3Q2q0L7M4rp7J34m6n1P1p3k8L3q3pqJ7m0N1L5m5K8Q9l0j07P0N2p7O1L8
2683F5m3Orl8L6J9Pp7M8L2l8Noo7O6J0k2j06J29j7n8Q6n4j4J06j22oM6J6p4K9
2714d5N4k7j3P1Op6Q0M7q4L8jn7M3k5k7M2k2j1j4O3Oj36O9K8j16J0J00n2KM3q7
2745i1J7Q7qj8Nk1l2O2k4J7KO9l5l1L0ROJ8p9M3O9k7m4J4p4L2K2Qk5k7J7Q3j13
2778c9K4L6q5K3P6j4q7J00l3m8P5l3Mj6J9L4l3M5j01L3L6Lj0kk2jQ9l9o0Q5Rn5
2810A3oK6j19J74p8Lo2J1L4r7J18jj7l5Rk5O1Q6r7rM0Jn9M7j7m4L2k3K0pP1m5
2842Em5Q2q6M1N9o1m4J08k5l5K4M6p6k9P7On5K2O5k9l3Jm7LR7j04RN9o1M0lk8
2874a7M6k5N2p8M5l1J2p2Q2L7j06J24p7K4K0l6pkK5j7j5M8r1M0J9M2n3N1J3l1
$$ plain form
2904 22 -62 32 6 -43 5 15 -2 -30 21 -62 23 -40 -36 0 -18 8 12 58 -9 32 49 -39 -49 40 69 8 64 29 11 20 30 2
2936 2 20 14 84 43 108 37 -32 9 -54 -13 -1 76 -22 -19 -3 -45 15 12 -19 3 -20 -10 10 -30 1 -69 -1 12 -21 -57 -5 -12 -29
2969 -29 -2 25 -50 -2 -6 -8 35 37 -33 41 8 1 12 28 13 -44 -13 13 18 15 5 2 69 48 -9 -22 27 17 -15 17 49 -31 18 -17
3003 -17 15 -18 54 -50 -9 -19 0 -16 59 -26 -15 -3 18 21 36 17 -1 -46 -9 -13 -44 30 74 63 41 26 34 21 23 -38 78
3034 78 49 15 16 14 -2 -75 -41 -8 -10 -30 -49 47 -7 21 29 -34 -16 -39 15 40 -29 9 -57 35 -1 -12 25 5 4 -8 15 -9 21
3067 21 -7 -44 60 12 -30 40 10 1 -24 -11 -12 7 -8 29 -47 -83 60 -49 4 -14 -69 -87 -23 -38 -87 51 -32 -59 20
3096 20 -3 -32 -113 26 46 34 56 43 47 27 31 59 35 -22 -47 28 28 -30 9 -7 -21 11 -20 45 52 41 10 -50 10 -62 -70 53
3128 53 5 -8 -2 -48 -11 -11 29 -4 4 21 -24 20 23 31 36 -17 -6 -33 45 36 -21 -13 -35 51 -8 65 21 -36 -39 21 -32 -12 -11 -60 -1
$$ packed form
2904B2q4R4k6m9M8J0j7k8N1q3Q5o3ML6j8K6MM6o7M1J7q8j0Q9K9o1N6l5j8RJ0k8
2936BJ8oP0m1O5p1o9M1o3M1J2P7r8LJ6m2O0ll1K2k3J0K0m0L1p0O8J3l3l6N2pj7
2969b9K7K7p5M8mkM3Kp0P4l3pJ1J6j5n7L1K6Nlj0lO7k1n7j3M9j0l2L2L2q0M9l5
3003a7L2l3P2j04M1j0J9j6P5q5J1J2K1LJ5j9j8m5L7ml1P4M4j1k2j5Qj3Ko1J16
3034G8k9l4Jkj6p3L4L3kk0j9R6n4K8Qo3J8k3N4K5o9L8o6R2l6j1L7k0jj2K3k4L0
3067B1k8l7J04m8m2P0l0rk5J3jJ9j5L7p6l6J43j09N3j8n5j8O4j5m9J38q3k7P9
3096B0k3k9q1J39K0j2K2j3Mk0MK8k4n7k5P5%n8L9j6j4L2l1O5Pj1l1o0O0p2qJ23
3128E3m8j3Om6L7%M0l3QJ7m5M4LQNn3J1k7P8rn7Qk2Q6n9P3m4n7lO0n3K0Jm9N9
$$ plain form
3163 -1 -45 3 5 18 -2 45 29 -31 1 -74 5 30 -1 6 31 0 2 65 -43 -10 -13 -14 10 34 11 -6 2 -2 -34 27 -21 9 -42 -7
3197 -7 -57 -15 17 -18 -16 -38 59 4 11 -13 -26 -10 15 70 34 41 28 -21 14 8 -50 -19 5 -29 38 24 15 -53 16 18 -56 2 -11 -7
3231 -7 23 4 34 51 19 -34 -66 15 -18 -47 -23 -12 17 -42 -35 0 5 8 4 -11 46 -26 -31 17 68 4 15 -11 -10 39 -17 -12 -34 28
3265 28 46 7 -27 -9 -36 54 -4 -16 -1 22 -13 10 19 -32 26 4 24 -9 -14 0 -22 -3 43 -44 17 13 -48 27 30 -22 7 -11
3297 -11 -45 -39 -9 -29 25 17 -62 37 9 -47 -37 -40 2 -21 -30 -38 -1 -13 28 27 45 19 44 -38 44 59 -56 33 24 35 -19 -1 21
3330 21 -10 7 -6 -30 -14 -16 -14 -11 39 18 -9 39 1 34 2 -5 20 -26 0 -24 -32 9 25 -49 -47 4 0 21 -27 17 11 17 -47 -59 28
3365 28 42 29 -4 20 0 -3 0 -47 -19 -14 -31 -3 45 -13 18 45 21 69 -1 77 21 6 -35 29 -41 22 7 -4 -10 -28 -84 57
3397 57 18 -34 5 33 -26 68 19 46 42 -1 8 -63 75 21 20 48 32 -24 17 42 -27 10 -20 -14 -28 37 -24 -33 -4 9 21 40
$$ packed form
3163am4M8KJ3k0M7j6o0L2p5P9K5l1PK5l1KO3j08L3ljK4K4k3j7Qml2O1m8L0n1L5
3197gn0M2L2l5Kk2R7n5Pk4j3J6K5N5l6Pj3m9L5on8L1K4l4O7j4ro8O9Kp4N8j3M
3231gL0j9L0J7l2n3l2Q1l3k9K4J1K9n9PL5NLmj5N7p2nM8N1o4J1k6JM9n6Nk2O2
3265B8J8l9l4J8k7R0n8j2J5K3l5K3Rn1N8k2K0l3nJ4k2J9M6q7O1mo1P5Ln2K9j8
3297a1l4OL0k0N4qp9R9k8n6J0lM2k3rqL7j2M1jJ8k6K5q2Q2J5j15Q9rJ1n4J8K2
3330B1l1J7j3k4J6kKLN0k1k7M8l8L3l2pK5m6K6k4qM1J6p4KN1mK1m8M4oOo4j2Q7
3365B8J4j3l3K4k0lLm7K8Nj7K8M8n8L1K7k4M8p0P8n6j5m1O4p0O3j5j1oj8n6J41
3397E7l9n2L9K8n9R4m9K7mm3Rp1J38n4jK8j6n6M1K5o9L7l0Oj4O5o1rK9J3J2J9
$$ plain form
3429 40 9 -61 -11 23 -19 -17 59 36 41 11 -6 -14 -24 -15 -49 52 48 -43 6 42 7 23 13 58 3 -9 59 -5 36 3 -42 40
3461 40 0 -17 -24 -5 -72 32 38 -60 -7 -24 0 18 12 41 -39 -12 5 -21 3 -6 47 -1 65 15 19 5 5 29 8 45 17 52 -3
3494 -3 24 -48 11 -5 4 14 -23 -62 12 11 -12 -32 8 -12 9 -28 -56 9 -63 5 -31 -10 -16 2 -39 71 -17 -4 5 -28 47 -48
3526 -48 12 -26 24 21 -43 -8 -18 7 34 53 -23 -43 15 17 -28 -37 -10 4 11 58 -60 19 -14 20 -12 -19 -19 -18 -9 4 -58 -28 65 15
3560 15 37 -45 -18 -38 42 -31 -28 50 -19 -2 35 33 -27 -17 97 -34 -45 41 9 18 -39 -14 38 3 -14 10 29 -10 33 -27 5
3591 5 -26 -23 25 54 -30 40 42 21 -14 -46 -58 -2 56 21 -61 19 -24 10 12 -37 43 28 31 -71 19 2 -37 -54 40 -4 3 17 16
3624 16 8 22 13 -11 -43 48 -57 -26 -14 1 12 10 15 10 -34 14 3 -60 3 -42 20 -4 41 -51 21 -37 -9 -16 -4 -50 17 24 30 29
3658 29 32 51 -59 55 16 -52 14 -30 -18 29 7 -42 -5 6 -10 -12 -11 11 -16 -8 7 -30 29 43 38 -18 -16 -14 -40 84 2 20
$$ packed form
3429D0l1p0N0L4m2KP6k3Nl0j7qj0Rl4J01mr1M9L6l5J6j0M5n5j2O8o4M1l3m5Q2
3461D0m0j7pJ9o7J04Or8N3j7K4J8oK9q0K7J7k6K4rN3m8O6n0Mj4%K4k1L7k8L5n5
3494cK7p2N9j6RJ0l7l9P4jk3k0M0k0K1l7k8O5p2O8l6K1oJ8m1J10q8J3Rl3P5r5
3526d8O0l8N0lo4L5j0K5K7J9p6k0N8Km5rK7J4PM7j18P9l3L4l2p%JRJ3o2L0R3n0
3560A5K2q2K7k0Q0p3LP8o9J7L7ko0J0J14j31j1Q6l2Rn7K5N2l5j7K4J9l9M3o0L2
3591El1LM8K9q4P0Kk1l5l2j2N6N8l5q2Q0m3L4Km9Q0j5Lj02R0j7l9j7R4m4PJ4j
3624A6qJ4rk4l2R1j05L1J2J5J1kNnm4M8j1o3O3m5O2k4M5r2P2n8K8pJ2m6O7POj
3658B9LJ9j10J14l9o8O6m4J2M7k2m9L7J1j6kJK2k7QJ5l7N9J4nn6KKk6J24q2J8
$$ plain form
3690 20 21 -5 7 53 -1 -8 -31 -25 -1 -20 -5 37 -2 50 17 -26 3 49 -33 -19 10 -1 25 -36 -39 -52 -56 22 -5 -2 -7 -41 -14 31
3724 31 -3 -17 41 4 -33 -9 -17 28 23 41 -2 3 9 -21 -62 16 -8 -19 25 -28 -69 68 46 -37 53 20 44 -41 17 1 12 -8
3756 -8 -15 -72 22 10 -3 3 2 5 -65 12 -35 25 -15 -44 6 -2 -13 47 -15 13 -8 17 6 33 -2 -26 -60 16 -6 19 -28 94 64
3789 64 -15 20 23 -32 29 13 -58 17 -12 -19 -78 10 23 34 -21 40 -34 32 0 19 -21 6 30 40 38 -25 20 -6 -32 -19 -30 -22
3821 -22 -37 -39 4 1 -76 53 -38 -37 -13 -26 7 42 60 42 -35 42 -22 -13 45 0 -2 -40 15 -29 34 -43 -72 1 37 -3 29 15
3853 15 -31 -34 72 5 1 23 -37 12 -4 -31 -30 19 55 -10 -19 -31 9 -46 17 -2 19 26 -15 38 27 24 -28 27 -1 -3 -17 -29 25
3886 25 32 37 -7 -30 -41 57 -42 -17 26 -24 -6 -10 15 -52 20 17 11 39 35 5 -29 14 33 -11 0 45 3 -22 -23 -2 70 -8 3 2
3920 2 -21 -10 20 -10 12 -9 -27 28 -27 12 -11 -15 -14 7 -70 4 -40 -41 -34 -68 29 -11 11 30 -35 27 54 7 1 -12 -4 -29 32 38
$$ packed form
3690B0Jk6J2M6n4pk3OK4j9J5M2l9N2l3m3K9M6q2J4K9j1K6o1lj3mP8k7Lnl4K7M5
3724C1l4j4N8l7l7K4qM5nJ8m3NOl0m1P8k4j1M4n3m1J37k2q3R0l3K4q5N8j6J1k0
3756hpn7R4j2j3OjLp0P7m7O0m0k9N0qj1O0o2K8k1K5j1K7l5k4l4P6k2K5m7J22l0
3789F4p9L5Ln5O1j6p1P5k9pn9Q8J3J1n5O1p4O6l2J9m0K7K4J0ko3M5k6k6J3j1Q
3821b2j5kM3lp7J29r1JK4j3L3L5J8j8p7P7o4RN8m5kl8N5m4O3p7k9P3L6m0L2j4
3853A5m6lJ06o7mK2o0M9j6k7JM9L6o5rj2M0n5O3j9K1Pm1N3j1ln2N5k8kj4j2N4
3886B5PNm4k3j1R8r9K5M3n0J8mK5o7P2loK8ml0l4M3J9m4J1M5m2k5jK1P2p8J1j
3920Bk3J1L0l0K2k1j8N5n5L9k3mJK1p7P4m4jPl4R7m0K2J9o5O2K7m7oj3Qk5O1O
$$ plain form
3954 38 -19 40 46 -19 36 38 -20 -10 26 31 -11 -24 30 -9 -29 43 -3 -21 0 -54 11 -13 -39 -17 -12 -42 82 -32 -50 -4 0 8
3986 8 -23 -22 14 2 -12 -56 -14 -23 70 -19 36 34 -54 -30 14 25 10 -40 -17 -17 -32 10 16 -15 48 49 -7 9 -6 -30 -9 -4 -55 12
4020 12 23 -6 9 -10 -25 15 -26 -6 50 -42 7 -48 12 10 -8 -55 5 57 -17 -9 -15 -71 -13 19 3 -16 -7 -17 -54 -15 8 25
4052 25 -19 25 2 -32 22 -83 23 -44 2 -2 26 18 -47 1 20 -30 10 -56 34 13 42 32 54 5 -23 38 27 19 3 74 -3
4083 -3 21 71 8 -38 -17 -5 -16 38 15 -49 8 22 40 -34 6 -7 -18 -14 -30 74 -49 -17 -71 14 -16 59 13 -30 37 -7
4113 -7 20 -33 12 18 26 19 54 -4 -7 8 36 35 87 30 7 -40 -13 59 -46 -34 12 13 -18 -13 79 -37 -30 31 -25 2 4 -30 26 -32
4147 -32 6 -3 -15 5 -19 -4 -25 -9 3 3 -2 21 -16 18 23 -31 -41 40 67 -1 -53 -21 8 10 41 -33 41 -11 19 -26 -68 -27 32
4180 32 -48 19 26 -16 -13 -13 34 21 -47 35 -14 -31 4 -6 62 -29 16 -3 7 6 -35 -49 -12 11 63 -10 38 -27 -14 -12 -4 57 34
$$ packed form
3954C8n7N9Oo5N5Kn8J0L6Nm2j3N4l9k0P2m6j8K1n4O5k4k6K2Nl0J24j14j8M6MQ
3986Hl1JL6j2j4m4M2rR3q9N5kq8K4M4J1j5n0K3%j5M2Ol1O3Jn6J6j5k4K1Nn1O7
4020A2J1k9J5j9j5M0m1K0N6r2M9n5O0kj8m7O0N2p4Qon6N8L2j6j9Rj0l7L9K3J7
4052B5m4M4k3l4N4j05J06o7M6mK8qo5M8J9n0M0o6R0k1K9j0K2m9k8O1j1qj6P1p7
4083cK4N0o3m6K1J2j1N4k3o4N7J4J8p4M0j3j1Mj6J04j23L2n4Q5l0P5m6m3O7m4
4113gK7n3M5OQpL5n8lJ5K8jN2n7k3m7K7P2j05J2M6Jl1NR2j16PO1n6K7Kl4N6n8
4147c2L8rj2K0k4J5k1J6J2%nK3l7L4Nn4j0Q1K7o8n2L2K9KL1p4P4n2L0m5m2M1N9
4180C2q0O7Pm2L%M7j3o8Q2m9j7L5j0O8r1M5j9J0jm1j4L7K3N2p3M8o5J3KQO1k3
$$ plain form
4213 34 -12 63 11 24 -9 -21 -25 0 -18 -9 61 -24 -33 32 -34 -53 -4 -51 32 7 35 -31 -17 33 -9 -22 20 -52 -45 32 8 -3
4245 -3 59 -38 3 7 49 25 31 -58 31 -5 -23 13 -14 -12 -36 -10 4 45 9 -2 -6 -6 70 8 28 -6 49 -7 -10 -16 -3 -22 -14 -7 -39
4280 -39 -18 36 26 27 52 7 26 47 10 -3 -12 -4 27 13 -47 -12 -6 15 -7 54 -19 17 -12 -3 34 -10 57 23 -15 -32 -15 -16 -54
4313 -54 -1 -19 -28 -32 -4 14 -23 -10 18 4 0 2 25 -20 12 33 41 41 -8 8 -3 44 -31 -16 44 2 19 -20 2 -16 27 -26 17
4346 17 11 -63 -33 34 -14 17 3 -26 11 -46 -7 -60 45 -1 -14 -57 -4 -4 -28 33 -11 -10 -9 -9 6 -25 12 -1 27 -8 4 0 -41
4379 -41 -34 -25 -7 -24 39 -5 49 -69 10 52 -4 18 45 -1 -33 -15 -35 21 32 -61 -4 1 40 43 -2 16 33 13 -20 21 -7 32
4411 32 38 46 24 74 42 -32 -32 12 7 30 64 6 8 -57 18 -28 -14 7 -8 2 -48 -69 17 -8 0 -47 1 -1 -15 3 2 61 42 -25
4445 -25 -37 4 -17 -2 -18 29 39 -8 11 36 -6 12 -8 13 -4 3 -16 -28 -49 -27 10 24 24 71 -21 -27 39 27 -16 -48 -15 -25
$$ packed form
4213C4m6P5n2J3l3j2mK5j8RP0q5rO5o6j9M9m7Q3k5K8o6J4N0m2j3M2p2PP7k4j1
4245cO2r7M1MM2k4Oq9Q9l6j8L6k7Kk4K6J4M1l6j1m%P6o2K0l4N5n6loJ3j9QPl2
4280c9K1N4j0JK5m5J9K1l7j3rQL1j4o0L5OK1k2O1p3L6k9RL7m4O7l4l8j7J7jl8
4313e4N3j8rmK8J8l7J3K8j4mKK3m5L2K1Q%m9J6j1M7p5J5O0m2J7l9K2j8M3n3M3
4346A7op4L0O7m8L1j4k9L7n7L9n3J05m6j3m3N3%k4O1m4JJ%J5l1L7j3K8l5J2mm1
4379d1PRJ8j7O3m4N4j18P9M2n6K2K7m6l2J8k0N6J1r3N7NL9Lm5J8J7k0l3M1k8L9
4411C2OQk2N0l2p4%M4nK3L4n8Ko5P5m6J4K1j5J0n0k1Q6k5Qm7M8kj4J8jN9j9o7
4445b5j2M1k1J5j6M7J0m7J9K5m2J8k0K1j7Pj9j2k1K2L7J4%M7r2oO6j2m3l2L3j0
$$ plain form
4477 -25 -1 4 19 0 7 -32 -70 32 -12 -8 -26 -17 -15 52 73 -3 -63 8 -17 12 -28 10 27 -10 14 28 36 -3 -3 -73 5 -23 9
4510 9 -24 17 4 -46 19 -26 -54 44 -28 -43 -48 9 -45 -31 -57 10 16 26 -13 -10 15 -61 -43 2 23 -21 -4 -20 40 -1 -17 -22 -30
4543 -30 -9 -44 -39 3 33 81 -23 -15 5 14 43 -40 0 17 9 -25 -17 6 -21 -55 45 -34 5 13 -46 -3 19 -55 -11 39 -27 39
4575 39 17 11 7 46 -11 -1 -19 48 30 14 42 -39 29 20 -30 -30 -21 20 41 5 0 -24 14 29 -12 8 -82 -10 -23 96 -34 -15
4607 -15 15 -2 2 12 -11 -66 -19 -48 4 -18 63 -12 3 -6 49 23 50 18 13 34 46 35 -15 21 -10 -3 -35 23 -15 13 -3 -14
4639 -14 71 37 9 -2 -32 50 -39 -23 31 50 -3 9 -48 22 -34 -24 -14 -35 4 -10 40 42 3 3 -48 70 -44 2 50 45 -11
4670 -11 -47 -29 21 12 -20 43 -12 57 33 13 39 -13 -11 16 -9 5 -10 -17 -41 8 -3 1 2 -61 0 -27 27 -36 9 24 -7 -116
4702 -116 -2 22 -17 -66 6 -45 7 24 -1 67 -15 -27 1 35 34 4 21 32 -23 -60 -18 -8 -52 30 -6 -3 -65 10 40 -7
$$ packed form
4477b5K4NJ5j9Pl9l8J02m4Mj8RKO7K1p6o0P1k5K9m0L8J7l7K4J4Ql9%p0P8k8L2
4510Il3M1j3n0O5m5k8R8p2j5nN7n4J4k6O7OJ0l9LK5p6J8M5K1m4J7j6O0m1j6nq
4543c0K1l5NM2L0M8j04QK0RK9q3M0J7ql4QK3k7l4J00p9L9Qn9M3K2p4M4N0o6O6
4575C9k2omL9n7J0j8O7j8j6K8q1O8rn0%RM1K1l6nk4L8J5m1K0r0P2j3J19j30J9
4607a5L0j7MJ0k3n5M7k9N2k2Q1p5J5rN5k6K7l2nK1J2j1n0L6l1Pl2N8l8K8j6j1
4639a4Q5l4k8j1l0Q2q9J6N4J9n3J2n7P0n6J0J0k1L9j4N0Kl9%n1J18j14M6M8nn6
4670a1l6J8N0rl2O3n5O9k4k0K6n2KK7k5J4j5pk4M9j1MJo3O1k7N4o3M5J5l1j09
4702a16J14K4l9m9P2n1N2J7k5O8q2j2K8L4jl0J7J1n5l7M2J0m4Q2l6Lo2P5L0m7
$$ plain form
4732 -7 25 18 53 -43 26 -27 3 3 -1 -32 -41 -8 6 -10 16 15 -9 -48 30 -39 5 -48 2 61 13 -15 -13 -21 -31 12 26 -46 26 -12
4766 -12 2 44 -16 -37 -7 1 -20 -7 58 -7 -36 -27 -20 -20 9 56 -3 50 33 12 24 -2 -22 3 0 -58 67 -6 22 10 5 -11 -47
4799 -47 4 42 14 -20 50 -7 -3 -16 -47 0 -27 -36 -32 11 -1 -23 -14 -34 -84 9 -4 -4 3 9 18 -10 -1 70 25 21 1 85 -16 16 10
4834 10 14 1 69 12 63 51 -36 13 34 4 16 -6 38 -47 -1 -10 -31 88 -40 27 -4 -20 14 -7 -57 -15 -4 -55 -4 -2 -36
4865 -36 16 1 21 -13 -8 -15 -31 -28 47 -9 -8 35 33 -20 25 -5 8 -2 -4 -1 20 -11 -48 48 -21 77 24 -10 -1 10 69 -40 -86 -50
4899 -50 -45 -58 -37 75 -11 -17 -31 60 35 -14 -38 -29 -17 23 8 12 14 1 7 -14 -5 48 14 48 44 9 -13 -1 60 14 64 -24 -32 9
4933 9 -69 0 52 12 -7 61 -8 -3 41 10 -37 2 -9 -9 -5 -76 -34 7 -15 8 -23 -31 -21 -26 19 28 18 -34 11 -25 -8 13 -24 45
4967 45 44 13 -5 -17 -9 23 -33 -1 6 -22 -9 -6 58 5 -77 5 23 -34 18 -15 -20 -14 -69 7 -9 -4 -5 -35 61 28 40 94 33 35 40
$$ packed form
4732gL2pL5r6O9n3L0%ml1rL3J4j6K6jk4l9P8o9M4n3N0N9m8k8Kqj0M3J4p2P2l8
4766a2J4M2o0k1L0Qk1J3O5o5k9RP%K9M7n9N3j7k1J2k6k0K5ln8J25p3K8j2nj6l6
4799d7N1L8k8l4P0n7Mj3l1M7k7rMM3j2k2Rk0n0R3j3%PORk8RP1m5mk0Q4j01L2o
4834A0Mj3O8n7N1j2q7M9K1l0J2k2M4q5M6rk1J19j28O7l1j6L4k1n0M2J1n1N1Kl4
4865c6N2j5K0l4Npj6LP5n6JM3kn3M5l0J3j0kLK1l1l7R6o9R8n3l4RJ1N9j09m6L6
4899e0Nj3K1J12q6oj4R1k5m9k4RJ2M0j5MKj3Ok1RN3l4L4ml5k2J2O1m6N0q8qM1
4933Ip8O9N2m0j9O8o9NM4l1m7L9j1%Mp1M2M1k2K3l1qJ0nM5Rj0n2M5l6J7K1l7O9
4967D5jl1j8j2QL2n6L2Pk8J3LO4n3q2Q2J8n7N2l3nOn5P6j6Njl0R6l3J2N4o1KN
$$ plain form
5002 40 -28 43 -2 16 27 -3 -65 -6 53 -7 1 -32 -6 -28 -11 4 39 -16 -14 -3 -19 43 27 -28 41 -52 49 23 -4 47 8
5033 8 38 60 -13 -38 -2 -11 -43 -5 -13 -84 24 0 20 17 22 -51 25 32 27 37 17 5 4 33 10 15 -1 17 -15 -4 6 -16 14 30
5067 30 16 11 -13 8 -10 -3 -7 -20 13 -10 21 -43 40 -19 16 -7 1 4 25 42 6 60 31 -3 15 37 49 49 6 11 -15 -15 10 2 -20
5102 -20 -9 -40 26 -31 -9 -8 -31 -4 -52 38 -21 -39 -6 -18 -22 10 9 -34 -18 -4 -5 38 29 17 18 14 -61 69 7 -7 58 -10 11
5135 11 -20 1 -15 60 6 35 22 8 19 39 54 -31 -15 26 20 -36 44 17 -42 -84 -41 -59 21 27 -34 -6 -12 -24 -16 -25 -2 29 11
5168 11 52 15 14 38 6 30 -48 19 14 -5 4 20 -19 -9 27 29 40 -41 40 -19 10 -11 -21 14 5 -42 -30 -3 2 -52 -15 69 16
5201 16 7 -4 -8 -21 20 -23 6 -47 -1 -31 -26 -2 1 -9 2 -21 13 -13 10 -23 -31 -42 7 -6 22 6 28 8 10 54 -24 77 -28
5234 -28 3 61 -39 -21 -18 13 26 17 -39 49 32 -30 0 39 26 38 -32 -7 -2 -16 21 -20 8 11 34 -32 18 -20 -42 -16 59 -7
$$ packed form
5002D0o8P1m5J8J1l0o2N9N9o0Ql3K6k2J7J5L5n5KJ1j6O2j6n5O9r3J01k6k7N1l9
5033HL0K2p3k5L6rl2L8qp1J08k4K0lNp3P6PnJ0k0j2jK9k3Nj6J8l2J1J0k2L0J6
5067C0j4nk4K1j8Pmj3L3k3L1o4Q3n9L5k3QLK1J7l6N4k9l4J8K2J2%m3Nk6%K5qk2
5102b0J1l1O6n7K2Jk3K7m8R0n9j8L3j2mL2jm3J6J4jM3rj2Jmp5J30o2j4O5o8K1
5135A1l1K1j6P5n4K9j3j4J1K0J5q5J6M1on6Q0k7n9m2M3j8Q0Oo1K8oj2QrK3L1j8
5168A1M1l7jK4l2K4p8O7nj9RJ6l9J0L6KJ1q1Q1n9K9k1j0L5rm7J2K7Nn4L7Q4n3
5201A6rj1mj3M1m3K9n3M6l0NK4Lj0J1k3L4k6K3l3qj1M9j3K8j6K2k0KM4p8J01j05
5234b8L1N8j00J8LL1J3rn6Q8j7o2L0L9j3J2p0K5Nj4L7m1K8LK3o6N0l8k2K6P5o6
$$ plain form
5266 -7 2 -46 -29 -13 -14 20 4 -35 6 27 15 -21 -23 9 -35 15 34 -6 68 14 -13 -37 -8 -67 -17 -33 32 21 21 -16 -11 6 8 -1
5300 -1 -40 -10 -29 -34 -13 33 44 38 -7 -28 38 -51 -71 14 9 -10 40 -30 -46 -4 -36 -8 -11 35 -49 -30 -51 12 -8 -36 -9 41 17
5333 17 -20 -8 22 65 -16 29 -3 -8 -8 14 13 56 -5 30 34 -10 -65 22 1 25 -17 -62 43 -36 -26 -15 20 9 45 14 -12 -1
5365 -1 6 9 27 -30 -32 21 -30 -27 -43 23 -58 -50 -38 33 41 33 -62 46 17 56 22 -9 14 -17 10 -11 9 62 24 2 41 -1 36 -26
5399 -26 -14 -20 8 17 -16 7 14 -42 -6 9 -39 38 3 -3 16 38 -5 28 38 -41 -27 -3 -26 -29 -12 41 -18 8 54 -24 8 23 18
5432 18 -14 10 3 23 -26 13 -81 -20 26 58 -7 9 44 37 3 -8 30 -21 -19 -18 8 -10 -55 9 -63 -18 -53 22 -15 -30 44 -59
5464 -59 -4 -46 -17 37 8 -12 11 -4 17 31 16 0 32 10 16 -18 -61 16 1 19 -18 -19 -35 -22 -31 20 -47 -8 23 -58 -17 1
5496 1 26 -68 -71 -21 2 -37 -3 0 26 19 7 -11 6 -37 -30 2 31 -31 -21 -15 -39 -42 -1 4 25 43 -13 -16 54 9 -9 34 -3 5 -24
$$ packed form
5266gRm8J7J6jL4j6l9M1K1j2l6kL2m4N0J9m0P4n4k7k4K9n9N0j6O5j1%l7NJ7Kr
5300al9L0j9nK1M6J1om5k1O6q9k0Q5nj9N0p0j6M2l2K8lM6q4J9k1O3k0k8K7N0k4
5333A7l7J2L0M3q1M5l2n%K2jM3o1L5Mm4n5Q7k1K4m2m5J05p9J0J1L5j1L6l1k6J1
5365aPLJ8n7kN3n1Lj6O6q1QJ2P1Qqr5J08k9L9l4l1K3l1K7k1K0N3l8k2L9m2L7o2
5399b6J2oK8Rl3K3Pn6L6J5m8P7l5oJ9K2m3L3J0p9J4K4k3lJ7N3n9K6M6p8L2J5n
5432A8l2K4pK0m9L9r4O1M6L2o5J6L5pl4j1L8n1KJK6j8m5O4p2M5l5P5l7j5P4j03
5464e9N5m2K9N4k9k0K3j5K1J4j5j6L2k2Ol4m3P7j5J8l7jj6J3rN1o7L9L1q1M1J8
5496AK5r4lN0K3l9L4LK6pj2j8J7m3PL2K9o2J0Ok4lM1NK1J8n6lP0m5j8M3l7Qk9
$$ plain form
5531 -24 3 29 19 21 54 -12 6 -29 -24 -48 -20 39 -40 -42 -54 -7 -24 -88 42 -21 5 26 12 -5 -32 28 50 -12 46 20 26 -13
5563 -13 -44 71 12 21 5 41 27 17 1 -14 11 -39 -55 -6 -81 -20 -19 -19 -11 36 22 22 33 -19 -4 62 5 4 -1 4 41 -19 -39 9
$$ packed form
5531b4K7K6j0KL3o6J8l5Nk4K8N9p9kj2M7j7o4J30o3K6K1j4j7k7O0K2o2N8k6Ol9
5563a3l1J15n9Rj6L6j4j0j6j5K5n0j6M9p5O1J%QM7j4%J1n2J5O6n7jnNL7o0k0M8
$$ [...]
8191b8
##END NTUPLES=NMR FID
##END=
