##TITLE=1H_DE-80H_X3
 200.13MHz, d2o
 8 sc
 
 19ns.26.2.2025
##JCAMPDX= 6.0         $$ Bruker NMR JCAMP-DX V2.0
##DATA TYPE= NMR FID
##DATA CLASS= NTUPLES
##ORIGIN= UXNMR, Bruker Analytische Messtechnik GmbH
##OWNER= pz
$$ XWIN-NMR		Version 3.5
$$ Fri Feb 28 14:07:37 2025 Russian Standard Time (UT+4h)  new_Human@DPX200
##.OBSERVE FREQUENCY= 200.1313
##.OBSERVE NUCLEUS= ^1H
##.DELAY= (6, 6)
##.ACQUISITION MODE= SIMULTANEOUS
##.ACQUISITION SCHEME= undefined
##.AVERAGES= 8
##.DIGITISER RES= 18
##SPECTROMETER/DATA SYSTEM= spect
##.PULSE SEQUENCE= zg30
##.SOLVENT NAME= CDCl3
##.SHIFT REFERENCE= (INTERNAL, CDCl3, 0, 14.3821)
##AUDIT TRAIL= $$ (NUMBER, WHEN, WHO, WHERE, WHAT)
$$ ##TITLE= Audit trail, XWIN-NMR		Version 3.5
$$ ##JCAMPDX= 5.01
$$ ##ORIGIN= Bruker BioSpin GmbH
$$ ##OWNER= new_Human
$$ C:/Bruker/XWIN-NMR/data/yarkov/nmr/H-C/1/audita.txt
$$ ##AUDIT TRAIL=  $$ (NUMBER, WHEN, WHO, WHERE, WHAT)
(   1,<2025-02-28 14:06:01.56 +0400>,<new_Human>,<DPX200>,
      <created by zg, POWCHK disabled, PULCHK disabled
       configuration hash MD5:
       00 E9 B6 7A A2 85 ED C7 34 08 36 98 17 FE 4E 26
       data hash MD5: 16K
       4C FC 8B 6D B1 9C DB 8E 9D 5F 17 80 41 6C 2C B6>)
$$ ##END=
$$ 
$$ hash MD5
$$ 17 B9 72 3D 7A 8D 67 0F 8D 6D D0 42 FC 8D 05 18
##$RELAX= 
##$RELAX= 
##$RELAX= 
##$RELAX= 
##$RELAX= 
##$RELAX= 
$$ Bruker specific parameters
$$ --------------------------
##$DU= <C:/Bruker/XWIN-NMR>
##$EXPNO= 1
##$NAME= <H-C>
##$PROCNO= 1
##$TYPE= <nmr>
##$USER= <yarkov>
##$AMP= (0..31)
100 100 100 100 100 100 100 100 100 100 100 100 100 100 100 100 100 100 
100 100 100 100 100 100 100 100 100 100 100 100 100 100 
##$AQSEQ= 0
##$AQ_mod= 1
##$AUNM= <au_zg>
##$AUTOPOS= <>
##$BF1= 200.13
##$BF2= 200.13
##$BF3= 200.13
##$BF4= 200.13
##$BF5= 200.13
##$BF6= 200.13
##$BF7= 200.13
##$BF8= 200.13
##$BYTORDA= 1
##$CFDGTYP= 0
##$CFRGTYP= 5
##$CHEMSTR= <none>
##$CNST= (0..31)
1 1 145 1 1 1 1 1 1 1 1 1 1 1 1 1 1 1 1 1 1 1 1 1 1 1 1 1 1 1 1 1 
##$CPDPRG= <>
##$CPDPRG1= <>
##$CPDPRG2= <>
##$CPDPRG3= <>
##$CPDPRG4= <mlev>
##$CPDPRG5= <mlev>
##$CPDPRG6= <mlev>
##$CPDPRG7= <mlev>
##$CPDPRG8= <mlev>
##$CPDPRGB= <>
##$CPDPRGT= <>
##$D= (0..31)
0 0.7 0 0 0 0 0 0 0 0 0 0.03 0 0 0 0 0 0 0 0 0 0 0 0 0 0 0 0 0 0 0 0 
##$DATE= 1740737160
##$DBL= (0..7)
120 120 120 120 120 120 120 120 
##$DBP= (0..7)
150 150 150 150 150 150 150 150 
##$DBP07= 0
##$DBPNAM0= <>
##$DBPNAM1= <>
##$DBPNAM2= <>
##$DBPNAM3= <>
##$DBPNAM4= <>
##$DBPNAM5= <>
##$DBPNAM6= <>
##$DBPNAM7= <>
##$DBPOAL= (0..7)
0.5 0.5 0.5 0.5 0.5 0.5 0.5 0.5 
##$DBPOFFS= (0..7)
0 0 0 0 0 0 0 0 
##$DE= 6
##$DECBNUC= <off>
##$DECIM= 32
##$DECNUC= <off>
##$DECSTAT= 4
##$DIGMOD= 1
##$DIGTYP= 9
##$DL= (0..7)
0 120 120 120 120 120 120 120 
##$DP= (0..7)
150 150 150 150 150 150 150 150 
##$DP07= 0
##$DPNAME0= <>
##$DPNAME1= <>
##$DPNAME2= <>
##$DPNAME3= <>
##$DPNAME4= <>
##$DPNAME5= <>
##$DPNAME6= <>
##$DPNAME7= <>
##$DPOAL= (0..7)
0.5 0.5 0.5 0.5 0.5 0.5 0.5 0.5 
##$DPOFFS= (0..7)
0 0 0 0 0 0 0 0 
##$DQDMODE= 0
##$DR= 18
$$ [...]
##$SUBNAM0= <"">
##$SUBNAM1= <"">
##$SUBNAM2= <"">
##$SUBNAM3= <"">
##$SUBNAM4= <"">
##$SUBNAM5= <"">
##$SUBNAM6= <"">
##$SUBNAM7= <"">
##$SUBNAM8= <"">
##$SUBNAM9= <"">
##$SW= 18.0517328524113
##$SWIBOX= (0..15)
0 0 2 0 0 0 0 0 0 0 0 0 0 0 0 0 
##$SW_h= 3612.71676300578
##$TD= 16384
##$TD0= 1
##$TE= 0
##$TE2= 300
##$TE3= 300
##$TEG= 300
##$TL= (0..7)
0 120 120 120 120 120 120 120 
##$TP= (0..7)
150 150 150 150 150 150 150 150 
##$TP07= 0
##$TPNAME0= <>
##$TPNAME1= <>
##$TPNAME2= <>
##$TPNAME3= <>
##$TPNAME4= <>
##$TPNAME5= <>
##$TPNAME6= <>
##$TPNAME7= <>
##$TPOAL= (0..7)
0.5 0.5 0.5 0.5 0.5 0.5 0.5 0.5 
##$TPOFFS= (0..7)
0 0 0 0 0 0 0 0 
##$TUNHIN= 0
##$TUNHOUT= 0
##$TUNXOUT= 0
##$USERA1= <user>
##$USERA2= <user>
##$USERA3= <user>
##$USERA4= <user>
##$USERA5= <user>
##$V9= 5
##$VALIST= <valist>
##$VCLIST= <CCCCCCCCCCCCCCC>
##$VD= 0
##$VDLIST= <DDDDDDDDDDDDDDD>
##$VPLIST= <PPPPPPPPPPPPPPP>
##$VTLIST= <TTTTTTTTTTTTTTT>
##$WBST= 1024
##$WBSW= 4
##$XGAIN= (0..3)
0 0 0 0 
##$XL= 0
##$YL= 0
##$YMAX_a= 65860
##$YMIN_a= -91170
##$ZGOPTNS= <>
##$ZL1= 120
##$ZL2= 120
##$ZL3= 120
##$ZL4= 120
##$ABSF1= 10
##$ABSF2= 0
##$ABSG= 5
##$ABSL= 3
##$ALPHA= 0
##$AQORDER= 0
##$ASSFAC= 0
##$ASSFACI= 0
##$ASSFACX= 0
##$ASSWID= 0
##$AUNMP= <proc_1d>
##$AZFE= 0.1
##$AZFW= 0.1
##$BCFW= 1
##$BC_mod= 2
##$BYTORDP= 1
##$COROFFS= 0
##$CY= -3
##$DATMOD= 1
##$DC= 2
##$DFILT= <>
##$DTYPP= 0
##$F1P= 0
##$F2P= 0
##$FCOR= 0.5
##$FTSIZE= 0
##$FT_mod= 4
##$GAMMA= 1
##$GB= 0.15
##$INTBC= 1
##$INTSCL= 1
##$ISEN= 128
##$LB= 0.25
##$LEV0= 0
##$LPBIN= 0
##$MAXI= 10000
##$MC2= 0
##$MEAN= 0
##$ME_mod= 0
##$MI= 1.114404
##$NCOEF= 0
##$NC_proc= 0
##$NLEV= 6
##$NOISF1= 3.799351
##$NOISF2= 2.8
##$NSP= 1
##$NTH_PI= 0
##$NZP= 0
##$OFFSET= 14.38212
##$PC= 1
##$PHC0= -1336.644
##$PHC1= 6.192235
##$PH_mod= 1
##$PKNL= yes
##$PPARMOD= 0
##$PSCAL= 0
##$PSIGN= 0
##$REVERSE= no
##$SF= 200.129724274929
##$SI= 16384
##$SIGF1= 3
##$SIGF2= 2
##$SINO= 400
##$SIOLD= 16384
##$SREGLST= <1H.CDCl3>
##$SSB= 0
##$STSI= 0
##$STSR= 0
##$SW_p= 3205.1282051282
##$SYMM= 0
##$S_DEV= 0
##$TDeff= 0
##$TDoff= 0
##$TI= <>
##$TILT= no
##$TM1= 0
##$TM2= 0
##$TOPLEV= 0
##$USERP1= <user>
##$USERP2= <user>
##$USERP3= <user>
##$USERP4= <user>
##$USERP5= <user>
##$WDW= 1
##$XDIM= 8192
##$YMAX_p= 0
##$YMIN_p= 0
$$ End of Bruker specific parameters
$$ ---------------------------------
##NTUPLES= NMR FID
##VAR_NAME=  TIME,          FID/REAL,        FID/IMAG
##SYMBOL=    X,             R,               I
##VAR_TYPE=  INDEPENDENT,   DEPENDENT,       DEPENDENT
##VAR_FORM=  AFFN,          ASDF,            ASDF
##VAR_DIM=   8192,          8192,            8192
##UNITS=     SECONDS,       ARBITRARY UNITS, ARBITRARY UNITS
##FACTOR=    0.0002768,     1,               1
##FIRST=     0,             0,               0
##LAST=      2.2672688,     0,               0
##MIN=       0,             -91170,          0
##MAX=       2.2672688,     65860,           0
$$ Real data points
##PAGE= N=1
##DATA TABLE= (X++(R..R)), XYDATA
0 0 0 0 0 0 0 0 0 0 0 0 0 0 0 0 0 0 0 0 0 0 0 -8 8 -8 8 -8 8 -15 16 -16 16 -24 24 -29 32 -37 40 -47 53 -56 64 -71
42 -71 79 -87 100 -109 120 -133 148 -162 179 -196 214 -237 261 -289 321 -354 393 -439 492 -555 631
63 631 -725 842 -995 1194 -1461 1738 -2580 65860 -11768 -82074 30443 33567 -54518 -12237
77 -12237 47329 -27144 -45817 39644 32526 -38822 -8251 19201 -22788 -5486 39021 -3099
89 -3099 -36073 10696 36636 -9303 -26072 24800 25493 -30488 -3782 42584 -12925 -35435 41904
102 41904 39944 -42402 -23321 40904 -1881 -36253 21756 8694 -52755 2659 41572 -29016
114 -29016 -22732 37413 -4032 -31156 24877 13955 -41646 -2445 40742 -16418 -38904 22370
126 22370 21393 -20347 6721 23942 -12086 -10835 18782 13528 -7956 -8484 8442 8205 -6607 593
140 593 6268 -8339 -2401 10404 -8324 -18861 4644 10857 -12111 -5713 16394 -6675 -15784
153 -15784 24898 13209 -29431 -212 21903 -15463 -13596 15378 -2943 -15573 11436 11767 -13364
166 -13364 -594 17548 -3941 -7074 12512 -4374 -13229 13006 7165 -13367 -143 7948 -2431
179 -2431 -2628 2475 444 -4716 -2680 3786 -100 -4685 792 4434 2397 -1782 -1140 3716 -1556 -2933
195 -2933 5320 -3766 -8183 7899 2872 -7878 6141 6085 -7747 1084 8568 -5279 -8410 5524
209 5524 2277 -10982 102 7900 -7685 -2369 11379 -3686 -6536 8947 1322 -6233 4188
222 4188 3422 -4422 9 5521 8 -4083 3272 3091 -5225 -260 3059 -4014 -1430 2209 -1252 -154
238 -154 205 549 2615 -1863 -915 3352 -2776 -3017 3141 -1242 -3855 1505 2002 -2398 -1602 4092 715
255 715 -5206 3264 3944 -6483 1024 6519 -4802 -1678 6823 -964 -3568 3600 2411 -3754 -1168
270 -1168 4152 -1808 -5100 3904 1461 -6112 1844 3366 -4168 -329 2929 -1101 -1501 777 1918
285 1918 -600 -1836 2926 1237 -2999 1891 2205 -2621 -227 1708 -339 -1856 -778 2157 -1195
300 -1195 -3427 3176 642 -4820 2512 2939 -3941 180 3677 -1015 -1873 2056 2063 -2668 -818 4375
316 4375 -1761 -3521 4611 581 -4283 2676 2012 -3307 -226 2013 -623 -2206 494 2238 -2026
331 -2026 -1267 3516 -892 -2509 2478 90 -2551 206 317 -596 -1244 -170 2055 -1190 -1140 3508 -228
348 -228 -2239 2707 957 -1951 721 1801 11 -960 1583 2471 -2122 -413 3390 -2590 -2868 2477
364 2477 -1880 -3661 1153 -56 -2243 -278 1285 231 -1688 974 1985 -2176 104 2904 -1260
379 -1260 -112 2793 245 291 1311 669 698 -895 -118 1242 -1911 -742 1961 -1003 -593 1773 207
396 207 -637 -338 90 -788 -2896 -456 152 -3730 -570 1939 -2445 -252 2809 -827 -647 1706 363
413 363 -610 108 1601 678 -491 2528 2050 -764 2280 1933 -1111 861 627 -1086 242 -559 -399
430 -399 507 -1399 -319 291 -2346 -1416 -799 -2644 -1943 -1267 -977 -712 -648 1745 1224 -561 2842 1996
448 1996 -1685 1774 1666 -2204 618 1647 -763 444 1662 1165 445 879 1779 -194 -597 1662 -802
465 -802 -1421 1505 -861 -1459 975 -1280 -1731 -350 -2227 -1834 -1045 -2233 -798 -97 -503 697 1052
482 1052 1207 957 540 1631 79 -1081 1614 -163 -1596 2349 762 -920 2922 1569 -819 1694
498 1694 1015 -1229 -597 149 -842 -1946 -39 578 -2304 -274 1520 -2182 -752 1456 -1943 -713
514 -713 1396 -1026 -89 1525 -14 389 719 -22 -320 -689 -316 -840 -1055 536 -240 -11 2342 327
532 327 407 3099 -177 -825 2186 -1069 -2238 886 -698 -2038 292 634 -754 -388 1523 177 -1591
549 -1591 1543 947 -2347 1195 1856 -2061 868 2027 -1592 -147 997 -1373 -1037 -248 -846 -947 -322
566 -322 482 -198 123 1377 -307 -156 1179 -1337 -760 1145 -1651 -582 1947 -822 142 2710 273
583 273 12 2021 670 -809 243 1003 -1171 -1287 1459 -580 -2147 1710 209 -2687 1133 561
599 561 -2659 387 726 -1708 -79 914 -421 -465 419 194 -1097 -333 592 -1423 -341 1121 -853
616 -853 542 2136 -213 1156 2351 -339 769 1605 -865 -223 795 -705 -780 327 167 -1157 -412
633 -412 943 -1390 -1429 1371 -1250 -2098 1514 -529 -1939 1513 371 -1396 896 772 -890 -7 835
650 835 -40 -719 1001 979 -875 1017 1501 -950 630 1299 -1239 238 824 -1253 140 574 -841
667 -841 309 555 -342 -99 158 -71 -741 -332 242 -1311 -588 966 -1274 -631 1519 -1005 -719 1723
685 1723 -523 -869 1327 149 -638 713 794 -173 -24 1117 190 -1024 890 253 -1587 682 390
702 390 -1655 486 627 -1140 435 576 -682 253 329 -164 27 107 249 -228 -20 597 -559 29 779
721 779 -1004 -123 822 -1158 -187 884 -1017 -184 955 -537 -157 748 -6 -226 212 639 -342 -479
739 -479 1026 -217 -973 1118 -97 -1208 1095 112 -1044 714 275 -633 357 254 -93 -50 121 288
757 288 -416 21 605 -674 -33 691 -896 20 581 -978 72 389 -866 185 311 -631 306 267 -148
776 -148 181 255 351 -70 58 778 -279 -277 1167 -437 -620 1046 -471 -849 761 -453 -864 241 -242
795 -242 -403 -191 166 166 -480 349 558 -711 320 719 -807 304 619 -703 387 485 -405 396 214
814 214 -171 319 -91 8 156 -213 211 -17 -133 539 -321 -129 695 -727 -349 604 -938 -448 487 -801
834 -801 -365 421 -268 -221 145 174 4 -255 593 311 -566 841 617 -583 897 692 -563 677 344
853 344 -485 173 -80 -373 -117 -386 -48 -175 -401 269 -359 -378 344 -500 -301 421 -634 -26 516 -606
873 -606 295 618 -453 266 468 -319 114 145 -45 2 -124 482 15 -294 815 42 -608 771 -115 -810
893 -810 578 -46 -634 357 -64 -264 77 -55 6 -357 -288 259 -568 -238 521 -505 54 695 -283 413
913 413 766 -284 426 433 -397 321 88 -383 92 -119 -142 -109 -334 103 -354 -479 419 -515 -527 724 -375
934 -375 -315 920 -91 -237 728 -29 -189 339 16 47 -54 171 290 -293 342 557 -555 302 418 -754
954 -754 171 190 -701 117 -51 -492 162 -51 -312 29 -270 -133 -228 -340 173 -367 -237 472 -386 -21 857
975 857 -307 71 946 -220 178 877 -63 223 627 117 192 112 227 -3 -555 151 -145 -970 62 -244
995 -244 -1136 208 -138 -849 331 -67 -548 264 -47 -224 143 7 104 38 132 435 -92 177 645 -288 333
1016 333 664 -476 310 744 -440 260 588 -382 161 328 -200 -62 -102 -108 -314 -446 94 -421 -671 313
1036 313 -418 -699 466 -359 -654 532 -216 -387 545 19 -74 459 266 202 193 344 419 -130 389 413 -440
1057 -440 364 321 -665 303 296 -699 216 184 -621 86 106 -317 -65 55 -22 -207 -111 244 -363 -198 456 -451
1079 -451 -348 615 -496 -390 595 -361 -182 547 -122 -45 377 31 149 116 297 136 -155 449 155 -421
1099 -421 432 24 -669 486 0 -659 386 -6 -559 245 20 -341 138 95 -8 -133 61 259 -349 71
1119 71 452 -515 1 563 -610 -57 526 -574 -39 410 -429 -15 286 -107 -32 63 182 39 -106 449
1139 449 22 -217 548 -67 -376 536 -123 -481 500 -168 -501 295 -143 -389 125 34 -99 -91 71 127 -313
1160 -313 222 281 -479 259 430 -532 237 404 -585 101 240 -431 104 143 -194 31 73 73 -43 -39 350 -89
1182 -89 -119 526 -223 -230 575 -369 -257 488 -336 -235 376 -302 -226 140 -85 -101 -93 76 51 -263 338 142 -445
1205 -445 432 249 -492 397 235 -453 297 127 -419 120 50 -242 -13 -34 -38 -172 -75 249 -246 -97 346 -313
1227 -313 7 478 -381 35 482 -365 9 337 -337 5 180 -85 -32 -29 130 -24 -194 314 23 -283 457
1248 457 18 -414 463 11 -415 391 -80 -349 151 -99 -201 18 -94 9 -145 -84 153 -261 25 332
1268 332 -286 212 463 -261 214 385 -260 263 287 -275 180 92 -118 1 -76 40 -120 -144 206 -268 -362 299
1290 299 -255 -294 437 -200 -223 433 -94 -128 319 -110 -20 109 -71 58 -160 10 157 -220 184 297 -263
1311 -263 240 310 -356 233 136 -246 243 179 -200 195 12 -57 46 -136 -38 -193 -279 126 -254 -227 287 -285
1333 -285 -123 465 -212 -7 420 -189 43 238 -88 67 186 -51 140 -102 72 85 -348 97 22 -406 153
1354 153 -13 -433 224 16 -270 366 64 -177 148 -59 -62 54 -131 49 -106 -131 244 -140 -45 328 -226
1375 -226 25 364 -354 -30 245 -262 41 297 -109 129 98 48 -37 -163 104 -18 -278 110 -53 -351 284
1396 284 67 -309 283 -86 -289 239 -106 -160 188 -56 89 188 162 258 51 64 245 -214 11 194 -460 15
1418 15 153 -420 101 133 -302 139 133 -159 35 -31 -52 2 -68 206 16 -134 274 -63 -283 268 -256 -285 222
1441 222 -177 -115 317 -49 93 301 -26 140 69 -32 81 -164 -44 73 -244 133 112 -304 183 146 -373
1462 -373 132 -11 -315 69 -105 -229 127 -77 -25 112 12 160 -6 -84 256 -186 -117 346 -208 -39 375
1483 375 -178 4 256 -236 -77 73 -284 -64 2 -37 71 -33 201 214 -129 262 14 -274 220 -117 -342
1504 -342 207 -133 -322 210 7 -129 125 13 -22 22 -102 132 -50 33 239 -143 136 325 -225 99 189
1525 189 -324 -4 136 -331 39 171 -155 107 127 27 66 -31 150 -98 -175 161 -87 -162 257 -48 -155 335
1547 335 -74 -123 241 -132 -144 103 -105 -132 -67 -58 44 -72 75 241 -183 102 187 -269 117 156 -219 214 211
1570 211 -206 142 120 -150 38 1 -63 -77 -68 73 -117 -56 267 -75 -102 334 -182 -109 262 -236 -115 230 -165
1593 -165 19 119 -108 -5 7 -62 -41 -137 36 -3 -190 142 99 -138 278 148 -168 316 82 -212 247 -46
1615 -46 -213 14 -105 -85 -68 -61 45 -140 -43 113 -152 67 295 -242 -5 306 -201 53 147 -209 -22 110
1637 110 -111 -17 -31 -29 -21 -94 119 7 -105 226 16 -142 237 -134 -191 232 -32 -117 228 -79 -56 95 -36
1660 -36 -35 2 56 47 -148 -39 103 -195 56 124 -296 136 134 -302 126 129 -136 159 184 -84 92 -32 -91 -67 -102
1685 -102 76 -127 -131 127 -207 -129 251 -161 -98 318 -93 10 246 -55 64 207 13 -7 -16 -32 -36 -162 -44
1708 -44 7 -247 81 83 -202 209 150 -184 257 110 -231 139 19 -173 -11 12 13 -47 -27 133 -67 -44 211 -201
1732 -201 -118 163 -213 -47 183 -129 83 156 -156 19 117 -88 20 -24 30 54 -55 179 8 -91 199 -34
1754 -34 -243 106 -87 -314 90 -105 -218 166 58 -48 175 87 26 25 21 45 -144 -3 109 -215 30 170 -228
1777 -228 85 183 -209 81 162 -179 121 116 -32 173 84 109 6 -34 78 -119 -165 33 -167 -196 129 -107 -147
1800 -147 204 -146 -55 150 -121 -90 42 -100 46 -16 35 138 -19 134 184 -92 85 81 -287 27 -48 -242 118
1823 118 95 -100 114 111 6 58 -44 -23 -67 -88 58 -61 -67 178 -85 -10 211 -144 -76 100 -189 -164 14 -151
1847 -151 -4 134 -6 65 29 73 85 -66 16 20 -207 101 82 -188 183 118 -77 197 -5 -159 89 -78 -108
1870 -108 18 -58 -19 -16 13 208 17 71 170 -106 -56 136 -198 -23 125 -218 -15 108 -122 71 58 -71 24
1893 24 -89 -46 -19 -47 106 115 -58 216 44 -82 159 -49 -175 70 -165 -102 91 -82 4 87 14 56 65 5 128
1918 128 -115 -5 114 -170 45 181 -147 134 113 -118 85 34 -144 37 -59 -83 15 -107 66 53 -77 129
1940 129 -4 -149 131 -85 -95 197 -77 -36 190 -16 96 170 -29 12 -14 -79 -5 -131 -55 -15 -31 76 140 -76
1964 -76 119 82 -181 75 5 -171 101 -8 -94 43 -30 -53 -7 -23 -10 -66 -85 80 -93 -53 148 -36 -11 218
1988 218 -90 35 215 -70 73 74 -133 -16 5 -25 34 -17 24 105 -66 85 2 -204 117 -46 -145 117 48 -59
2012 -59 128 -15 -72 30 -61 -37 2 -108 6 -46 -4 51 -77 -30 130 -121 38 113 -169 1 83 -128 98 91
2036 91 -44 152 66 10 13 -28 30 -3 -78 83 11 -147 101 -72 -98 79 -100 -68 126 -88 -16 103 -53 33 96
2061 96 -48 64 -21 -30 41 -116 -56 33 -157 44 73 -145 108 89 -54 174 100 -59 107 42 -43 52 -42 61 -34
2086 -34 -126 14 -143 -174 47 -163 -158 129 -113 -22 164 -70 17 128 -50 23 20 -52 -6 -22 100 20 -114 65 95
2111 95 -122 187 65 -93 145 2 -121 120 -32 -67 71 -128 -45 -80 -110 -3 -41 -45 75 -55 -22 154 -112
2134 -112 -24 83 -192 -71 22 -187 -36 30 -95 23 8 20 130 10 94 20 11 115 -6 -104 97 -77 -171 59
2158 59 -82 -156 78 -59 -60 85 -69 50 64 15 104 7 74 22 -141 -28 -11 -152 47 14 -87 81 93 -107
2182 -107 87 -10 -61 51 -50 -23 15 -76 3 -19 -81 58 -80 -116 124 -101 -76 153 -158 -35 146 -157 -36
2205 -36 48 -77 1 25 -44 -1 -106 -37 133 -72 163 40 -57 54 102 -110 89 -27 -115 30 -70 -136 84 -78
2229 -78 -39 -8 -41 78 20 -41 91 -82 -65 151 -66 -17 131 -110 -39 118 -55 -8 9 -97 15 3 -25 32 -17
2254 -17 90 91 -86 156 33 -159 87 -30 -202 61 -87 -124 98 -73 -4 94 -25 -24 -38 -98 -1 -47 -8 108
2278 108 -54 63 128 -32 50 82 -69 28 75 -87 61 7 -38 65 -42 -49 19 -87 -27 -65 -94 82 -12 -133 97
2303 97 -30 -25 99 -13 -33 85 -88 -90 19 -84 4 13 -49 64 29 30 99 -71 40 59 -186 75 45 -98 111
2328 111 21 -28 79 -4 -35 11 -91 -69 -60 -113 -42 -54 -96 72 -64 60 80 -93 0 90 -109 -60 82 -94 4 11
2354 11 -27 97 16 35 65 -79 7 -17 -112 26 35 -59 64 64 -25 75 9 -64 50 -24 -47 11 -38 -10 -47 -32 78 16
2382 16 -62 56 -71 15 78 -120 -9 106 -23 59 132 -22 75 40 -49 57 -55 -39 -12 -32 3 37 -39 68 -22
2407 -22 -129 34 -76 -94 64 23 -97 86 -7 9 120 -6 -20 -39 -36 -18 -43 -19 82 -117 -26 74 -139 66
2431 66 44 -95 61 31 -82 38 -3 -14 52 -9 124 68 -26 90 -52 -46 19 -64 -55 62 -89 -72 78 -18 21 46
2457 46 -50 37 15 -7 15 13 6 79 -37 14 20 -64 32 37 -85 53 34 -99 49 9 -42 55 22 -51 45 -44 34 -29 -19 86
2487 86 -45 -71 42 -20 -64 67 -100 10 41 -81 -1 22 -81 68 22 -16 77 34 15 63 -44 8 -3 -2 55 27
2513 27 -63 30 -22 -39 95 -71 -77 21 -37 -20 25 -4 26 19 17 86 37 21 116 -21 24 25 -23 2 63 -88 59 92 -94
2542 -94 57 -9 -16 58 3 15 70 -33 57 -3 -20 51 -13 -78 17 -86 -115 -12 -79 -7 19 -110 -6 37 6 23 15 -17
2570 -17 84 -59 18 25 -30 78 46 -8 65 -11 -31 87 21 -43 73 -50 -47 16 -12 -41 -10 -38 -10 -33 -86 17 -77 -21
2598 -21 51 -103 -8 46 -75 -24 62 -68 4 -42 -51 7 -20 -27 47 -20 60 54 -32 109 44 -45 113 -29 -53 59 -35 -28 20
2627 20 -80 -75 6 -64 45 -11 -36 63 10 -13 68 -77 26 36 -103 -27 55 -151 -6 30 -55 29 82 7 33 -39 -48 41
2655 41 -85 18 29 -58 139 3 -28 133 -40 -17 44 -73 7 33 -6 36 17 13 63 -27 -29 5 -73 3 -63 -114 -7
2682 -7 9 -48 16 35 -21 88 11 -80 -13 -78 -98 -10 -49 -26 -56 -51 -6 1 -11 97 3 2 126 -33 35 54 -67 -52 92
2711 92 -55 -30 15 -32 -1 -71 -22 -51 -122 -40 -19 -116 54 37 -88 5 -9 -82 73 -9 -20 60 18 -7 29 -93 -14 52
2739 52 3 47 -59 -13 46 -81 46 17 -74 -12 34 -4 53 -1 -93 22 -17 -23 48 -98 10 17 -22 -4 -63 -75 48 -24
2767 -24 -83 84 25 -78 105 -21 -34 68 -23 23 17 8 36 -28 -14 -15 -55 3 13 -33 20 30 -90 7 -28 -19 52 -40 17
2796 17 51 12 88 15 -52 -55 0 -11 17 -46 -43 10 -81 -25 31 -69 -59 32 -45 -51 41 -38 15 -17 9 9 -53 17 -9 -50 -16 35
2828 35 -53 29 73 -42 121 27 -96 65 67 36 98 -22 96 68 3 32 -53 -1 47 -25 -12 -45 -94 -43 68 -40 -72
2855 -72 3 -40 -19 2 -16 26 6 -35 -14 -21 28 78 -13 57 5 -17 38 40 -60 25 -30 -21 64 -10 -8 43 -60 80 19 -23 26
2886 26 -20 -15 22 -22 -44 69 -110 -10 20 -78 29 44 -102 16 -64 -56 -22 5 5 -12 -48 43 15 -64 43 21 -35 43
2914 43 17 -33 78 -10 -27 58 -34 1 5 -75 12 3 -37 -1 -42 -20 25 -2 -1 24 -92 20 30 -94 20 -51 -75 -11 -39
2943 -39 0 44 -7 17 43 -3 35 16 -14 84 -27 -33 54 -25 25 115 -84 54 66 -18 42 65 10 24 58 29 22 10 6 -6
2973 -6 -36 -25 -1 -34 -1 -18 -72 44 -50 -58 25 -36 28 -2 -54 -48 2 -2 2 -15 -5 27 7 31 128 -30 27 67 -14 17 49 -76
3005 -76 19 24 -19 9 56 -37 38 -31 -42 -61 -96 7 -17 -24 87 34 -14 40 -26 -41 81 -57 38 31 -50 -38 10 -76 52
3034 52 -72 24 71 -44 29 53 -4 5 60 -52 81 45 -33 56 13 -21 63 15 3 19 -13 1 -44 -32 10 -26 -65 56
3062 56 -39 10 60 48 7 59 -87 10 -41 -49 13 -5 -27 12 -75 -18 14 -35 12 -32 -104 70 28 -14 72 18 -19 98 -36
3091 -36 18 81 -61 -6 -31 12 44 -7 -20 22 -48 -39 0 -68 -15 48 -36 45 38 -87 32 9 -59 -25 -31 -25 26 -32 33 -15 -15
3122 -15 36 5 -68 24 -30 -1 48 -1 29 81 0 56 31 -4 79 13 7 40 -40 -31 48 -63 2 35 -112 32 2 -118 -4
3151 -4 17 -41 7 -59 -106 34 -62 -31 46 -65 -26 74 -17 7 -32 -63 55 -24 -61 85 3 47 45 23 4 73 -20 -1 -39
3180 -39 15 26 15 -4 30 -66 -72 5 -116 -2 2 -17 -26 -5 12 28 -85 -63 15 -38 31 3 -27 124 -4 9 95 13 -24
3209 -24 25 -43 9 67 -18 -22 55 -54 34 7 -28 31 61 -17 24 -52 -15 -3 -57 6 -54 -86 -70 -47 -73 34 20 -21 13 18
3239 18 -29 12 0 48 -60 -14 60 -6 84 66 -28 9 40 -19 11 59 -77 27 1 22 10 9 38 34 -37 -16 48 -34 4 11
3269 11 -66 -18 -23 -36 11 2 -59 63 -48 -93 -16 4 -41 12 -15 6 -34 -27 51 -53 52 114 -6 5 16 14 2 23 -48 -12
3299 -12 -11 -78 9 -56 35 42 -16 -20 30 7 18 -15 -34 42 -8 -29 20 -16 70 64 -85 -98 21 -81 -35 -7 -66 4 -63 -6 10
3330 10 -46 50 -3 -42 29 28 -84 31 -17 -70 -19 -21 -4 46 30 -49 7 -61 -36 11 -78 3 31 -31 65 22 -8 54 -12 -22
3360 -22 4 -23 -23 -17 -47 -60 4 4 27 -35 -34 21 -32 -49 -18 -28 25 -26 -1 59 42 -52 55 -42 14 41 -62 -59 10 -10 35 41
3392 41 -47 -21 -9 -35 54 -10 -35 50 -44 -28 56 -82 46 25 -68 -94 -101 -20 -14 -15 -56 -33 -38 14 -44 5 0 28 -5 77 15 -3
3424 -3 65 -68 1 39 -24 34 44 3 -6 55 -74 -16 -22 2 0 -70 35 22 -16 12 41 -42 18 24 -42 3 -78 -19 39 -47 4
3455 4 2 -27 12 12 5 77 -15 -14 83 -3 -81 85 -32 -40 9 -57 -25 42 -33 60 -2 31 -14 -72 41 59 -68 -6 -24 -41 40
3486 40 34 -84 -10 -30 -58 73 2 -36 7 4 28 21 14 14 -38 -50 20 -4 -76 30 2 27 75 -20 46 23 6 -12 -11 -27 -79 12
3518 12 -43 -40 -85 8 -17 -30 -17 -14 -58 54 -66 -39 96 -35 14 8 30 23 -12 -52 108 -49 -17 23 26 23 26 -27 -39 8 -64
3549 -64 58 -35 -49 69 -22 -63 -13 28 -15 -4 -23 52 -13 -12 73 1 -53 12 9 -56 80 -39 -54 -59 -20 -14 20 0 7 -10 4
3580 4 -18 0 13 39 -79 26 43 -49 45 13 -35 50 -3 -53 19 44 66 44 -20 -23 49 -3 -11 6 -39 50 -70 -36 21 -20
3610 -20 -53 -19 -16 -28 -9 10 23 -36 -5 26 -62 -42 29 -16 10 -13 -42 32 28 -23 26 13 -22 -14 11 -56 -12 -52 -13 -2 39 0
3642 0 20 -49 72 -3 6 22 -2 -2 29 -5 -8 22 -45 32 -20 -22 27 -15 -49 -9 38 -5 -21 -8 37 14 -32 32 -18 15 54 11
3674 11 55 27 -3 -57 41 -43 -11 15 -13 20 -8 -3 45 1 -39 3 -32 5 20 -44 8 -24 -58 1 28 -79 38 -11 -29 -13
3704 -13 -58 0 -13 15 -31 -15 30 31 17 7 67 -19 -26 97 -44 31 60 21 13 8 -97 32 9 0 46 -42 9 9 -4 33 64
3735 64 -90 63 29 -34 -7 -31 -65 15 -75 -41 -27 37 3 -15 -42 -13 -3 -81 52 -25 -31 69 -1 -15 11 -39 15 64 -35
3764 -35 76 58 -18 -32 -31 -52 5 -92 -24 58 14 -33 -21 14 13 12 -21 2 -19 33 31 7 13 -22 17 -12 -52 61 3 -53 -10 35
3796 35 -32 -89 -10 -15 32 66 -40 41 50 -4 16 -3 -7 69 -1 -17 72 -34 23 -2 -19 -31 60 -55 96 -1 -19 37 62 -34
3826 -34 47 8 -18 -40 32 54 -10 -31 -16 2 18 47 3 19 18 -85 5 39 -24 4 20 0 85 3 21 -2 48 14 -31 -28 27
3857 27 -11 -74 20 -71 -34 50 -26 -37 -13 -76 25 7 -42 18 2 -32 14 -30 -32 15 14 -36 12 -13 23 -36 -42 -65 34 7 -9
3888 -9 70 63 33 68 -12 39 21 41 2 31 68 12 -65 30 -21 -23 28 -56 -3 33 -11 43 18 -102 64 7 -39 26 -3 -26 28
3919 28 -17 25 -20 -5 -15 22 -10 -3 22 5 38 -78 -26 -6 -68 9 -2 -29 -31 12 -2 21 7 -39 42 -30 22 -24 -1 7 -1 -37
3951 -37 -1 27 4 0 -20 -31 -17 6 29 -30 7 30 -3 16 -44 52 -2 -17 -38 -25 5 -12 29 39 -6 -54 -31 17 12 5 3 11 -45
3984 -45 8 47 -15 -4 -9 -51 0 -17 -79 3 -26 -81 21 6 -20 -16 -91 -25 -31 -8 14 39 -22 28 -22 -54 17 28 -9 81 -21
4015 -21 -52 57 11 26 53 -22 -10 33 -41 3 4 31 70 -29 21 36 -14 40 -92 25 53 -71 -42 -19 -25 -39 38 -58 3
4044 3 -13 -68 -24 22 68 58 0 1 16 -19 73 9 -64 32 45 -15 16 51 -20 59 -52 -4 31 -47 -29 -33 -23 -9 -27 -20 -42 -19
4076 -19 4 -14 -29 -36 39 -16 31 -25 -17 -26 -34 -39 27 35 11 36 -12 53 38 -34 62 -64 -1 57 68 15 11 -26 -13 27 -40 -57 -9
4109 -9 2 60 -36 -31 36 -50 3 7 -16 -62 -6 -14 15 -13 7 1 -25 -74 34 35 -22 8 46 34 -51 -50 32 57 -4 92 44 22 10
4142 10 57 -9 72 24 -17 51 73 4 -16 -19 6 31 -48 1 -56 9 -35 -8 -3 -74 22 37 -63 -65 -17 -2 -2 -3 -48 -39 -32 -12 23
4175 23 -39 0 5 15 19 9 15 0 46 -25 -10 -33 -51 22 -5 -27 -47 15 -28 44 -7 -31 53 -37 -2 28 -53 -15 -80 -32 -37 -11
4207 -11 -71 29 -2 -15 -19 -9 28 9 -35 20 35 -9 11 12 9 -16 15 -37 55 -17 -10 24 47 -7 47 25 -10 33 -2 -30 -55 -62
4239 -62 -20 -26 38 7 -17 25 -10 -12 -12 -3 21 15 41 0 -6 -30 16 -6 9 -44 -15 -35 28 19 -19 7 -8 27 2 30 26 19 -81 -93
4273 -93 46 68 -43 -22 -36 46 7 -44 -29 -42 2 -41 -7 8 -13 11 1 -20 24 5 -14 -30 -12 -26 15 -8 32 -38 21
4302 21 3 -49 -37 25 52 -22 -1 -14 -62 -14 -31 -28 -13 -21 -15 8 21 38 62 -40 -19 -45 -84 -28 39 -45 -57 44 4 18 12
4333 12 -17 14 -3 9 -12 -30 24 -10 -34 55 -34 -61 9 5 41 64 16 -48 53 -5 50 -50 -25 14 -13 33 47 -52 -1 64
4363 64 -2 28 8 16 9 -30 -34 -41 -66 -52 -43 -48 39 -18 -58 -43 -18 -15 4 -5 -25 52 59 -43 62 -21 -39 -25 -90 -14 -33 -18 42 8
4397 8 26 41 21 15 26 50 -33 15 -17 49 -45 18 101 9 18 -32 -15 -24 22 -26 40 -12 2 -31 3 4 -35 40 -28 10 8 -43 16
4430 16 3 5 30 -23 13 -25 -8 37 -6 -18 61 1 -16 -5 -5 14 -53 -36 -3 -26 -64 15 -26 7 -8 -18 -61 -42 -13 2 -24
4461 -24 11 4 -5 -20 4 -18 -26 11 62 39 6 6 21 10 3 20 -17 20 39 -34 -56 10 2 50 32 -4 29 -51 -9 13 -11 -22 -5
4494 -5 -67 43 22 -50 41 42 -22 30 -21 -39 1 8 -42 20 -5 -8 3 -40 -39 -60 1 -19 0 0 69 -41 -16 19 66 -8 20 -37
4526 -37 -19 -24 -12 52 4 -31 -38 -8 -5 1 -39 21 21 -27 108 52 -35 26 14 -76 -12 27 22 18 -33 57 28 -13 -6 -29 18 -50 4 -21
4560 -21 3 47 44 60 49 5 -5 -29 29 25 -43 -9 -49 2 -31 -30 -44 -17 -64 38 -15 26 -41 30 -1 39 -52 -4 -8 -60 12 0
4592 0 39 -24 17 36 10 -35 25 16 -1 61 23 -16 49 7 -15 13 47 25 4 -67 8 -10 -24 -19 29 47 -40 5 -69 -7 -41 3
4624 3 -35 19 -50 21 17 -10 -49 -19 57 -45 18 -12 38 -13 -14 3 -19 1 3 25 -36 19 -12 4 17 9 -18 7 -5 27 -20 -28 -37
4657 -37 0 -9 -45 -9 -25 14 0 17 -41 2 -19 0 35 -35 -16 25 14 -14 -12 -75 75 -17 2 -8 -19 14 6 -6 61 -26 -7
4688 -7 12 -22 3 12 -3 22 21 24 60 43 -40 -19 8 -33 -49 -43 -29 -11 -5 31 -26 -72 -17 -5 -17 21 11 -71 29 -48 -21 -38 -47
4721 -47 -13 17 -20 -35 19 5 8 59 -20 -30 -35 1 -2 -2 -36 6 8 -6 -7 -49 24 -31 4 8 -14 -10 15 -55 43 -16 -24 23 -37 -43 -86
4756 -86 5 -65 -22 -18 -41 -36 11 20 4 6 -15 -20 -2 37 37 -33 -16 5 11 22 9 76 -46 -24 -52 19 -34 -37 8 -19 20 11 -11 2
4790 2 -12 -27 -1 5 -18 -62 33 27 16 -36 -7 33 11 -35 10 -24 -11 27 27 6 13 3 25 -25 32 -16 56 41 25 22 46 15 45
4823 45 -2 23 43 25 -14 1 -32 -51 27 -15 8 -17 -7 -17 -2 10 -18 -4 8 5 -9 -44 -16 23 13 -55 11 2 8 6 33 -19
4855 -19 -6 11 -25 36 23 37 -12 -45 19 14 15 -58 -14 13 51 -18 -40 67 37 -26 -53 -36 4 29 -3 32 60 -79 8 -6
4885 -6 -62 14 -24 44 -25 -70 18 27 25 21 55 -6 -32 3 -29 -34 35 -3 36 33 65 -12 -8 57 -6 -9 -8 -27 -1 -54 -8 -20 23 -1 -24
4920 -24 -39 -19 -26 -8 -58 -15 -39 -12 64 30 4 -26 3 -36 55 -5 -36 -28 -12 35 26 47 -30 25 15 29 -13 50 2 37 48 42
4952 42 13 -22 -14 -53 8 -12 -32 28 -13 -50 8 -9 -27 32 -60 13 66 -5 88 -17 34 -48 -20 31 0 -35 -3 -11 3 -3 0 20
4984 20 5 25 51 17 -48 48 10 -49 -3 22 -7 12 -17 -46 -6 1 -36 -39 9 -32 -13 -32 -9 -27 57 -36 26 -28 -12 36 11
5015 11 36 11 -68 -64 -22 21 35 -24 -29 30 -33 -2 12 -3 28 3 19 30 -12 -12 -3 28 21 -9 14 -31 -12 -10 5 -55 26 -25 -30 29
5049 29 -33 7 10 2 -51 -22 -52 -45 17 -7 -12 58 -12 33 53 4 28 30 42 20 6 -15 57 -10 -13 -1 10 0 -2 3 19 53 -18 -48
5083 -48 -49 13 -16 -48 15 -4 -63 -23 -43 -51 0 -4 -56 -14 22 -24 -3 -35 21 -21 5 13 -42 0 -27 3 -10 -20 -5 -5 0 -4 13 0
5117 0 -15 5 -11 -17 37 11 28 26 -16 -3 -63 -38 16 33 -39 5 -34 -28 -34 5 32 50 -35 -66 -34 -17 -3 -19 13 -28 23 2 19
5150 19 19 26 18 -47 -26 -14 -3 19 57 50 3 79 15 -6 -50 -5 20 63 20 -5 10 20 11 -1 86 -23 -39 1 -57 -13 21 -22
5182 -22 -43 35 -81 -66 24 -8 -34 2 -5 12 -13 -8 43 37 31 -1 9 -2 4 5 -4 -11 2 -4 17 11 -27 7 36 -48 31 40 -22 -61 -6
5217 -6 -17 -22 -9 -28 -6 -24 -54 5 -15 -25 -50 -31 -50 -11 -22 -7 -17 37 -19 19 26 3 -15 -26 93 -54 -27 -23 42 -42 0
5248 0 13 -66 35 30 -23 -26 -46 -3 -3 28 14 -10 -2 -3 -40 9 -24 -14 -31 -28 34 54 -6 -45 30 0 -23 -15 -21 33 24 -48 27 -24 1
5283 1 7 -10 -27 59 -27 -3 38 -24 -8 33 19 3 5 -15 46 11 -17 -12 -5 68 47 -64 26 2 24 -14 -30 3 -42 1 13 -7
5315 -7 -60 -5 9 2 -10 38 -12 60 25 4 40 28 28 34 18 26 3 -14 5 0 -44 -35 -29 27 -54 -7 -19 32 -39 25 -10 -30 -6 -6 1
5350 1 26 -10 7 -4 10 -12 -41 -40 -34 -5 -18 -15 30 24 -9 53 63 -30 -25 -10 16 49 -5 6 10 8 13 -35 -49 -14 -19 16 8 -50 -40 -2
5386 -2 33 -7 -1 13 -24 -4 -17 -36 14 -31 -21 -18 14 -29 -24 -15 -7 28 -6 -13 34 35 33 -14 -27 41 5 36 13 10 21 17 -19 52 -4 -19
5422 -19 30 -12 -64 -6 -4 -30 36 11 38 21 -61 -12 43 -46 22 28 -47 -4 11 -4 53 -12 30 25 -40 27 -4 17 59 -13 -1 36
5454 36 -5 3 13 38 15 -11 -46 25 -20 -44 45 56 6 -25 24 -8 -29 -52 63 1 7 -20 -24 33 11 14 -32 14 -60 45 -22
5485 -22 28 1 -16 -19 -25 43 39 47 19 -20 -32 55 -47 50 14 42 62 -37 22 33 -21 -18 -19 3 27 -18 0 89 2 -74 -22 -32 18
5518 18 -10 22 -8 -3 8 33 18 5 51 -33 5 20 2 49 -32 1 9 -67 24 58 6 -43 43 28 -11 27 -15 30 -12 12 -22
5549 -22 -39 10 33 -35 -10 -15 -23 -48 2 -10 -14 0 -2 9 -25 -18 34 8 -13 -18 -23 -24 -9 62 15 8 -28 -9 -12 16 6 50 -30 -94 14
5584 14 -15 -28 17 17 -50 25 42 -13 -12 -25 17 19 35 -13 1 -14 -8 22 -78 20 -18 -2 -16 -36 32 -2 -5 -32 39 -41 -2 -25
5616 -25 -39 0 -18 54 36 17 18 42 3 -22 18 39 11 -14 -22 -2 -21 -9 35 -27 28 -20 -27 68 19 -31 17 -20 -81 -40 -61 32
5648 32 40 9 9 3 -16 31 -2 -24 31 21 2 -14 25 10 -61 -1 38 -19 27 -43 0 -49 -22 39 -25 -2 -61 -27 46 -12 -36 33
5680 33 -45 17 -10 -34 -28 32 -38 -18 -44 5 -22 44 24 12 -37 13 -45 24 34 17 19 47 -10 -16 -8 31 -10 58 -67 3 67 -59
5712 -59 83 -1 -8 32 25 67 75 -75 31 9 -11 -11 -7 59 47 -32 4 35 40 0 45 7 9 -10 -30 42 -21 -65 48 8 -9 -10
5744 -10 -1 4 45 -24 -29 -21 -62 -58 -1 -1 50 32 7 0 -21 10 24 -32 -5 6 -2 22 -12 -4 -2 9 -26 -51 16 38 70 0 -13 -8 -24 14
5780 14 29 46 28 -16 6 15 37 23 -50 -35 22 52 37 52 -13 -25 27 23 -32 20 -1 -30 -38 -52 0 -36 -49 -31 11 -36 -30 46
5812 46 16 25 -72 -53 19 -1 -2 11 -28 -20 30 -7 -28 26 5 107 -24 -7 44 17 41 50 3 -8 -50 26 22 24 -21 -52 -16 28
5844 28 -33 -7 -10 -17 19 -28 -11 31 -9 11 -9 -44 5 -25 0 -26 -32 34 -16 -7 -37 -50 62 -19 32 -18 -5 -23 -38 39 52 4
5876 4 -57 -30 11 -31 53 -1 17 -10 -28 -36 -17 9 49 -11 -18 -38 -10 -6 3 -29 -10 22 72 -1 9 -24 -44 -19 17 6 -12 63 11
5909 11 17 -10 -4 33 52 34 -22 73 -13 47 24 -59 -10 6 44 1 10 19 29 -4 -10 32 -14 -4 -45 -34 7 -59 20 40 -17 18 38
5942 38 -30 19 -27 -99 -49 45 -11 -10 18 34 23 38 -5 63 27 -30 -23 31 -60 -14 -10 52 -32 34 7 36 13 -8 -30 -9 35 -22
5974 -22 26 -39 1 16 27 -41 -24 -40 40 1 14 28 -32 -11 14 8 16 -28 8 14 14 3 1 -22 0 -11 38 -3 22 53 33 35 -16
6007 -16 0 37 4 66 46 1 -5 -1 -16 24 43 -55 -32 -10 -11 -14 -51 17 33 -12 -5 21 17 24 36 3 9 -28 -30 43 12 -6 -36 -13 -24
6042 -24 21 2 24 -72 -60 4 -33 -36 9 -19 26 -19 7 18 2 39 -40 -18 9 -3 2 -3 -24 52 40 -34 -6 22 -70 -5 -26 -25
6074 -25 -3 -30 -8 -12 12 -23 10 9 -10 5 60 15 6 -10 -35 34 -35 10 45 32 -47 1 -20 12 -42 -30 -7 10 -18 2 -34 7
6106 7 -1 -33 10 -21 -20 3 -11 24 17 -8 16 24 -42 26 43 -1 7 62 36 -3 21 7 34 33 62 25 -9 4 26 6 20 49 58 -31
6140 -31 1 29 40 24 -45 14 29 23 -3 -72 -6 0 -37 17 11 39 -27 -22 8 1 36 9 48 40 59 6 -7 42 -48 32 -8 -41 30
6173 30 38 -27 31 -60 6 44 -28 -23 -49 66 0 -39 38 -12 18 -44 43 -12 -38 -1 -43 -17 0 -54 13 -22 17 -7 35 12 -13
6204 -13 -14 4 21 -21 -50 62 -11 -47 4 2 43 40 8 27 -3 8 32 37 -5 5 -11 34 39 -8 -16 -64 33 -23 -37 -33 48 -12 -24
6237 -24 -39 -20 12 -54 -4 27 7 33 -2 -8 -57 -16 18 -3 -10 -35 23 -20 8 17 18 -36 11 -11 1 79 43 54 -21 -28 18 -14 23
6270 23 -21 -22 2 11 13 6 -40 -6 53 -62 -23 -46 4 6 -25 25 19 -17 -6 24 29 19 11 25 5 -22 30 -7 27 21 -18 -41 -18 20
6304 20 11 -32 20 18 2 -31 -55 -39 -56 38 1 -21 -37 7 -11 -34 -7 35 13 35 -2 14 -70 -4 -14 -28 18 16 -32 24 -6 34
6336 34 -15 45 47 -2 45 0 -39 -41 7 -41 53 29 0 -19 -38 26 -8 37 -45 -23 13 27 51 6 3 63 -21 53 -49 -24 -3
6367 -3 -41 -48 -2 31 13 -20 5 -44 -13 14 -12 -38 24 -34 3 4 -33 -40 26 -50 -45 35 83 15 5 14 19 36 5 -5 -9 -32 -37 -59 8
6402 8 -39 9 -16 9 21 -6 -39 -21 30 -26 22 43 48 -14 5 -20 6 0 24 -24 -44 33 4 -6 -3 -20 24 -46 -26 -46 10 57
6434 57 42 1 19 -52 9 -36 -29 -63 9 -3 28 23 15 -3 -1 -65 -18 -28 3 -21 29 31 8 -34 -8 -39 12 -34 -16 -5 14 68 -22
6467 -22 28 30 9 -8 24 8 47 29 65 -28 17 34 -15 26 -64 -25 -2 -2 -26 14 -51 -4 -48 8 -29 -5 5 -15 50 -5 31
6498 31 -31 -12 17 -5 17 1 -9 -9 4 82 54 20 8 -40 36 54 -28 15 13 -26 -3 -41 -35 -40 -23 -26 32 1 -51 -4 -10 15 -13
6531 -13 -71 34 -5 -11 -41 43 20 -7 16 42 16 13 -13 85 85 13 25 35 11 -12 -2 3 25 -36 5 27 -50 1 42 -10 70 -11
6563 -11 -14 -38 23 6 -24 23 51 -16 58 -39 -60 24 -7 19 24 7 -14 -22 -5 18 -16 -20 52 -41 33 -22 -15 -5 13 -30 58 28 -17
6596 -17 -4 11 -10 -35 -49 -14 -24 21 34 -20 -77 -27 -3 -51 -1 -49 38 0 21 13 -13 4 -31 -27 9 4 5 30 28 27 55 25 -20
6629 -20 -12 0 8 44 -14 45 3 14 43 0 5 26 -5 61 56 -2 -34 24 -46 -28 0 -19 26 -16 -14 -64 14 13 -45 37 28 -9 -29 -23
6663 -23 -28 6 -32 24 23 2 -24 -10 -5 28 8 52 32 -28 -7 16 -25 8 -37 -19 7 -45 19 48 -9 7 4 -11 10 -4 0 -25 14
6696 14 -17 2 -11 -27 -18 15 -34 -16 -28 -18 59 -30 -26 13 20 7 33 38 10 46 -25 -36 -35 31 -11 5 73 -1 24 45 -20 -45 7
6729 7 -16 3 -36 6 -24 7 18 4 -39 -18 -35 -22 -8 6 -28 63 -39 18 28 -15 3 -21 31 13 -39 -1 31 28 44 38 69
6760 69 51 65 -22 -5 -6 71 -2 -3 -35 -13 -20 73 -8 -77 -10 30 -51 15 -15 49 20 52 -30 -23 -58 -29 38 -15 -11 10 -7 -26 -7
6793 -7 -14 63 36 19 8 33 -23 4 27 -12 -8 6 61 11 6 -105 -4 -7 49 23 37 -17 2 -35 3 34 53 -47 -3 -66 1
6824 1 0 -43 -4 1 -25 -58 -21 -39 -29 0 -26 -25 43 -2 16 -13 33 5 -12 -42 37 53 -30 -26 27 -40 -35 -14 6 12 -47 -10 -19 -8
6858 -8 -40 -4 25 -2 -48 -28 -6 12 43 15 -66 15 24 28 -2 -27 -11 15 -37 -5 -80 -106 17 -9 10 58 -10 4 -31 3 -25
6889 -25 24 -28 15 -20 -9 5 3 -19 5 -29 10 30 14 30 5 2 -41 -20 -4 -6 -42 -33 42 -30 -19 18 -14 -4 6 -26 -32 10 -42
6922 -42 38 84 -22 18 -28 49 17 38 30 21 10 48 -1 15 24 49 -29 -7 19 -47 21 -26 1 18 13 -45 -31 19 -5 -29 26 -43
6954 -43 -30 -49 -20 -23 0 33 22 8 -50 31 -89 -50 -6 15 36 8 2 31 30 26 16 35 28 5 36 -7 -31 -45 -19 43 -3 -8 41
6987 41 24 -2 14 -18 -2 -48 -20 8 24 24 -92 -7 69 41 -10 22 6 33 -36 47 -32 24 -49 16 -7 -47 15 41 52 40
7017 40 -9 32 67 -43 4 38 75 -21 -50 34 -16 -17 -9 -33 13 -12 41 6 5 4 -41 28 -15 -36 11 -16 -37 14 34 7 8 -34
7049 -34 -8 -17 -6 21 40 43 -13 0 10 46 32 46 -10 20 17 66 -7 -48 6 -11 8 -17 -8 -51 40 8 -3 20 11 -26 28 40 61
7082 61 59 4 -38 -36 53 -85 71 -19 33 45 6 -18 35 8 -48 44 22 37 48 15 -20 13 -36 -60 -36 -15 53 0 52 14
7112 14 -22 -5 6 5 0 -1 -5 -39 -36 17 -32 -30 27 5 14 23 -71 2 26 -15 -16 4 -42 -6 -51 -23 21 -9 13 20 25 -28 -48 48 25 -31
7148 -31 3 -71 2 -22 39 11 11 -9 -23 8 16 -53 -22 -7 -1 17 -29 -1 10 -15 -29 -27 -27 -10 -11 -31 43 17 8 -26 39 -6 18 -9
7182 -9 53 -15 -53 7 24 -20 -9 0 21 49 -12 -21 -31 42 -33 -53 32 -12 -90 -40 37 -15 -35 31 -6 -84 -18 -36 -17 -4 -1 -5 14
7215 14 -41 -15 34 -22 -32 11 2 6 12 2 16 40 58 -2 11 17 5 -4 8 44 -43 -21 7 -34 -6 15 21 -7 -13 13 -87 -11 -48
7248 -48 31 -5 -15 -56 -23 -31 -2 17 -50 14 5 -18 28 -4 4 -4 -19 25 10 0 -30 0 44 -2 -11 12 -11 -50 5 11 -10 9 29
7281 29 64 -5 56 -10 -4 -7 -77 29 -36 54 54 -90 18 -28 12 -10 -7 -44 13 17 4 64 -16 14 94 -18 1 23 59 -13 38
7312 38 24 -23 16 47 -39 -30 8 -55 14 -66 42 -18 -45 -36 -7 49 25 -60 -17 -1 -18 17 -30 15 -25 -35 -42 17 18 63 -4 43
7344 43 11 -1 -9 77 24 -23 22 3 2 -16 -19 42 -3 -37 14 0 21 28 -2 -14 10 43 -43 -61 -65 -55 18 27 -15 -1 -8 -18 -12 -30
7378 -30 -11 18 3 4 -8 23 37 -24 5 13 -12 -21 -4 23 -39 -22 -27 -18 -8 5 3 20 49 20 33 49 -29 37 1 -47 -8 17 8 43
7412 43 5 -37 -20 14 -5 -29 30 45 -13 12 -6 -4 -25 -17 -2 -10 69 -27 -16 10 -9 3 -19 -34 -13 14 -29 44 26 6 -7 -16
7444 -16 -33 -40 42 20 -35 33 15 -48 10 8 1 -7 20 -32 -29 47 -46 43 69 37 -36 -84 62 -57 11 -47 11 -45 -4 45 61 20
7476 20 -11 12 82 -27 -13 -26 -12 -14 -18 63 58 -43 -6 27 2 31 10 10 -45 14 3 -12 -2 49 -3 -32 -2 -23 12 19 19 -50
7508 -50 -73 39 30 -30 -46 -11 6 8 23 43 18 67 40 29 19 -30 54 -29 24 28 -57 6 -39 -44 19 -10 -44 -10 -77 -10 13 15
7540 15 -27 15 13 -59 -28 12 67 2 26 21 17 28 -3 -9 3 1 47 47 12 55 17 -45 44 -21 3 18 -17 -44 18 6 -20 50 24
7573 24 39 -39 -3 12 0 -17 -8 -71 -7 44 4 -41 13 -44 29 21 9 -24 23 -49 -5 45 -25 -15 -11 -15 -17 9 2 -39 -6 10 38
7606 38 -25 -37 7 47 44 14 3 73 25 35 30 -45 16 -22 21 0 2 -39 -7 -5 -20 -2 -55 2 6 -45 34 -29 30 13 -15 17 -100
7639 -100 -8 18 15 0 10 -60 47 13 -15 37 21 40 10 3 -72 13 -6 10 -16 -32 -37 -8 -29 5 53 -18 56 -8 -14 1 -39
7670 -39 -30 60 -21 10 -14 0 0 17 13 13 -36 -2 97 2 -11 5 20 -7 -24 -8 -5 5 47 -35 11 36 -8 -59 0 0 -14 -43 -43 78
7704 78 39 -47 29 -18 3 22 -28 -52 -22 48 -2 14 14 -27 -8 86 29 -33 15 -12 54 -7 -1 82 47 22 -61 -12 7 -6 -16
7735 -16 -13 -41 -15 -17 -6 -3 -21 -7 11 17 -36 -50 44 -11 -25 -15 9 15 -45 8 -31 -7 40 -5 -47 -27 -16 20 24 -11 21 27 33 -60
7769 -60 -6 -45 29 -21 -5 21 -8 7 -24 -14 -29 -2 23 56 10 -8 -59 -85 -18 -36 8 -56 36 -22 -7 -46 8 4 -58 1 46
7800 46 -32 -14 -15 -17 -25 27 -14 5 48 -5 -48 0 -25 47 45 7 -42 19 26 -26 -18 -56 -6 -47 21 -22 12 42 -8 -33 4 62 28
7833 28 -3 -37 -16 -13 21 -69 -23 44 13 -63 23 -13 18 -8 -75 -9 30 60 6 -19 23 -43 -10 67 -9 17 5 -16 1 10 -43
7864 -43 17 8 -73 -3 -26 15 -16 -18 -26 6 -4 -1 -24 -24 -19 -8 -9 -15 -68 -14 -4 -42 -20 -7 0 -16 21 -22 50 -5 15 14 32 -5 -1 17
7900 17 37 15 49 32 14 -9 21 45 35 49 4 25 -5 -52 31 -16 -22 49 22 -27 25 -10 20 35 16 7 -3 68 -33 26 -43
7931 -43 -58 -44 2 -41 -5 -14 -52 -3 19 -10 4 41 -1 24 -57 -9 47 -38 -27 -36 0 33 -33 21 0 8 -5 -5 1 49 -44 9 1
7964 1 27 -22 22 21 -18 14 -6 -14 16 3 2 11 27 -48 -41 15 -14 29 -9 11 -44 -9 -4 2 -2 49 -7 -27 4 74 15 -26 -2 42 -34
7999 -34 78 -3 -34 -38 -11 15 -12 -26 -15 11 4 -61 56 -32 -15 -10 -43 3 20 42 3 22 -18 -40 13 -27 -25 -27 -22 14 66 -12
8031 -12 -3 -2 38 11 10 8 -36 24 -10 9 -26 34 35 21 -35 30 -54 -2 -34 22 -34 -21 -52 -19 25 -32 -4 -4 34 -17 -24 16 -28 -44
8065 -44 -10 0 -30 41 57 -23 -46 18 -74 23 -49 -14 -5 -54 -15 -3 30 -8 37 13 1 -15 -14 24 -56 -1 -2 -29 0 -3 43 11
8097 11 35 -2 -22 41 46 -24 4 5 93 -14 119 25 -12 -13 12 7 60 7 -22 -3 56 36 42 27 10 11 16 28 23 15 -28 35 12 12
8131 12 45 -43 -17 -26 -13 -18 4 17 23 -14 -36 -16 15 -20 6 20 15 26 -5 29 20 -35 2 29 0 24 -32 15 -3 47 38 -55 -23
8164 -23 -20 -9 -20 1 17 4 -53 40 34 -42 22 7 -6 -55 39 -11 -6 -16 6 4 19 -45 -58 48 43 17 2
8191B
$$ Imaginary data points
##PAGE= N=2
##DATA TABLE= (X++(I..I)), XYDATA
0 0 0 0 0 0 0 0 0 0 0 0 0 0 0 0 0 8 -8 8 -8 8 -16 16 -16 24 -24 32 -37 40 -48 56 -64 72 -80 90 -104 119 -129
37 -129 144 -164 184 -202 224 -249 279 -306 338 -375 412 -455 500 -551 607 -668 738 -817 904
56 904 -1003 1118 -1251 1411 -1599 1834 -2130 2516 -3045 3818 -5057 7350 -13012 56847 40185
71 40185 -91170 17537 52151 -37344 -21789 53144 -16911 -56966 21836 35746 -38833 -12020
83 -12020 32682 -13480 -25133 22643 -5132 -37323 9130 35667 -16035 -38863 11789 29316
95 29316 -21518 -10903 35736 -10468 -45790 28690 45490 -32254 -22543 49322 15353 -35438
107 -35438 18641 31859 -33585 -3870 43064 -26204 -40762 33579 11851 -32669 16178 21245
119 21245 -36500 -8112 44108 -6536 -44393 12306 21235 -30703 -11208 22723 -9345 -16484
131 -16484 15817 10504 -12720 -7462 12411 12709 -5866 -4170 7866 -1019 1427 16227 949
144 949 -14376 4447 12274 -10613 -10980 12157 -2982 -20380 14008 16192 -25083 -2039 31209
157 31209 -6613 -19152 14041 2400 -18343 5253 10717 -16572 -9467 15191 -235 -10229 11808
170 11808 3309 -13525 9059 10480 -13887 -2566 11726 -1459 -4858 3098 2431 -1702 -418 4177
184 4177 -252 -6926 -1641 3193 320 -2464 -1509 3487 1359 -2305 4998 876 -7721 4703 4137
199 4137 -10589 728 7498 -6487 -734 10373 -1440 -6594 7257 6632 -8405 -2679 7878
212 7878 -6443 -7766 8771 -1712 -10151 6652 3682 -8156 2058 4896 -4625 -1700 4740 -15
226 -15 -4396 2590 5304 -2944 -605 5354 -1768 -2386 3121 -994 -2055 175 -637 1338 -636 -1173
242 -1173 4067 110 -2739 3729 841 -4024 975 1997 -2819 -2612 2465 1122 -4926 1067 4907
257 4907 -5408 -2079 6571 -3719 -4790 6003 112 -5112 3068 3700 -2688 -878 4812 453 -4486
272 -4486 3127 3568 -5515 -29 4744 -3657 -2046 3519 -1040 -2335 729 1101 -787 -2264 1469 1801
288 1801 -3015 590 3263 -2028 -566 2851 172 -1237 57 2076 104 -3152 1934 2031 -4729 506
304 506 3675 -4130 -1763 3584 -1045 -2709 1540 2036 -2086 -1465 3865 -176 -4232 3448 2319 -4727
320 -4727 1490 3641 -3000 -535 2939 -238 -1920 322 2071 -1312 -2254 2768 324 -3017 2380
335 2380 1773 -2340 573 1368 -749 -1062 -690 867 -1197 -2532 2002 305 -3244 1712 1736 -2538 33
352 33 1682 -575 -1333 680 2208 -1105 -645 4319 293 -2035 3998 1223 -3056 1454 1069 -2750
368 -2750 -1060 468 -661 -2151 -308 1572 -2071 -1612 2236 -1523 -2384 1724 -404 -1331 1040 728
384 728 777 390 434 2137 -292 -972 2121 -455 -1667 1648 691 -499 1039 1577 1238 -421 650 1876
402 1876 -2254 -1490 1742 -2738 -2765 1595 -1469 -2418 1055 -12 -1490 -603 249 -470 -2016 100 1012
419 1012 -1848 510 2470 -573 1023 2591 188 1081 1185 188 1403 151 423 2196 42 334
435 334 1951 -306 -743 -165 -1363 -1860 -2487 -1482 -1118 -3055 -309 1218 -2241 467 2498 -1747 -299
452 -299 1872 -1378 -1202 685 -133 -559 263 1543 725 12 2422 1207 -754 2159 1137 -905 2009
469 2009 1066 -405 1817 512 -440 573 -1224 -1435 -821 -2339 -1898 -1249 -1425 -811 -665 576 509 -924
487 -924 1214 719 -2241 682 477 -2712 746 1410 -1519 1444 2495 197 1076 2087 949 -410
503 -410 532 1370 -1292 -812 1972 -1120 -1359 1997 -996 -1700 1219 -1181 -1722 620 -688 -701 747
520 747 279 396 440 532 176 -895 -229 -778 -2038 21 -744 -1684 1769 555 -953 2970 1421 -1056
538 -1056 2138 1149 -1690 147 552 -1247 -1061 691 256 -1577 642 1533 -2047 51 2130 -2029
554 -2029 -536 2529 -963 -366 2367 78 -254 1029 13 -751 -616 -356 -876 -1153 359 -228 -726
571 -726 1393 -72 -737 1566 -757 -1738 1063 -1293 -2099 1083 -467 -1436 1465 1116 -349 981 1824
588 1824 178 -593 1738 731 -1868 1268 1500 -2170 847 1976 -2009 -19 1620 -1596 -831 842
604 842 -671 -816 329 492 -574 -264 851 -905 -1236 472 -1463 -1714 591 -1399 -1123 1425 -446
621 -446 -122 2145 266 150 1901 466 -184 928 801 -370 -5 1489 9 -980 1721 304 -2074
638 -2074 1214 377 -2577 466 599 -2180 75 807 -1124 -524 608 -266 -1090 39 504 -1337 -384
655 -384 1317 -986 -225 1813 -532 -35 1729 -502 -107 1156 -614 -167 849 -226 40 640 437
672 437 116 181 805 -346 -609 1012 -713 -1373 1171 -575 -1675 1256 -304 -1746 856 199 -1359
689 -1359 138 531 -521 -423 758 561 -690 794 1204 -1060 436 1322 -1357 55 1140 -1203 -225
706 -225 814 -715 -85 439 -252 -22 114 155 -79 -137 531 -184 -175 966 -413 -388 1217 -573 -624 1108
726 1108 -650 -804 900 -547 -805 516 -83 -480 75 395 -21 -514 784 376 -1085 806 590 -1313
744 -1313 671 742 -1166 310 708 -776 124 428 -321 -62 96 329 -193 -181 693 -302 -297 891 -388
763 -388 -337 906 -509 -257 728 -701 -257 495 -741 -175 228 -440 -146 0 -53 -138 -222 540 4 -496
783 -496 970 133 -698 1183 374 -765 1111 404 -724 506 251 -571 -116 -47 -49 -597 -254 434 -716
802 -716 -252 750 -696 -246 777 -647 -138 565 -534 50 426 -304 285 190 -159 277 -106 71 147
821 147 -271 356 36 -245 799 17 -268 1093 -89 -446 852 -330 -644 445 -325 -583 -59 -162
839 -162 -252 -457 -80 139 -803 32 412 -953 139 774 -593 382 898 -217 522 621 -48 338 117 100
859 100 131 -350 200 114 -410 440 -42 -494 434 -350 -508 426 -584 -449 487 -558 -193 532 -327 -90
879 -90 273 -141 -42 -162 108 128 -519 415 382 -668 652 562 -744 547 456 -674 353 333 -298 125 188
900 188 55 38 -70 369 -246 -473 290 -502 -677 319 -559 -428 510 -344 49 696 -180 324 559 -129 283
921 283 367 -33 221 46 175 78 -456 390 -140 -793 368 -152 -1003 479 -121 -792 497 75 -432 271
941 271 107 -79 -42 27 232 -281 -88 610 -326 42 847 -320 204 862 -382 96 539 -454 165 247 -322
962 -322 168 40 -97 101 -237 -14 -196 -528 203 -432 -723 428 -461 -719 562 -361 -525 589 -137
981 -137 -313 490 165 91 379 403 462 129 544 702 -269 527 611 -669 240 372 -852 48 131 -685 37
1002 37 32 -525 -56 -151 -326 -149 -328 -13 -273 -357 340 -309 -256 619 -410 -222 747 -374 -118 770 -160
1023 -160 -8 686 89 151 392 291 259 36 358 212 -413 428 137 -737 343 29 -856 250 -43 -836
1043 -836 49 -208 -677 -35 -135 -288 -51 -39 181 -147 38 541 -275 191 702 -371 151 762 -447 119
1063 119 637 -397 -5 435 -259 -27 170 -31 -66 -90 279 -55 -341 492 -55 -530 569 -177 -579 543
1083 543 -209 -591 300 -133 -439 232 -40 -167 -13 13 138 -125 161 385 -356 309 498 -444 348 488
1103 488 -589 293 386 -563 194 220 -385 -23 100 -173 -130 -57 208 -216 -112 470 -286 -218 637 -299 -343 661
1125 661 -313 -323 583 -276 -246 331 -204 -178 94 -49 -33 -175 119 131 -285 379 165 -493 497 284 -503 497
1147 497 144 -477 370 161 -435 139 25 -187 -76 -54 76 -272 -124 387 -377 -43 568 -432 -47 605
1167 605 -397 -58 530 -386 -80 281 -275 -95 23 -64 10 -192 288 -18 -292 374 14 -332 555 24
1187 24 -375 585 -35 -343 460 -81 -346 226 -71 -187 -67 -53 -72 -302 41 174 -480 104 403 -487 174
1208 174 498 -470 175 522 -319 218 316 -199 91 102 -15 -37 -144 120 -154 -315 400 -226 -373 415 -209
1229 -209 -279 461 -235 -253 376 -136 -153 301 -100 -26 71 53 11 -204 109 117 -339 250 266 -430 408 302 -413
1252 -413 405 292 -273 274 181 -213 118 -22 -67 -44 -126 142 -228 -219 207 -374 -304 326 -403 -153 446 -276
1274 -276 -30 364 -152 86 349 -55 90 75 60 105 -64 239 48 -282 264 0 -456 360 -7 -492 263
1295 263 -14 -407 288 56 -150 209 2 -7 -30 -103 72 -164 -83 226 -301 -63 324 -357 77 354 -326 43
1317 43 225 -258 162 187 -56 152 136 44 137 -89 170 38 -387 252 -167 -476 282 -195 -384 370 -97 -261
1339 -261 297 -29 -63 169 -40 103 101 87 205 -33 100 372 -228 100 249 -373 10 139 -406 95 200
1360 200 -292 223 71 -144 111 -77 -11 -26 -189 106 -114 -310 309 -164 -248 394 -159 -118 281 -174 -163 262
1382 262 -123 -8 191 36 201 94 81 180 -200 123 177 -302 117 141 -370 197 147 -340 130 -27 -369 -13
1404 -13 -158 -310 -64 -184 -40 -42 -1 281 44 100 416 -125 -36 301 -308 -105 269 -284 -28 238 -192 25
1426 25 146 -92 26 -130 12 81 -175 144 98 -181 248 64 -283 234 -83 -395 110 -200 -317 87 -51
1447 -51 -92 182 54 114 32 -14 189 -179 -21 273 -194 0 326 -208 203 337 -244 98 197 -245 -1 -22
1469 -22 -171 -62 -70 12 32 -139 211 35 -244 247 -100 -247 333 -59 -170 372 -31 -58 277 -43 -24 59 -157
1492 -157 -130 -141 -101 73 -175 147 293 -158 281 286 -209 152 189 -287 143 17 -259 118 43 -108 70 -51
1514 -51 30 -73 -152 126 -181 -182 249 -125 14 411 -118 -6 342 -157 -165 163 -236 -71 58 -126 51 -53
1536 -53 48 89 -121 143 28 -252 150 75 -240 273 115 -183 294 34 -67 205 10 -93 23 -42 -23 -113
1558 -113 -45 132 -174 -29 194 -286 20 227 -299 16 178 -284 52 206 -133 74 134 -37 28 -58 37 -30
1580 -30 -128 127 -75 -248 253 -41 -237 281 -11 -167 272 -35 -130 205 -42 -10 97 21 121 -4 -40 80
1602 80 -153 -10 35 -320 24 97 -306 133 128 -201 252 203 -134 169 138 -106 26 -20 9 -21 -138 114 -148
1625 -148 -139 170 -179 -127 274 -151 -84 317 -79 -11 224 -61 13 65 16 19 -97 0 80 -123 78 139 -283 192
1649 192 56 -229 189 80 -242 212 37 -227 125 3 -27 79 -12 61 -25 -20 122 -125 17 231 -182 -74
1671 -74 163 -296 -52 119 -226 -12 156 -39 21 118 56 89 47 109 50 -159 135 -38 -210 142 -87 -238 186
1694 186 -81 -319 168 -34 -153 134 18 -21 107 54 116 -54 80 149 -200 -63 56 -297 18 134 -282
1715 -282 97 206 -161 103 109 -117 69 49 -52 -26 -70 80 45 -91 172 -62 -77 193 -59 -218 232 -143
1737 -143 -102 184 -168 -82 109 -78 -24 -7 -124 10 -54 52 76 -132 162 169 -86 151 147 -210 145 -15 -245
1760 -245 36 1 -278 60 -8 -60 53 36 98 39 -32 128 -139 -60 187 -279 -55 222 -167 -57 177 -223 -70
1783 -70 11 -147 -16 -10 -39 -20 -7 143 90 -66 167 50 -152 181 -27 -234 137 -11 -168 158 47 -54 55
1806 55 -24 -40 25 -38 -1 -108 -31 133 -32 28 264 -32 64 175 -247 3 91 -260 -4 61 -142 91 76 24
1830 24 6 -45 56 -2 -156 90 -69 -112 197 -6 -93 276 1 -119 180 -116 -109 24 -142 -98 -10 -40 66 -29
1854 -29 43 145 -111 19 78 -202 20 48 -116 151 152 -79 150 39 -106 58 -84 -124 -109 -206 -21 -89 -81 71
1878 71 4 -75 240 -28 -69 235 -89 -93 163 -115 -9 149 -31 55 33 17 78 -173 -25 42 -221 45 100 -129
1902 -129 180 135 -89 168 64 -149 60 -47 -144 -38 -84 -45 -22 -22 84 -7 -10 144 -129 -71 94 -142 -21 167
1926 167 -96 42 225 -63 54 84 -89 27 -32 -81 17 -109 -11 36 -80 144 17 -223 118 -31 -263 61
1948 61 -39 -151 139 19 38 92 11 13 65 -98 -33 -147 -114 5 -158 -27 118 -126 107 198 -138 117 92 -165
1972 -165 115 60 -36 72 -19 89 30 -61 57 37 -85 68 -75 -186 74 -58 -95 144 -53 -69 131 -37 4
1995 4 56 -92 5 -52 -20 44 -36 1 89 -112 59 106 -188 37 25 -100 136 73 -93 148 97 36 140 -27 16
2020 16 50 -101 34 -108 -97 82 -76 -73 136 -171 -78 94 -119 -50 63 -114 38 20 -19 27 105 32 47 -55
2044 -55 94 96 -70 109 48 -113 112 21 -161 132 -27 -110 113 -39 16 50 -92 33 43 3 71 14 9 114 -130
2069 -130 -14 96 -217 -23 49 -238 63 48 -124 95 91 -18 121 57 67 84 -28 124 75 -62 96 -82 -134
2092 -134 89 -75 -116 111 -78 -64 115 -31 -15 132 7 101 -6 17 23 -60 61 40 -108 19 67 -134 34
2115 34 86 -93 118 59 -58 114 -36 -53 30 -14 -16 -20 -96 37 -38 -15 134 -38 -52 217 -40 -50 125 -68 -72 70
2141 70 -179 -44 -16 -145 30 -32 30 103 -59 101 139 -99 151 118 -77 183 19 -99 69 -36 -172 -5
2163 -5 -128 -82 -17 -22 -37 22 -3 99 -14 -28 170 -124 -23 137 -129 -25 61 -108 -30 82 -67 94 79 30 92
2188 92 -17 89 47 -72 93 4 -91 184 -15 -133 119 -79 -146 77 -82 -112 31 -60 -31 -4 -50 -34 -21 -132
2212 -132 57 -121 -37 43 -114 32 161 -80 118 136 -6 157 56 -60 66 40 -87 -5 -60 2 -9 -15 56 -24
2236 -24 -49 123 -95 -142 143 -71 -68 187 -85 -4 92 -67 8 38 -82 45 -78 -50 48 -42 34 108 -16 112 170
2261 170 -107 29 43 -111 56 53 -110 75 7 -5 48 33 37 -56 -116 -4 -46 -43 113 -84 -61 97 -31 -49 77
2286 77 -128 5 88 -56 8 -49 -48 53 -14 3 11 -94 49 -29 -84 56 -40 -166 104 34 -136 123 44 1 76 -35
2312 -35 47 59 -64 -15 -78 -22 54 22 -43 99 -60 -3 60 -144 -16 72 -130 81 28 -71 87 83 22 30 -42 -55 -55 -77
2340 -77 17 -17 -79 115 -43 -86 129 -14 -65 138 -19 -65 109 -71 53 78 -13 34 -4 9 98 -66 -1 32 -146
2365 -146 -45 15 -170 83 54 -21 75 39 -33 63 -27 -71 -43 10 67 39 -2 77 -26 -51 133 -26 -84 55 -84 -33
2391 -33 82 -71 30 95 -33 45 79 -29 80 -37 30 41 -76 68 17 -75 42 48 -73 66 -23 -113 -20 -67 -45
2416 -45 57 -87 -29 37 -23 94 43 -63 36 -23 -53 51 -71 -47 90 -37 81 32 -109 28 98 12 1 -4 -89
2441 -89 13 -68 94 74 -68 82 47 -43 57 -51 -107 19 -73 -167 50 -61 -18 29 -51 39 -99 -67 6 11 -12 18
2467 18 8 -5 114 -109 58 51 -86 35 13 -33 33 26 -44 41 70 37 53 -3 110 24 -17 56 19 -67 -4 -5 -4 54 -63
2496 -63 27 66 -42 15 19 -106 -28 -42 -9 50 -83 -24 44 -47 6 16 -64 84 35 -80 96 0 -61 103 20 -46 40
2523 40 -75 -11 -17 6 0 -25 -13 100 -12 -21 138 -20 -23 68 5 4 37 -81 11 10 -44 -26 -45 -110 54 -15 30 19 42 56
2553 56 0 -17 79 -37 -20 61 10 -88 47 -43 -56 33 -59 55 0 -49 43 -27 -7 68 -2 4 10 -79 -1 62 -59 36 38 -75
2583 -75 17 -21 -24 14 22 -19 45 7 -35 -12 -71 -21 -16 -69 77 -44 -28 131 -36 9 78 -12 3 32 -13 -3 -5 -40 12 10 -25
2614 -25 63 -31 29 138 -45 82 39 -29 46 100 -41 59 -8 -25 26 -68 -34 -30 -91 -26 -39 -48 64 19 -68 79 -5 -29
2642 -29 8 -42 43 52 -42 25 59 -16 20 1 -25 85 -17 64 -8 -12 58 9 -86 44 21 -59 33 3 -41 50 -72 25 40
2671 40 -78 27 -28 11 18 -89 -58 69 -60 -32 14 -111 -81 41 -30 32 86 -4 -4 38 -42 30 66 2 7 -32 17 -62
2699 -62 -25 28 -93 -50 68 48 12 62 28 -9 77 5 10 97 -7 6 20 -40 65 24 -13 46 -62 -15 8 -39 19 30
2727 30 -72 78 48 -31 42 17 -14 24 -73 -6 19 -18 13 19 -62 47 12 -11 57 -34 -26 63 -39 -28 20 -48 14 -15 17
2756 17 16 -12 13 79 -13 -12 0 -33 31 7 -5 -21 -76 -81 11 50 -59 38 43 6 60 -27 29 36 -4 30 21 -27 20 -11 35 67 -110
2789 -110 -30 -15 -130 -11 24 -8 -4 -34 -17 2 -29 -7 49 10 44 -19 -59 55 -11 -53 99 -24 -17 45 6 -116 67
2816 67 -40 -19 30 12 93 -32 0 86 48 -24 63 3 39 55 -65 43 16 -150 -11 13 -40 -27 -20 -101 -47 -19 22 -33
2844 -33 -87 88 -4 -23 64 25 26 44 -68 -59 62 -27 -20 39 -69 49 -9 4 4 10 -10 18 4 16 18 -19 31 54 -103 33
2874 33 45 -78 24 -59 -19 12 -25 -58 0 1 -5 21 21 0 -4 -52 99 10 30 33 -19 -8 85 11 -41 12 20 48 48 -44 68 -17
2906 -17 16 46 -75 -16 10 14 9 64 -73 64 72 13 52 -63 -43 -13 -21 -26 45 -48 -47 10 -38 29 62 -15 62 -20 17 38 -14
2937 -14 6 21 -56 -66 52 -91 31 14 -2 26 -32 56 -11 8 12 37 -48 32 61 9 60 63 12 36 -26 -2 -15 -50 -19 -7
2967 -7 -24 31 -8 30 26 4 -32 44 -27 28 24 -40 17 32 -68 28 20 64 69 1 -38 -17 -13 30 -29 -73 -19 -15 36 77 17 -31 1
3000 1 42 5 40 42 10 11 -20 -13 -23 18 27 -8 52 14 -3 43 99 -63 0 24 -111 31 -36 -55 23 -18 43 43 -34 3 8 26
3032 26 58 57 11 39 -31 -3 75 -20 12 62 -17 -20 -11 -56 -4 64 -79 30 -29 -53 42 2 35 23 -57 -29 -11 -18 3 -55 -43
3063 -43 66 8 -48 28 35 22 75 -27 10 9 30 60 -9 -48 94 -11 -9 12 -33 -28 -1 -78 5 7 -84 35 -1 -98 -6 -14 48
3094 48 47 -67 -26 29 -4 17 35 -83 -46 -47 -73 68 -15 -59 23 -28 15 67 0 36 27 -34 29 2 -10 37 -67 39 12
3123 12 -53 -10 -23 -77 -33 -9 -68 -9 -3 -79 23 -46 7 98 -37 45 8 24 -1 -30 -27 46 -37 -37 36 -4 2 51 -42 66 -2
3154 -2 -35 -18 50 15 33 -26 -27 68 -7 59 11 -71 61 18 -76 38 12 -15 85 -10 -5 58 26 1 65 -6 -2 25 -27 20 27
3185 27 26 5 -68 -21 37 -26 -12 -3 -8 -15 52 21 -35 -12 16 -5 -10 -43 -3 -63 -14 21 -43 50 -31 22 26 -69 11 129 -6 -26
3217 -26 63 -25 73 27 -66 75 -15 6 -14 -17 10 44 -46 1 68 -43 3 -1 -104 57 11 -4 31 9 23 3 -3 -51 69
3246 69 -28 -12 -60 -21 90 -37 2 0 -29 -49 37 -37 -1 36 -18 -48 -55 27 46 -3 -6 5 -70 15 18 -35 44 47 -16 73 6 -54
3278 -54 30 11 49 15 -25 -2 -2 13 -6 -15 -2 83 2 -36 28 -88 -33 53 -53 24 47 -77 -35 12 0 21 -35 18 -31 -65
3308 -65 -45 80 -26 34 34 -42 21 19 19 60 11 -17 33 -15 -28 -27 47 -4 45 -27 -27 10 3 -25 -40 28 26 -43 13 28 -23 41 38
3341 38 -66 21 45 -2 10 -6 -43 25 -44 19 30 -61 34 -7 -95 12 -21 12 75 -10 56 55 34 6 -18 5 19 -5 19 18
3371 18 -41 -1 -12 -16 -20 -15 -13 -15 1 -66 16 26 -6 20 13 -93 -17 -9 3 22 -46 28 -3 -17 44 -28 -20 15 -81 -4 46 -60 23
3404 23 14 -40 109 53 15 28 2 31 -10 7 3 10 -63 8 -45 -93 29 -39 -32 19 -7 -31 10 14 -46 62 -46 -13 -14 16 62
3435 62 -78 -34 -1 2 -3 62 -74 6 -2 16 -2 57 -57 40 4 42 7 4 30 1 30 -11 46 -47 39 -10 9 27 10 -13 56
3466 56 -10 34 35 -10 23 71 -17 -21 4 71 2 -20 49 18 -11 72 -18 -39 27 2 -35 -34 71 -59 -4 57 -19 43 -47 24 40
3497 40 -15 18 22 26 39 11 -6 68 -49 -2 25 -14 -53 -24 -32 -36 51 -25 2 -12 -34 -25 -11 -19 48 -102 -24 23 -65 10 -12 -40
3529 -40 74 -7 -46 23 18 -44 30 -7 53 -1 27 83 -14 -51 29 -10 -3 11 -13 -28 -12 -32 10 -15 -11 -41 -25 -27 11 -72 -5 27
3561 27 20 -10 31 -62 5 14 -36 56 -37 -49 16 -14 -25 47 -2 60 -29 -51 38 44 -8 31 -5 -6 96 -3 -3 37 18 41 46 -7 -52
3594 -52 -35 -25 58 -31 -37 14 -20 28 5 -28 47 50 -21 15 66 -32 3 -12 26 -56 -15 3 54 -9 39 24 -50 15 43 -32 48
3625 48 42 -10 86 -46 67 45 -58 31 58 5 59 42 -41 -37 1 -7 5 -32 -6 -25 -81 65 52 -38 36 -16 -17 15 17 15 53
3656 53 -27 47 20 49 11 26 -17 101 2 -34 66 19 35 23 -23 20 9 -40 48 -45 -43 85 13 -29 -71 -63 6 1 -32 -23 -27
3687 -27 -33 23 32 17 39 34 4 48 -29 -2 54 28 37 44 -11 16 -18 -51 28 -40 34 20 -4 -1 19 -32 54 -8 -71 24 52 -16 60
3720 60 -45 12 -15 -51 2 23 -56 0 -49 -12 60 -87 30 -15 -59 -2 -13 7 -17 -4 -7 20 67 -15 42 14 12 47 39 -1
3750 -1 77 -31 -12 27 -52 36 -70 10 85 12 -3 23 27 23 38 5 -16 63 6 -41 -3 -60 24 20 -23 -5 11 -19 45 -41 53
3781 53 7 -54 55 7 20 117 21 39 31 5 -4 75 22 31 3 -15 80 25 -18 52 2 13 51 -57 -23 -10 -8 13 -25 18 11 -2
3813 -2 -41 -16 -23 24 -39 -42 23 -32 -9 68 -13 -7 32 8 3 60 23 4 57 21 56 -10 16 -6 28 25 -10 -44 6 67 11 8 -29 29
3847 29 27 61 -26 46 -34 -9 29 19 -18 -9 -27 33 5 -64 57 10 -24 48 25 -66 24 39 31 -52 20 -15 -67 -35 -21 19 23 41
3879 41 19 62 -3 -36 15 -29 -40 -32 21 -69 -4 -2 20 -21 -10 10 -38 -11 13 2 -63 9 -15 -16 17 24 2 45 -22 -9 1 -21
3911 -21 -68 27 22 -31 28 -36 15 13 -4 12 7 61 31 -35 1 -4 -28 3 -56 -11 -62 26 22 -37 -9 8 25 -18 -45 -51 -63 17 -53
3944 -53 0 -23 33 14 56 -32 3 48 60 38 38 -40 -27 -8 -58 13 23 19 23 -22 -9 18 -19 25 22 8 12 75 -37 3 -44 -14
3976 -14 31 -24 -2 -37 -58 -10 -16 -54 12 -37 -29 8 -76 -1 1 -20 -11 -2 -18 36 -21 -5 1 -15 20 41 26 -20 17 14 -13 39 11 82
4010 82 -45 -41 49 11 -1 -20 15 25 19 -4 -6 12 -20 -31 0 19 0 -11 -20 22 -19 33 -3 27 19 -20 -50 75 -35 -8 53
4041 53 -7 18 9 -10 3 21 12 61 -24 -31 12 10 -9 71 -36 28 13 -29 3 13 24 -15 -36 -71 -5 -22 -33 -30 16 20 49 -2 -33
4074 -33 36 -6 10 -34 10 -5 9 -81 40 -25 -27 36 -13 26 -2 -74 40 38 -25 43 -16 73 -12 12 -30 -49 -20 -6 36 -45
4104 -45 7 -43 44 13 -21 12 42 -49 -3 -33 7 20 -29 28 32 15 -34 28 -40 22 44 -10 35 -42 11 15 -35 83 -5 -23 0
4135 0 62 -17 -32 -20 -38 -1 -31 -24 -17 7 28 4 -19 -16 5 -30 -1 -38 0 9 2 -12 -13 -10 61 3 -33 -11 -9 24 -4 -12 33 2 21
4170 21 25 63 2 0 4 26 77 38 -11 -16 9 -57 -2 -1 -35 33 22 25 2 13 11 -19 -11 -11 -8 12 58 -14 54 40 22 -7 47 -55 -34
4205 -34 2 16 -9 -10 -57 -28 -15 -3 45 -56 18 8 14 -31 26 2 24 39 -38 9 -81 -26 -37 -9 -6 -31 -5 12 -9 -12 22 -10
4237 -10 -16 55 33 -31 34 -10 12 37 -36 -20 10 3 63 30 -59 48 -29 26 25 32 -16 11 4 31 -22 22 45 -24 52 33 -16 -21 -46
4270 -46 -31 -35 -16 76 -13 2 24 45 9 -35 -39 40 -56 45 -18 9 80 -36 -1 14 -15 11 -28 -28 59 -30 -21 22 37 10 -20
4301 -20 -69 22 38 38 -6 -13 -9 7 -36 33 66 -36 -20 -7 -52 41 26 22 -36 -50 40 7 -27 -11 2 -22 30 20 -27 42 -21 -17
4333 -17 63 -23 -15 -10 4 64 7 0 28 -8 -10 -11 -23 37 -9 -13 28 30 34 -14 0 -83 -35 -20 38 5 -14 -57 -12 -52 -27 -27 -42 4 -8
4368 -8 23 -7 40 -9 -25 -24 22 -12 -5 5 -42 -29 1 57 32 -34 19 -19 33 -54 -29 40 0 35 -34 22 39 18 -29 16 8 24
4400 24 -9 -37 -128 -23 -32 -3 15 -23 16 -2 -13 59 21 65 32 -10 -2 49 -40 16 -1 -59 9 58 -4 41 -2 -51 66 -32
4430 -32 25 45 32 -15 -53 24 -6 -65 11 10 -49 22 -18 14 50 -23 -52 -7 35 -9 15 19 -13 44 39 -24 0 18 -6 -12 34 28 -3
4463 -3 39 51 -14 -26 -25 -15 14 8 13 4 -61 -28 5 39 -42 6 23 0 -5 -19 -34 17 -42 67 -38 -8 27 1 -26 2 -44 -27
4495 -27 19 -30 -54 -5 -42 2 -19 23 45 -3 11 17 14 -7 -19 -36 18 -5 -34 -3 28 -8 -11 -36 24 -21 -59 21 24 49 27 64
4527 64 -28 -21 35 10 -19 13 -30 12 4 17 -54 -32 32 25 -22 30 1 -27 12 -33 2 65 -15 -64 22 -83 -31 -3 -24 -10 4
4558 4 -8 82 -1 8 -3 21 9 -27 -1 43 75 -24 -13 27 -5 33 -14 -58 13 -21 -52 -5 -7 -18 24 -19 24 0 35 48 -33 35
4590 35 -7 -1 -15 21 12 -30 -43 -53 28 28 -27 41 4 -41 12 -7 11 62 20 13 19 -14 45 -45 -37 48 -12 51 40 15 -19 -35 -29 -10
4624 -10 16 -7 6 -24 38 30 -19 -11 29 30 25 27 -24 26 37 14 8 48 11 37 1 -1 -33 27 28 57 48 27 3 27 27 11 17 -16 19 -27
4660 -27 -39 -24 -11 -13 10 26 13 -64 -41 17 14 48 -14 -65 40 -50 31 -2 14 -1 36 38 -12 15 -21 12 -23 41 -6 -26 15
4691 15 -1 -10 -9 36 -40 -11 9 30 -19 -37 11 -28 2 47 -9 -14 29 8 -15 -9 -5 27 -36 -5 11 36 30 47 21 40 -8 44 -12
4724 -12 -25 -10 -13 16 2 13 46 -33 -3 25 0 35 18 44 -21 -11 -18 22 -25 16 2 -34 72 19 19 76 -10 -31 21 32 1
4755 1 -35 10 -13 34 -25 5 -52 47 -13 27 12 7 -13 -2 24 13 39 9 10 -4 35 29 11 0 -30 20 -9 -79 0 -4 5 -8 28
4788 28 34 -51 -15 40 -20 -15 24 1 -5 37 -29 11 -1 -30 35 -14 57 -17 -40 16 8 8 15 -31 -1 59 15 26 -25 33 -37 -5 15
4821 15 -10 -52 28 47 36 -8 20 5 17 21 -3 9 2 42 -9 29 48 45 41 -4 68 7 9 53 -13 32 -2 44 -7 6 17 -7 13
4854 13 -7 68 5 40 4 -24 -11 -14 -9 -9 16 18 2 16 7 -40 6 11 -23 -3 -37 -41 -18 10 -15 -30 12 33 38 -36 1 -2 20 37 19
4889 19 17 26 41 0 -15 52 -29 48 7 -14 44 11 -37 19 35 -2 45 -26 -49 2 65 25 10 8 -2 13 10 30 8 -11 -7 31 43
4922 43 10 -11 5 -61 -18 12 1 15 23 9 42 -9 42 17 26 -76 -4 27 -19 22 -11 -44 19 -32 -52 -33 -3 -17 9 18 22 18
4954 18 -12 19 26 33 -32 -22 -25 29 1 24 -21 19 20 41 10 6 15 -46 30 16 58 -1 108 11 44 -8 -16 23 -71 27 36 -6 -27 -72
4988 -72 -53 -23 -27 29 17 17 22 -7 45 -6 -19 2 -23 -19 -29 75 -40 -58 15 56 39 1 27 9 96 4 56 17 -11 -6 -24 76
5020 76 0 -52 -16 -32 -37 13 27 -52 -2 69 -64 10 -3 -7 -25 -31 4 28 14 0 62 42 33 -31 41 -8 0 45 21 -38 60 -10
5052 -10 1 -51 38 14 15 -18 74 65 -11 -7 22 6 27 68 74 14 -7 1 -28 -36 7 -21 10 50 21 -13 -34 1 -18 4 -11 -18 9 62
5086 62 -37 49 2 88 -8 -1 31 -14 -33 2 1 5 46 39 56 -18 7 26 14 -22 54 6 -41 24 51 -24 -25 37 39 52 -48 8 1
5119 1 -20 17 -20 4 -27 16 -7 -53 -18 4 21 8 -50 32 3 -4 -2 19 15 -8 34 -78 -10 8 3 24 2 43 -19 46 61 17
5151 17 6 18 -6 49 -2 6 -13 -2 -55 -20 35 -46 -82 -19 27 -28 17 11 14 -9 -5 -27 16 -67 60 46 6 79 55 -20 16 50
5183 50 66 -9 100 62 15 11 50 11 -40 9 0 -18 3 -15 2 -49 36 6 3 -15 17 50 -35 7 5 -27 23 -10 -18 21 -21 27
5215 27 -64 -2 37 -18 -41 42 -5 6 49 20 24 -13 38 5 15 -20 32 -20 -26 48 80 -16 -5 13 0 25 -12 31 29 -19 -15 13
5247 13 -18 -43 29 75 -43 -47 47 -48 -51 7 10 29 -30 -13 6 16 -11 33 39 8 1 -40 5 -21 1 22 48 -3 26 -67 45 44
5279 44 24 15 -37 4 12 -2 -4 10 4 -3 -33 -10 -11 -37 14 0 15 6 -5 -20 -46 24 15 -40 -44 5 -2 10 16 7 -19 -2 24 -6 6 -16
5315 -16 23 -24 -17 36 39 28 9 13 39 -34 13 3 23 -20 -10 -13 12 -13 7 17 -16 -42 -4 58 20 11 21 -27 5 -14 -10 0 -5 -24
5349 -24 7 -33 7 19 8 31 30 43 13 19 -44 55 -3 3 48 33 58 12 -2 -12 -20 -32 -14 3 28 -17 -13 -67 -34 13 46 5 14
5382 14 8 -12 -15 22 -12 38 71 -21 3 -23 11 -36 44 15 54 15 -21 -8 -38 11 -4 -18 31 12 -4 -40 1 -10 -19 28 -2 -13
5414 -13 34 -1 11 -45 9 -26 -16 -18 16 -4 25 -3 -17 52 8 45 4 -28 51 1 15 43 -10 -24 -7 65 27 26 -10 -26 83
5445 83 10 67 52 5 10 -4 32 -19 52 -12 14 59 -7 -34 -77 -42 -1 17 -4 -14 -33 29 11 17 14 -33 41 -4 -18 8 15 39
5477 39 20 36 10 18 40 17 54 -30 12 -14 16 11 22 49 17 -3 14 -15 -5 9 40 17 8 14 -30 -29 -11 16 -16 -53 -38 7 36
5510 36 14 -16 -29 -37 61 -27 8 46 -23 1 -28 -24 -27 30 30 -15 21 -8 55 -30 19 34 47 32 -64 -11 50 -17 6 -7 -8 19 4
5543 4 4 -45 2 -42 -14 -31 -24 69 23 -10 -35 28 7 67 -45 35 12 -52 -27 -33 13 -10 13 -14 42 -20 37 34 -21 6 -11 20
5575 20 -29 -22 28 -4 6 9 -1 2 18 -36 -21 53 -31 -31 14 -25 -39 -6 -15 2 51 37 13 6 26 -21 22 -11 23 -37 3 18 49
5608 49 26 -4 -3 39 46 -25 -34 65 30 33 -58 -49 35 -24 -28 -13 17 -14 -6 -83 -45 -18 39 -53 -55 -42 -27 -7 28 8 24 10 -5 30
5642 30 -28 20 -44 27 8 -3 16 -24 -10 10 2 100 -62 7 0 18 -53 41 -1 -7 -42 -12 49 23 -11 -20 12 38 30 -12 31 51
5674 51 -43 -9 -18 7 -4 -21 -23 42 42 -6 39 -4 53 -4 -50 14 12 -23 -10 -5 -22 7 -31 -7 11 0 16 -1 6 8 30 -44 7 53
5708 53 -45 -12 3 4 -80 -28 29 7 -30 30 7 -20 28 0 27 -5 6 33 30 8 5 3 -5 -17 22 -5 58 51 22 12 -19 48 49 9
5742 9 -8 -48 -24 5 15 33 35 -47 13 13 47 29 22 -96 11 1 -35 -21 -15 12 -34 -7 21 13 10 -22 24 -10 1 57 -6 -5 31
5775 31 -8 30 27 -18 61 14 18 -2 -29 10 33 32 -5 35 -5 19 -27 -7 14 15 -31 13 -29 -26 14 -29 -18 27 -8 -21 -36 -29 -8
5808 -8 -14 10 11 -10 -26 -40 -26 19 -14 31 -22 22 18 5 -54 -34 41 13 6 30 43 -6 -16 44 -25 12 0 -28 -8 -50 2 -47 4
5841 4 -42 30 24 -15 17 30 24 -30 7 16 -2 31 23 26 -12 -10 3 54 31 16 -26 17 28 71 80 44 26 29 44 46 39 21 -37 -7 29 -13
5877 -13 12 -7 -46 -43 8 38 -22 -42 -21 -76 2 44 13 -20 12 9 10 12 -40 -23 1 -33 10 19 -20 20 32 56 16 -16 -24 -1 64
5910 64 2 38 -7 32 26 -31 -39 -44 2 32 -39 -50 21 -73 4 -21 -44 -23 0 49 -8 -34 -1 -8 -13 -5 0 66 -22 -64 32 30 -58 -22
5944 -22 -31 17 23 37 28 -17 -51 34 56 -47 37 -1 -15 24 15 16 -44 -38 16 -5 12 51 24 -6 -19 32 3 21 -23 43 0 -3 -4 11
5978 11 32 49 43 21 1 -10 26 30 19 -11 1 12 6 1 23 -12 -5 -12 15 -9 34 12 -20 -18 48 -13 -19 19 3 3 -10 20 11 -22 -31 20
6014 20 -33 -55 7 -25 -41 -28 -45 37 0 -32 -7 52 -13 80 34 -7 20 19 16 17 -57 35 5 41 -49 -36 -2 32 9 -10 -3 -3 17
6047 17 -58 -16 -22 10 -37 -1 -39 -17 -16 -16 30 22 -37 47 23 -14 0 -9 3 10 -34 7 4 -51 -12 15 -34 -16 -8 -22 35 13 1 1 20
6082 20 21 42 -30 6 18 56 47 3 -28 2 -22 -20 27 -25 26 8 -3 -10 8 -29 -12 -42 -8 -99 10 52 7 -20 29 0 37 -22
6114 -22 22 -4 9 1 40 24 9 37 8 -2 -50 15 -32 12 -16 -43 46 29 -9 -14 -93 39 46 -12 -37 -41 -49 3 7 2 8 29 -28 6
6148 6 -13 6 39 54 24 24 -10 50 60 8 -12 -24 -39 17 22 -37 10 -28 40 -28 63 -56 12 -2 -23 -2 4 3 -36 -22 13 17 -11
6181 -11 -29 -34 12 -38 -12 2 20 5 -44 -13 -2 41 0 0 24 -32 43 -8 42 9 -12 17 15 3 -55 -32 -3 4 -10 5 -21 15
6213 15 0 -13 -88 -17 9 7 -1 27 11 -86 -6 -44 -24 -61 -18 33 17 25 -20 -31 39 -10 -40 52 -42 -68 38 67 11 13 80 -2
6245 -2 -32 -38 -31 -26 13 49 -54 -39 -2 -71 7 -21 -40 -11 28 -8 18 -7 -30 -68 16 -74 -10 -37 -30 -26 -13 -6 1 12 -2 1 22 41
6279 41 -7 44 24 -7 -29 41 -21 36 -30 10 25 -5 12 23 -2 -26 -62 -1 -19 4 -42 -21 1 33 28 28 18 13 -35 -12 -12 -38
6311 -38 48 -14 13 21 42 12 92 -46 50 13 46 46 6 -4 50 -18 -14 14 3 3 -17 12 4 -2 7 29 1 30 -6 25 18 -41 -10 -29
6345 -29 26 6 -8 4 -71 -8 1 -1 -41 -5 -66 -18 -40 -1 47 -18 6 20 -1 50 22 -25 -39 59 5 22 -18 9 30 -45 -24
6376 -24 61 57 56 22 8 7 17 -22 2 21 -30 0 2 -50 27 -34 -18 27 -58 30 -48 70 43 1 -10 61 -41 38 19 36 39 -13
6408 -13 42 66 10 -24 -8 7 -3 -4 51 -4 69 -9 -18 16 -32 -33 -22 -53 47 40 -27 -9 -26 -11 13 0 11 18 -27 52 19 15 18
6441 18 -32 19 11 -40 -26 20 -6 47 -13 19 1 66 -37 50 19 6 0 2 66 22 -18 2 -23 -17 10 -17 -4 18 -10 2 -28 9
6473 9 -8 20 32 -49 5 -12 50 24 -16 24 27 -11 2 13 24 8 24 41 37 43 -27 -78 -11 -13 -72 33 -7 -42 2 4 -39 3 4
6506 4 -26 -28 3 -38 -22 21 27 -6 -34 -27 34 -65 17 -26 -11 36 -60 -34 34 -36 -16 -3 17 26 -25 9 21 11 2 -21 -35 45 6
6539 6 38 61 -7 -41 -26 22 16 18 15 29 60 -24 20 -17 -25 -15 -22 -18 65 -20 -79 12 3 -32 5 -32 -21 -15 -48 49 -1 4 66 -25 12
6574 12 59 63 -34 13 22 3 36 -19 22 46 48 27 52 18 68 -3 -13 -23 -17 54 5 8 16 -54 43 54 -3 -36 14 25 -3 10 -32
6607 -32 -30 35 40 -45 8 -43 71 18 13 -1 -8 18 -25 -6 -12 -4 -35 1 3 14 -18 -2 17 -90 2 -14 1 32 6 -34 19 12 -21
6640 -21 -7 38 -52 -26 -25 -10 7 10 -7 -11 -8 7 -14 23 -8 4 30 54 2 27 31 -14 -16 46 36 37 51 -15 -15 16 4 41 -38 -33 -32
6675 -32 -28 5 -15 -16 24 -64 -16 -16 -61 38 -12 2 -77 -94 3 32 40 2 24 56 -16 16 2 19 -14 -5 38 -31 -26 8 10 33 -61 17
6709 17 -2 32 -16 -28 6 -26 -4 -5 34 36 2 -45 -38 34 -6 -48 -40 -19 50 -14 49 6 44 12 -39 -49 -3 -16 -28 10 -24 -23 72
6742 72 31 19 -49 23 -7 -64 58 14 25 15 78 67 44 -52 -30 -5 55 -11 -40 9 -30 9 -34 -41 -21 -24 -57 -30 -24 -52 25
6773 25 -21 -74 71 -33 -31 -28 20 -25 -62 -10 21 -11 -13 -45 44 -8 15 -6 9 -20 3 15 -28 2 -8 -37 3 27 39 13 -14
6804 -14 43 8 31 -16 -41 -23 39 -77 -21 27 -50 -13 -3 2 4 -16 -29 3 -17 -3 -46 50 -7 29 -58 -25 15 -4 -30 -46 -18
6835 -18 -39 68 21 21 35 -52 -1 -41 -36 16 41 -91 -38 39 -3 -10 36 -7 -22 -3 -73 -30 14 0 30 -1 -5 5 -26 -61 14
6866 14 18 17 65 -63 31 -3 5 68 -4 37 -25 31 -1 9 -57 -21 47 22 -31 39 -3 -8 12 -20 -15 -67 -20 -39 -65 13 38 14
6898 14 -31 -66 -19 -58 -45 -36 6 47 -12 59 -23 -20 37 39 -18 18 -5 -15 28 61 17 24 17 -11 46 27 42 7 6 31 3 16 68
6931 68 18 7 10 -2 -19 -35 46 14 27 -39 12 -2 -20 -2 -65 22 -24 18 40 22 8 70 14 -5 -2 -9 29 23 -21 30 69 8
6963 8 -29 4 -48 19 3 -9 -25 -61 41 41 22 20 36 39 17 -34 -46 -12 51 -79 34 -94 21 26 29 -37 -22 13 43 8 35
6994 35 -45 -35 5 -22 -13 3 32 31 57 -16 -12 -4 4 -15 53 -12 -52 -20 -32 9 21 40 -47 7 25 6 -36 -17 -23 -9 -35 -10 4
7027 4 57 -15 -56 -17 37 22 55 -10 41 48 53 -52 -46 -2 4 39 -19 24 16 61 39 -35 71 40 21 -4 18 -20 12 67 22 -39
7059 -39 -37 -27 36 -5 -7 -26 -29 -18 33 0 16 28 -14 -15 -47 -44 36 -41 -4 -10 24 -29 0 83 31 -24 2 -33 -50 12 43 68 -14
7092 -14 30 12 30 0 -12 -21 -1 -51 44 -37 -4 30 -60 -1 11 -11 -16 -3 -12 0 -53 -52 -8 10 16 -57 5 -7 43 67 60 4 -43
7125 -43 -21 60 20 -17 29 56 71 29 -24 -5 16 77 15 -22 -6 -14 -6 -69 -16 8 43 22 -10 -18 17 -6 13 -15 10 -25 9 -17
7157 -17 6 2 -39 43 54 31 -2 21 -8 48 29 29 4 -22 -9 -11 25 21 -3 74 -21 -22 -59 23 -10 -23 20 -32 4 16 31 -56 -17
7190 -17 -66 20 40 -53 -29 -43 -9 -2 26 25 -9 -17 -55 1 -11 -14 -5 52 37 18 6 58 6 5 24 40 39 -1 39 8 -3 -9 39 4
7224 4 3 34 23 19 25 22 6 -25 -17 -11 -26 -12 -19 -4 19 18 4 -51 -3 -18 -17 32 0 -40 83 72 -43 15 8 19 48 8 44 18 0
7259 0 -12 27 -38 -32 15 9 28 37 -28 -42 34 1 34 -39 26 54 -29 -15 50 41 -26 -27 -8 -3 -6 21 -47 25 -26 -31 -16 17 62 18 22
7294 22 1 -30 34 42 -4 1 27 69 20 27 14 6 -21 -4 9 16 -27 -5 26 19 -19 -22 -4 -24 -10 -9 -7 -23 -7 49 -34 -18 -34 16 12
7329 12 -39 44 -19 -59 -19 18 33 -5 23 4 44 -62 8 11 -14 -24 70 33 -20 13 39 0 -31 -49 -29 21 -61 44 -40 -5
7359 -5 32 -57 38 9 -64 22 1 -12 -52 -55 31 -20 7 16 -8 12 -32 -7 -19 0 36 70 -16 -34 8 17 28 -31 23 -24 16 34
7391 34 30 57 -29 -25 14 44 -8 -50 28 -12 -69 -8 0 -17 -17 -10 -13 14 -18 -43 -4 -28 14 14 35 -24 -35 18 -62 -39 -22 -5 20 9
7425 9 18 40 -1 -38 13 1 30 17 -36 -36 -8 -32 26 0 36 26 -10 29 -56 31 -8 -48 -33 42 2 -53 -4 -34 -8 51 3 -9
7457 -9 5 29 19 36 -11 56 3 -5 44 49 -8 -10 12 -12 15 -1 18 12 15 -40 36 -58 -5 28 21 -37 49 -45 -25 11 -60 -3 35 8
7491 8 -8 -52 17 -5 -15 37 5 -5 3 16 -31 8 -32 22 14 44 -28 9 12 -37 -78 20 0 31 -75 -18 3 10 -33 54 29 14
7523 14 73 -3 56 -48 -25 -6 8 10 1 -57 29 -19 -6 -2 -24 1 29 24 -16 -4 -12 -20 61 -8 19 43 -11 77 6 4 28 36 -6 45
7557 45 12 14 -3 -14 -7 -25 -4 -37 0 9 10 -30 67 -27 0 -10 20 16 16 -26 -56 -14 -11 -21 3 51 5 22 -48 51 23 19 -14 -9 -29
7592 -29 46 -18 37 87 29 42 11 20 0 32 -15 -17 -24 63 51 -41 24 11 -16 4 -54 13 53 -7 -40 -18 21 25 -27 5 -5 -53
7624 -53 6 -64 -12 64 24 -23 -29 7 9 -45 25 48 23 20 43 -10 58 27 -29 3 -64 2 28 -11 14 -26 21 -30 -54 -5 -30 -44
7656 -44 -89 34 -27 26 -28 -75 -30 -13 14 44 30 -34 -23 -5 44 -39 -9 -25 25 -27 -9 42 1 36 -21 36 33 51 74 22
7686 22 40 29 -45 -20 6 -55 23 35 -44 -42 45 -8 18 -30 22 -12 -4 6 -15 -23 -11 -22 -19 -6 18 -57 31 0 23 -2 12 28
7718 28 49 48 69 -1 8 1 -10 50 14 35 28 -11 41 23 5 30 -15 33 -19 -29 -7 1 -82 44 19 12 -9 -13 -22 -7 48 -77 19
7751 19 -33 13 42 23 6 0 -8 -10 12 11 33 3 17 14 39 7 51 63 -7 16 29 22 -2 6 7 74 -33 -23 14 27 -22 -14 30 -18
7785 -18 38 -21 -79 -23 -63 16 -2 13 20 10 0 -6 52 -37 -5 -31 29 16 12 8 40 -9 46 25 27 -27 49 19 26 -8 23 -8 -44
7818 -44 75 17 -12 13 -33 -24 -15 -8 -15 -33 -42 16 -2 -58 2 -19 20 -1 -52 26 -17 -32 5 -18 9 54 18 39 -65 39 20
7849 20 -12 4 -6 39 0 29 34 -16 -14 9 -6 -6 14 9 45 32 -4 -6 -9 41 21 -20 -33 -17 -55 -35 -19 -28 -20 -47 1 -36 13 -3
7883 -3 10 3 -24 1 -7 -5 51 2 36 -52 16 -4 42 40 -32 2 -35 -8 7 -30 1 -27 9 45 17 -4 -32 -24 -50 33 -43 -12 -21 4
7917 4 -48 -35 -57 8 8 -23 24 -4 -39 -3 17 -8 -20 36 -25 -4 10 -15 21 -23 4 -25 -4 15 7 30 11 -32 23 19 12 -6 -31
7950 -31 29 -69 20 70 5 4 -26 16 -25 -16 -39 22 26 7 -17 -5 -52 -4 -17 -1 32 77 96 18 51 -11 -6 33 16 -7 -11 26 -12
7983 -12 23 -20 -28 4 -42 -19 -46 -42 -6 -27 -22 10 -2 -40 -5 -70 8 -8 -36 -23 15 16 -36 -36 64 25 43 -48 -6 -25 4 -32
8015 -32 -29 -29 0 -28 -57 8 45 1 -20 70 -65 20 41 19 -17 -18 -8 8 -14 0 -30 -29 3 22 15 -59 -51 17 -17 -27 10 -27 1
8048 1 33 42 -11 8 -75 64 -9 81 35 0 -32 40 -40 -9 -22 -21 4 11 67 22 -26 47 -20 30 -37 23 44 94 5 34 -16 -30
8080 -30 32 -69 8 12 3 -8 -21 12 -2 23 14 39 -13 39 -3 41 7 12 58 6 18 -27 17 30 31 7 55 3 2 32 -25 -26 3
8113 3 37 -14 32 9 2 -1 50 -18 -62 -15 22 6 17 -41 -41 14 -4 -25 2 40 34 -20 6 -18 -41 6 -18 40 -44 4 31 12 15
8146 15 11 -2 34 5 -25 -24 42 -2 -72 -1 15 -4 34 23 21 -46 -78 1 6 -49 5 16 45 1 -18 -3 -42 -30 -35 61 -2 -17 36
8179 36 -22 -4 -43 -11 3 -31 31 -20 6 -5 4 7
8191G
##END NTUPLES=NMR FID
##END=
