##TITLE=1H_30-2025
 200.13MHz, CDCl3
 8 sc
 
 19ns.26.2.2025
##JCAMPDX= 6.0         $$ Bruker NMR JCAMP-DX V2.0
##DATA TYPE= NMR FID
##DATA CLASS= NTUPLES
##ORIGIN= UXNMR, Bruker Analytische Messtechnik GmbH
##OWNER= pz
$$ XWIN-NMR		Version 3.5
$$ Wed Feb 26 14:00:53 2025 Russian Standard Time (UT+4h)  new_Human@DPX200
##.OBSERVE FREQUENCY= 200.1313
##.OBSERVE NUCLEUS= ^1H
##.DELAY= (6, 6)
##.ACQUISITION MODE= SIMULTANEOUS
##.ACQUISITION SCHEME= undefined
##.AVERAGES= 8
##.DIGITISER RES= 18
##SPECTROMETER/DATA SYSTEM= spect
##.PULSE SEQUENCE= zg30
##.SOLVENT NAME= CDCl3
##.SHIFT REFERENCE= (INTERNAL, CDCl3, 0, 14.3821)
##AUDIT TRAIL= $$ (NUMBER, WHEN, WHO, WHERE, WHAT)
$$ ##TITLE= Audit trail, XWIN-NMR		Version 3.5
$$ ##JCAMPDX= 5.01
$$ ##ORIGIN= Bruker BioSpin GmbH
$$ ##OWNER= new_Human
$$ C:/Bruker/XWIN-NMR/data/yarkov/nmr/H-C/1/audita.txt
$$ ##AUDIT TRAIL=  $$ (NUMBER, WHEN, WHO, WHERE, WHAT)
(   1,<2025-02-26 13:57:21.84 +0400>,<new_Human>,<DPX200>,
      <created by zg, POWCHK disabled, PULCHK disabled
       configuration hash MD5:
       00 E9 B6 7A A2 85 ED C7 34 08 36 98 17 FE 4E 26
       data hash MD5: 16K
       5E B9 B4 E2 92 54 0F C9 15 5E C6 93 84 BE 06 61>)
$$ ##END=
$$ 
$$ hash MD5
$$ 5E 2E 51 73 27 25 60 6B D4 7E 2F AC C2 5D 35 B4
##$RELAX= 
##$RELAX= 
##$RELAX= 
##$RELAX= 
##$RELAX= 
##$RELAX= 
$$ Bruker specific parameters
$$ --------------------------
##$DU= <C:/Bruker/XWIN-NMR>
##$EXPNO= 1
##$NAME= <H-C>
##$PROCNO= 1
##$TYPE= <nmr>
##$USER= <yarkov>
##$AMP= (0..31)
100 100 100 100 100 100 100 100 100 100 100 100 100 100 100 100 100 100 
100 100 100 100 100 100 100 100 100 100 100 100 100 100 
##$AQSEQ= 0
##$AQ_mod= 1
##$AUNM= <au_zg>
##$AUTOPOS= <>
##$BF1= 200.13
##$BF2= 200.13
##$BF3= 200.13
##$BF4= 200.13
##$BF5= 200.13
##$BF6= 200.13
##$BF7= 200.13
##$BF8= 200.13
##$BYTORDA= 1
##$CFDGTYP= 0
##$CFRGTYP= 5
##$CHEMSTR= <none>
##$CNST= (0..31)
1 1 145 1 1 1 1 1 1 1 1 1 1 1 1 1 1 1 1 1 1 1 1 1 1 1 1 1 1 1 1 1 
##$CPDPRG= <>
##$CPDPRG1= <>
##$CPDPRG2= <>
##$CPDPRG3= <>
##$CPDPRG4= <mlev>
##$CPDPRG5= <mlev>
##$CPDPRG6= <mlev>
##$CPDPRG7= <mlev>
##$CPDPRG8= <mlev>
##$CPDPRGB= <>
##$CPDPRGT= <>
##$D= (0..31)
0 0.7 0 0 0 0 0 0 0 0 0 0.03 0 0 0 0 0 0 0 0 0 0 0 0 0 0 0 0 0 0 0 0 
##$DATE= 1740563841
##$DBL= (0..7)
120 120 120 120 120 120 120 120 
##$DBP= (0..7)
150 150 150 150 150 150 150 150 
##$DBP07= 0
##$DBPNAM0= <>
##$DBPNAM1= <>
##$DBPNAM2= <>
##$DBPNAM3= <>
##$DBPNAM4= <>
##$DBPNAM5= <>
##$DBPNAM6= <>
##$DBPNAM7= <>
##$DBPOAL= (0..7)
0.5 0.5 0.5 0.5 0.5 0.5 0.5 0.5 
##$DBPOFFS= (0..7)
0 0 0 0 0 0 0 0 
##$DE= 6
##$DECBNUC= <off>
##$DECIM= 32
##$DECNUC= <off>
##$DECSTAT= 4
##$DIGMOD= 1
##$DIGTYP= 9
##$DL= (0..7)
0 120 120 120 120 120 120 120 
##$DP= (0..7)
150 150 150 150 150 150 150 150 
##$DP07= 0
##$DPNAME0= <>
##$DPNAME1= <>
##$DPNAME2= <>
##$DPNAME3= <>
##$DPNAME4= <>
##$DPNAME5= <>
##$DPNAME6= <>
##$DPNAME7= <>
##$DPOAL= (0..7)
0.5 0.5 0.5 0.5 0.5 0.5 0.5 0.5 
##$DPOFFS= (0..7)
0 0 0 0 0 0 0 0 
##$DQDMODE= 0
##$DR= 18
$$ [...]
##$SUBNAM0= <"">
##$SUBNAM1= <"">
##$SUBNAM2= <"">
##$SUBNAM3= <"">
##$SUBNAM4= <"">
##$SUBNAM5= <"">
##$SUBNAM6= <"">
##$SUBNAM7= <"">
##$SUBNAM8= <"">
##$SUBNAM9= <"">
##$SW= 18.0517328524113
##$SWIBOX= (0..15)
0 0 2 0 0 0 0 0 0 0 0 0 0 0 0 0 
##$SW_h= 3612.71676300578
##$TD= 16384
##$TD0= 1
##$TE= 0
##$TE2= 300
##$TE3= 300
##$TEG= 300
##$TL= (0..7)
0 120 120 120 120 120 120 120 
##$TP= (0..7)
150 150 150 150 150 150 150 150 
##$TP07= 0
##$TPNAME0= <>
##$TPNAME1= <>
##$TPNAME2= <>
##$TPNAME3= <>
##$TPNAME4= <>
##$TPNAME5= <>
##$TPNAME6= <>
##$TPNAME7= <>
##$TPOAL= (0..7)
0.5 0.5 0.5 0.5 0.5 0.5 0.5 0.5 
##$TPOFFS= (0..7)
0 0 0 0 0 0 0 0 
##$TUNHIN= 0
##$TUNHOUT= 0
##$TUNXOUT= 0
##$USERA1= <user>
##$USERA2= <user>
##$USERA3= <user>
##$USERA4= <user>
##$USERA5= <user>
##$V9= 5
##$VALIST= <valist>
##$VCLIST= <CCCCCCCCCCCCCCC>
##$VD= 0
##$VDLIST= <DDDDDDDDDDDDDDD>
##$VPLIST= <PPPPPPPPPPPPPPP>
##$VTLIST= <TTTTTTTTTTTTTTT>
##$WBST= 1024
##$WBSW= 4
##$XGAIN= (0..3)
0 0 0 0 
##$XL= 0
##$YL= 0
##$YMAX_a= 626945
##$YMIN_a= -635549
##$ZGOPTNS= <>
##$ZL1= 120
##$ZL2= 120
##$ZL3= 120
##$ZL4= 120
##$ABSF1= 10
##$ABSF2= 0
##$ABSG= 5
##$ABSL= 3
##$ALPHA= 0
##$AQORDER= 0
##$ASSFAC= 0
##$ASSFACI= 0
##$ASSFACX= 0
##$ASSWID= 0
##$AUNMP= <proc_1d>
##$AZFE= 0.1
##$AZFW= 0.1
##$BCFW= 1
##$BC_mod= 2
##$BYTORDP= 1
##$COROFFS= 0
##$CY= -3
##$DATMOD= 1
##$DC= 2
##$DFILT= <>
##$DTYPP= 0
##$F1P= 0
##$F2P= 0
##$FCOR= 0.5
##$FTSIZE= 0
##$FT_mod= 4
##$GAMMA= 1
##$GB= 0.15
##$INTBC= 1
##$INTSCL= 1
##$ISEN= 128
##$LB= 0.25
##$LEV0= 0
##$LPBIN= 0
##$MAXI= 10000
##$MC2= 0
##$MEAN= 0
##$ME_mod= 0
##$MI= 1.114404
##$NCOEF= 0
##$NC_proc= 0
##$NLEV= 6
##$NOISF1= 3.799351
##$NOISF2= 2.8
##$NSP= 1
##$NTH_PI= 0
##$NZP= 0
##$OFFSET= 14.38212
##$PC= 1
##$PHC0= -1182.405
##$PHC1= 10.99225
##$PH_mod= 1
##$PKNL= yes
##$PPARMOD= 0
##$PSCAL= 0
##$PSIGN= 0
##$REVERSE= no
##$SF= 200.129724274929
##$SI= 16384
##$SIGF1= 3
##$SIGF2= 2
##$SINO= 400
##$SIOLD= 16384
##$SREGLST= <1H.CDCl3>
##$SSB= 0
##$STSI= 0
##$STSR= 0
##$SW_p= 3205.1282051282
##$SYMM= 0
##$S_DEV= 0
##$TDeff= 0
##$TDoff= 0
##$TI= <>
##$TILT= no
##$TM1= 0
##$TM2= 0
##$TOPLEV= 0
##$USERP1= <user>
##$USERP2= <user>
##$USERP3= <user>
##$USERP4= <user>
##$USERP5= <user>
##$WDW= 1
##$XDIM= 8192
##$YMAX_p= 0
##$YMIN_p= 0
$$ End of Bruker specific parameters
$$ ---------------------------------
##NTUPLES= NMR FID
##VAR_NAME=  TIME,          FID/REAL,        FID/IMAG
##SYMBOL=    X,             R,               I
##VAR_TYPE=  INDEPENDENT,   DEPENDENT,       DEPENDENT
##VAR_FORM=  AFFN,          ASDF,            ASDF
##VAR_DIM=   8192,          8192,            8192
##UNITS=     SECONDS,       ARBITRARY UNITS, ARBITRARY UNITS
##FACTOR=    0.0002768,     1,               1
##FIRST=     0,             0,               0
##LAST=      2.2672688,     0,               0
##MIN=       0,             -635549,         0
##MAX=       2.2672688,     626945,          0
$$ Real data points
##PAGE= N=1
##DATA TABLE= (X++(R..R)), XYDATA
0 0 0 0 0 0 0 0 0 0 0 0 0 0 0 0 0 -8 8 -8 8 -8 8 -12 12 -16 16 -20 22 -26 28 -33 36 -40 46 -49 56 -62 67 -73
38 -73 81 -92 100 -108 120 -131 145 -158 172 -189 209 -229 251 -278 309 -345 384 -431 488 -558 647
59 647 -757 899 -1092 1363 -1760 2379 -3421 5401 -9878 23821 -144357 -635549 298705 571571
73 571571 -389524 -126874 531555 -116459 -327072 410708 246731 -405084 -73803 371520
83 371520 -49969 -158601 231031 -22359 -208817 216336 192564 -218115 -152661 199447
93 199447 95334 -215025 25731 188866 -190283 -110711 330914 42292 -420293 13620
103 13620 376350 -217850 -362938 228975 35187 -388967 103823 303799 -322571 -212896
113 -212896 431691 62012 -322112 184399 154174 -243855 102284 239675 -234344 -155984
123 -155984 300491 53814 -255405 131879 153318 -235547 42592 259138 -168604 -212411
133 -212411 181627 131736 -162839 -51402 140242 -892 -56973 102215 70721 -112010
143 -112010 -55540 139307 19821 -171677 -23706 71007 -56586 -33695 70151 -32500
153 -32500 -94059 127839 116136 -159144 -211 159971 -104649 -50754 167093 -70025 -172938
164 -172938 147766 136375 -189774 -51187 184315 -73810 -128855 139178 -13244 -199821
174 -199821 61524 123338 -133768 -62518 118703 -22909 -47706 99587 1657 -88284 42081
185 42081 75010 -53634 -64390 49646 11392 -54687 45255 41692 -48508 5680 74888 37087
197 37087 -48815 -15610 83238 -4480 -63244 59425 27045 -80444 30040 93732 -58954
208 -58954 -63449 87786 11451 -97175 28477 38917 -102854 -23999 90365 -56351 -96184
219 -96184 90063 28759 -105616 46240 65034 -92339 -12875 82750 -34136 -75103 47946
230 47946 43265 -68578 5789 76875 -38201 -24865 74647 4178 -45292 26578 34081 -26576
242 -26576 -15761 32839 5390 -29499 14824 36397 -20659 -22045 42247 5270 -48573 16156
254 16156 28052 -40232 -20215 34110 -1809 -45364 20428 41265 -53974 -12259 66073 -34412
266 -34412 -46971 52392 3026 -53967 20850 38653 -40802 -18283 60119 -2535 -50458 39327
278 39327 32252 -50121 5367 47217 -36100 -29231 47950 -259 -44105 16737 23815 -24406 -10641
291 -10641 27253 -3344 -34569 21908 28196 -37625 -4846 34484 -12042 -14312 18794 8055
303 8055 -18620 -2864 31449 -6033 -33394 24467 19072 -33645 3201 27153 -23299 -17012 32125
316 32125 1323 -34957 10360 28937 -21384 -15951 32270 -3519 -36486 27939 20165 -47939
328 -47939 740 34055 -25817 -19105 25295 1071 -25536 11471 29380 -22535 -15520 39263
340 39263 -1586 -28328 25561 13529 -24214 9485 25877 -9099 -11401 20983 12083 -19233
352 -19233 -1832 18731 -14776 -21226 16609 -1214 -30029 7174 16170 -17770 -7707 17454
364 17454 3968 -18636 2643 20456 -21621 -16802 28352 -10305 -28706 23751 11387 -24548
376 -24548 5229 22867 -9209 -13932 21102 6430 -27500 9668 26703 -20822 -6865 32956
388 32956 -586 -12867 24798 8803 -19838 4121 12977 -14569 -21740 2560 2728 -21812 -3896
401 -3896 13968 -16055 -6872 22644 446 -14490 3887 11873 -2650 -11504 9842 6911 -16785
414 -16785 12485 25860 -17067 -6552 29191 1692 -16106 10623 5609 -18315 1949 21018
426 21018 -9974 -17958 23774 18072 -17569 8644 16010 -22029 -2269 15453 -24253 -27303 220
439 220 -3506 -17048 -12009 459 -7283 -7897 14230 1794 -19787 2691 13475 -1417 -4989 310
453 310 8254 7550 6643 18128 6273 -7552 20623 23562 -12974 -4681 15340 -3209 -1568 15685
467 15685 93 -9688 16384 26049 -4043 -7888 17683 -2953 -15435 11878 -13982 -38668 1911
480 1911 4523 -27098 -15069 -1666 -9931 -6144 2825 -6796 -18518 -3815 8372 -6578 -9769
493 -9769 -1288 -521 10900 13217 -3172 4217 12398 3639 11324 4563 -13733 4257 13457 -2285
507 -2285 4161 7493 1366 14362 23454 6608 -7100 11026 17238 -10193 -5854 6362 -21587
520 -21587 -11791 18407 -12248 -24276 8846 3220 -10365 3615 -4216 -17297 160 8220 -10708
533 -10708 -12389 5141 1657 -3226 13034 2356 -15104 10619 12877 -14354 -4436 -676 -12567
546 -12567 3823 3977 -11507 1378 9022 3711 8763 8188 -2965 -1633 12134 3107 -16411 -2173
560 -2173 5336 -12283 1452 9684 -15766 -1383 19640 -5019 -6248 12122 -4875 -5581 15447
573 15447 2039 -11259 8703 17418 -758 1744 16190 -1427 -6231 16324 -2949 -20151 5086
586 5086 -1298 -16196 4200 -970 -14001 6390 8123 -7587 -1057 4624 -6116 -6281 1727 -8156
600 -8156 -15196 387 -474 -14628 1297 3515 -13228 4293 10154 -13787 290 12269 -8503
613 -8503 197 14353 -948 948 17466 9893 67 11904 14135 -4020 2540 13640 -9045
626 -9045 -7304 13004 -7158 -11167 13917 -473 -10563 11014 3989 -9309 3839 2780 -10528
639 -10528 -3932 2718 -8709 -10195 2140 -4274 -11614 4724 -504 -15656 3090 3400 -14035 614
653 614 3330 -10873 4160 8909 -5363 2863 11583 1976 2525 10471 1643 -5821 7577 7962 -11275
668 -11275 -905 10404 -7979 -1015 13461 -7359 -5505 14794 -566 -7073 6953 -1024 -6589
681 -6589 5697 3204 -9016 -3050 8393 -1200 -6386 5158 -2401 -9602 7533 365 -13599 1663
695 1663 1325 -6282 5433 566 -7895 6079 7495 -3254 91 3231 -2400 -924 5926 -1749 -10641
710 -10641 3554 6921 -7970 625 5432 -9543 2474 11396 -9431 -5408 8574 -1735 -2671
723 -2671 6074 -1174 -5066 5580 8649 -3919 -4407 6919 139 -3309 6412 -3767 -8373 7224
737 7224 1753 -6497 2314 -1657 -3277 6318 683 -6076 560 2796 -127 -197 212 -2451 -1830 6009
753 6009 1512 -8221 1905 4010 -5844 4270 2556 -10167 2413 8289 -5112 -1705 4308 -1707
767 -1707 409 5841 936 -5028 2148 7871 -2341 -3331 5008 -3468 -2811 7121 -3869 -8109 3793
782 3793 -431 -4038 1751 -3518 -3645 2657 1030 -1617 -1658 271 2019 28 1659 -284 -3633 4434
798 4434 2860 -3997 3069 1231 -3448 6235 2435 -6075 2912 3704 -2519 1460 2187 -1755 -68 4474
814 4474 2451 -4391 499 5156 -3850 -1841 4158 -6352 -3830 5010 -4495 -5419 2035 -2400 -2724
829 -2724 1203 -918 -1871 -607 2049 579 -2334 1674 2343 -1537 3647 2558 -1853 4298 2748 -1267
845 -1267 4194 730 -2359 3979 -274 -3143 2223 563 -1811 1049 918 -364 -1618 1413 816 -5417
861 -5417 -334 2398 -6634 -1631 2875 -6298 -2040 3147 -4574 -2525 2043 -1258 -2006 53 424 -1118
877 -1118 -955 3457 633 -1546 5390 3218 -585 5431 2567 -701 5592 1678 -1831 2708 226
892 226 -506 2356 -1403 -1230 793 -83 -338 -2041 -1392 -588 -3205 357 -760 -6432 741 1911 -5023
909 -5023 439 1239 -5437 925 2366 -4683 -2525 623 -1030 -1273 86 776 -1027 1062 6063 -114
925 -114 -1060 6546 936 -397 5803 -616 -1942 4979 1361 -1407 1063 -690 206 990 -526 -1237
941 -1237 -2551 -165 395 -3051 -308 -238 -2735 3511 1178 -3987 2253 1502 -2409 2861 -322 -4391
957 -4391 1404 1774 -2382 -932 81 -508 -241 1903 1088 -3771 1090 4923 -2895 -1016 4108 -3281
973 -3281 -687 5038 -3258 -3270 2563 -1108 -1755 -175 -2478 -2997 -651 511 -2358 -3488 1728 287
989 287 -1540 3798 319 -2303 5608 2807 -1749 3637 848 -729 5015 1179 -1966 2261 2112 701
1005 701 944 1403 84 -1304 3009 1488 -4321 1224 2481 -4044 852 1983 -5858 -39 2773 -4893
1021 -4893 -2378 134 -4178 -2656 -159 -2805 -4797 -1255 1372 -3371 -2430 2995 -1689 -1706 5503 -706
1037 -706 -2182 5674 946 -943 4852 1012 -442 4597 2398 -184 1598 2256 912 192 2848 859
1053 859 -2312 3102 1248 -3572 2492 741 -4111 2775 974 -5059 1307 1175 -4518 -294 471 -3786
1069 -3786 -2389 593 -1149 -4026 -188 1445 -4335 -659 3572 -4350 -580 5236 -3131 -1144 5199
1084 5199 -1480 -1485 4665 430 -1430 2302 1705 -636 263 2258 -446 -1671 2842 -31 -2772 3426
1100 3426 57 -3215 3889 419 -2997 3877 572 -2798 2982 1047 -2672 778 1205 -1761 -1069
1115 -1069 1287 -745 -3383 1864 1497 -4783 1263 3225 -4655 895 3914 -4970 -319 4525 -2845
1130 -2845 -1336 2696 -620 -1753 1360 725 -2701 -1084 2486 -2172 -2444 2767 -1696 -2743 4385
1145 4385 -596 -3081 3857 55 -1836 3567 87 -1890 2337 1155 -686 313 1199 -573 -966 1941
1161 1941 -202 -3223 2474 1145 -4187 2296 1447 -4918 2605 2844 -4334 973 2687 -2357 -172
1176 -172 2290 -1268 -1828 1620 1258 -3219 -325 2876 -3085 -1171 3754 -3463 -2264 4523 -1484 -2002
1192 -2002 3117 -838 -1119 2492 176 -1268 1056 1292 -230 -238 1196 -346 -1926 2158 -848 -3136
1208 -3136 2348 103 -3310 2716 -111 -3593 2774 1247 -2546 1648 1453 -1396 467 1556 -275
1223 -275 -1628 1644 1609 -2779 511 2552 -3641 325 3581 -3656 -592 3664 -1764 -628 3047 -1096
1239 -1096 -866 1532 606 -891 -237 1522 -742 -1553 1934 -940 -2689 1972 -1070 -2986 2132 -783
1255 -783 -2607 2173 -578 -1934 2142 524 -1124 1203 926 -239 31 1495 355 -1581 1833 1331
1271 1331 -2889 1479 2069 -3324 1410 2037 -3476 455 2290 -2415 -531 1568 -789 -649 728 882
1287 882 -1056 -116 2129 -1410 -1698 1999 -1749 -2017 2477 -1476 -2258 2241 -802 -1064 1761 -471
1303 -471 -298 1680 515 -100 473 769 570 -574 1520 621 -1364 2275 856 -2589 1639 485 -2840
1320 -2840 1135 369 -3352 391 885 -1579 -141 858 -210 -476 507 1013 -1942 -529 1908 -1872
1336 -1872 -1079 2106 -2042 -869 2932 -1216 -983 1709 -494 -200 1066 -913 -462 307 914 462 -533
1353 -533 1376 1059 -494 2103 539 -2054 2212 -4 -2428 659 -908 -2407 1313 -311 -1991
1368 -1991 463 453 -264 321 57 -97 -967 785 1710 -1798 17 2353 -1486 971 2623 -1991 456
1385 456 2176 -1477 -898 483 -1512 -368 482 -44 -244 -91 1909 975 -941 1545 27 -1221 1812
1402 1812 -866 -2473 1124 -830 -1537 974 -1052 -1592 917 12 -674 -738 -400 -248 -488 441 718 -1178
1420 -1178 1654 2306 -871 1826 1871 -1599 1317 1271 -2824 -392 489 -1782 -206 151 -540 -225 828
1437 828 1741 -297 -20 1641 -669 -983 1416 -1572 -1380 1799 -994 -1493 1277 -886 -1011 894 -1128
1454 -1128 -1525 -246 -818 -467 -824 392 729 -162 2358 1327 -839 2189 1544 -1195 1409 269 -2448
1471 -2448 745 90 -1869 66 364 -427 407 818 182 -208 510 1115 -1559 -516 1423 -1520 36
1488 36 2148 -1437 -348 1844 -1384 -822 871 -2009 -1304 80 -722 -791 -554 746 388 129 2126
1505 2126 738 -641 2148 225 -1773 1482 -177 -2111 1412 -379 -1406 1366 462 -732 478
1520 478 550 -394 -571 203 331 -1306 497 1182 -1334 815 2061 -1186 826 1969 -1878 141 906
1537 906 -1930 -602 417 -1025 -271 636 356 -10 493 1571 -302 -396 1269 -1045 -1446 1526 -826
1554 -826 -1357 2034 -116 -921 2102 -147 -889 1235 81 -1224 -195 -78 -457 -758 829 380 -850
1571 -850 1230 1036 -1111 1096 853 -2019 857 829 -1995 372 869 -1179 404 794 -315 -132 501
1588 501 655 -1129 -164 856 -1354 -692 1181 -1453 -442 2372 -982 -150 2087 -723 -340 1298
1604 1298 -1203 -949 190 -324 -681 -257 553 79 -435 1507 -113 -1439 1647 43 -1996 1603 220
1621 220 -1837 1534 677 -1277 696 969 -631 165 340 -543 -877 -274 275 -1715 89 1088 -1361
1638 -1361 684 1720 -1541 514 1873 -1309 -138 1374 -1432 -402 797 -851 -486 256 296 -553
1654 -553 -226 1016 -829 -961 1816 -539 -1095 2209 -354 -920 2130 -157 -1225 1544 296 -1094
1670 -1094 394 -37 -694 -617 75 -65 -1157 808 775 -1369 949 1212 -1659 1041 1037 -1877 711 1053
1688 1053 -1418 88 671 -714 -291 431 -345 -1031 -152 851 -808 -182 1454 -591 -432 2315 -832
1705 -832 -695 2035 -698 -545 1487 -691 -856 923 -136 -603 -34 225 -197 -612 618 -134 -1122 1183
1723 1183 280 -1388 1342 292 -1775 1210 598 -1257 838 329 -1236 17 133 -368 -142 283 505
1740 505 -455 459 1214 -961 83 1478 -1186 -284 1431 -1280 -372 1387 -892 -200 1160 -458 -325
1757 -325 565 10 -458 -496 549 -268 -601 718 -252 -910 1397 -105 -1126 1456 -503 -1305 914 -453
1775 -453 -1387 219 191 -453 276 773 190 375 868 816 -1019 324 688 -1247 30 831 -1429 610
1793 610 1440 -1190 113 1158 -477 225 519 -445 -539 227 278 -439 -431 1230 -463 -305 1447 -795 -800
1812 -800 1177 -1037 -1142 612 -1249 -789 991 -16 -218 728 477 348 217 738 -331 -754 554
1829 554 237 -1286 825 510 -1140 946 861 -1279 1017 568 -995 -13 -116 -742 -243 322 86 -57
1847 -57 362 1316 -414 -449 885 -798 -337 581 -1704 -1141 856 -832 -293 1260 -254 99 817 168
1865 168 197 -274 185 -371 -665 382 -167 -765 1189 492 -688 1683 521 -922 1215 -244 -1607
1882 -1607 324 -247 -836 181 -68 -43 139 638 571 -797 276 773 -946 -306 530 -1528 -214 1078
1900 1078 -700 435 1276 -369 636 793 -594 -674 -349 -276 -497 -621 304 -8 -331 1184 337 -252
1918 -252 1472 259 -782 769 -785 -1305 602 -653 -642 646 -153 58 235 116 306 -355 245 123
1936 123 -1231 177 304 -863 671 1184 -471 1043 1334 -253 509 257 -728 -482 -176 -650 -582 -397
1954 -397 277 37 6 1170 54 -258 938 -757 -641 685 -857 -743 534 -588 -507 616 -302 -388
1972 -388 -94 -261 -114 -560 -307 -196 -767 262 633 -328 1233 1159 -476 1517 926 -763 481 167
1990 167 -962 -86 104 -541 -128 72 418 -139 160 777 -476 -119 625 -842 -351 943 -1002 -249
2008 -249 759 -500 134 778 -512 59 -132 -634 -647 -724 -295 -426 -699 277 13 -730 1096 281 -656
2027 -656 1062 111 -438 850 -302 -549 571 -326 -39 549 100 278 -109 249 456 -571 218 878
2045 878 -822 143 702 -900 725 1050 -248 611 913 -481 168 250 -715 -219 -334 -526 -663 -382 435
2064 435 -6 -534 991 -558 -815 623 -694 -839 997 -636 -288 930 44 181 256 162 26 -283
2082 -283 -192 -15 -928 -80 182 -901 432 560 -484 1009 616 -614 953 857 -480 702 255 -332
2100 -332 493 143 -115 -131 -289 436 -644 -404 331 -742 -581 632 -807 -523 574 -802 -381 807
2118 807 -330 518 836 -23 104 -96 -40 -388 -384 87 -257 -567 477 177 -889 432 23 -364 898
2137 898 565 -350 715 319 -335 730 41 27 37 -68 41 -445 -441 47 -1401 -293 176 -1175 155
2156 155 729 -924 412 1026 -539 471 705 -15 304 130 40 190 -248 13 -453 -665 107 -220 -681
2175 -681 563 -330 -620 1192 -138 -292 1392 211 -158 594 179 -301 179 -122 -176 -424 -86 87 -1013
2194 -1013 -115 -58 -1539 38 208 -881 608 610 -529 733 1016 -290 545 337 -186 384 81 -107
2212 -107 -273 -311 146 -503 -330 519 -603 32 1173 -767 106 968 -226 -160 774 -402 -82 153 -187
2231 -187 -315 -333 1 -351 -612 65 -361 -843 436 -39 -1253 731 243 -640 953 658 -225 908 729
2250 729 214 494 175 -41 -214 -437 -40 -482 -149 354 -518 223 508 -539 365 655 -697 120 768
2269 768 -558 -148 526 -286 -222 206 36 -45 46 -108 -76 -469 427 -319 -581 963 -103 -383 1298 60
2289 60 -155 1160 63 -189 607 -244 -64 -82 103 -52 -79 185 268 -283 -65 357 -874 16 72 -843 116
2310 116 185 -746 2 97 -523 311 243 -29 -183 -167 265 -266 -571 256 -340 -218 989 -49 49 772 -161
2331 -161 172 858 -443 -149 432 -387 -221 261 243 290 67 230 341 -296 433 -138 -1018 233 -425 -952
2351 -952 98 3 -695 489 215 -312 312 378 -363 29 -170 242 -362 -111 701 -190 174 702 -49 362
2371 362 781 -633 -326 393 -553 -185 318 -376 58 233 77 341 -13 224 64 -61 167 -30 -1159
2390 -1159 306 -385 -966 532 -500 -611 538 -84 -410 160 -38 36 160 -68 -33 23 146 451 -40
2409 -40 396 826 -360 353 599 -824 130 391 -703 76 315 -159 552 575 -13 275 40 94 18 -413
2429 -413 371 -302 -383 288 -304 -235 621 -231 -471 386 -508 -403 213 -540 -301 82 -306 -152 -138 60 62 51
2451 51 125 469 -553 203 195 -966 375 -43 -591 285 161 -485 318 149 31 293 174 70 39 -58 315
2472 315 -274 -80 749 -408 -46 856 12 67 430 -713 -99 228 -309 -206 77 -212 -108 -134 -112 4
2492 4 -233 203 -166 -507 68 -278 -635 155 -285 -464 463 -104 -595 394 66 -212 28 -15 -11 108 -83 167
2514 167 -54 240 737 -245 379 659 -388 201 398 -322 58 232 -467 36 7 -503 131 -84 -145 36
2534 36 -411 -4 43 -230 260 -313 -122 589 -28 -316 263 12 -424 260 -386 -344 191 -256 -289 -109 -444
2555 -444 176 -259 243 230 -201 248 337 -192 81 493 -594 438 247 -564 92 79 -495 286 332 -142 89
2576 89 -16 267 -187 -104 413 192 -183 472 -159 -189 398 -437 97 204 -230 -42 393 -83 -166 -104 98 144
2598 144 -88 19 122 84 112 268 -471 284 43 -648 230 -95 -450 234 90 -574 14 95 -321 -229 -207 -190
2620 -190 -252 -187 215 -257 87 265 -324 -140 322 -413 151 446 -486 -117 451 -84 52 349 -194 298 63
2641 63 -30 55 -158 476 -73 -174 430 -129 -417 398 15 -463 311 -396 -482 548 -143 73 -12 -74 -93 53
2663 53 -369 292 -275 148 595 -262 -91 361 -339 243 301 -600 155 -19 -275 143 436 -209 179 126 -192
2684 -192 -10 -166 33 -102 -384 119 -231 -578 88 -322 -368 266 -382 -459 458 -294 -363 144 49 247 -15
2705 -15 -53 526 -104 12 596 -205 290 400 -211 258 229 -367 402 136 -279 250 -36 -14 351 418 265 356
2727 356 -57 227 -54 -325 173 -663 -281 183 -576 -203 202 -515 -638 365 -264 -4 267 -233 45 118
2747 118 213 41 62 79 295 -155 312 -50 -151 393 -11 -408 475 299 -357 544 1 -163 375 252 82
2768 82 336 -70 -7 -140 121 -327 -270 48 -97 -389 -359 262 -371 200 -46 -167 66 174 -433 -200 36
2789 36 -201 215 131 162 -119 33 476 45 -108 250 -168 -277 212 -275 -438 238 -6 -148 491 -96 -18
2810 -18 287 -215 39 -151 98 54 -225 60 187 -517 -51 53 -305 291 252 -363 341 48 -466 85 540
2831 540 -148 152 -131 73 279 40 305 -46 -283 330 52 -62 259 -91 -216 332 -383 -32 413 -201
2851 -201 -328 386 -29 -186 -36 208 100 -236 -109 88 -19 272 -56 -438 374 40 -455 97 5 -128
2871 -128 342 8 116 86 58 -110 192 156 380 4 -107 16 -196 146 14 -382 66 309 -386 119 145
2892 145 -164 117 244 -195 57 34 -23 223 -101 111 52 -118 148 107 48 300 -59 -285 245 -145 -243 335
2914 335 -18 -194 363 -26 89 67 -225 416 -492 234 188 -369 -221 124 -440 126 200 -139 154 180 -344
2935 -344 185 -161 -405 250 54 -115 231 207 281 189 -25 331 -216 -200 410 -505 57 399 -313 227 240 -406
2957 -406 -141 221 -246 205 95 -6 70 -296 -26 -261 -321 36 179 -47 -43 194 -492 354 45 -414 -28
2978 -28 138 -196 -59 274 -71 -107 -87 33 -71 -56 86 -174 -9 245 -62 -236 184 -183 -50 449 -526
2999 -526 -42 -86 -385 -114 225 1 -98 33 79 249 -3 325 30 -172 378 -29 -302 233 107 -354 139
3020 139 105 -144 314 21 -272 237 -232 -60 -150 229 -33 -181 -319 42 -282 100 207 -461 132 12 -326
3041 -326 74 241 -522 -112 116 -64 262 -42 292 -87 20 50 73 22 253 94 81 518 -5 -160 238
3062 238 98 -99 107 -137 -275 120 -64 68 -26 -297 48 164 -66 98 -557 -129 133 -156 167 151 10
3083 10 62 72 -366 197 -90 -291 29 -87 -47 -41 -104 -114 -168 209 25 187 98 344 -74 -56 178 -207 77 85
3107 85 -208 -22 146 -54 -55 -102 -96 -14 -40 -143 -231 -6 -209 -152 -319 154 182 -259 173 25 -404 267 -96 -68
3131 -68 301 6 -41 122 -192 -54 58 167 162 -56 -38 292 -68 155 365 -239 140 170 -156 92 269 -306
3153 -306 -37 7 -216 -80 -22 114 -2 -370 -6 33 -425 272 -322 -197 352 21 -353 5 -106 -86 415
3174 415 102 152 191 -79 331 325 43 86 -376 -38 414 -412 340 153 -206 142 316 -232 -124 387 -149 296
3196 296 253 -116 132 -80 102 -84 -195 -25 -208 -105 326 -196 -60 364 11 84 419 45 -284 162 -51
3217 -51 -104 47 -251 -128 35 134 -126 -99 -61 -87 -183 -121 107 -19 -218 -227 -297 174 100 -263 131 17 -201 -389
3241 -389 -17 -147 -96 -240 48 331 -197 203 -105 32 330 -52 142 278 -129 67 216 -176 16 -89
3261 -89 -136 42 -91 -67 -13 -100 111 107 16 183 -113 -126 -48 -226 -149 245 27 -338 118 -167 -156 234 228 49 46
3286 46 -184 75 -279 148 323 -281 20 4 -317 190 141 54 87 55 -172 214 221 40 111 104 25 255 -176 43
3310 43 101 -263 211 -116 -74 -128 -181 -688 170 183 -37 111 -35 -13 151 9 -2 -170 -139 38 163 -11 -364
3333 -364 -34 -115 29 -327 -147 7 -69 125 5 -145 318 265 -221 170 7 282 143 -105 -39 252 -20
3354 -20 63 68 63 120 -87 -206 -187 -323 57 213 -256 140 153 -89 68 -52 -266 -102 507 -134 231 -74 332
3377 332 144 -121 131 -159 -63 16 -188 -109 157 -123 35 187 180 117 169 10 20 106 -64 103 -159 -118 266
3400 266 -33 -164 214 -207 -226 -159 -338 154 38 -308 3 -229 -127 -45 -168 132 154 -102 82 -192 -178 118
3422 118 -70 -200 243 -284 104 363 -156 11 42 -96 -198 -167 -123 111 -143 -60 172 -91 131 425 -61
3443 -61 107 206 -276 233 133 -480 230 179 -535 -55 20 -385 170 -106 -5 152 -454 343 218 314 333 -185
3465 -185 148 -140 -285 -279 335 37 28 117 26 -309 139 -166 11 47 -59 272 12 83 204 243 16 230 97
3488 97 186 132 -52 -159 163 -65 470 118 -148 92 -376 62 24 -177 -132 155 -22 365 -469 93 70 -116
3510 -116 66 -33 -202 -170 204 -84 -370 205 -106 -192 92 -2 121 -110 26 36 172 66 -61 -51 131 210
3532 210 184 210 240 0 128 -132 -85 -195 -321 -135 102 -35 372 195 -5 -22 57 -132 200 -129 -120 236 -200
3555 -200 -37 -96 -350 -55 24 -243 -21 -73 -39 -247 -161 4 35 61 97 177 16 361 284 101 98 -43 12 -63 -339
3580 -339 -434 31 -272 -226 -150 -223 183 -81 -49 220 103 18 212 -178 -138 168 -294 104 52 -136 -104 70 -317
3603 -317 124 -86 -204 165 -81 55 -248 3 -18 -149 143 207 -25 1 333 -262 65 175 -280 104 -54
3624 -54 -114 -60 -34 -223 -223 -186 -42 107 -299 197 419 -11 256 -122 -99 193 133 -24 357 -172 -198 -120 225 -443
3648 -443 176 -39 44 8 82 199 158 30 5 -231 67 67 -160 49 -189 -155 77 374 -252 -41 71 -22 181
3671 181 64 -375 249 11 139 166 103 292 381 -17 339 234 -88 264 4 -136 223 -303 -139 71 124
3692 124 -196 -87 31 27 -89 -216 -174 -164 -166 118 -213 -181 67 -103 19 -51 -194 -12 263 -251 100 -154 46
3715 46 191 116 9 83 104 56 -109 -207 108 -13 -148 50 -115 -99 79 -183 45 54 -242 5 -96 -84 -94 21
3739 21 -38 -53 7 157 127 -236 78 220 -162 146 157 -330 -5 -123 -154 -52 -200 -19 -83 4 47 21 -221 -117
3763 -117 -29 -221 259 135 60 120 -184 -134 9 -1 -234 137 -66 48 165 -50 116 -80 49 -59 -64 -124 96
3786 96 -90 206 284 -298 -7 221 -87 67 -32 -42 73 -293 -225 -62 -47 -65 23 -29 164 106 21 -17 -219 163
3810 163 63 -330 110 150 -18 -219 -113 -88 -44 22 -96 -60 -194 78 68 -103 191 175 -291 126 216 -70 -208
3833 -208 209 -156 172 242 -132 403 -17 113 -183 -20 145 142 -46 -149 -110 153 117 -164 -309 282 -423 -86
3855 -86 -15 37 -61 114 54 -98 45 94 169 34 175 152 -331 50 -239 45 48 -45 -37 -50 55 -269 216 -126 -209
3880 -209 124 206 104 -31 -120 -6 393 -5 3 265 -127 -27 21 -187 -165 -194 -54 -314 -220 -39 36 -6 61 4
3904 4 -13 -18 24 -55 -89 -218 139 192 116 96 -57 53 144 93 -134 53 13 116 139 80 217 94 22 -15 -91 -251
3930 -251 -71 216 -10 77 -60 163 148 -170 107 34 -95 113 -117 -376 120 -41 -252 64 4 -8 -278 183
3952 183 -43 -63 -102 42 53 172 -23 -303 -62 33 -63 139 -63 -69 -180 198 -69 59 -56 -3 -20 74 64 -117
3976 -117 -57 55 -322 -246 -28 -86 8 348 -47 -154 215 -267 -8 155 -47 -35 40 25 135 -316 -38 -168
3998 -168 -196 98 92 21 86 -191 -61 253 111 -131 283 -95 202 321 181 -129 170 163 11 49 -23 -270 -323
4021 -323 -294 23 -198 76 -127 -26 -39 84 4 -41 179 -27 -56 -151 138 -12 46 -332 95 72 -317 -111 -325
4044 -325 305 113 23 -3 -39 -208 -283 -22 -233 -98 -230 -154 72 -150 -154 102 -392 115 -94 4 -128 137 75
4067 75 -30 -51 52 -3 185 130 111 170 -213 120 -159 -109 -63 -73 -40 2 8 145 14 184 -129 -16 -4 138 72
4092 72 132 -38 133 161 -111 116 -238 -29 -257 78 -209 22 345 -55 414 -57 124 220 -190 -44 256
4113 256 -161 -81 -42 19 109 87 -141 -14 104 -359 -121 -81 252 25 -127 129 27 -14 171 153 -122 -34 107
4136 107 -385 142 -155 32 -18 -130 204 55 -256 223 59 -184 179 -100 -8 -112 -224 208 -5 -169 -243
4157 -243 -79 -5 156 -10 -58 162 6 -92 -43 150 47 98 -114 94 -89 -170 -49 -225 -38 348 -264 -42
4179 -42 46 -8 -196 262 -4 -63 -58 -205 61 -163 257 -114 102 -290 -42 7 -54 407 179 -52 177 -6 -32
4202 -32 -81 54 206 -264 -30 225 148 -283 306 -14 83 -215 -41 -112 249 -58 -71 -19 -37 119 -158 25 299
4225 299 -104 62 150 -26 74 40 240 -56 -233 -6 -48 277 279 -137 -336 136 3 -30 157 -92 108 339
4247 339 61 170 -240 -255 120 -9 -36 80 93 -4 96 -419 77 30 -49 177 -60 -230 189 -73 -50 95
4269 95 69 205 133 -302 -129 34 113 -158 121 35 -26 -250 -85 -179 222 91 193 219 -13 43 -414 -39 -53
4292 -53 -56 -170 111 -152 87 -131 85 354 -140 143 -30 56 -11 -89 -116 -65 -32 36 63 329 220 52 -49 100
4316 100 8 -25 -3 308 -226 7 99 -16 92 8 -135 -107 -247 -239 -65 -260 -211 -36 34 -97 355 -97 283
4339 283 -46 234 183 8 65 -102 -55 136 144 -263 289 -91 -149 -15 27 -151 -60 -91 167 -266 -431 -40 -106
4362 -106 230 90 64 -124 2 -38 263 156 -378 226 137 -156 -25 -148 -203 -30 131 29 197 174 -129 133
4384 133 341 19 94 33 308 -80 59 22 185 4 120 -157 155 32 264 -27 -29 4 -100 5 -65 255
4406 255 -83 -111 -195 -188 22 180 -232 -117 142 -196 94 -46 -205 283 152 -68 -137 -53 -86 243 87 92 315
4429 315 2 3 -327 -189 24 -202 -269 50 -154 -236 33 -222 189 204 -359 -85 -17 -76 -153 -100 -131 43 75 7
4453 7 -311 -190 -57 -163 -31 280 -131 -67 149 -58 -112 -23 -194 68 232 -73 481 -104 -122 -69 -224 -10
4475 -10 63 -149 -313 17 27 -88 367 -176 113 101 -254 -222 -125 -225 -91 72 263 -316 -231 154 33 29 -120
4498 -120 55 -416 69 -38 329 -183 -72 71 -218 -260 122 83 159 83 -160 39 216 111 166 164 -127 49
4520 49 50 -266 -47 80 50 286 67 -139 10 -410 -37 20 32 29 -72 -229 -262 -48 -216 194 5 52 27 109
4544 109 -14 -265 -248 -145 141 12 -29 -112 81 296 157 40 229 -207 54 -122 147 136 119 -78 504 1
4566 1 -225 134 116 24 -24 -12 -301 -32 66 -200 -37 -62 -78 67 63 94 -122 82 202 75 -54 -94 -207 27
4590 27 96 19 -12 94 -9 -60 18 -66 66 -224 62 -26 -71 -91 -71 -46 206 215 -30 181 43 -27 -36 51 85 -46
4616 -46 146 -80 22 -26 -146 -14 -134 -18 -138 -193 105 -63 95 -44 -101 59 49 32 -229 -294 -50 -23 82
4639 82 -289 139 -78 -86 149 -165 -177 215 44 260 -139 -465 -56 -61 -40 309 -116 -95 -53 -225 111 -248 45
4662 45 111 34 -365 242 145 274 348 -13 179 -4 -163 16 57 122 168 133 -217 76 -125 22 40 -74 -126 57
4686 57 101 -14 178 -28 14 -68 -13 -181 -113 115 65 -51 155 -104 12 156 268 -4 287 -1 -115 53
4708 53 10 -86 -42 -61 95 101 -189 154 46 28 -125 -257 1 241 -90 -130 79 171 150 -159 67 106 46 76 -85
4733 -85 7 13 16 -25 -376 131 -365 -106 -1 -187 6 122 -73 -134 -250 -73 -43 37 -30 -255 -89 -16 119 -52
4757 -52 2 81 217 -52 -27 -132 52 39 -176 44 -20 -51 -203 -6 51 -152 -106 274 -207 135 -123 -224 -137
4780 -137 355 140 199 160 -79 96 69 -102 -47 29 87 84 289 -54 15 152 230 215 6 15 -107 -99 182 207 -120
4805 -120 112 -276 140 79 83 55 -31 -48 47 -239 106 -111 -6 167 -155 25 -230 -46 11 -232 224 53 -292
4828 -292 -43 -69 62 -81 -95 68 79 193 -61 -76 -14 181 52 128 26 37 55 -63 -62 -139 37 -33 259 165
4852 165 -118 171 14 -24 323 363 -210 90 29 146 -64 38 -70 79 228 143 -110 -115 -129 -233 30 34 -36
4875 -36 92 -13 -6 -274 -80 -135 41 -23 -133 -144 14 92 59 55 63 -315 296 -87 -168 90 168 62 -65 94 -136
4900 -136 96 55 -30 161 -172 -44 269 -88 27 193 167 -74 260 350 72 -186 -226 -22 -19 19 -99 -20 109
4923 109 -179 -169 186 269 -5 65 101 -173 38 -51 7 -217 172 -123 7 -166 92 -165 -275 -38 126 -78
4945 -78 -117 -80 67 -24 -32 95 28 179 -116 -26 -19 232 -287 -121 -60 -114 -68 -77 11 -70 -98 -64 -17 72 316 -48 -246
4972 -246 -43 65 228 -226 65 37 5 -1 -94 134 15 172 -71 20 8 -118 84 24 -19 20 67 32 -34 -340
4996 -340 -12 163 -137 51 -126 77 -185 173 -87 -64 -177 -258 119 -201 -134 172 311 -21 -47 395 12
5017 12 91 -104 17 -291 -103 132 15 64 -170 197 -223 -219 225 173 -108 46 -219 -135 281 134 330 -80
5039 -80 25 -189 86 94 155 1 -266 331 -275 -26 92 -318 135 -81 -39 -19 -89 -102 -86 114 51 161 23
5062 23 272 75 9 118 121 400 -201 -6 47 123 -27 104 -38 6 -173 -35 154 -156 115 -59 222 -129
5084 -129 49 -28 -44 8 177 142 171 -49 153 -137 -8 11 -188 -146 90 -253 40 -15 -29 97 313 -130 48
5107 48 10 -50 61 28 -90 93 246 24 155 -9 -17 -59 204 212 48 -201 4 23 -54 -16 79 30 42 -68 -46
5132 -46 36 -84 -86 -156 28 337 -88 -254 -108 183 217 -52 -121 7 -146 -62 21 -105 238 12 83 -233 251
5155 251 -35 -72 41 -23 45 10 60 -74 -115 -109 2 125 -258 -15 -228 -118 -184 -273 90 83 208 20 -4 -71 -139
5180 -139 37 229 -101 -151 46 -60 -152 174 20 -481 -267 70 -303 115 -281 18 140 -12 13 111 145 -150
5202 -150 189 -169 142 -200 -134 -138 46 -278 -222 71 56 -60 -358 216 175 -82 -196 129 -55 -151 -239 -12 -212
5225 -212 229 -100 -63 43 87 12 37 95 -59 4 -23 -47 79 -125 -102 258 72 17 -63 210 -55 -107 -52 16 32
5250 32 264 -133 -227 62 65 -79 -14 53 91 88 -41 36 60 -34 39 38 -66 85 40 117 61 283 38 -96 -184 18
5276 18 161 146 -177 -10 -274 -105 -188 11 22 146 -310 -39 107 96 -83 -18 -76 92 -44 -48 -309 -23 235
5299 235 109 -213 186 87 55 14 100 -234 -128 62 -307 15 -64 -123 -8 146 -239 22 -13 101 -110 105
5321 105 82 63 159 -125 100 -160 232 -37 127 156 23 89 -59 -90 -200 79 -136 -34 1 -18 102 -204 -88
5344 -88 -31 68 142 115 -25 -426 42 95 14 -268 49 264 -90 -364 -96 -226 -360 -157 -267 -61 -126 -58 97
5367 97 -108 -10 0 276 130 108 166 175 14 166 264 -36 -27 61 -90 -59 -93 34 -271 169 162 -65 -99 30 96 57
5393 57 198 147 -274 18 26 175 -59 -31 98 -117 -183 -151 70 -43 -134 66 218 -49 -158 204 -7 287 382
5416 382 0 180 145 12 150 -151 -24 -142 -186 51 -207 57 64 -129 202 -72 -4 -302 -79 -67 -105 -23 -69
5439 -69 -191 118 -131 -111 -122 53 137 -44 6 149 -113 -117 6 -114 182 -56 -16 358 6 151 68 -177 -20
5462 -20 -10 99 -130 57 117 -15 -190 98 -165 92 -167 41 -14 127 30 -206 175 13 10 -76 -164 85 -68
5485 -68 -85 -61 172 116 199 -205 -163 -33 112 46 285 262 -288 -116 -53 133 -137 -146 31 -9 -250 -43 -299 -13
5509 -13 -37 -51 -67 -150 -230 -98 -162 93 91 -90 27 -235 79 -6 -225 57 160 53 227 -48 65 -149 -111 104
5533 104 -22 -255 132 -122 -79 -206 50 -193 275 65 -88 -114 -272 226 86 -59 47 22 104 -141 -127 231
5555 231 -71 15 14 -82 -94 208 -154 -44 -135 -94 150 192 -137 109 -359 -33 90 -103 101 36 -193 -64 -113
5578 -113 90 80 -72 128 -123 14 -31 9 -189 83 -45 47 132 -48 280 133 53 128 100 -292 -257 100 292
5601 292 100 -187 60 -12 58 24 -12 201 24 43 -115 -237 97 -30 -238 -241 282 -17 54 -112 -240 -171 -161
5624 -161 127 -183 348 17 109 -291 -4 129 74 122 33 177 78 59 -26 68 -67 -25 34 206 -103 -122 -45 -5
5648 -5 318 7 118 -90 9 32 20 50 -7 -57 42 -71 207 -60 -96 170 321 -153 -79 -300 -248 -75 264 182
5672 182 -156 -30 -60 60 125 15 -58 115 143 -93 171 -149 -157 -85 75 -75 46 59 193 50 129 82 190
5695 190 -187 157 202 -397 -21 92 -267 -17 -199 -179 -31 49 376 -44 -65 -76 -58 69 23 -23 97 -113 65
5718 65 -47 -34 23 118 -189 -160 116 36 -156 -1 225 -96 139 297 -226 143 -130 243 35 147 -145 105
5740 105 56 -11 101 23 243 -19 243 -182 170 339 55 -42 31 -51 -65 355 -86 -127 -145 -64 -21 -115 32 78
5764 78 192 86 87 -270 183 17 -61 34 -68 -161 -11 -25 -95 29 201 -18 -51 129 -50 -232 72 12 -151
5787 -151 38 123 -254 103 -236 -177 -115 41 177 -324 189 -29 -131 183 179 68 -84 -272 49 -2 -214 -93
5809 -93 20 -106 -18 306 -87 99 99 313 -8 -46 43 208 -53 251 12 118 173 -44 -78 -373 265 -142 57
5832 57 15 208 -64 172 17 52 402 94 -188 84 -30 160 -56 167 -102 99 314 -41 0 -21 -4 -58
5854 -58 47 -283 -82 -144 54 -107 243 203 120 110 -114 180 -23 -117 -80 -256 -69 -36 3 -92 -35 107 -9 -334
5878 -334 10 181 -198 69 -1 -45 -2 -180 -85 42 -102 -177 97 -9 40 45 63 -72 195 -302 80 236 134
5901 134 8 -41 89 -129 -189 -48 -113 45 30 137 -97 123 -112 -141 -114 65 301 -24 -183 83 89 -64 -20
5924 -20 -145 24 67 -33 -192 265 60 148 -22 -28 141 216 88 411 -16 -167 -76 281 -8 47 141 -130 85
5947 85 -20 47 -102 -141 292 -203 -1 148 73 -186 -125 -190 -81 205 92 35 -124 51 185 41 63 179 -226
5970 -226 132 155 -350 -414 -41 -275 165 -48 -113 298 377 30 -168 239 50 188 -143 33 31 290 -83 -174
5992 -174 315 -123 289 -52 32 -54 -162 -56 105 0 288 57 -45 53 -133 21 127 18 18 124 -73 57
6014 57 -21 -183 247 -162 -164 22 21 -230 -83 -14 -40 -78 -1 27 -120 172 -51 328 -399 -105 138 -6 -126 -141
6038 -141 -28 145 242 -23 -141 -301 -141 118 23 -102 -96 -245 75 130 24 31 176 -15 6 74 -347 -23 31
6061 31 247 -73 -216 -212 256 -22 -9 137 187 64 94 -105 151 146 -199 -42 -77 -94 90 104 -105 104 -13 10
6085 10 57 148 -106 -28 6 147 -108 350 55 -42 -58 -191 -94 222 -209 -139 74 -83 104 -352 252 -31 -6
6108 -6 -140 48 -134 33 128 41 -39 96 5 -41 82 -72 126 -165 -62 59 -83 29 -178 -21 74 107 -89
6131 -89 154 33 34 -135 41 254 33 -87 149 -162 180 -208 -264 -104 -11 -94 -55 85 255 -198 -61 312
6153 312 -142 56 121 92 -42 -135 -96 276 -79 -9 114 -373 -212 -68 152 191 151 -98 162 40 -14 129 -163
6176 -163 -127 133 9 370 27 3 -198 47 13 -201 118 125 -17 25 119 -55 143 -103 -77 295 -59 105 -60
6199 -60 166 128 -131 -150 -15 187 -215 75 -136 142 -183 -91 181 158 -22 -127 -81 -50 -89 -271 -264 151 -205
6222 -205 -90 72 86 3 -193 -113 -144 -298 -18 130 66 -393 47 63 204 167 57 255 -51 53 -90 -53 -123
6245 -123 -68 61 -340 -137 259 -139 110 -53 227 206 -190 -159 201 76 61 -253 282 9 1 -149 54 -56
6267 -56 129 259 -161 -177 -41 -54 -144 -158 -44 100 -45 -21 -105 179 -335 -67 -80 -129 85 79 -258 -147 -86 3
6291 3 -36 57 99 8 84 181 -176 125 125 59 83 -241 42 -107 46 -291 111 -227 286 10 -58 -110 108 49 58 -13
6317 -13 -149 123 37 279 -164 -88 114 -232 345 -82 88 96 195 -117 -26 102 -45 -283 -47 -238 -268 76 -85
6340 -85 131 99 166 20 -219 154 104 22 -93 -51 184 17 -65 -119 -92 -16 -16 457 139 -232 19 -229 -253 -50
6364 -50 -150 -242 87 -31 -10 48 34 -151 156 134 108 169 -83 -2 51 -212 -27 -71 -105 188 -228 126 158 -125
6388 -125 -88 134 -46 -22 36 19 -81 50 40 96 -291 -213 -106 -97 19 196 -255 -152 129 -7 -128 282 -200
6411 -200 -177 30 -185 159 -238 57 -141 -273 49 -50 -136 -89 126 89 -143 23 -78 -23 88 -95 -275 -223
6433 -223 32 -323 -158 -79 -25 43 -187 -70 -63 -219 228 203 -94 5 25 120 138 58 22 206 -268 208 3 83
6457 83 -93 -11 123 -84 -10 -33 151 114 -345 -198 -100 12 -37 46 158 19 163 -268 87 -4 22 304 67
6480 67 90 -210 85 81 -52 32 38 77 28 -16 171 -112 -186 -262 -168 160 47 -214 -302 41 126 120 25 102 -207 14
6506 14 160 -97 -42 161 -59 178 -165 154 -61 21 186 -88 65 36 -141 -26 174 -87 42 -35 -138 30
6528 30 -133 116 -403 -62 1 -38 -92 -175 48 -98 147 -178 -138 143 11 -408 111 -111 18 119 -89 -145
6550 -145 -275 -119 107 -77 -6 -39 -146 -5 293 103 227 -47 -191 117 89 6 196 129 60 -212 -412 -112
6572 -112 23 -158 119 130 -200 -62 -226 243 27 111 40 -152 -88 -1 -8 109 194 -183 -225 34 -2 -169 364
6595 364 167 21 136 267 -17 -31 -162 -6 54 -61 -282 66 5 -82 78 105 77 -220 -19 120 195 117 -93
6618 -93 5 -121 -38 -30 43 57 162 -360 -150 40 -97 -248 -218 29 -266 -101 130 28 147 -270 49 110 -5
6641 -5 194 -41 326 13 339 78 -116 87 -41 119 167 -65 135 120 146 205 -153 8 -48 -68 166 188 -171
6664 -171 189 -61 154 -128 -121 46 -228 229 -59 -29 -122 -301 -50 258 -153 252 268 -12 -132 119 -125 56
6686 56 -146 103 384 -106 21 0 -331 -34 161 -72 -25 -259 55 -1 -93 33 -135 65 -79 -158 225 -26
6708 -26 117 -216 -70 336 153 -8 246 84 -85 430 1 234 -316 -57 77 13 357 -75 -131 -60 -12 64
6730 64 -254 -72 53 -134 4 -37 42 -252 -43 -23 -14 109 -38 -131 -116 53 -154 -15 0 35 176 -60 -11 -54
6754 -54 50 -245 -95 350 -121 149 24 -110 163 -5 6 54 66 -336 181 -59 -120 -80 -60 -34 95 104 -76
6777 -76 -74 98 107 -7 -52 -244 153 -254 -88 104 -158 -241 103 -19 -116 43 1 -104 -229 136 74 322 -8
6800 -8 -151 19 -17 -147 113 19 44 -1 -232 -3 44 -366 202 -67 169 -18 -88 -86 8 33 402 -172 -120 318
6824 318 165 -66 45 -113 -47 -103 0 53 -60 -320 -120 -11 36 136 -175 -84 69 139 69 250 -27 -34 33
6847 33 224 52 -65 -224 -39 129 -202 168 120 116 170 -192 208 10 32 -383 -51 255 -120 195 18 -2
6869 -2 -78 1 -441 109 37 -28 -57 -17 -63 -386 49 153 158 281 45 -79 97 178 -43 -8 -212 238 -26 193
6893 193 230 97 -6 81 -109 13 21 100 -64 -15 -25 33 140 -79 41 -56 76 -59 103 -5 -173 7 35
6916 35 33 -49 25 -45 216 -27 -46 145 -82 -27 -142 -18 -51 169 6 -114 -253 -164 -167 -78 75 -100 91 73 -166
6941 -166 69 14 -196 137 142 248 -24 19 116 -68 20 37 88 -31 136 41 -182 -237 6 -18 59 3 46 -32 -34 89
6967 89 0 -179 -11 12 -126 274 -134 309 245 307 -120 59 8 31 36 91 74 80 -88 -50 36 -138 307 -75 29
6992 29 194 86 118 18 54 208 180 83 250 23 70 389 311 180 99 -22 100 12 -414 -230 65 -73 -296
7015 -296 -216 -95 71 -152 -135 -17 33 -153 -277 -61 -256 55 72 143 -296 -250 -62 90 129 13 -1 -107 -141
7038 -141 40 71 -88 -3 101 131 92 -299 -168 -39 137 30 43 17 -85 36 -1 -53 -36 -231 46 88 -145
7061 -145 -207 86 126 -70 132 194 -8 -202 239 127 136 126 -109 226 -363 84 34 185 86 -142 119 43 202
7084 202 -56 6 -41 10 46 127 17 -43 31 240 147 -60 105 -26 170 192 -192 14 -156 -90 67 -105 -145 136
7108 136 177 7 70 -41 176 -148 -57 2 -38 -193 -169 177 253 204 -266 152 -37 112 93 -79 13 -160 -201 131
7132 131 -17 110 -54 -69 -244 -237 137 -172 102 -13 -52 223 -38 82 48 173 302 -275 -91 -261 148 102
7154 102 -48 -59 178 143 21 91 -172 42 46 -60 -112 65 26 13 37 48 124 254 -165 -373 -148 -217 -109 -39
7178 -39 -323 -106 -130 -112 66 229 209 -106 -56 19 -150 99 -112 -50 -67 181 158 -35 -52 107 114 -20 43 -30 -145
7203 -145 -21 -30 -56 81 220 -62 101 -85 -164 181 -152 63 -118 -20 145 29 -48 -40 -128 130 132 -145 -87 -110
7227 -110 -108 -114 240 -66 51 -185 -223 174 75 95 -20 -157 176 72 -221 -45 -18 23 -67 -51 -233 -163 -155 -100 -65
7252 -65 200 -73 -121 7 4 -125 10 80 9 166 174 45 -194 -190 10 94 36 86 -67 -174 -283 -233 139 138 -23
7277 -23 38 26 -51 358 -192 -145 -53 -107 -76 61 -158 201 -99 -47 110 -303 84 48 -3 122 85 255 246 114 -19
7302 -19 -96 -86 -107 146 -118 232 -347 152 110 7 -193 -83 -48 73 -8 -92 -211 199 -111 -100 43 181 -43
7325 -43 -2 171 -180 257 74 2 11 165 -124 26 31 149 63 181 101 -184 -34 184 64 -41 -193 144 1
7348 1 41 53 109 -5 92 -2 120 -99 -72 -95 -181 -149 97 136 -115 -2 188 199 184 67 12 221 -72 -31 45 -228
7374 -228 -27 -45 77 102 119 134 -239 -318 -147 90 12 229 40 220 45 212 -134 149 -57 144 34 212
7396 212 30 152 -47 71 -180 -36 83 -90 -62 -137 238 -30 -117 -191 218 251 -46 -58 53 94 167 -51 4
7419 4 216 74 118 -73 126 -268 -34 92 -207 -64 12 -84 45 4 6 26 -25 -32 14 182 58 -137 104 -15
7443 -15 238 334 -57 148 -17 -173 120 -76 40 -39 -99 202 -167 -64 -85 9 -16 -255 106 -334 -99 -77 20
7466 20 -93 191 -18 -7 -180 -69 21 240 152 -86 20 -104 292 55 -108 -197 62 115 -5 -56 69 84 60
7489 60 -62 -350 269 -240 -236 -263 -120 202 -191 46 -276 225 157 -181 49 60 482 -145 126 20 54 -20 -25
7512 -25 -6 -48 -13 165 -32 -32 -316 155 -70 111 45 230 30 44 308 113 -53 -79 75 102 246 -13 -71 179
7536 179 49 -247 -22 12 299 -16 -5 -66 43 88 -95 -39 -228 169 -272 -226 -249 -91 295 166 -128 -56 58
7559 58 71 -155 67 37 -18 -134 -13 162 362 -81 208 -149 -42 118 65 132 -157 411 -132 -108 202 -166
7581 -166 -222 243 -277 -57 115 72 -160 -53 59 -136 114 -13 3 31 16 164 243 19 173 136 -148 -312
7603 -312 -31 -175 76 -129 -284 79 -125 41 -229 8 115 -70 371 31 50 -24 1 -3 176 246 50 -98
7625 -98 -11 -137 97 -67 -257 50 -54 -73 -320 -22 -97 -6 -20 -103 197 -94 160 -42 173 -69 -107 221 104
7648 104 -171 189 61 -143 15 43 110 247 2 286 -7 -2 -24 -147 314 -1 189 29 -266 -220 127 -131
7670 -131 -31 59 44 -39 -150 -55 103 -78 -140 102 -70 -62 70 172 239 198 61 -77 63 219 116 174 -91
7693 -91 -128 111 9 234 146 -187 85 -181 -52 -75 139 -38 73 -11 -158 38 -239 84 -105 78 -111 -38
7715 -38 200 34 -79 382 -274 -60 32 -4 -92 58 -191 -275 215 -215 -254 76 202 217 227 197 26 -94 -354
7738 -354 -41 20 -20 43 123 81 -37 104 -55 -192 -140 -53 45 104 -309 -247 -251 61 121 87 -101 -139 -174 -1 376
7763 376 169 135 224 -7 -170 106 -115 -209 -71 12 178 54 -108 -58 84 -35 -276 -30 -67 -42 200 129 -122
7786 -122 -194 -203 54 54 -24 228 80 40 -39 -179 -83 281 108 -92 -74 -61 -48 51 277 -312 72 72 112 -19 -337
7811 -337 184 71 -134 120 223 -145 69 145 2 -122 174 -148 48 68 91 -42 -20 287 144 115 169 97
7833 97 -87 -58 59 113 98 117 -115 8 187 36 -120 3 -206 28 173 62 42 37 106 -14 -63 -143 81 41
7857 41 -18 -185 39 109 201 53 -93 264 57 106 -144 37 30 178 -117 9 80 94 233 -48 29 93 -33 -162
7881 -162 74 112 84 -13 -201 13 -99 16 -98 103 52 -20 -89 166 -67 -11 123 81 -25 -256 -35 116 177
7904 177 -32 120 407 -68 58 -37 122 47 97 93 2 -192 -164 126 -82 69 56 0 42 -199 56 -255 -142
7927 -142 -187 87 123 80 -345 -152 99 -99 77 -84 -171 36 -102 -10 179 15 -55 207 -3 -95 -133 156 -339
7950 -339 -84 32 5 232 -7 41 -88 21 89 -106 80 -6 -337 -84 243 74 -19 16 34 174 -64 217
7972 217 -58 -85 -61 135 -191 -6 -221 -5 117 -31 240 -239 -9 156 94 115 118 -77 -40 9 184 153 -79
7995 -79 152 -61 150 -158 307 88 76 -41 -212 44 -72 -389 -61 258 -148 88 13 -60 -94 110 211 -137
8017 -137 140 -195 72 82 82 -33 105 187 88 85 -165 27 260 -95 -65 153 35 127 -173 162 43 -211 -74
8040 -74 -205 26 287 -44 117 79 -138 131 -35 -200 23 -35 128 271 188 47 77 -114 -2 -241 -90 -3
8062 -3 -57 -47 -34 -112 -71 139 -274 50 17 -68 98 -106 -28 -37 33 71 187 154 233 37 188 -142 79 171 -93 -59
8088 -59 -31 -183 137 51 3 -47 -10 -127 104 -25 -270 -37 75 108 184 -36 -54 79 -74 32 -46 -254 -145
8111 -145 -173 -32 126 157 18 -103 -167 101 37 -90 -1 -2 189 -121 -195 -140 -61 -127 -415 -187 -108 39 -269 -226
8135 -226 -27 131 159 -51 -20 -39 159 7 27 -157 -111 -170 63 -12 54 -36 89 -38 -74 93 -175 -169 149 -5
8159 -5 -49 -85 -95 28 -97 109 18 -130 8 -103 12 -126 28 122 37 7 15 -147 57 327 -49 -63 -125 224
8183 224 -252 -140 -13 113 -1 -94 -162 248
8191B48
$$ Imaginary data points
##PAGE= N=2
##DATA TABLE= (X++(I..I)), XYDATA
0 0 0 0 0 0 0 0 0 -8 8 -8 8 -16 24 -24 32 -40 49 -64 77 -89 112 -135 160 -184 216 -255 296 -343 393 -452
30 -452 517 -592 670 -758 856 -965 1084 -1213 1355 -1513 1685 -1872 2075 -2299 2543 -2810
46 -2810 3101 -3416 3766 -4150 4570 -5034 5549 -6122 6766 -7490 8312 -9257 10354 -11649
60 -11649 13200 -15097 17486 -20593 24816 -30915 40530 -57963 99539 -406529 -62056 626945
72 626945 -442124 -306816 389181 -8673 -448186 295789 353546 -397274 -165782 434686
82 434686 -36497 -242104 149883 68543 -188268 133393 241235 -178323 -164139 275933
92 275933 130486 -191376 -18231 184485 -76654 -144710 275038 140356 -367737 49667
102 49667 467736 -87346 -323999 222916 201534 -331181 -38547 319524 -298914 -343681
112 -343681 359053 75968 -410818 56063 230061 -199908 -32556 264337 -167995 -229095
122 -229095 292278 89585 -302428 52443 195575 -168608 -43619 262848 -81697 -251143
132 -251143 194724 172694 -208567 -90626 120309 7552 -90229 38261 92846 -86392
142 -86392 -38133 183281 56452 -125854 -4987 111990 -10455 -87376 36049 -17281 -126966
153 -126966 76490 99284 -155022 -42854 168727 -28383 -96767 143814 10857 -186307
163 -186307 118740 169083 -184169 -76394 200401 2976 -134071 114912 81462 -174702
173 -174702 29181 169272 -137491 -116957 111444 -18305 -92083 47928 17565 -85687
183 -85687 19395 102368 -44376 -75339 59878 18626 -64969 1770 19854 -57184 -35829
194 -35829 57544 21717 -64566 -9047 75506 17807 -57277 29493 60038 -68304 -1842 107451
206 107451 -44733 -66371 98355 49995 -66402 22994 83116 -50734 -39453 103849 -24045
217 -24045 -116285 72610 47327 -110662 7579 79384 -66804 -42368 90462 -9113 -93840
228 -93840 39847 47684 -77895 -27269 56001 -30708 -57928 52058 22072 -63881 19610 50225
240 50225 -30326 -14850 28948 7394 -25307 -3323 38357 -13962 -30950 46628 18282 -37964
252 -37964 18161 39751 -19494 -24282 35079 12816 -49105 10428 43543 -42755 -24050 60485
264 60485 -8036 -56279 42058 29670 -61024 5243 46172 -42812 -30321 46514 2957 -53704
276 -53704 17595 47519 -42176 -14837 59792 -22127 -37648 50114 10040 -44429 9144 31625
288 31625 -17593 -21788 27335 4825 -36425 15284 29120 -32873 -16278 32687 -2980 -26964
300 -26964 14213 13603 -21707 -2930 25920 -2040 -28608 13770 30732 -26955 -10448 36884
312 36884 -14990 -22684 32669 5333 -32528 4075 29797 -12701 -26589 28772 10124 -37206
324 -37206 21759 30901 -38889 -5835 40369 -14282 -29797 21244 7279 -33350 1731 24682
336 24682 -22691 -23484 28997 6730 -34840 11588 23607 -28649 -3548 27737 -12720 -15168 18996
349 18996 14770 -10466 -2052 27704 3519 -17587 22915 11656 -26259 4701 17602 -16144
361 -16144 -14780 13515 6721 -18698 622 23795 -11405 -17089 24997 1349 -32322 11360 16823
374 16823 -30708 -7925 23489 -10778 -18201 16225 9493 -23210 -1405 25663 -18117 -24155 26929
387 26929 421 -24939 19240 14935 -13707 10191 26206 2196 -10443 12600 15426 -16090
399 -16090 -8438 11583 -14436 -16800 13284 202 -20931 906 14154 -4013 -12523 3716 5021
412 5021 -16812 -2985 18655 -17030 -18861 28016 7904 -19456 12172 14801 -10807 237 17696
425 17696 -6931 -23996 14105 20076 -20813 1706 27370 -5016 5477 33015 107 -12562
437 -12562 16978 12855 -13511 -12232 -431 -8484 -13446 1857 -2478 -23336 -5608 12586 -8790
450 -8790 -17473 -6922 -4773 -5237 -9227 -3325 -2839 -15174 8880 23034 -12802 -7809 21367 3810
464 3810 -5635 9388 -1582 -13564 7602 22012 -4588 -8505 26538 19388 1132 26151 16603
477 16603 -13594 16618 26639 -15786 -13860 8642 -4166 -7264 1909 -6100 -14206 -3255 7801
490 7801 -8187 -20651 -8094 -7754 -7542 -2709 -18039 -11812 6113 -2060 1208 3523 -12319 1088
504 1088 12827 -7568 -10627 -1900 -7352 -716 10863 -628 -8835 13341 26420 4724 2886
517 2886 21672 3133 -2515 25194 1349 -23963 10889 14058 -10941 3166 4713 -9796 4416
530 4416 12035 -7833 -15223 1646 1697 -11545 847 551 -16282 6863 19116 -9345 -4466 10144
544 10144 -4404 -233 3622 -15804 -10336 2842 -6054 -4876 1418 -4525 -393 14129 9220 -8395
558 -8395 888 13586 -5574 -5527 7931 -13888 -11307 16163 -5528 -15327 10030 -488 -10006 9532
572 9532 928 -17151 -538 11937 -6348 -7843 12410 4164 -3859 19610 12512 -9669 12105
585 12105 15964 -8938 2679 6577 -13480 811 9921 -8696 -2674 9702 1641 20 8866
598 8866 2768 -7258 3160 5503 -13122 -5781 4091 -14822 -5998 7385 -15298 -9871 8958
611 8958 -10982 -13143 4710 -8532 -14520 3035 225 -10724 2282 11377 -2116 1761 17799
624 17799 2785 -4449 17180 4080 -11420 12039 6119 -13281 8085 10268 -7476 6099 11858
637 11858 -2014 2418 11128 1076 -5065 5822 2939 -9118 3166 4494 -12668 486 8696
650 8696 -12370 -4844 4610 -12504 -6427 3417 -12888 -9791 3573 -4134 -6036 4946 1734 -5391
664 -5391 6481 10946 -6716 -3846 12667 -3944 -7192 11120 -4286 -10508 13025 3749 -9397
677 -9397 6576 5272 -4646 5561 6245 -6724 -2530 9471 1907 -7015 4808 4043 -5894 7010
691 7010 6606 -10814 306 6914 -7085 -716 915 -10546 805 6856 -5899 -3535 4207 170
705 170 -484 5598 1387 -7914 2390 9260 -7285 -4745 7382 -6250 -2156 11351 -6950 -9289
719 -9289 9029 868 -6917 3070 -998 -6811 2997 6439 -4586 -5868 6925 4237 -3918 5138
733 5138 1591 -7192 6903 5933 -8250 584 2442 -3828 4413 1895 -7151 553 4467 -77 -1404
748 -1404 -199 -1356 -956 4420 2142 -7697 145 6804 -4732 160 4651 -8360 -804 9284 -5517
763 -5517 -6622 4412 -1357 -2784 3611 -277 -5311 853 7531 -914 -4618 5279 1928 -2873 7783
778 7783 1130 -7111 5442 4654 -4251 1483 -560 -3728 2072 945 -3767 -2912 -510 813 -1208
793 -1208 -1317 -908 -3493 1645 3047 -5600 -481 2807 -4330 2609 3589 -6681 816 5494 -2867 -964
809 -964 2638 -1878 -1068 3170 2367 -3148 145 7068 -28 -1669 6948 -207 -2936 7342 340 -5569
825 -5569 3415 492 -3805 775 -987 -3498 -1256 135 -896 -4112 -1252 658 -3707 -924 799
840 799 -4392 604 2858 -3013 2125 2589 -2166 4036 2882 -2675 2786 2376 -1257 1143 2013 247
856 247 151 2162 3381 -1564 654 5564 -2528 -1767 5141 -3299 -3255 4713 -2870 -4472 2726 -1010 -3768
873 -3768 -700 -1041 -2724 -3131 -972 -1925 -5908 -332 990 -5118 733 2230 -2952 3350 3193 -2135
889 -2135 3010 2882 231 3511 1185 -164 3115 2014 1687 1084 1123 2886 594 1225 2092 -3406 305
906 305 4248 -4059 -1230 3270 -3682 -707 3881 -3622 -2745 1564 -938 -2842 -2329 -1801 -3442 -2974
922 -2974 1170 -2899 -5830 2879 1295 -3501 3757 883 -3504 4712 2956 -2184 1814 1870 768 2683
938 2683 1323 315 563 1588 2362 -1517 -1097 990 -2406 885 1401 -5026 143 3499 -2520 1517
954 1517 2258 -3410 1802 3458 -2386 -1566 468 -744 -711 76 286 -3153 -603 4758 -1760 -3125 4625
971 4625 -726 -1921 5814 -1135 -3676 4552 1548 -1329 1590 148 -890 917 675 -1781 -4004
986 -4004 -217 94 -4641 -645 -935 -5696 1092 2136 -5277 337 1855 -2590 2399 1299 -3312 1606
1002 1606 2626 -177 784 1512 748 206 2419 3305 -2248 1049 5903 -1511 387 5101 -2228 523
1018 523 6438 -1032 -989 3951 -284 -942 2150 -940 -2978 -852 926 -3145 -4761 609 -2240 -5921
1034 -5921 1623 -1928 -6604 1495 -222 -5135 1409 -330 -3653 1982 1172 -1966 434 1783 632
1049 632 128 2146 2031 -1289 2394 3900 -2209 1592 4027 -2264 2246 4431 -3051 1772 4854 -1888
1065 -1888 681 3905 -1122 -840 2290 218 -2858 -416 1917 -3404 -2610 2895 -3640 -4167 3594 -2657
1081 -2657 -4989 3455 -1570 -4348 2598 -82 -3314 1185 1305 -1723 -722 1973 -54 -2042 1818
1096 1818 1698 -2853 1734 1728 -3987 2116 2019 -4002 1916 2421 -3476 2088 2887 -2155 864 2638 -369
1113 -369 -657 1747 895 -1892 1011 2863 -3332 -459 4238 -3611 -1581 4918 -3295 -2382 4982 -1548
1129 -1548 -3192 3078 298 -1919 1763 1851 -1567 -930 2786 -478 -2963 2181 -125 -4376 2493 -84
1145 -84 -5064 2161 1116 -3545 1493 742 -3057 1397 1266 -1490 167 1282 397 -688 1604 1166
1161 1166 -2259 2010 2977 -3607 866 3111 -4134 511 3830 -4005 -952 4196 -1640 -1130 2844
1176 2844 -305 -1545 1575 2036 -2430 -1147 3341 -1480 -2496 3346 -1688 -3520 3840 -502 -4226
1191 -4226 2399 -15 -2666 1755 381 -2259 666 1335 -87 -306 1096 731 -1080 1965 1672 -2792
1207 -2792 1334 2119 -3289 997 1649 -4144 1036 2226 -3500 129 2020 -1867 -254 1799 -327
1222 -327 -1507 1044 2053 -2279 -539 3149 -2188 -1364 4251 -2094 -2352 3940 -953 -2395 2573 -628
1238 -628 -1654 1709 883 -821 115 1710 612 -1223 2006 912 -1914 1977 1191 -2989 1801 868
1254 868 -3247 1385 87 -3377 771 99 -2508 269 635 -1021 -274 694 448 -1089 889 1933
1270 1933 -2268 519 3303 -2417 -61 3915 -2288 -652 3160 -1534 -1535 1558 -533 -1286 696 545
1286 545 -708 -494 1911 128 -1706 2329 544 -2054 2329 95 -3044 1536 49 -2800 869
1301 869 -497 -1713 694 -12 -684 -46 415 185 -781 145 1274 -1307 1481 2092 -1889 1121 2737
1318 2737 -1768 908 2458 -2208 -92 1949 -1780 -1187 574 -870 -748 50 790 -1249 -813 2330
1334 2330 -481 -1701 2222 -1079 -2310 2069 -844 -2649 1560 -13 -950 1038 -428 -941 572
1349 572 125 -504 -1159 35 1222 -918 1083 1255 -1220 2121 2657 -1447 1475 1705 -1649 1257 714
1366 714 -2490 61 617 -798 -320 -290 -297 -732 29 1308 -1650 -1408 1736 -1189 -1369 1991 -1296 -837
1384 -837 3044 213 -809 1949 -355 -327 399 -734 -1297 -1206 513 210 -1515 1034 1184 -850 2154
1401 2154 1309 -1787 1677 1286 -1414 1019 117 -1562 1036 515 -1142 -386 -154 -54 -550 -868 -397
1418 -397 -2105 -586 949 -2235 -720 2154 -843 761 2822 -726 230 2781 -692 -630 384 -1066
1434 -1066 -1005 -25 151 -731 -960 1448 983 -723 1868 303 -1474 2010 315 -1876 1719 350 -1175
1451 -1175 1541 -42 -1045 667 114 -633 -1398 -1346 -748 -1864 -515 380 -2270 429 2123 -979 1360
1468 1360 2469 -989 1426 2111 -1626 -434 552 -1078 -331 30 -233 -497 314 1570 -387 -863 1610
1485 1610 -542 -901 1973 -638 -1233 2380 406 -708 2374 223 -357 969 -363 -1395 -1115 -688
1501 -688 -781 -1579 -29 8 -1323 1097 1236 -1261 1654 1330 -1863 1137 658 -2404 413 545 -1652
1518 -1652 113 712 -56 -141 563 444 -1170 -247 1158 -1682 -848 1649 -1196 -458 2597 -590 192
1535 192 2537 -488 -443 1321 -791 -1247 -291 -395 -878 -605 429 299 -715 1556 408 -1282 1797
1552 1797 221 -1922 1596 -21 -2021 1388 437 -1052 1381 821 -333 623 548 -194 -736 -209 223
1569 223 -1724 99 991 -1880 441 1979 -1367 310 2063 -1517 -17 1359 -1196 -582 743 -354
1585 -354 -522 480 856 -97 114 1321 -322 -1216 1108 -961 -1408 1565 -984 -1649 1936 -386 -960
1602 -960 1887 99 -621 1060 222 -801 -502 319 2 -1062 633 437 -1720 1030 970 -1861 492
1619 492 1317 -1978 384 1043 -1751 268 1058 -541 315 858 259 47 422 661 -1074 -628 1122 -1705
1637 -1705 -1009 1636 -1531 -560 2136 -895 -586 1986 -347 -573 1359 -233 -874 -140 339 -444 -537
1654 -537 714 -126 -883 1059 -67 -1902 1259 375 -2069 1196 564 -1739 1404 953 -936 489
1670 489 897 -303 -203 202 -122 -972 30 696 -1437 -122 1321 -1538 -6 1560 -1634 -8 1807
1687 1807 -905 -260 1865 -617 -87 1023 -35 -612 -327 405 -674 -847 1073 -582 -1353 1353 -332
1704 -332 -1305 1573 -15 -1319 1519 55 -1022 842 302 -829 194 599 -97 -294 350 601 -1238
1721 -1238 188 709 -1712 776 1028 -1577 667 1379 -1381 730 913 -945 125 969 -533 -505 161
1738 161 -178 -1231 -360 729 -845 -513 1481 -784 -576 1669 -534 -1037 1698 -299 -958 1375 -97
1755 -97 -803 713 43 -91 -35 215 106 -658 591 -112 -948 824 741 -1527 1155 993 -932 1086 686
1774 686 -1327 29 288 -1152 -294 -43 -417 -197 181 576 -451 63 1496 -637 -59 1332 -1118
1791 -1118 -393 1419 -1000 -850 1240 -343 -253 1090 -215 -215 214 363 -243 -603 848 -20 -987 1243
1809 1243 321 -895 1531 304 -1224 1085 -225 -1579 572 -601 -1219 161 168 -298 323 483 674
1826 674 -108 614 710 -993 189 899 -1497 -154 1140 -1293 571 1552 -485 108 1151 -217 -37
1843 -37 -14 -644 -728 -479 420 -242 -477 1176 216 -360 1278 -351 -946 1016 -636 -1110 369 -808 -1014
1862 -1014 739 -82 -208 356 660 339 -392 399 153 -1106 197 51 -1398 604 654 -901 965 1313
1880 1313 -743 785 610 -474 191 -176 -589 -130 23 214 -184 147 1068 -332 -128 1303 -702 -905
1898 -905 909 -1123 -935 910 -564 -431 828 139 55 557 224 116 -511 -254 -425 -1343 131 -101
1916 -101 -1261 754 778 -826 1082 659 -707 688 162 -1040 16 -435 -664 -333 -4 114 -111 209
1934 209 543 -666 -161 704 -1330 -513 545 -1091 -341 1395 -270 529 1482 -106 471 846 60 93
1952 93 -399 -252 -467 -977 341 -90 -505 933 493 -250 1363 -117 -849 589 -333 -895 501 -5
1970 -5 -414 483 81 62 -60 187 -48 -968 -534 -74 -1815 -359 179 -1224 402 1208 -435 958 1291
1989 1291 74 368 748 -206 -130 58 -248 -80 -19 604 83 -706 791 -13 -479 1352 -277 -699 762
2008 762 -531 -515 807 -22 191 784 352 84 157 -75 -146 -1093 -470 -366 -1571 -67 -2 -1051 521
2027 521 779 -1037 833 584 -984 437 23 -886 156 -162 -226 178 -263 481 -403 25 714 -317
2045 -317 -438 1007 -676 -535 939 -789 -276 1453 -224 476 897 40 342 259 439 172 -406 190
2063 190 145 -771 360 -146 -604 766 245 -665 728 -140 -1036 421 -447 -1028 347 -32 -261 -68 122
2082 122 178 -545 -15 352 -849 -177 322 -1323 -251 628 -1115 -172 914 -678 360 786 -188 176
2100 176 660 -31 90 -85 435 454 -71 837 -11 -695 711 -352 -1069 1057 -539 -868 576 -438
2118 -438 -712 451 104 -161 473 155 75 -137 330 112 -774 80 192 -1134 -7 249 -1412 295 65
2137 65 -1166 399 173 -600 370 352 -201 452 272 526 402 11 737 -332 -326 627 -639 -1082 446 -742
2157 -742 -744 389 -617 -560 384 -414 -77 483 328 227 347 409 382 -179 381 210 -520 443 -216 -953 205
2178 205 26 -975 758 38 -376 490 559 105 710 659 358 257 -3 543 -647 -190 328 -943 37
2197 37 213 -1112 -653 447 -1275 -204 594 -590 -92 758 -127 179 410 319 451 47 612 165 -522
2216 -522 274 -200 -757 495 -345 -1113 752 17 -245 757 43 -98 831 250 82 443 4 -147 -178
2235 -178 355 260 -789 317 563 -1160 90 276 -998 -100 72 -906 212 398 -120 376 466 558 188
2254 188 119 271 -85 -208 515 -322 -209 803 -534 -53 1195 -240 -310 609 -547 -132 599 -482 -140
2273 -140 2 94 218 62 -109 268 -475 402 -217 -924 174 -450 -1257 326 -41 -797 496 158 -47
2292 -47 696 245 -225 307 70 297 -144 135 708 -227 258 874 -234 -6 1127 -634 -172 532 -721
2311 -721 -461 329 -711 -459 329 -135 -106 18 -63 3 -99 113 -273 -624 25 -565 -714 644 -245 -609
2331 -609 821 79 -160 630 -49 -257 205 44 -81 -212 377 293 36 570 547 -172 527 576 -448 379
2351 379 429 -986 -56 296 -581 49 171 -146 326 -35 -39 -104 -130 317 -444 -654 335 -112 -357 391 -89
2372 -89 -45 587 -91 91 873 -512 -181 134 -166 -233 -34 142 173 212 190 465 -364 509 420 -774 290
2393 290 284 -1166 276 -53 -1033 86 73 -261 62 -68 -81 -218 -317 137 -212 -240 686 -305 -216 878 -179
2414 -179 -224 672 -236 -46 681 -534 -226 204 -415 163 19 296 300 152 372 197 -180 186 167 -612 481
2435 481 80 -305 567 192 -338 601 -55 -315 222 -341 -355 -446 -488 -1 -301 -300 279 -383 11 680 -498
2456 -498 -167 473 -428 -287 294 -747 -69 10 -589 74 14 20 340 -180 99 28 -512 396 -157 -386 684
2477 684 45 -172 822 267 -72 865 -28 58 380 4 -151 162 -266 -89 -183 114 215 -292 107 325 -714
2498 -714 170 156 -707 119 294 -660 -16 95 -389 15 291 -226 -114 -105 -491 -381 -383 139 -378 -452 326 -243
2520 -243 -62 824 -218 139 677 -383 -162 609 -28 221 81 5 255 225 303 -41 -55 182 180 -299 140
2541 140 282 -404 310 125 -624 432 167 -218 198 121 -355 114 -381 -273 -93 -351 198 -377 -56 177
2561 177 -253 187 533 -491 131 325 -335 158 207 -452 -142 201 -287 -160 196 49 -9 -192 142 98 -345
2582 -345 296 -86 -154 399 75 -340 622 133 -214 508 -129 -373 394 -249 -189 80 -3 -146 -159 78 488
2603 488 -277 262 449 -35 149 468 -316 245 272 -87 58 153 -243 38 -74 -148 165 -162 96 -27 -367
2624 -367 201 -362 -433 606 -174 -136 384 -315 -366 284 -528 -131 122 -148 -51 96 47 -39 -153 377 347 -174
2646 -174 369 558 -599 372 373 -447 486 208 -126 -27 259 -439 320 166 -354 -77 -150 8 -147 -431 180
2667 180 -61 -9 55 -313 -198 160 -488 -63 563 -337 28 501 -216 209 -70 -5 124 -1 227 407 117
2688 117 455 -66 -272 121 163 -357 194 -266 -897 190 -249 -546 60 -58 -342 40 -142 61 -197 -46
2708 -46 16 -274 119 305 -315 -47 319 -507 -225 178 -451 -64 431 -220 -52 304 23 382 364 285 338 271
2730 271 700 154 -332 492 122 -285 89 -216 -418 233 -276 -356 9 -267 -429 -103 -185 -345 -217 -201 114
2751 114 -183 17 308 -408 424 281 -366 5 -140 -299 85 188 -460 59 270 -334 376 236 210 336
2771 336 240 654 64 25 290 -102 -1 536 -447 -432 251 -649 -125 118 -419 -79 4 -256 -227 -29 -83 97
2793 97 -226 198 8 -151 222 205 -205 -149 289 -286 319 71 -394 318 155 -237 129 15 131 287 181
2814 181 50 193 -11 104 -171 -204 33 -233 -156 305 -447 69 179 -262 -93 106 -168 -225 -17 -158 47
2835 47 -132 129 91 -101 398 2 -304 283 -410 -246 268 24 -217 369 -30 -105 225 -140 72 249 -17
2856 -17 97 -266 -181 354 -147 406 75 -367 121 227 -317 198 52 -334 142 27 -620 37 214 -341 18
2877 18 -190 68 -63 -17 152 -182 -121 257 -157 -400 321 -393 -187 199 -144 -154 402 -202 85 17 74 367
2899 367 -79 -58 144 -159 174 187 -298 46 414 -182 212 329 -251 113 57 -24 222 147 -99 -208 -201 -5
2921 -5 138 -294 -92 -38 -110 224 -145 -104 327 -309 -52 229 -344 -79 -62 -211 -207 -10 -281 -284 83 109 173 -156
2945 -156 41 -30 -198 313 33 -218 533 -4 -84 496 62 -55 254 115 -351 224 -69 117 -35 176 -60
2966 -60 -93 -318 168 -65 -18 255 -97 0 356 -250 -12 202 -232 -174 236 -246 202 -17 -491 -73 -252 77
2988 77 18 -207 399 -255 -182 -142 -74 -118 165 -106 17 221 -184 -10 84 -275 -58 276 -302 -177 -266 78 -199
3011 -199 -201 7 233 -249 148 310 -412 220 18 -226 334 -133 41 271 -68 260 253 -90 307 212 -219 310
3033 310 -147 -60 -4 -263 -193 572 -340 -81 167 -246 -204 197 -318 -184 -351 -357 -77 -161 -289 -56 -255 94
3055 94 194 -178 307 -224 -71 386 178 -270 460 -117 -181 228 91 -151 150 40 70 -18 -110 34 -106 -319
3077 -319 216 -320 60 52 -179 128 133 -353 -15 150 -301 -106 -123 -256 -17 -64 -143 115 279 -35 -22 -552 400
3100 400 -84 -352 210 110 -131 327 111 -226 213 14 181 142 -221 -21 67 -209 162 -148 -105 8 -152
3121 -152 307 49 -479 -33 96 -178 137 -111 -321 232 77 -158 54 -93 164 118 -86 76 108 -223 381
3142 381 -40 -45 301 -87 116 100 -37 8 435 -348 205 277 -66 79 0 116 143 178 93 10 -22 66 -14 -427
3166 -427 -95 37 -185 -231 -68 -208 402 -154 -144 -77 -122 -28 -44 -236 89 145 -261 30 -187 217 -145 -338
3188 -338 -206 106 -187 -55 192 -89 -91 331 182 214 106 72 418 249 -142 91 -417 184 -107 -195 99 -18
3210 -18 16 281 -49 -521 142 24 -225 161 119 239 77 143 89 87 149 43 -198 -11 -50 -117 126 574 -186
3233 -186 22 4 -186 -237 145 -258 56 10 38 133 57 81 -33 96 10 143 -352 137 -31 -555 162 -69 -70
3256 -70 166 -171 -267 183 -39 73 -106 -135 189 -89 -54 284 63 67 93 -292 331 -195 -255 188 125 -288 268
3279 268 123 -658 66 -252 -95 271 -149 -170 217 -26 246 -159 0 116 -260 -196 226 -41 -120 179 -142
3300 -142 -94 320 -150 160 78 -83 137 -191 74 160 187 -240 -115 199 165 199 -183 192 128 -23 323 -200
3322 -200 -148 -47 -23 50 -2 160 179 160 -324 131 -115 -135 160 58 -166 237 -210 -12 7 -315 96 5 -255
3345 -255 -133 40 -237 24 -202 81 166 122 -12 44 -58 76 -41 -186 82 -69 -300 190 -363 -317 76
3366 76 -135 131 136 -237 101 -63 -10 239 -129 -107 266 -134 -180 15 -100 265 56 -344 23 112 -324 222
3388 222 -190 -116 -118 -89 -145 -90 -93 3 121 26 182 67 -203 240 25 -83 30 -133 92 -63 -96 -122 143 -108
3412 -108 18 -71 -129 55 -268 -43 156 -166 -124 163 -382 303 107 -346 177 -70 -361 142 -188 -58 28
3433 28 -148 -4 -301 -47 75 15 -107 -56 -272 88 265 -182 -142 339 -39 197 100 -69 76 152 -72 -81 88
3456 88 -54 133 226 -34 -299 -151 156 -146 -420 29 -261 -50 -152 69 -184 308 9 -266 130 -43 17
3477 17 -98 -209 109 -364 120 46 -180 -8 -24 11 130 490 240 77 272 51 181 118 -251 6 -49 -106
3499 -106 88 -219 -178 -367 -81 108 78 -261 152 16 -153 66 -151 -170 277 176 -84 215 -25 -160 147
3520 147 -367 74 83 27 -85 -319 -172 -18 -159 -39 214 -29 198 401 -25 224 97 -97 86 372 -47
3541 -47 -36 -120 -34 174 -77 67 -29 -135 190 -125 -194 86 -177 -188 375 -101 66 298 68 -59 -68 -472 125
3564 125 -181 -250 84 -339 -73 54 -238 123 116 -261 411 193 -176 76 130 343 140 40 -124 114 56 -43
3586 -43 211 -172 47 -229 -34 322 -246 -104 -65 117 -138 198 -195 78 139 -315 66 247 -352 38 -12
3607 -12 -135 -170 -77 218 -7 -262 30 344 -19 245 -170 -104 198 227 30 162 153 -1 -31 1 49 333 38
3630 38 -147 68 -238 80 -172 350 220 -211 236 193 -74 64 395 6 -305 -155 -112 15 -229 -194 114
3651 114 -48 102 134 -396 110 -62 -170 361 -22 69 258 -77 -150 148 -3 -212 155 -119 -148 -45 76
3672 76 165 -394 -196 326 -282 31 166 -38 81 254 -45 -244 319 -92 114 219 -307 245 8 203 263
3693 263 32 180 4 -93 53 24 -189 160 -68 -305 173 -116 -50 8 -132 -125 -226 -61 259 -118 -67 -286
3715 -286 112 -89 34 247 -158 129 -335 36 107 -157 60 33 -45 199 110 -47 48 -392 -65 -144 -305 37
3737 37 -65 -31 -86 173 -19 170 -283 -140 279 -52 37 36 -237 -4 162 -151 -85 -43 -136 -167 -158 -87 -83 20 -25
3762 -25 -86 -225 -32 57 15 171 -140 -127 133 -16 -225 131 305 -79 22 -101 -41 -94 -192 191 -145 -56 243
3785 243 -318 154 -66 177 305 36 -71 -153 156 -587 365 -323 -47 57 -249 -159 -61 45 -38 63 -235
3806 -235 214 -195 49 -133 -389 -46 91 -133 -224 134 -94 13 -310 -78 -25 24 27 346 9 71 -107 5
3828 5 240 189 147 62 -84 -201 94 -125 -252 256 13 57 47 15 -253 205 -36 181 24 -56 166 -55 -375
3851 -375 -93 -7 37 75 -220 -28 120 -1 -1 -38 -494 122 -74 103 7 40 228 77 -231 28 204 -41 15
3874 15 20 -193 263 -102 -40 22 -35 -46 -6 -271 -120 44 -403 228 72 28 193 56 202 176 -216 8 246
3897 246 -132 -229 288 20 208 24 -218 -204 -48 -144 -60 -34 -177 94 98 157 48 -4 202 19 -79 275 133
3920 133 -235 95 -95 188 103 -42 -280 -56 186 -430 4 -320 110 125 -96 141 -368 176 125 -122 152
3941 152 -73 -229 0 85 -325 -31 -188 -145 2 112 -161 320 115 226 -231 -15 244 -227 -13 119 -121
3962 -121 -348 60 148 -35 133 27 134 69 -256 -36 120 0 -21 268 -44 88 -157 102 114 -171 339
3983 339 200 -168 186 -366 -34 27 146 -63 183 -109 14 281 -122 71 -90 103 -51 -155 -89 -199 -321
4004 -321 -286 -26 -195 -206 224 -207 -135 -28 -59 -176 -55 -131 23 -232 77 -175 -81 -66 155 -80 -154 22 -196
4027 -196 6 -51 -14 215 274 -40 107 -5 144 132 -168 168 15 92 -1 -126 -131 227 -272 -139 3 -454 203
4050 203 53 -193 157 -152 -168 -252 -83 -85 -268 -434 -163 -126 -79 -78 -156 117 16 21 -241 78 -164 -1 -106 -77
4074 -77 -135 -14 -117 -84 -35 155 12 62 -103 58 -24 115 31 -177 106 11 -313 -78 116 -282 73 -15 -74
4097 -74 231 -1 62 385 17 -98 -169 -149 121 178 160 -90 -116 -66 29 -26 0 393 -327 111 84 157 55 -156
4121 -156 -235 308 13 49 104 93 28 5 59 203 243 83 166 28 -108 285 19 111 357 -13 -169 22 29 -26
4145 -26 -5 43 -116 132 -471 -19 -31 -151 195 -131 21 24 164 -96 168 -174 4 73 -245 266 103 -136
4167 -136 -133 -171 -258 70 -119 133 -35 -69 211 47 124 46 26 -136 10 125 41 153 96 62 233 122 -33 -197
4191 -197 -216 160 -3 -277 100 -204 59 11 -207 -38 -239 -107 -274 -22 -162 -112 -243 24 -143 212 -5
4212 -5 -10 95 -195 156 -341 67 199 82 516 51 -128 -123 -90 -19 -89 -136 -127 496 120 -352 302 127 -39 -22
4236 -22 -63 -22 -186 -193 -51 -32 -44 154 40 327 -113 -34 106 -155 22 136 0 -411 -311 20 27 -271 -208 -41
4260 -41 -19 -159 51 -99 -118 -177 254 85 126 -312 -54 -116 -47 -44 83 -165 -222 -38 -6 -48 -144 239 -23 46 -33
4285 -33 70 -193 64 78 13 -187 131 -69 -64 -18 -7 88 8 198 88 -153 231 206 -49 1 -110 -41 96 -98
4309 -98 62 85 -291 -5 184 -278 59 -55 -159 206 -114 350 173 -39 -109 -117 -246 211 -319 145 67 -62
4331 -62 -177 7 -62 -7 159 -130 -55 279 200 -202 28 -39 333 -73 -17 60 -122 59 28 -64 22 -182 -153 -20
4355 -20 -44 20 -116 -76 121 24 -18 -107 8 -27 200 24 29 206 39 4 -100 37 -99 117 42 -120 178 -327
4379 -327 13 -45 40 -135 -180 -93 -114 -48 15 95 9 7 192 -217 242 111 102 74 -217 189 61 -248 -319 -37 -60
4404 -60 70 -111 32 41 257 -148 66 -36 -187 128 -263 -197 240 -268 57 131 -465 5 -61 150 62 -187
4426 -187 283 -51 -279 78 28 -12 -12 190 -118 81 30 16 100 -13 -19 -13 11 103 150 66 -163 18 22 -173 31 60
4452 60 252 37 -124 -171 50 -13 71 -100 -24 -249 -135 -231 -323 69 37 -137 -276 -295 245 91 120 -32 237
4475 237 135 176 176 -37 -103 170 89 -32 150 56 119 -46 -119 -192 200 198 92 -280 299 119 -47 425 63 -145
4499 -145 20 326 -143 53 -46 -112 -102 -57 -159 214 225 -128 268 -48 232 278 71 73 364 213 14 -41 120
4522 120 248 -117 -135 -168 -468 -216 -263 -7 2 48 144 85 -20 132 220 -29 46 -40 139 -98 74 -196 18 -8
4546 -8 -293 148 60 -141 -111 -99 -62 -86 399 285 -67 -204 34 7 202 83 217 -303 -4 305 -9 231 -82
4569 -82 29 -80 259 -149 -19 132 -31 51 -197 142 -180 321 25 -148 12 28 127 82 5 392 88 237
4591 237 -18 188 43 -257 -101 -111 243 -70 54 -9 -197 200 174 140 -71 -114 -210 256 315 -68 115 136 -329
4614 -329 -158 72 -199 -116 140 -84 -16 -62 238 131 -159 -354 -15 54 -149 -109 -239 184 154 -23 179 -51
4636 -51 176 34 103 -228 29 98 208 -199 -168 36 -149 223 139 -90 160 -117 -127 -171 22 -44 188 217 -295
4659 -295 285 -132 2 -8 -222 -94 -184 -41 9 21 275 81 -92 -75 -132 -4 218 193 -65 -100 167 86 23
4682 23 120 67 -68 -100 26 -291 3 -104 -262 -183 -106 -40 15 25 172 -42 132 -101 -292 139 -153 94 124
4705 124 95 82 -63 1 18 -260 -58 -254 147 -271 -217 -90 74 -51 -292 60 -36 36 -105 233 -88 -268
4727 -268 -244 -62 -237 -65 245 217 -29 -74 -209 -17 -184 -198 -171 53 -147 -79 -88 -252 -78 19 -20 -43 -130 52
4751 52 78 -239 93 253 0 66 -57 -99 77 -156 230 -45 -72 -168 24 -35 -118 289 -35 123 34 76 67 -58
4775 -58 29 20 -17 -38 152 50 -137 -207 16 -194 -15 -342 192 66 108 156 209 -135 224 -207 -283 21 -65 61
4799 61 26 127 101 51 -308 160 -55 81 -81 75 83 -19 47 -207 40 -42 41 -279 114 76 -37 -53 92 -96
4823 -96 130 30 209 158 209 53 -20 -161 -81 29 58 -99 36 -342 -133 -143 -74 163 -97 -4 168 258 274 -159
4847 -159 -43 -84 79 62 -191 -67 -100 -31 11 139 -145 220 38 170 5 250 -289 -108 -30 1 -113 -118 98
4870 98 275 184 186 104 -196 39 57 104 -75 -141 94 115 -92 73 80 261 -2 -258 -274 -121 5 -36 392 -21
4894 -21 35 13 39 -221 35 152 -180 100 272 -34 51 -87 -133 53 141 99 -62 194 -74 185 9 -30 70
4917 70 -103 -5 76 -131 -28 -116 213 42 -11 -218 -127 -12 242 -48 68 -189 -238 -97 -285 -59 2 51 -49
4940 -49 69 187 -183 135 25 -232 -117 -96 24 -142 -4 75 -22 250 -38 41 -65 83 347 -142 -124 53
4962 53 -64 -156 76 -53 155 -49 -33 -233 131 69 108 -43 82 -37 -38 -171 65 -225 -175 151 59 16 -307
4985 -307 27 105 -91 88 0 -143 -266 60 30 -20 239 -117 -68 -105 -62 -77 -274 43 -80 204 -182 -90 144
5008 144 -60 72 -154 7 172 -83 -205 59 -92 -214 -178 -127 -67 -19 64 -59 -218 66 181 52 303 -102
5030 -102 -212 37 -96 -225 -251 -138 -193 -190 -153 -52 -35 83 175 -160 292 -300 99 258 -141 2 55 125 -12
5053 -12 133 -73 186 -117 -380 -23 65 167 -174 -107 8 8 -175 -199 37 -56 -135 79 177 32 138 -250 -95
5076 -95 48 -26 122 -34 -100 -27 -93 49 14 -44 -22 177 168 48 -64 -202 -83 36 156 17 10 6 134 53 -320
5101 -320 -115 106 205 187 -193 -86 -24 140 161 -98 -154 -45 156 106 52 -100 72 -88 -99 129 43 33 -30 108
5125 108 -197 -122 1 -242 -41 -34 246 65 -24 96 -126 -55 -13 16 158 -12 -178 -89 -168 -17 -69 -49 139 -19
5149 -19 -142 -186 327 113 -128 -49 -173 124 44 48 119 -34 104 99 -50 47 157 -556 186 -153 -211 135 -8 -275
5173 -275 -66 31 14 -92 126 199 -163 41 -118 -305 -169 -26 40 234 -51 -97 46 244 -3 -70 234 -231
5195 -231 144 269 -11 -27 22 74 223 -12 38 -158 183 15 206 201 23 131 -144 50 211 282 -32 -25 -195
5218 -195 -104 26 -146 69 -321 -74 -17 272 -59 -151 135 104 -18 -135 122 163 -6 150 -4 272 -137 -64
5240 -64 54 -75 49 7 357 -126 -182 13 -70 -46 58 74 -36 61 6 28 62 -3 -10 -166 18 228 196 250 -12
5265 -12 55 -139 136 -155 414 -170 -51 -330 -225 -38 -216 -262 -163 102 -185 -36 47 -175 233 -109 57 216
5287 216 102 -132 -184 277 -53 203 -94 -213 -230 -9 240 171 106 -165 9 102 30 86 151 -3 -94 -55 107
5310 107 -361 -6 264 57 184 35 15 -219 165 -130 32 93 144 -4 -199 -18 -122 -147 27 62 64 138 159
5333 159 105 -176 164 -183 210 -18 -262 64 6 19 232 -5 -265 287 -214 88 205 72 -130 -25 -27 11
5355 11 -29 -84 128 -143 160 122 162 -254 36 -255 4 -149 43 -173 206 -42 80 -63 61 55 -28 -186 142
5378 142 -83 -182 -8 -76 -69 44 -39 2 -28 -293 259 88 -20 183 -171 -87 -11 74 -114 55 -1 -88 34 -38
5402 -38 -220 13 48 27 -208 -99 -42 -30 127 -53 258 41 231 -400 328 175 -253 109 258 208 70 93
5424 93 87 -157 -5 53 -207 35 47 289 127 -90 104 -26 -17 -24 31 -133 -35 -127 -48 159 -72 -84 8 140 56
5449 56 80 -47 76 -157 -188 -206 191 46 -43 -143 -84 68 -213 -46 144 -67 -174 102 57 116 -97 203 -94
5472 -94 73 35 136 35 205 -45 49 -282 76 -184 -141 88 72 16 -78 20 232 -93 120 151 36 53 -28 -41
5496 -41 -145 248 113 -42 -26 -97 -36 49 -99 1 -169 -209 60 17 27 -86 -33 237 192 -9 -146 -76 82 -15
5520 -15 5 7 -21 192 85 61 107 92 -211 30 353 -106 118 -90 19 -41 135 -51 136 -90 114 0 135
5543 135 130 -122 -59 -199 69 -50 134 -154 -175 82 193 -210 68 -255 -98 20 -19 -285 -25 6 88 -103
5565 -103 -84 91 -171 238 15 97 101 -17 12 -247 54 92 39 120 -117 -294 -16 136 -260 113 50 90 -232
5588 -232 -56 -60 -8 204 -83 137 94 6 -80 30 9 143 -194 29 305 -95 185 -327 -305 -14 83 132 100 256
5612 256 21 -35 -14 -50 25 105 -155 -141 123 366 124 218 -115 137 -9 -172 -13 -101 -281 -44 -169 -50 201
5635 201 71 -96 -69 -41 36 24 -40 14 -79 57 -91 173 -70 -139 -300 -162 -47 113 -317 11 -140 -95 -145
5658 -145 -264 43 -159 7 7 178 -187 -76 47 66 167 64 -128 6 -66 -27 34 -245 8 102 -96 -121 425
5681 425 -89 -74 -31 52 109 135 -60 -46 -217 -208 87 -60 -119 -145 228 97 -152 -171 271 3 -61 -92 -20 46 133
5706 133 -109 275 130 -30 19 253 -206 74 166 -16 49 -31 64 302 -233 -199 203 -23 92 -159 47 44 -63
5729 -63 -212 -76 14 58 101 -97 280 26 -182 -51 -126 -269 199 -32 -119 -19 136 151 130 -45 -17 45 -81
5752 -81 -103 -120 -224 -106 34 195 19 108 163 -29 122 27 226 129 21 43 20 -127 26 -259 281 -139 -122
5775 -122 -247 -23 -273 14 -32 -64 -1 -348 68 -50 -7 205 -97 74 -71 -285 422 179 171 11 -69 16 11
5798 11 -70 -77 -164 0 -198 77 145 -61 -3 -90 4 -29 96 -79 -147 -136 112 -104 56 -29 -106 96 -218 -120 -322
5823 -322 144 226 94 144 -201 75 62 127 -121 -168 -148 12 -31 -10 172 206 153 -75 67 25 -260 117 108 163 -81
5848 -81 -106 -60 71 -141 -354 -111 96 21 177 91 257 -245 88 -104 -60 -54 -307 93 87 14 112 32 39 -136 -101
5873 -101 159 143 118 106 171 75 161 145 275 -13 -101 277 -121 13 74 -92 91 -172 344 161 193 -285 25
5896 25 225 134 34 133 47 -141 80 155 137 117 -37 160 -151 -49 -63 86 -208 150 -64 -60 118 176 99 117
5920 117 283 -13 0 116 -69 -24 -122 151 -40 81 61 244 -67 326 -144 -145 -1 115 -134 -159 -306 -49
5942 -49 -90 -10 -105 146 -20 -49 3 -27 -4 -131 -117 -37 -1 -93 -15 -199 -4 -245 -118 104 93 288 -139 179 38
5967 38 -80 93 -132 14 -36 -256 175 -65 126 -233 316 -104 33 -94 -107 -235 -174 -56 33 48 22 -200
5989 -200 -112 187 -109 255 3 -44 -187 -146 40 -21 24 49 -236 62 -120 -9 117 -123 -4 -278 115 -37
6011 -37 -234 -23 -29 334 -79 222 -181 -108 81 67 88 90 202 -15 6 -97 -253 64 70 -147 -20 -31 141 -35
6035 -35 -83 93 12 298 -7 -198 178 -79 -24 -181 -15 64 328 116 180 -1 132 56 -178 178 40 99 167
6058 167 258 -10 84 -85 159 -170 90 99 0 -84 151 -200 88 -51 -38 -193 -193 -95 30 -210 -47 -177 7
6081 7 -159 -54 -27 58 -132 251 -184 -31 49 254 90 -70 131 7 131 295 -98 -59 -2 -196 -287 166 -19
6104 -19 -47 27 -145 -48 67 140 83 -460 45 -184 -67 -66 -94 -265 224 25 139 -227 139 -78 114 32 -110
6127 -110 166 -193 438 -53 -62 -221 140 145 20 237 101 220 157 6 329 166 35 83 -224 261 307 -63
6149 -63 -67 -88 -59 24 293 -186 -83 117 11 118 -4 -117 -24 69 10 45 132 131 -420 -20 -388 -40 -304 -107
6173 -107 140 227 -19 163 -158 -49 23 41 233 -165 136 95 382 48 -217 64 -8 -399 78 -38 120 49
6195 49 180 29 202 125 -224 24 78 49 -110 210 -74 97 4 30 -334 135 -104 -310 -132 48 -236 255
6217 255 -281 163 77 99 -127 205 152 -69 269 -125 78 82 -162 -239 -211 225 -11 22 -3 -122 -81 -124 109 68
6241 68 -18 -168 3 -28 -155 -279 -87 -4 104 -158 241 1 -148 -154 -101 2 -11 -102 -103 211 164 -106 156 -104
6265 -104 69 3 -195 39 116 81 129 234 -80 -66 109 67 153 -147 -43 -245 -162 111 -138 -249 93 -195 221
6288 221 2 -51 32 -12 -189 -49 144 -36 -67 23 -48 -180 121 -264 -268 31 -42 103 -12 89 187 166 183 -106
6312 -106 38 106 65 -57 246 60 -209 153 -154 216 29 343 156 -77 7 -251 153 246 114 -204 -55
6333 -55 100 -185 -59 72 -57 -192 77 -21 -143 7 21 121 16 -172 310 213 102 -81 65 50 42 53 -4
6356 -4 -158 63 -128 -76 88 -13 -444 164 -23 119 238 -85 188 -64 11 -127 -106 -137 -87 0 -10 -263 -127
6379 -127 -110 -122 -81 42 -112 -31 -81 103 -254 -51 42 -175 -78 42 -42 31 38 -16 286 207 -8 106 -254 -169 -79
6404 -79 -121 -45 -88 -97 -102 -43 -261 -121 90 88 -153 236 120 8 -224 -28 41 293 6 30 -139 106 -166 -190 23
6429 23 52 67 -66 16 -196 158 -6 -9 -65 -23 -115 102 232 157 117 171 -324 74 70 78 82 -22 -92 33 -63 60 -89
6456 -89 -58 -143 -61 201 42 -7 30 -362 91 67 95 -18 109 -120 25 60 -81 -129 -321 58 77 34 213 13
6480 13 101 0 173 51 17 31 -160 -176 -71 -125 139 -155 233 -38 124 -41 -60 227 214 -26 -310 -6 168
6503 168 180 -347 -166 180 -204 -40 -19 -29 -63 1 -146 -63 -130 -121 322 -230 299 -106 23 45 20 -76 102 19
6527 19 191 -101 -131 -138 116 -18 100 85 71 -50 284 -392 -40 95 24 -96 131 311 -192 18 -287 24
6549 24 -157 -299 -40 11 249 165 -165 -37 29 63 136 63 -37 -102 62 128 118 -220 86 279 164 55 121 98
6573 98 343 -365 1 -115 34 -87 155 -73 -400 -130 -53 -67 -240 255 91 -105 -41 23 77 185 -194 -308
6595 -308 -181 86 -129 181 188 -222 70 105 -65 146 107 -86 305 -92 -169 -69 -15 -74 -175 -50 -11 20 156
6618 156 130 -13 54 31 276 34 149 -70 98 -146 -56 -176 83 -256 171 -131 -243 -27 147 379 -187
6639 -187 7 -44 221 -232 -30 -129 217 -112 20 108 -44 146 40 -32 -123 52 -115 3 -66 4 108 215
6661 215 -77 288 27 -263 -50 0 235 180 -41 -32 273 -19 69 -35 -105 -18 136 328 172 59 169 -110
6683 -110 -115 132 144 -156 -120 65 31 -42 140 76 -91 6 189 -151 110 -179 218 -74 -14 27 -234 -78 26
6706 26 -98 -87 185 174 191 -73 -12 -75 145 105 -29 81 -198 -136 -4 67 -110 363 93 -58 132 126 -167 -229
6730 -229 -132 -105 97 10 255 97 161 109 43 -8 -63 -45 10 -49 -173 -210 161 -194 277 54 240 44 2 2 -38
6755 -38 -71 -196 -15 -151 100 105 -17 121 -268 -23 83 -214 134 66 254 152 -13 -6 174 -158 -54 128
6777 128 175 213 -173 83 11 254 95 -82 95 -66 -80 -132 98 -274 -166 37 21 164 487 -257 168 165 -112
6800 -112 -68 -49 -24 18 144 35 74 40 73 -78 44 23 -183 -40 -255 -100 -120 -2 58 -164 209 13 95 -227
6824 -227 71 -48 83 13 -94 -77 276 84 44 -152 -379 38 -270 172 128 68 190 95 -14 116 52 -15 -47
6847 -47 51 -183 -164 -3 -37 -20 -175 337 -317 55 -118 -27 -37 5 -83 -71 -16 -273 -59 26 102 -22 -90 19 46
6872 46 46 146 63 70 57 -21 -37 23 -73 -57 248 -27 0 31 -158 36 -83 118 150 231 -144 88 7 -395 -139 -144
6898 -144 -27 -183 112 -347 102 185 -376 -140 -141 173 -88 48 -118 -55 30 -179 -148 122 -5 106 -37 -190
6920 -190 -96 41 119 -24 -195 233 295 21 -66 208 -274 114 -213 129 -56 -274 -25 103 121 -247 -42 78
6942 78 -166 64 -73 57 206 -27 109 221 53 -214 56 53 18 108 -160 106 355 -235 53 228 -250 -63
6964 -63 56 -211 469 249 35 -396 -45 -25 -97 136 54 -84 -122 132 -14 -32 9 -217 153 -146 -149 -222 -56
6987 -56 178 -19 -154 -251 22 -76 67 -82 -3 35 -147 41 98 13 173 -252 141 102 13 -66 -39 315 31 -63
7011 -63 91 81 -12 -192 -25 43 -205 -342 42 101 -305 29 -15 114 -203 121 273 189 125 -75 -90 -20 7 -5
7035 -5 -181 -124 237 76 215 -9 -56 42 -246 44 -148 -96 -205 -114 -16 149 52 -155 -2 -121 -270 35 -105
7058 -105 98 31 10 -106 -98 -68 -31 -7 20 178 -33 -70 -140 -66 116 219 126 -165 228 -115 146 -29 -115 8
7082 8 -108 -144 151 55 -75 -71 -54 98 -27 -130 -288 -53 -91 164 48 -143 68 -196 -85 -227 38 211 65
7105 65 -92 -55 -193 -163 49 -100 79 -130 -113 -27 168 128 92 -148 -218 48 207 -73 58 290 -98 -71 5
7128 5 49 -103 -161 -68 169 189 249 -351 -55 53 -138 68 -116 -194 -173 286 -59 4 12 29 -160 41 -2 167 -46
7153 -46 -18 99 -63 -95 -17 94 -121 78 -41 223 44 58 94 32 -60 48 142 -174 -74 77 50 -55 45
7176 45 2 -105 -92 9 70 168 -253 -152 43 -107 -213 -18 -244 37 205 -192 -5 275 -22 -76 100 -22
7198 -22 106 75 151 -103 34 -79 -100 -58 97 -112 13 -102 -171 89 71 -197 140 -96 -260 -30 -98 -129 144
7221 144 53 -159 74 -67 -7 -96 -95 -279 -138 27 -92 -321 -192 -149 6 -117 -42 -57 -14 74 -196 -13 -103 -279
7245 -279 119 59 30 82 -8 7 67 149 -66 27 115 -171 68 -50 329 -141 -132 -115 56 -108 132 -49 110 -120
7269 -120 304 59 -241 90 -93 23 187 151 -62 95 156 198 58 93 113 3 -54 90 159 -129 -136 115 -46
7292 -46 -75 216 297 -120 88 86 -23 10 80 -58 121 -206 182 45 -68 -38 -46 60 85 -93 198 60 -88 59
7316 59 -76 -29 -64 222 98 -4 -159 -40 -164 -34 94 -19 14 -212 -210 228 224 -56 152 54 153 -115 -61 -52
7340 -52 -134 142 -218 -17 -334 -97 125 82 213 15 -225 225 -177 -81 -50 62 61 -32 203 40 24 302 -18
7363 -18 -50 -89 -53 79 44 -91 -246 -197 47 19 -205 97 83 -41 112 -144 -32 -24 4 -230 147 312 232 -38
7387 -38 170 -30 -43 289 120 -28 68 41 117 26 -48 -167 89 79 -53 -68 -304 73 14 -45 -2 118 -19 226
7411 226 -115 27 114 -120 -89 -46 -257 125 -124 210 7 147 13 203 66 162 -279 -3 42 -30 17 -66 -17
7434 -17 -21 127 -7 128 68 -109 -35 22 86 -208 -99 255 232 -74 -211 125 -111 29 -146 -134 221 -10 -152
7457 -152 26 97 30 -55 -202 69 -70 49 39 31 101 -66 223 -149 201 95 -10 -214 -115 63 -273 -10 -50
7480 -50 -48 -31 -204 63 54 31 150 -86 89 57 49 -46 60 -20 -426 -40 -348 249 -14 69 32 176 131 219 132 -14
7506 -14 -235 68 33 1 -281 45 -16 109 121 -168 -116 94 134 136 107 38 65 119 -157 16 -35 53 -31 -68 -115 -129
7532 -129 -203 19 -280 -96 -79 -31 -223 -18 -43 128 58 265 134 -165 121 -281 -130 -25 -108 -53 -6 123 -121
7555 -121 200 -418 92 -197 -6 110 2 209 -267 147 -54 185 -114 -18 24 -115 -201 -9 -42 126 -4
7576 -4 183 46 -75 -92 17 -109 -63 184 -325 -146 -255 194 95 133 -97 -181 75 113 34 -40 77 220 -110
7599 -110 -252 192 -30 -59 -38 -282 234 79 -64 -106 185 117 104 -322 87 -35 -59 244 -358 89 -21 -10
7621 -10 -79 22 68 270 -192 -124 -9 -182 -17 -132 -29 -176 192 -56 -10 -44 -90 14 120 207 15 109 119
7644 119 128 139 100 70 -53 -82 42 -15 61 3 144 -189 -30 23 -47 87 21 -80 78 -66 156 -366 -57 280
7668 280 -74 -132 -34 42 -261 65 -130 35 -133 198 -7 -7 -62 50 -76 52 224 -192 -195 150 118 59 -37 -269
7692 -269 -129 -102 -34 171 -108 -260 -40 75 -182 -365 45 -39 59 27 -250 -205 193 111 -5 -19 59 -82 -163
7715 -163 -50 165 13 -196 -183 -41 -156 -114 39 157 -227 234 -26 9 94 246 -229 33 -148 246 -165
7736 -165 50 1 -128 49 202 -90 -89 -39 30 -140 35 -147 98 -52 -19 -140 62 100 -182 95 187 -91 -145
7759 -145 148 141 89 -25 -154 -161 74 94 43 134 -34 -54 285 -173 103 41 -195 -262 142 -236 158 98 161 436
7783 436 -28 247 67 -228 109 81 13 -61 35 -102 -71 230 45 185 -26 -50 -301 -111 -421 303 19 -104
7805 -104 37 215 -34 194 -3 -41 -126 180 142 -158 -240 -50 50 -297 -123 194 143 -88 30 155 369 -174
7827 -174 -164 289 -159 -133 116 7 146 -69 44 56 -22 -18 -72 43 -33 43 89 76 26 35 -25 89 -95 290 38
7852 38 177 127 -70 -40 53 227 -89 34 -23 183 40 44 -281 61 88 172 -128 138 -196 -16 -27 172 68
7875 68 -97 -186 -155 143 -232 14 -12 50 153 -44 34 -153 -9 126 -12 58 -118 12 266 -159 285 -147
7897 -147 311 53 365 -313 129 18 -261 30 67 -43 -261 8 -32 -115 -90 44 -96 74 143 -18 -196 248
7919 248 -37 -34 26 118 33 63 -103 -50 -99 -162 19 14 145 -119 -141 -91 91 94 -134 95 68 134 1 59 -201 -139
7945 -139 232 -46 -41 139 40 -224 -58 -204 308 255 -53 131 55 148 -331 24 -1 204 -14 1 -39 86 3
7968 3 48 55 -79 -184 -114 -30 -79 76 -66 -198 87 -229 -109 62 -91 64 57 120 0 -68 -57 -62 104 -2 -7 57
7994 57 238 247 92 -52 -373 -248 50 57 -65 -46 -89 -172 57 221 -201 88 -74 -2 -226 -80 81 45 239
8017 239 37 15 -197 92 -196 -103 160 -90 -264 34 179 -144 -37 67 -54 -56 116 120 97 -49 -14 227 26
8040 26 -109 41 11 -85 -128 -1 5 -248 177 106 -1 -4 -167 -23 -23 -40 -15 -72 -73 31 -157 -117 218 -232 44 64
8066 64 -10 -166 119 -338 157 314 -260 -48 -167 9 -291 36 25 128 -141 80 173 -65 -216 -55 17 62
8088 62 6 70 219 -16 -188 -50 211 -102 -33 -130 -92 -114 -136 304 140 8 -96 186 42 156 -154 -348 -17
8111 -17 164 -73 -150 371 -41 170 168 25 35 65 -202 86 -63 -241 -117 246 103 18 -56 2 -109 -57 -182
8134 -182 -250 -122 -107 -5 -32 202 25 156 262 17 -312 -129 -196 -164 160 -10 45 58 -89 -109 -116 -13 -51 328
8158 328 -79 39 -123 -118 -169 -36 330 126 -316 23 165 51 74 0 73 -92 -99 123 25 100 177 12 -86 -271
8182 -271 -42 -51 107 3 -119 14 135 69 -100
8191a00
##END NTUPLES=NMR FID
##END=
