##TITLE=1H_29_2025_Bau
 200.13MHz, CDCl3
 8 sc
 
 19ns.25.2.2025
##JCAMPDX= 6.0         $$ Bruker NMR JCAMP-DX V2.0
##DATA TYPE= NMR FID
##DATA CLASS= NTUPLES
##ORIGIN= UXNMR, Bruker Analytische Messtechnik GmbH
##OWNER= pz
$$ XWIN-NMR		Version 3.5
$$ Tue Feb 25 13:58:37 2025 Russian Standard Time (UT+4h)  new_Human@DPX200
##.OBSERVE FREQUENCY= 200.1313
##.OBSERVE NUCLEUS= ^1H
##.DELAY= (6, 6)
##.ACQUISITION MODE= SIMULTANEOUS
##.ACQUISITION SCHEME= undefined
##.AVERAGES= 8
##.DIGITISER RES= 18
##SPECTROMETER/DATA SYSTEM= spect
##.PULSE SEQUENCE= zg30
##.SOLVENT NAME= CDCl3
##.SHIFT REFERENCE= (INTERNAL, CDCl3, 0, 14.3821)
##AUDIT TRAIL= $$ (NUMBER, WHEN, WHO, WHERE, WHAT)
$$ ##TITLE= Audit trail, XWIN-NMR		Version 3.5
$$ ##JCAMPDX= 5.01
$$ ##ORIGIN= Bruker BioSpin GmbH
$$ ##OWNER= new_Human
$$ C:/Bruker/XWIN-NMR/data/yarkov/nmr/H-C/1/audita.txt
$$ ##AUDIT TRAIL=  $$ (NUMBER, WHEN, WHO, WHERE, WHAT)
(   1,<2025-02-25 13:56:26.34 +0400>,<new_Human>,<DPX200>,
      <created by zg, POWCHK disabled, PULCHK disabled
       configuration hash MD5:
       00 E9 B6 7A A2 85 ED C7 34 08 36 98 17 FE 4E 26
       data hash MD5: 16K
       F4 65 53 DF 95 06 71 45 C3 E2 21 27 B7 48 56 63>)
$$ ##END=
$$ 
$$ hash MD5
$$ 3C 11 0E 80 55 6E DE B7 30 C5 EC 86 E8 A7 94 9A
##$RELAX= 
##$RELAX= 
##$RELAX= 
##$RELAX= 
##$RELAX= 
##$RELAX= 
$$ Bruker specific parameters
$$ --------------------------
##$DU= <C:/Bruker/XWIN-NMR>
##$EXPNO= 1
##$NAME= <H-C>
##$PROCNO= 1
##$TYPE= <nmr>
##$USER= <yarkov>
##$AMP= (0..31)
100 100 100 100 100 100 100 100 100 100 100 100 100 100 100 100 100 100 
100 100 100 100 100 100 100 100 100 100 100 100 100 100 
##$AQSEQ= 0
##$AQ_mod= 1
##$AUNM= <au_zg>
##$AUTOPOS= <>
##$BF1= 200.13
##$BF2= 200.13
##$BF3= 200.13
##$BF4= 200.13
##$BF5= 200.13
##$BF6= 200.13
##$BF7= 200.13
##$BF8= 200.13
##$BYTORDA= 1
##$CFDGTYP= 0
##$CFRGTYP= 5
##$CHEMSTR= <none>
##$CNST= (0..31)
1 1 145 1 1 1 1 1 1 1 1 1 1 1 1 1 1 1 1 1 1 1 1 1 1 1 1 1 1 1 1 1 
##$CPDPRG= <>
##$CPDPRG1= <>
##$CPDPRG2= <>
##$CPDPRG3= <>
##$CPDPRG4= <mlev>
##$CPDPRG5= <mlev>
##$CPDPRG6= <mlev>
##$CPDPRG7= <mlev>
##$CPDPRG8= <mlev>
##$CPDPRGB= <>
##$CPDPRGT= <>
##$D= (0..31)
0 0.7 0 0 0 0 0 0 0 0 0 0.03 0 0 0 0 0 0 0 0 0 0 0 0 0 0 0 0 0 0 0 0 
##$DATE= 1740477385
##$DBL= (0..7)
120 120 120 120 120 120 120 120 
##$DBP= (0..7)
150 150 150 150 150 150 150 150 
##$DBP07= 0
##$DBPNAM0= <>
##$DBPNAM1= <>
##$DBPNAM2= <>
##$DBPNAM3= <>
##$DBPNAM4= <>
##$DBPNAM5= <>
##$DBPNAM6= <>
##$DBPNAM7= <>
##$DBPOAL= (0..7)
0.5 0.5 0.5 0.5 0.5 0.5 0.5 0.5 
##$DBPOFFS= (0..7)
0 0 0 0 0 0 0 0 
##$DE= 6
##$DECBNUC= <off>
##$DECIM= 32
##$DECNUC= <off>
##$DECSTAT= 4
##$DIGMOD= 1
##$DIGTYP= 9
##$DL= (0..7)
0 120 120 120 120 120 120 120 
##$DP= (0..7)
150 150 150 150 150 150 150 150 
##$DP07= 0
##$DPNAME0= <>
##$DPNAME1= <>
##$DPNAME2= <>
##$DPNAME3= <>
##$DPNAME4= <>
##$DPNAME5= <>
##$DPNAME6= <>
##$DPNAME7= <>
##$DPOAL= (0..7)
0.5 0.5 0.5 0.5 0.5 0.5 0.5 0.5 
##$DPOFFS= (0..7)
0 0 0 0 0 0 0 0 
##$DQDMODE= 0
##$DR= 18
$$ [...]
##$SUBNAM0= <"">
##$SUBNAM1= <"">
##$SUBNAM2= <"">
##$SUBNAM3= <"">
##$SUBNAM4= <"">
##$SUBNAM5= <"">
##$SUBNAM6= <"">
##$SUBNAM7= <"">
##$SUBNAM8= <"">
##$SUBNAM9= <"">
##$SW= 18.0517328524113
##$SWIBOX= (0..15)
0 0 2 0 0 0 0 0 0 0 0 0 0 0 0 0 
##$SW_h= 3612.71676300578
##$TD= 16384
##$TD0= 1
##$TE= 0
##$TE2= 300
##$TE3= 300
##$TEG= 300
##$TL= (0..7)
0 120 120 120 120 120 120 120 
##$TP= (0..7)
150 150 150 150 150 150 150 150 
##$TP07= 0
##$TPNAME0= <>
##$TPNAME1= <>
##$TPNAME2= <>
##$TPNAME3= <>
##$TPNAME4= <>
##$TPNAME5= <>
##$TPNAME6= <>
##$TPNAME7= <>
##$TPOAL= (0..7)
0.5 0.5 0.5 0.5 0.5 0.5 0.5 0.5 
##$TPOFFS= (0..7)
0 0 0 0 0 0 0 0 
##$TUNHIN= 0
##$TUNHOUT= 0
##$TUNXOUT= 0
##$USERA1= <user>
##$USERA2= <user>
##$USERA3= <user>
##$USERA4= <user>
##$USERA5= <user>
##$V9= 5
##$VALIST= <valist>
##$VCLIST= <CCCCCCCCCCCCCCC>
##$VD= 0
##$VDLIST= <DDDDDDDDDDDDDDD>
##$VPLIST= <PPPPPPPPPPPPPPP>
##$VTLIST= <TTTTTTTTTTTTTTT>
##$WBST= 1024
##$WBSW= 4
##$XGAIN= (0..3)
0 0 0 0 
##$XL= 0
##$YL= 0
##$YMAX_a= 93960
##$YMIN_a= -101189
##$ZGOPTNS= <>
##$ZL1= 120
##$ZL2= 120
##$ZL3= 120
##$ZL4= 120
##$ABSF1= 10
##$ABSF2= 0
##$ABSG= 5
##$ABSL= 3
##$ALPHA= 0
##$AQORDER= 0
##$ASSFAC= 0
##$ASSFACI= 0
##$ASSFACX= 0
##$ASSWID= 0
##$AUNMP= <proc_1d>
##$AZFE= 0.1
##$AZFW= 0.1
##$BCFW= 1
##$BC_mod= 2
##$BYTORDP= 1
##$COROFFS= 0
##$CY= -3
##$DATMOD= 1
##$DC= 2
##$DFILT= <>
##$DTYPP= 0
##$F1P= 0
##$F2P= 0
##$FCOR= 0.5
##$FTSIZE= 0
##$FT_mod= 4
##$GAMMA= 1
##$GB= 0.15
##$INTBC= 1
##$INTSCL= 1
##$ISEN= 128
##$LB= 0.25
##$LEV0= 0
##$LPBIN= 0
##$MAXI= 10000
##$MC2= 0
##$MEAN= 0
##$ME_mod= 0
##$MI= 1.114404
##$NCOEF= 0
##$NC_proc= 0
##$NLEV= 6
##$NOISF1= 3.799351
##$NOISF2= 2.8
##$NSP= 1
##$NTH_PI= 0
##$NZP= 0
##$OFFSET= 14.38212
##$PC= 1
##$PHC0= -1176.621
##$PHC1= -0.2077489
##$PH_mod= 1
##$PKNL= yes
##$PPARMOD= 0
##$PSCAL= 0
##$PSIGN= 0
##$REVERSE= no
##$SF= 200.129724274929
##$SI= 16384
##$SIGF1= 3
##$SIGF2= 2
##$SINO= 400
##$SIOLD= 16384
##$SREGLST= <1H.CDCl3>
##$SSB= 0
##$STSI= 0
##$STSR= 0
##$SW_p= 3205.1282051282
##$SYMM= 0
##$S_DEV= 0
##$TDeff= 0
##$TDoff= 0
##$TI= <>
##$TILT= no
##$TM1= 0
##$TM2= 0
##$TOPLEV= 0
##$USERP1= <user>
##$USERP2= <user>
##$USERP3= <user>
##$USERP4= <user>
##$USERP5= <user>
##$WDW= 1
##$XDIM= 8192
##$YMAX_p= 0
##$YMIN_p= 0
$$ End of Bruker specific parameters
$$ ---------------------------------
##NTUPLES= NMR FID
##VAR_NAME=  TIME,          FID/REAL,        FID/IMAG
##SYMBOL=    X,             R,               I
##VAR_TYPE=  INDEPENDENT,   DEPENDENT,       DEPENDENT
##VAR_FORM=  AFFN,          ASDF,            ASDF
##VAR_DIM=   8192,          8192,            8192
##UNITS=     SECONDS,       ARBITRARY UNITS, ARBITRARY UNITS
##FACTOR=    0.0002768,     1,               1
##FIRST=     0,             0,               0
##LAST=      2.2672688,     0,               0
##MIN=       0,             -101189,         0
##MAX=       2.2672688,     93960,           0
$$ Real data points
##PAGE= N=1
##DATA TABLE= (X++(R..R)), XYDATA
$$ plain form
0 0 0 0 0 0 0 0 0 0 0 0 0 0 0 0 0 0 0 0 0 0 0 0 0 0 5 -6 7 -8 8 -8 8 -9 12 -14 15 -17 19 -20 24 -27 28 -32 35 -39 44
45 44 -49 52 -59 63 -71 79 -85 95 -105 116 -130 145 -163 182 -206 236 -273 321 -387 481 -624
66 -624 871 -1360 2699 -13061 -27597 53338 93960 75916 43419 21102 52660 53013 -15715 -36384
80 -36384 -9855 21295 17031 -52606 -51877 27020 7595 -57500 -53610 -7003 34049 4636 -39066
93 -39066 10409 51907 21656 -19122 -41504 1228 43002 -17619 -45886 22412 60135 33535
105 33535 -16549 -16475 39930 19934 -49787 -47852 -12863 18324 11664 -39389 -11079 59380 31556
118 31556 -26877 -29378 12722 38454 -17869 -53126 6367 34811 6397 -23126 -32200 18422
130 18422 40346 -22788 -33510 26177 55144 31098 -19783 -8442 45610 9129 -55615 -51605
$$ packed form
0@%%%%%%%%%%%%%%%%%%%%%%%%Nj1J3j5J6j6J6j7K1k6K9l2L6l9M4n1N5o0O7p4Q3
45D4r3J01j11J22j34J50j64J80k00K21k46K75l08L45l88M42n09N94p08Q68j105
66f24J495k231M059j5760j4536Q0935M0622j8044l2497k2317L1558L53o8728k0669
80c6384K6529L1150m264o9637P29P8897j9425o5095L890M6607M1052k9413m3702
93c9066M9475M1498l0251m0778k2382M2732M1774o0621k8267O8298L7723k6600
105C3535n0084P4N6405j9996o9721J935L4989L1187o660n1053K8310P0459k7824
118C1556n8433k501M2100K5732n6323l5257N9493K8444k8414k9523r074N0622
130A8422K1924o3134j0722N9687K8967k4046n0881J1341N4052l6481o4744M010
$$ plain form
142 -51605 -22999 377 -18402 -54221 -5636 52018 28578 -8717 -9815 31765 50053 -12463
154 -12463 -34620 23250 39681 12079 -15707 -16980 26785 23215 -38615 -44059 -4584 18231 -1487
167 -1487 -41974 -9153 47055 11858 -32467 -20483 5436 21123 -10401 -38416 9951 45887
179 45887 21087 -7357 -8730 30657 35181 -30143 -40470 8547 17054 -4470 -26270 -11895 35488
192 35488 21125 -25661 -19382 7127 19623 -5287 -42244 -5316 36569 2151 -26949 -12981
204 -12981 13959 23437 -14742 -27637 18357 34453 13822 -5755 -3979 33759 28505 -30032 -30558
217 -30558 5909 6622 -16705 -38031 -12879 26910 3816 -25682 -10504 12175 23680 -3641
229 -3641 -29217 12619 39968 6511 -13324 -1093 25265 23213 -22670 -26935 11879 12541 -8217
$$ packed form
142e1605K8606K3376j8779l5819M8585N7654k3440l7295j098M1580J8288o2516
154a2463k2157N7870J6431k7602k7786j273M3765l570o1830n444L9475K2815j9718
167a487m0487L2821N6208l5197m4325J1984K5919J5687l1524k8015M8367L5936
179D5887k4800k8444j373L9387M524o5324j0327M9017Q507k1524k1800J4375M7383
192C5488j4363m6786O279K6509J2496k4910l6957L6928M1885l4418k9100J3968
204a2981K6940R478l8179j2895M5994J6096k0631j9577J776L7738n254n8537n26
217c0558L6467P13k3327k1326K5152L9789k3094k9498J5178K2679J1505k7321
229c641k5576M1836K7349l3457j9835J2231K6358k052m5883m265L8814O62k0758
$$ plain form
242 -8217 -23451 -12612 25184 12841 -30137 -16529 13727 13663 -9623 -28526 4444 33953 3081
255 3081 -15432 1952 18082 21439 -11141 -27286 11015 21407 -9001 -22101 -7941 20915
267 20915 13421 -26814 -15858 17388 11443 -7095 -19618 -2232 29195 8278 -22373 -3973
279 -3973 18990 17147 -9991 -25764 9101 25078 -9624 -21058 -3283 14164 13259 -18948 -21001
292 -21001 15870 16887 -8654 -17790 -2624 26098 10331 -24577 -5122 21742 12370 -7177 -18777
305 -18777 3349 24173 -4369 -23972 -4953 12561 11114 -15228 -22976 14155 20021 -12056 -16740
318 -16740 -1 17577 10477 -18530 -8977 21916 15028 -5373 -13811 1429 24132 506 -26330
331 -26330 -3864 15778 6245 -11962 -18417 8538 19413 -10661 -20121 -2042 12024 8674 -16803
$$ packed form
242h217j5234J0839L7796j2343m2978J3608L0256o4k3286j8903L2970K9509l0872
255C081j8513J7384J6130L357l2580j6145L8301J0392l0408j3100J4160K8856
267B0915p494m0235J0956L3246n945j8538j2523J7386L1427k0917l0651J8400
279c973K2963j843k7138j5773L4865J5977l4702j1434J7775J7447r05l2207k053
292b1001L6871J017k5541r136J5166K8722j5767l4908J9455K6864r372j9547j1600
305a8777K2126K0824k8542j9603J9019J7514j447k6342p748L7131N866l2077m684
318a6740J6739J7578p100k9007R553L0893o888k0401q438J5240K2703k3626k6836
331b6330K2466J9642r533j8207o455K6955J0875l0074r460J8079J4066l350k5477
$$ plain form
344 -16803 -14398 21264 18603 -8472 -10648 4408 19226 3724 -22376 -5023 17750 7316 -7898
357 -7898 -12751 6002 22143 -5814 -23202 -1031 11992 2657 -15395 -15337 14197 15678 -11498
370 -11498 -12471 2673 12984 5314 -17622 -8078 21626 12374 -7401 -6883 7883 19309 -3308
383 -3308 -23306 -1911 11634 -115 -11663 -11943 10475 19921 -7574 -14904 5408 12618 2056
396 2056 -16770 -10875 17478 9830 -13621 -9326 4664 11836 -932 -20334 -3279 19151 7023
409 7023 -6438 -3440 13761 21062 -5938 -19365 1600 6612 -7268 -18099 -13521 10414 11841
422 11841 -10971 -8988 8650 13062 1496 -16418 -3845 20674 7682 -8198 793 13912 18027
435 18027 -617 -16604 1165 10713 -5852 -16812 -13444 5230 9325 -16159 -18452 3756 5361
$$ packed form
344a6803K405L5662k661k7075k176J5056J4818j5502k6100J7353K2773j0434j5214
357g898m853J8753J6141k7957j7388K2171J3023r335j8052N8K9534J481k7176
370a1498r73J5144J0311p670k2936R544K9704r252j9775N18J4766J1426k2617
383c308j9998K1395J3545j1749j1548k80K2418R446k7495p330K0312P210j0562
396B056j8826N895K8353p648k3451M295J3990P172j2768j9402J7055K2430j2128
409G023j3461K998J7201P301k7000j3427K0965N012j3880j0831M578K3935J427
422A1841k2812J983J7638M412j1566j7914J2573K4519j2992j5880Q991J3119M115
435A8027j8644j5987J7769R548j6565j0960L368J8674M095k5484k293K2208J605
$$ plain form
448 5361 -7129 -15980 -5325 19455 14669 -2948 6567 20793 22184 5691 -13363 -170 13537
461 13537 -6635 -20368 -10747 3933 7104 -11820 -17257 4609 8993 -4927 -12451 -6319 13855
474 13855 12222 -10977 -6216 12492 10103 -4048 -15315 -2823 15595 2357 -9863 2017 13885
487 13885 15049 -878 -13743 3185 10581 -8580 -16764 -7311 8392 9209 -10758 -8536 11523
500 11523 8201 -6033 -12978 -6517 11058 4267 -13451 -2177 14489 12595 -611 -10074 5406
513 5406 16667 -2409 -11333 837 10226 8898 -8310 -14822 2597 3130 -14772 -20174 -9742 7190
527 7190 6326 -9249 2390 22471 17627 4779 -2629 4045 13792 -1543 -16338 -5135 5457
540 5457 3508 -9021 -15072 3388 10102 -9138 -12817 -180 9318 7463 -6908 -4672 13324 8857
$$ packed form
448E361j2490q851J0655K4780m786j7617R515J4226J391j6493j9054J3193J3707
461A3537k0172j3733R621J4680L171j8924n437K1866M384j3920p524O132K0174
474A3855j633k3199M761J8708k389j4151j1267J2492J8418j3238j2220J1880J1868
487A3885J164j5927j2865J6928P396j9161q184R453J5703Q17j9967K222K0059
500A1523l322j4234o945O461J7575o791j7718J1274J6666j894j3206r463J5480
513E406J1261j9076q924J2170R389j328j7208o512J7419N33j7902n402J0432J6932
527G190q64j5575J1639K0081m844j2848p408O674R747j5335j4795J1203J0592
540E457j949j2529o051J8460O714j9240l679J2637R498j855j4371K236J7996m467
$$ plain form
554 8857 -6673 -11343 -3862 9082 718 -14923 -582 14803 8642 -1764 -5767 5767 12372
567 12372 -5291 -14159 -1530 7346 4900 -7211 -8826 10495 10200 -8769 -10605 -1233 6167 278
581 278 -14137 -4709 11873 5158 -5152 -6362 2571 13146 1223 -9890 5849 15949 8603
594 8603 -2496 -5277 6948 7054 -13374 -17731 -6980 -1505 -4303 -14159 -8322 12492 9723 -4078
608 -4078 -1836 7966 14452 4214 -8389 3618 14573 5024 -4022 -5568 3573 8562 -8472 -16537
622 -16537 -1946 4668 -1316 -10119 -7254 9669 8297 -8870 -6759 3296 7057 1340 -9561 -1405
636 -1405 14326 7104 -4331 -3151 5594 10265 -4007 -13943 571 7516 -1620 -7459 -5246 6850
650 6850 9381 -6399 -8623 4330 7316 688 -8990 -4014 11676 5012 -9127 -4829 3731 6164
$$ packed form
554H857j5530m670P481J2944q364j5641J4341J5385o161j0406m003J1534O605
567A2372j7663q868J2629Q876k446j2111j615J9321k95j8969j836R372P400n889
581B78j4415R428J6582o715j0310j210Q933J0575j1923j1113J5739J0100p346
594H603j1099k781J2225J06k0428m357J0751N475k798r856N837K0814k769j3801
608d078K242R802O486j0238j2603J2007J0955r549r046j546R141M989j7034q065
622a6537J4591O614n984q803K865J6923j372j7167K111J0055L761n717j0901Q156
636a405J5731p222j1435J180Q745M671j4272r936J4514O945r136n839K213J2096
650F850K531j5780k224J2953K986o628r678M976J5690o664j4139M298Q560K433
$$ plain form
664 6164 -1951 -11206 324 11304 2017 -5418 -2536 6957 9744 -6091 -11964 3027 6038 -3009
678 -3009 -8487 -4362 8799 6597 -7952 -4658 5839 7028 25 -9229 -1175 12059 2481 -7888
692 -7888 -2161 5618 6545 -4220 -10919 2225 8047 -2192 -6783 -3257 7112 7838 -7075 -7407 6100
707 6100 5912 -2275 -8087 -2253 9599 2760 -8786 -3058 5205 5460 -2484 -9642 668 10010 -1060
722 -1060 -7630 -1205 6834 7241 -5154 -7650 5939 7149 -3174 -6645 -2575 7167 4393 -9269
736 -9269 -5045 6286 4498 -3217 -8123 -80 10083 79 -8373 -732 6067 5304 -3045 -8049 4239
751 4239 8838 -3172 -6994 -1025 6089 4464 -7610 -5897 6588 4596 -3630 -6000 -470 8270
765 8270 2178 -8796 -1813 7020 4303 -2931 -6923 2514 9385 -2812 -7916 -255 5018 3070 -5665
$$ packed form
664F164q115r255J1530J0980r287p435K882R493K787j5835n873J4991L011r047
678c009n478M125J3161k202j4549L294J0497J189p003r254Q054J3234r578j0369
692g888N727P779R27j0765o699J3144N822j0239m591L526J0369P26j4913l32J3507
707F100j88q187n812N834J1852o839j1546N728Q263K55p944p158J0310R342j1070
722a060o570O425Q039M07j2395k496J3589J210j0323l471M070R742k774j3662
736i269M224J1331j788p715m906Q043J0163j0004q452P641O799p63q349n004J2288
751D239M599j2010l822N969P114j625j2074J713J2485j992q226k370N530Q740
765H270o092j0974O983Q833k717p234l992R437O871j2197n104P661N273j948q735
$$ plain form
780 -5665 -6611 5313 6320 -3902 -5321 203 7180 3061 -8206 -2743 7611 3792 -3223 -5045
794 -5045 1561 8372 -693 -8858 -671 5071 2079 -5047 -7316 4086 7458 -4089 -6066 1428 5721
809 5721 3256 -6028 -3933 7674 5494 -3363 -3603 1627 7218 988 -9046 -1786 5717 558 -5332
824 -5332 -6493 1518 6774 -3318 -7501 1162 5218 2565 -4457 -4108 7650 7461 -3301 -3005 3210
839 3210 6424 1404 -7940 -3108 6347 627 -5984 -5159 613 5857 -2200 -8695 102 5683 600
854 600 -4812 -4162 5221 7443 -3188 -3772 4001 5926 2353 -5089 -2820 7569 4054 -5012 -3082
869 -3082 2560 5774 -642 -8536 -1650 4901 -1356 -5955 -4580 2197 6119 -2669 -5905 3382 5938
884 5938 1179 -4034 -2966 6513 5644 -4459 -2771 4060 5199 543 -6706 -2055 5933 56 -6672
$$ packed form
780e665r46J1924J007j0222j419N524O977m119j1267N463J0354l819p015j822
794e045O606O811r065q165Q187N742k992p126k269J1402L372j1547j977P494M293
809E721k465r284K095J1607k180q857k40N230N591o230j0034P260P503n159n890
824e332j161Q011N256j0092m183Q663M056k653p022L49J1758j89j0762K96O215
839C210L214n020r344M832R455n720o611Q25N772N244q057o495Q797N581n083
854F00n412O50R383K222j0631n84P773J925l573p442K269J0389l515r066J930
869c082N642L214o416p894O886O551o257m599J375O777L922q788l236R287K556
884E938m759n213J068R479q69j0103J688O831J139m656p249M651P988n877o728
$$ plain form
899 -6672 -3853 1860 4771 -2444 -7507 1881 5526 -1041 -4549 -2608 5072 6360 -3145 -3482 4947
914 4947 5432 580 -5171 -2686 6032 1247 -6968 -3287 2548 3561 -1465 -6495 642 6418 -31
929 -31 -4372 -1662 3730 5464 -2908 -5496 3587 4233 -1905 -5256 -2803 4722 3089 -5569 -2435 4580
945 4580 4693 424 -4601 63 7089 210 -6347 -1857 2995 3521 -3144 -6655 1680 4596 -2853 -5435
961 -5435 -2073 3740 4161 -4451 -3142 5932 5413 33 -2488 509 6923 1933 -5787 -1318 3538 2186
977 2186 -2730 -6865 -812 4170 -3391 -6772 -2224 2748 3308 -3291 -3456 6013 6480 -73 -1685 1111
993 1111 6128 3378 -5210 -2689 4222 2216 -3086 -5600 -1113 4798 -1976 -7242 -1146 3010 2335
1008 2335 -2789 -4657 3216 5786 -1900 -3642 597 4284 3264 -4200 -2960 5716 3929 -2175 -3179
$$ packed form
899f672K819N713K911p215n063R388L645o567l508J941P680J288r505l37Q429
914D947M85m852n751K485Q718m785q215L681N835J013n026n030P137N776o449
929c1m341K710N392J734q372k588R083O46o138l351K453P525j633q658L134P015
945D580J13m269n025M664P026o879o557M490M852N26o665l511Q335K916p449k582
961e435L362N813M21q612J309R074n19n380k521K997O414m990p720M469M856j352
977B186m916m135O053M982p561l381M548M972N60o599j65R469M67o553j612K796
993A111N017k750q588K521O911k006n302k514M487N911o774n266O096M156o75
1008B335n124j868P873K570p686j742M239L687j020p464J240Q676j787o104j004
$$ plain form
1023 -3179 383 5385 443 -6175 -1061 4177 1917 -2501 -4894 1393 5412 -2520 -5497 198 2959
1038 2959 1513 -3809 -4105 4241 4327 -2334 -2845 923 4695 2157 -4943 -1231 5586 2163 -2961 -3557
1054 -3557 620 4729 -1771 -6570 -270 3158 806 -3190 -4034 3531 5460 -2395 -3230 2112 4417
1069 4417 2249 -3813 -2492 4761 2352 -3742 -3422 163 3801 -653 -6350 -913 4519 669 -3086
1084 -3086 -2819 2435 5313 -1822 -4115 1800 3909 1261 -3092 -3274 4114 3373 -3871 -3249 1373 3279
1100 3279 518 -4843 -825 5446 1379 -2929 -1711 2142 4978 -632 -5473 1085 3877 -200 -3786
1115 -3786 -3263 2876 3202 -4365 -3819 1860 2884 695 -3576 -1530 5253 2952 -3270 -1399 2499 4107
1131 4107 -215 -5260 222 4162 -569 -3599 -2702 1224 3323 -2932 -5076 1780 3383 86 -2886
$$ packed form
1023c179L562N002m942o618N114N238k260m418k393O287M019p932k977N695K761
1038B959j446n322k96Q346Q6o661n11L768L772k538p100L712O817l423n124n96
1054c557M177M109o500m799O300L428k352l996q44P565J929p855q35N342K305
1069D417k168o062J321P253k409o094L20L585L638m454n697N437N432l850l755
1084c086K67N254K878p135k293N915K109k648m353j82P388p41p244O22M622J906
1100C279k761n361M018O271m067m308J218L853K836n610m841O558K792m077l586
1115c786N23O139L26p567N46N679J024k189m271K046O783k301o222J871L898J608
1131D107m322n045N482L940m731l030Q97L926K099o255k144O856J603l297k972
$$ plain form
1146 -2886 -1832 4465 3356 -3415 -1823 2897 3383 108 -3812 -876 4444 285 -4063 -2206 1197
1161 1197 2937 -1824 -5378 1308 3890 -498 -3233 -1124 3595 3419 -3166 -2774 3070 3097 -31 -3040
1177 -3040 -1247 4763 1667 -4290 -1917 2059 2295 -1333 -4659 409 4147 -487 -3314 -1039 2432
1192 2432 3184 -2161 -3345 3039 3862 -967 -2647 -1060 3593 2358 -4401 -2359 2228 1743 -1013 -3882
1208 -3882 -737 4622 216 -3609 -590 2679 2607 -1507 -3855 2166 4473 -1061 -2480 -412 2757
1223 2757 2833 -3351 -3093 2459 2109 -1874 -3297 -854 3597 992 -4482 -1006 2908 2284 -875 -3165
1239 -3165 1247 4632 -436 -2844 153 2576 2322 -2339 -3307 2663 2483 -2147 -2847 -798 2589 1354
1255 1354 -3927 -1702 2946 1845 -1214 -2576 154 4239 228 -3348 304 2690 2174 -1418 -3043
$$ packed form
1146b886J054O297j109o771J592M720M86l275l920K936N320m159m348J857L403
1161A197J740m761l554O686K582m388k735K109M719j76o585L92N844K7l128l009
1177c040J793O010l096n957K373L976K36l628l326N068L738m634k827K275L471
1192B432P52n345j184O384Q23m829j680J587M653j235o759K042M587m85k756k869
1208c882L145N359m406l825L019L269p2m114k348O021K307n534j419K068L169
1223B757P6o184K58N552l50l983j423K443M451k605n474L476L914o24l159k290
1239c165M412L385n068k408K997K423k54m661r68N970j80m630p00K049L387j235
1255A354n281K225M648j101l059j362K730M085m011l576L652K386n16l592j625
$$ plain form
1270 -3043 1902 3680 -1812 -3055 -406 2050 1402 -3274 -2900 3027 1890 -1848 -2350 272 3495 912
1286 912 -3780 -312 3435 1639 -1499 -2629 1346 3767 -1375 -3534 155 2105 1198 -2115 -2433 2547
1302 2547 3177 -2175 -2227 262 2605 1429 -3565 -1257 3645 1409 -1182 -2211 415 2973 -925 -3977
1318 -3977 315 2554 720 -1514 -2251 1911 3054 -2222 -2460 673 2521 1106 -2588 -1438 3566
1333 3566 2277 -2140 -1978 533 1929 -93 -4171 -535 2735 339 -1780 -1611 1408 3270 -1177
1348 -1177 -2927 1414 2683 490 -1680 -1806 2721 2354 -2734 -2518 493 1596 -129 -3471 -1090 3114
1364 3114 770 -1768 -1288 1340 2807 -674 -3380 943 2682 456 -1529 -1282 2458 3148 -1863 -2215
1380 -2215 1070 1658 -315 -2972 -1628 2639 1081 -2783 -1522 1082 1729 -311 -3085 282 3261
$$ packed form
1270c043M945J778n492j243K649K456o48m676L74N927j137l738n02K622L223k583
1286I12m692L468L747j796l138j130L975K421n142k159L689J950r07l313l18M980
1302B547O30n352n2K489K343j176m994K308M902k236k591j029K626K558l898l052
1318c977M292K239j834k234p37M162J143n276k38L133J848j415l694J150N004
1333C566j289m417J62K511J396k022m078L636L270k396k119J69L019J862m447
1348a177j750M341J269k193k170j26M527l67n088K16L011J103j725l342K381M204
1364C114k344k538M80K628J467l481k706M323J739k226j985K47L740O90n011l52
1380b215L285N88j973k657J344M267j558l864J261K604O47k040k774L367K979
$$ plain form
1395 3261 666 -1191 -388 1829 2877 -1282 -3107 953 1595 -683 -2202 -1393 2587 1887 -2410 -1436
1411 -1436 1686 1413 -461 -2969 -962 2874 336 -2128 -512 1570 2183 -369 -2755 1129 2563
1426 2563 -641 -1100 -561 2000 1889 -2277 -2338 1021 1099 -1417 -2456 -1101 2659 1484 -2023 -5 1984
1443 1984 1763 -432 -2589 -164 2478 -901 -2289 -508 1441 1692 -1421 -2350 1348 1881 -1217 -1833
1459 -1833 -678 2072 1356 -2321 -1133 1712 1119 -804 -2270 -147 2948 401 -1911 428 1887
1474 1887 1446 -1195 -2790 310 1700 -1795 -2401 -643 1668 1867 -1282 -1015 2376 1703 -812 -1673
1490 -1673 -321 2646 575 -2773 -579 1553 474 -1192 -2646 268 2100 -632 -1880 748 2420
1505 2420 1797 -1095 -1629 1754 1450 -1798 -1920 -93 1800 1189 -2252 -224 2359 1164 -1065 -2137
$$ packed form
1395C261k595j857Q03K217J048m159j825M060O42k278j519Q09L980p00m297R74
1411a436L122k73j874k508K007L836k538k464J616K082O13k552k386L884J434
1426B563l204m59N39K561j11m166o1L359P8k516j039J355L760j175l507K018J989
1443A984k21k195k157K425K642l379j388J781J949K51l113r29L698N33l098o16
1459a833J155K750p16l677J188K845n93j923j466K123L095k547k312K339J459
1474A887m41k641j595L100J390l495o06J758K311J99l149K67L391o73k515q61
1490a673J352K967k071l348K194K132j079j666j454K914J832k732j248K628J672
1505B420o23k892n34L383l04l248j22J827J893o11l441K028K583j195k229j072
$$ plain form
1521 -2137 -244 2004 -965 -2904 267 1526 861 -524 -1772 1405 2274 -1156 -1704 648 1659 1084
1537 1084 -1635 -1228 1772 843 -2138 -2016 -287 1661 -194 -2529 222 2395 933 -679 -1164 1141
1553 1141 2401 -987 -2384 535 1465 526 -1721 -1425 2028 1447 -1612 -1366 355 1176 469 -2402 -449
1570 -449 2461 658 -1326 -1394 491 2015 -620 -2211 565 2169 608 -1024 -1150 1300 1655 -2026
1586 -2026 -2077 179 929 301 -1924 -1019 2627 951 -1438 -683 641 1738 -148 -2130 231 2443
1602 2443 383 -1104 -1202 770 1636 -1520 -2289 447 1441 -194 -1311 -837 1616 1366 -1715 -1217 783
1619 783 1321 -148 -1866 -143 2623 275 -1251 -403 796 1348 -1015 -2440 484 1528 -478 -1401
1635 -1401 -759 1372 1334 -1643 -1347 1255 1496 42 -1622 -142 2398 859 -1494 -632 927 1053 -753
$$ packed form
1521b137J893K248k969j939L171J259o65j385j248L177Q69l430n48K352J011n75
1537A084k719M07L000r29k981J22J729J948j855k335K751K173j462j612m85K305
1553A141J260l388j397K919R30r39k247K96L453n81l059K46J721Q21p07k871J953
1570d49K910j803j984o8J885J524k635j591K776J604j561j632j26K450L55l681
1586b026n1K256P50o28k225R05L646j676k389P55J324J097j886j982K361K212
1602B443k060j487r8J972Q66l156p69K736R94j635j117M74K453k50l081M98K000
1619G83N38j469j718J723K766k348j526Q48J199N52k363j425K924J044k006r23
1635a401O42K131l8k977K96K602K41j454j664J480K540j539k353Q62J559J26j806
$$ plain form
1652 -753 -2173 -190 1801 -516 -1515 -460 1205 1699 -1076 -1581 1486 1763 -311 -1298 -436 1922 1163
1669 1163 -2017 -1051 1380 1157 -410 -2092 -231 2273 -422 -1787 -438 1228 976 -623 -2074 983
1685 983 1855 -597 -1367 -101 1668 1350 -1657 -914 1535 1410 -723 -1421 -383 1583 188 -2368 -692
1702 -692 949 1093 -594 -1529 370 2244 -171 -1347 24 1415 1229 -787 -1379 1240 1471 -689
1718 -689 -1394 -552 1368 664 -2336 -1025 1392 811 -512 -1333 388 2040 -194 -1948 -172 1404
1734 1404 711 -855 -1324 1249 1957 -1090 -1232 -170 1274 777 -1656 -1350 1548 1086 -1142 -1310 -159
1751 -159 1561 308 -2071 138 1417 727 -643 -1065 942 1721 -992 -2025 305 907 390 -1418
1767 -1418 -1436 1670 1489 -1159 -1225 37 1394 262 -1981 -365 1894 853 -265 -679 474 1856
$$ packed form
1652g53j420J983J991k317r99J055J665M94k775n05L067K77k074r87Q62K358p59
1669A163l180R66K431k23j567j682J861K504k695j365J349J666k52j599j451L057
1685I83Q72k452p70J266J769l18l007P43K449j25k133o98J038J966j395k556J676
1702f92J641J44j687r35J899J874k415j176J371J391j86k016n92K619K31k160
1718f89p05Q42J920p04l000J311K417n81j323q21J721J652k234j754J776J576
1734A404o93j566m69K573P08l047j42J062J444m97k433L06K898m62k228j68J151
1751a59J720j253k379K209J279o90j370m22K007P79k713j033K330O02n17j808
1767a418j8L106j81k648o6J262J357j132k243J616K259j041j118m14J153J382
$$ plain form
1783 1856 -735 -2214 -172 872 62 -1348 -1266 1520 2076 -805 -1094 608 1142 244 -1773 -954 1926
1800 1926 1320 -901 -777 496 1502 -163 -1837 -417 1274 112 -1308 -984 856 1611 -745 -1725
1816 -1725 185 989 109 -1077 -694 2120 1438 -906 -352 717 1275 -89 -2332 -819 1033 -117
1832 -117 -1418 -730 841 1614 -369 -1706 558 1306 174 -927 -699 1368 1629 -844 -1196 776 1037
1849 1037 -30 -1402 -637 2083 977 -1083 -413 852 1040 -607 -2322 -587 881 -301 -1209 -641
1865 -641 1117 1824 -181 -958 906 1429 -85 -1282 -563 1298 716 -1223 -638 532 826 -289 -1995
1882 -1995 -725 1347 218 -1158 -227 932 1530 -114 -1444 557 1002 -497 -1084 -659 1086 1690
1898 1690 -941 -701 1323 605 -590 -1594 -1164 1084 -288 -1570 -572 886 1416 12 -1045 676
$$ packed form
1783A856k591j479K042J044q10j410Q2K786N56k881k89J702N34q98k017Q19K880
1800A926o06k221J24J273J006j665j674J420J691j162j420L24J840P55k356r80
1816a725J910Q04q80j186L83K814o82k344N54J069N58j364k243J513J852j150
1832a17j301O88J571P73j983j337K264P48j132j101K28K067K61k473l52J972K61
1849A037j067j372P65K720j106k060O70J265J88j647j715J735J468j182r08N68
1865f41J758P07k005p77J864N23j514j197P19J861n82j939N85J170K94j115j706
1882a995J270K072j129j376R31J159N98j644j330K001M45j499n87M25J745O04
1898A690k631K40K024p18j195j004M30K248j372j282R98J458N30j404j057J721
$$ plain form
1914 676 2073 -211 -907 -108 856 1177 -883 -1471 357 558 -943 -1401 -582 1140 1081 -706 -28 1880
1932 1880 1292 -166 -1373 -273 1070 -512 -1684 -84 765 829 -221 -1065 927 1366 -710 -1291 -216
1949 -216 997 801 -789 -282 1515 980 -682 -1189 -433 1390 134 -1309 111 1099 891 -483 -1433
1966 -1433 -37 864 -811 -1926 -291 1038 1153 -166 -540 1604 1678 -410 -758 -308 677 -57 -1729
1983 -1729 -821 954 381 -645 -1118 -89 1225 -339 -1467 -40 1064 667 -224 -897 663 986 -972
2000 -972 -1152 -176 637 494 -1277 -446 1373 1130 -425 -781 -95 828 -161 -1792 -309 1105 449 -668
2018 -668 -906 560 1503 -820 -1157 171 833 468 -676 -778 1174 913 -1030 -844 164 697 247 -1319
2036 -1319 -166 1307 508 -488 -778 75 874 -305 -1561 -35 950 443 -493 -597 1054 1424 -326
$$ packed form
1914F76J397k284o96P99R64L21k060n88J828K01j501m58Q19J722n9j787O78J908
1932A880n88j458j207J100J343j582j172J600Q49O4j050q44J992M39k076n81J075
1949b16J213j96j590N07J797n35j662n07P56J823j256j443J420R88k08j374r50
1966a433J396R01j675j115J635J329J15j319l74K144P4k088l48M50R85p34j672
1983a729R08J775n73j026m73J029J314j564j128J427J104l97q91o73J560L23j958
2000i72j80R76Q13j43j771Q31J819k43j555l56O86R23r89j631J483J414o56j117
2018f68k38J466R43k323l37J328O62l65j144j02J952k61j943J86J008N33m50j566
2036a319J153J473p99r96k90Q53P99j179j256J526R85n07r36j04J651L70j750
$$ plain form
2053 -326 -911 602 392 370 -1273 -912 851 683 -1182 -766 39 939 -6 -1609 136 1497 332 -389
2071 -389 -84 1171 1234 -584 -986 182 413 49 -844 -637 964 590 -1064 -825 540 877 156 -1137
2089 -1137 -119 1289 451 -611 -118 538 1330 -375 -1180 243 962 -93 -560 -547 607 979 -818
2106 -818 -917 451 433 -330 -897 -611 1290 440 -814 -99 682 1113 -142 -1130 452 1101 -59 -834 -415
2125 -415 725 606 -1023 -1190 381 555 -540 -530 -503 1351 909 -813 -285 831 794 -116 -1107 71
2143 71 1162 -337 -993 -420 364 804 -718 -1049 672 975 -259 -722 -248 828 846 -1096 -706 655
2161 655 497 -11 -896 58 1016 330 -981 -160 646 636 65 -786 299 1447 -213 -939 -196 470 598
2180 598 -631 -717 831 1030 -440 -347 -333 683 325 -1459 -669 407 185 -522 -897 191 1314 108
$$ packed form
2053c26n85J513k10k2j643L61J763j68j865M16Q05R00r45j603J745J361j165p21
2071c89L05J255O3j818m02J168K31l64q93K07J601l74j654K39J365L37p21j293
2089a137J018J408q38j062M93O56P92j705q05J423P19j055m67J3J154L72j797
2106h18r9J368j8p63n67K86J901q50j254P15P81M31j255r88J582O49j160p75M19
2125d15J140j19j629j67J571J74j095J0K7J854m42j722N28J116l7r10r91J178
2143G1J091j499o56N73P84M40j522l31J721L03j234m63M74J076J8j942L90J361
2161F55j58n08q85R54R58o86j311Q21Q06j0n71q51J085J148j660p26P43O66J28
2180E98j229q6J548J99j470R3J4J016l58j784P90J076k22p07l75J088J123j206
$$ plain form
2198 108 -830 -17 712 929 -240 -865 816 1003 -321 -654 -86 214 512 -847 -901 950 357 -534 -568
2217 -568 -14 1002 -30 -1217 -148 592 433 -379 -562 682 1365 -495 -925 125 764 307 -1020
2234 -1020 -1152 712 662 -480 -782 -96 806 400 -1283 -474 880 447 -233 -461 267 1504 -6 -717
2252 -717 202 933 -6 -664 -969 529 934 -609 -596 -2 360 166 -1096 -523 835 354 -865 -311 531
2271 531 1003 220 -643 441 742 460 -139 -791 691 943 -414 -976 588 449 95 -1159 -1011 579
2289 579 255 -569 -273 129 668 229 -748 -28 757 291 -826 -327 586 1411 -388 -1423 359 723 -224
2308 -224 -640 -605 407 1048 -418 -318 643 605 34 -995 -777 789 -58 -914 -253 495 1039 91 -1014
2327 -1014 -42 817 -223 -420 -153 321 1054 -297 -935 528 536 -132 -931 -490 631 286 -1049 -338 521
$$ packed form
2198A08r38Q13P29K17j169o25J681J87j324l33N68L00K98j359n4J851n93q91l4
2217e68N54J016j032j187J069P40j59q12j83J244O83j860m30J050O39m57j327
2234a020j32J864n0j142l02O86R02m06j683Q09J354m33o80k28P28J237j510p11
2252g17R19P31r39o58l05J498M05j543J3N94L62j94j262N73J358m81j219N54Q42
2271E31M72p83q63J084L01k82n99o52J482K52j357n62J564j39l54j254J48J590
2289E79l24q24K96M02N39m39r77P20P85m66j117M99R13Q25j799j035J782L64r47
2308b24m16L5J012O41j466J00R61l8n71j029K18J566q47q56O61P48N44r48j105
2327a014R72Q59j040j97K67M74P33j351o38J463Qo68p99M41J121l45j335P11Q59
$$ plain form
2346 521 693 50 -960 -600 686 72 -728 -274 700 1085 109 -647 603 868 -324 -382 -529 276 415
2365 415 -718 -567 538 785 -65 -810 -320 1041 115 -605 -72 364 763 -392 -836 132 661 -92 -473
2384 -473 -836 691 623 -210 -401 1035 846 -152 -335 -719 327 52 -950 -645 395 382 83 -812 296
2403 296 820 212 -641 -80 780 576 -40 -858 494 944 -451 -745 -473 -51 282 -715 -375 548 521 -370
2423 -370 -549 -211 828 163 -1015 -415 908 491 308 -368 350 987 4 -557 -45 58 438 -884 -1158
2442 -1158 310 273 -400 -742 -161 620 212 -747 100 960 850 58 -351 90 717 -100 -1065 -196 233 153
2462 153 -581 -724 329 878 -70 -413 -173 528 281 -708 -251 844 497 -277 -360 -60 825 -28 -1043
2481 -1043 -144 551 46 -324 -148 156 817 -498 -540 173 512 394 -597 -419 580 408 -479 -622 178 507
$$ packed form
2346E21J72o43j010L60J286o14q00M54R74L85r76p56J250K65j192n8j47Q05J39
2365D15j133J51J105K47q50p45M90J361r26p20N33M36L99j155m44R68N29p53l81
2384d73l63J527o8q33j91J436j89r98j83l84J046k75j002L05J040j3k99q95J108
2403B96N24o08q53N61Q60k04o16q18J352M50j395k94K72M22L33r97L40R23k7q91
2423c70j79L38J039o65j178O00J323m17j83o76P18O37r83n61N12J03L80j322k74
2442a158J468l7o73l42N81P81m08r59Q47Q60j10p92m09M41O27q17r65Q69M29q0
2462A53p34j43J053N49r48l43K40P01k47r89M57J095l47p74q3L00Q85q53j015
2481a043Q99O95n05l70J76L04O61j315m2P13L39j18r91J78R99j72q87j43Q00L29
$$ plain form
2501 507 -164 -756 -186 630 271 -301 -59 535 855 65 -758 -45 576 294 -52 -427 562 415 -581 -450
2521 -450 88 458 191 -724 -372 927 102 -595 -419 133 585 45 -669 -134 310 191 -354 -335 375 610
2541 610 -427 -784 354 592 143 -331 -126 481 400 -229 -464 -116 537 -145 -684 -155 724 -118 -710 -220
2561 -220 305 588 -95 -454 258 460 91 -253 -331 403 483 -797 -416 251 182 -325 -376 -493 669 137 -527
2582 -527 -274 117 522 -68 -490 110 337 -287 -552 -214 337 426 -321 -509 359 232 -176 -335 -304 557 310
2603 310 -563 -130 158 513 110 -494 118 462 185 -329 -43 152 364 -526 -668 -59 412 -393 -455 57
2623 57 623 305 -623 -339 507 356 80 -453 -118 671 181 -537 -106 529 357 180 -625 363 450 -150 -344
2644 -344 -122 29 149 -406 -418 561 443 -92 31 217 626 301 -933 -258 489 203 -14 -189 -129 737
$$ packed form
2501E07o71n92N70Q16l59n72K42N94L20p90q23P13O21k82l46l75R89j47r96J31
2521d50N38L70k67r15L52J299q25o97J76N52M52n40p14N35M44j19n45J9P10K35
2541F10j037l57J138K38m49m74K05O07q1o29k35L48O53o82n39N29Q79q42n92M90
2561b20N25K83o83l59P12K02l69l44p8P34Q0j280L81O67o9n07n1j17J162n32o64
2582e27K53L91M05n90m22O00K27o24k65L38N51Q9p47j88Q68j27m08j59L1Q61k47
2603C10q73M33K88L55m03o04O12L44k77n14K86J95K12q90j42O09M71q05o2N12
2623E7N66l18r28K84Q46j51k76n33L35P89m90p18M31O35j72j77q05R88Q7o00j94
2644c44K22J51J20n55j2R79j18n35J23J86M09l25j234O75P47k86k17j75O0Q66
$$ plain form
2664 737 -20 -793 -109 57 55 -526 -365 570 877 -429 -269 194 567 89 -401 -152 341 183 -47 -359
2684 -359 -60 782 368 -447 -92 416 19 -94 -507 142 461 -504 -326 104 379 241 -114 -531 393 542
2704 542 -288 -98 29 410 130 -264 -81 538 40 -330 -438 182 475 -299 -438 20 77 169 -435 -509 460
2725 460 469 -233 -477 286 402 461 -445 -178 754 123 -273 -335 -94 568 192 -507 -71 383 -69 -290 -557
2746 -557 222 417 -362 -445 188 230 139 -273 -234 278 172 -414 -49 307 847 420 -339 275 407 92 -552
2767 -552 -209 241 699 -283 -408 66 198 -313 -460 -544 -86 177 -624 -388 165 246 375 -70 -30 864 430
2788 430 -235 -203 -36 329 -117 -575 65 155 -341 -431 -514 32 92 -303 -384 122 155 7 -280 -8 511 328
2810 328 -558 -55 601 382 90 -270 217 536 -89 -409 -309 3 470 -415 -551 386 308 -374 -185 10
$$ packed form
2664G37p57p73O84J66kn81J61R35L07j306J60M63L73m78m90K49M93j58k30l12
2684c59K99Q42m14q15L55N08l97j13m13O49L19r65J78M30K75j38l55m17R24J49
2704E42q30J90J27L81k80l94J83O19m98l70j08O20K93p74j39M58N7R2o04p4R69
2725D60Rp02k44P63J16N9r06K67R32o31l96o2K41O62l76o99M36M54m52k21k67
2746e57P79J95p79q3O33M2r1m12L9N12j06n86L65L56N40m27p59O14J32l15o44
2767e52L43M50M58r82j25M74J32n11j47q4M58K63q01K36N53Q1J29m45M0Q94m34
2788D30o65L2J67L65m46m58O40R0m96r0q3N46O0l95q1N06L3j48k87K72N19j83
2810C28q86N03O56k19k92l60M87L19o25l20J00L12M67q85j36R37p8o82J89J95
$$ plain form
2830 10 370 195 -239 -542 467 172 -173 -292 -78 336 21 -692 -464 337 286 83 -461 163 554 -75
2850 -75 -495 -361 33 229 -454 -271 402 332 -184 -470 183 563 263 -316 -213 529 147 7 -102 93 270
2871 270 124 -204 -96 151 -82 -247 -519 152 185 -174 -483 52 385 258 -444 176 144 324 131 0 194
2892 194 636 154 -526 -390 461 210 -284 -392 -16 293 -222 -571 -44 304 241 -340 -485 341 -37 -269
2912 -269 -156 123 452 151 -330 -567 364 353 -218 -163 168 547 234 -466 -22 327 187 -339 -700 101 183
2933 183 -232 -286 15 254 128 -801 -225 383 -87 -58 -45 194 450 -53 -417 62 629 90 -34 -205 190
2954 190 464 -489 -372 -284 169 248 -489 -257 401 485 -152 -83 185 206 280 -158 -7 300 -14 -373 -234 -130
2976 -130 520 -200 -686 70 192 -34 -364 -578 241 209 -486 -99 354 501 43 -261 -3 305 178 -666
$$ packed form
2830A0L60j75m34l03J009k95l45j19K14M14l15p13K28Q01n1k03n44O24L91o29
2850g5m20J34L94J96o83J83O73p0n16k86O53L80l00n79J03P42l82j40j09J95J77
2871B70j46l28J08K47k33j65k72O71L3l59l09N35L33j27p02O20l2J80j93j31J94
2892A94M42m82o80J36Q51k51m94j08L76L09n15l49N27L48o3n81j45Q26l78k32
2912b69J13K79L29l01m81k37R31j1n71N5L31L79l13p00M44L49j40n26l61Q01Q2
2933A83m15n4L01K39j26r29N76O08m70K9J3K39K56n03l64M79N67n39j24j71L95
2954A90K74r53J17Q8M53P9p37K32O58Q4o37O9K68K1P4m38J51L07l14l59J39J04
2976a30O50p20m86P56J22k26l30k14Q19l2o95L87M53J47m58l04K58L08j27q44
$$ plain form
2996 -666 -134 -161 273 -1 -593 40 371 -16 -142 -441 244 897 -184 -300 84 354 195 -149 -54 427
3016 427 103 -446 -331 112 365 -13 -551 42 293 221 -522 -310 -39 335 -239 -202 384 512 292 -218 -369
3037 -369 71 298 -396 -234 128 485 -44 -186 -28 326 -140 -316 -35 31 429 -116 -517 313 363 304 -82
3058 -82 -123 99 288 -185 -346 212 123 -58 -440 -245 45 302 -282 -280 154 158 244 -606 107 392 -222 -199 195
3081 195 378 489 -246 -475 201 524 5 -242 -351 109 328 -387 -182 231 387 49 -210 190 186 -11 -85
3102 -85 -83 -80 341 258 -310 294 93 -55 127 -9 267 123 -223 -294 351 121 -63 -138 -1 482 163 -274 -98
3125 -98 295 84 -351 -435 -107 171 23 -306 255 -147 129 -213 -35 160 264 -135 59 67 298 -41 -409
3146 -409 7 312 285 -216 -116 -430 152 35 -567 -241 189 -1 -104 -11 33 271 252 -441 -46 89 437
$$ packed form
2996f66N32k7M34k74n92O33L31l87j26k99O85O53j081j16L84K70j59l44R5M81
3016D27l24n49J15M43K53l78n38N93K51p2p43K12K71L74n74L7N86J28k20n10j51
3037c69M40K27o94J62L62L57n29j42J58L54m66j76K81O6L98n45m01Q30N0n9l86
3058h2m1K22J89m73j61N58q9j81l82J95K90K57n84KM34MQ6q50P13K85o14K3L94
3081A95J83J11p35k29O76L23n19k47j09M60K19p15K05M13J56l38k59M00mj97p4
3102h5KLM21q3n68O04k01j48J82j36K76j44l46p1O45k30j84p5J37M83l19m37J76
3125i8L93k11m35q4L28K78j48l29N61m02K76l42J78J95J04l99J94QK31l39l68
3146d09M16L05k7n01J00l14N82j17o02L26M30j90j03R3M4K38j9o93L95J35L48
$$ plain form
3167 437 -245 -351 429 191 -38 -65 -39 36 -61 -195 105 -32 99 -132 -205 7 91 -198 -136 -33 153 109 -227
3190 -227 -233 161 686 35 48 -274 48 21 -183 -182 65 89 -246 -284 91 248 9 -434 -204 397 163 -201 -109
3213 -109 165 292 -58 -189 -97 -3 -51 161 -276 232 388 -193 -271 69 293 -182 -131 -141 209 -12 -62 -142 -280
3236 -280 360 -114 -420 127 197 28 -342 -196 363 280 -307 -62 -91 68 -49 -197 -298 148 111 -267 -246 -63
3258 -63 6 225 -482 -180 221 261 -286 -140 -12 403 -311 -210 216 168 75 -613 15 177 -14 -96 24 123
3280 123 -162 -86 -288 -395 46 119 57 -232 84 266 192 -374 77 196 -167 158 -288 149 318 -176 -244 51
3302 51 508 37 224 -93 10 32 -93 -184 -51 379 303 -156 310 82 151 -111 -135 188 -88 -8 -137 120
3324 120 266 -177 34 -75 265 113 -130 -133 158 -55 -160 -31 24 58 155 -108 -35 402 188 8 -139 33
$$ packed form
3167D37o82j06P80k38k29k7K6P5r7j34L00j37J31k31p3K12Q4k89O2J03J86m4l36
3190b27oL94N25o51J3l22L22k7k04JK47K4l35l8L75J57k39m43K30O01k34l64R2
3213a09K74J27l50j31R2R4m8K12m37N08J56n81p8L40K24m75N1j0L50k21n0q0j38
3236b80O40m74l06N47P0j69l70J46N59q3n87K45k9J59j17j48j01M46l7l78K1J83
3258f3O9K19p07L02M01M0n47J46J28M15p14J01M26m8r3o88O28J62j91q2J20R9
3280A23k85P6k02j07M41P3o2k89L16J82p4n66M51J19l63L25m46M37J69m94o8K95
3302E1M57m71J87l17J03K2j25r1J33M30p6m59M66k28O9k62k4L23k76Q0j29K57
3324A20J46m43K11j09L40j52k43lK91k13j05J29N5L4R7k63P3M37k14j80j47J72
$$ plain form
3346 33 180 322 -354 -47 -10 307 -185 -101 113 66 86 -5 -369 388 170 157 -58 157 11 38 69 -85 142
3369 142 56 139 -14 142 63 82 -268 -10 -136 162 -145 2 107 5 2 -173 169 374 -16 -209 38 270
3391 270 -26 73 -23 74 -22 -37 -144 306 231 -38 -44 207 285 242 -33 18 -33 -28 -106 111 -139 236 478 -472 73
3416 73 54 93 66 -134 67 187 361 -290 48 287 259 140 334 198 -87 -165 -327 19 -1 248 -210 -60
3438 -60 282 384 90 -213 289 8 -138 -397 -55 185 71 -103 -164 43 174 129 -77 -38 294 42 43 -45
3460 -45 31 67 -74 -82 -58 -161 50 -162 -103 241 160 -54 -110 443 224 44 224 10 69 111 1 -123 111 119
3484 119 -232 -16 -107 -83 173 -316 -147 -55 -39 -194 43 -223 12 -58 -36 147 -302 61 158 -239 24 186
3506 186 -228 -228 256 43 190 -72 -67 5 171 -42 -63 103 269 77 -131 93 42 -55 -64 -68 -91 6 18 -169 -86
$$ packed form
3346C3J47J42o76L07L7L17m92Q4K14m7K0r1l64P57k18j3k15K15j46K7L1j54K27
3369A42q6Q3j53J56p9J9l50K58j26K98l07J47J05j02lj75L42K05l90j93K47K32
3391B70k96R9r6R7r6j5j07M50p5k69oK51P8m3k75N1n1Np8K17k50L75K42r50N45
3416G3j9L9k7k00K01J20J74o51L38K39k8j19J94j36k85p8j62L46k0K49m58J50
3438f0L42J02k94l03N02k81j46k59L42K40j14j74o1K07J31m5k06L9L32k52Jq8
3460d5P6L6j41qK4j03K11k12N9L44q1k14n6N53k19j80J80k14N9M2j10j24K34Q
3484A19l51K16r1K4K56m89J69R2J6j55K37k66K35p0K2J83m49L63R7l97K63J62
3506A86m14%M84k13J47k62NP2J66k13k1J66J66j92k08K24n1r7rmk3R7J2j87Q3
$$ plain form
3531 -86 203 -86 -154 -114 301 342 -114 -50 105 -10 -98 -157 66 225 87 0 285 -4 -14 -8 -109 83 336 -167
3555 -167 197 -63 -99 105 187 -73 110 40 -165 169 31 -73 -33 -62 84 -91 101 -24 -87 -51 51 -120
3577 -120 -200 46 5 61 188 -259 27 441 -202 -58 -18 39 -44 62 55 165 161 140 98 150 358 -60 243 -70
3601 -70 47 -274 194 -42 -11 -141 -113 -7 127 49 25 -48 -106 17 27 109 59 -205 86 237 42 129 -15 -41
3625 -41 83 66 -264 149 -85 -90 -186 65 149 254 -106 39 322 -160 86 230 66 217 70 -15 -105 229 -175
3648 -175 -272 -41 -132 123 -62 74 94 -46 30 -397 199 82 -72 -235 -119 141 157 -30 -301 -66 -42 149
3670 149 -180 -104 210 275 -11 -57 -57 107 60 83 29 338 -237 -87 -38 -211 -39 -205 -55 150 61 -222 -142 -39
3694 -39 -288 -31 -30 -273 60 195 220 -2 -28 -138 -87 -193 73 14 13 -214 -135 -185 71 9 33 -13 77 -54 -141
$$ packed form
3531h6K89k89o8M0M15M1m56O4J55j15q8n9K23J59j38q7K85k89j0Oj01J92K53n03
3555a67L64k60l6K04Q2k60J83p0k05L34j38j04M0k9J46j75J92j25o3L6J02j71
3577a20q0K46m1N6J27m47K86M14o43J44M0N7q3J06pJ10mk1m2N2K08m18L03l13
3601g0J17l21M68k36L1j30K8J06J34p8k4p3n8J23J0Q2n0k64K91J51j95Q7j44k6
3625d1J24j7l30M13k34nr6K51Q4J05l60J45K83m82K46J44j64J51j47q5r0L34m04
3648a75r7K31r1K55j85J36K0j40P6m27N96j17j54j63J16K60J6j87k71K35K4J91
3670A49l29P6L14O5k86m6%J64m7K3n4L09n75J50M9j73J72j66J50K05q9k83Q0J03
3694c9k49K57Jk43L33J35K5k22k6j10N1j06K66n9jk27P9n0K56o2K4m6R0j31q7
$$ plain form
3719 -141 12 -65 -267 -44 -36 -45 -105 72 59 232 -9 -169 26 -139 -188 24 135 -140 135 -296 -247 136 -30
3742 -30 165 94 -22 244 231 262 60 196 -95 102 -136 -73 101 72 -252 -138 38 -329 -138 132 113 -273
3764 -273 -96 120 -107 219 234 -248 -154 142 -134 83 -21 -29 -53 102 201 0 38 2 -44 -34 19 146 102 116
3788 116 -95 -170 60 191 142 -2 -291 -77 121 267 -3 -60 -205 -182 8 -232 218 -140 43 -167 -7
3809 -7 1 54 -106 14 119 126 49 -65 45 106 44 69 -23 90 27 -53 -81 4 -44 -160 0 12 -51 -30 -127 261 50
3836 50 -126 -21 -146 127 -14 -336 -151 92 175 113 237 -33 84 136 -18 -168 28 271 -133 227 100
3857 100 177 79 6 75 -235 -137 210 245 80 -111 -142 -78 -46 -32 209 240 45 182 2 -235 -225 -68 -202 -76
3881 -76 180 -103 -60 89 -56 -19 62 87 167 -50 481 64 -208 11 -18 64 -72 -230 82 99 -62 150 -55
$$ packed form
3719a41J53p7k02K23Qro0J77j3J73k41j60J95j65m9K12J11k75K75m31M9L83j66
3742c0J95p1j16K66j3L1k02J36k91J97k38O3J74k9l24J14J76l67J91K70j9l86
3764b73J77K16k27L26J5m82R4K96k76K17j04qk4J55R9k01L8l6m6J0N3J27m4J4
3788A16k11p5K30J31m9j44k89K14J98J46k70n7j45K3J90k40M50l58J83k10J60
3809gQN3j60J20J05Pp7j14J10O1o2K5r2J13o3q0k8Q5m8j16J60J2o3K1r7L88k11
3836E0j76J05j25K73j41l22J85K43Q3o2J24k70J17N2j54j50J96K43m04L60j27
3857A00P7r8p3O9l10R8L47L5j65j91l1O4L2J4K41L1j95J37j80k37J0J57j34J26
3881g6K56k83M3J49j45L7Q1K5Q0k17N31m17k72K19k9Q2j36j58L12J7j61K12k05
$$ plain form
3904 -55 -168 3 -126 61 121 -214 -52 -31 -13 -52 122 289 -62 -102 -136 -80 87 -131 16 -23 -6 -9 27 60 79
3929 79 -39 10 -210 70 180 76 284 55 -14 168 64 -5 287 76 -201 -7 271 -176 233 214 -227 256
3951 256 53 -125 -87 168 -67 85 -57 -44 -58 -115 25 74 -45 125 79 -129 47 -94 -58 78 -54 236
3973 236 25 -22 -252 4 24 106 -91 75 -92 -17 7 -83 152 -105 -92 -150 -34 138 -62 174 -250 139 102
3996 102 -156 -27 219 175 172 5 -83 143 -34 153 154 51 -53 11 -52 -102 10 -164 -137 82 33 137 103 175
4020 175 -155 -126 -16 90 165 71 1 -84 -212 -289 -189 117 -246 136 -156 39 -315 172 178 295 -322 -159 -153
4043 -153 -7 101 114 88 -90 -108 305 -127 128 -175 98 15 -40 175 -20 24 -89 39 157 1 135 124
4065 124 -174 -56 226 -129 33 97 -15 -191 26 -162 123 -77 -225 5 -2 -183 26 105 -18 -77 177 86
$$ packed form
3904e5j13J71j29J87O0l35J62K1J8l9J74J67l51m0l4N6J67k18J47l9J7lL6L3J9
3929G9j18M9k20K80J10j04K08k29o9J82j04o9K92k11k77J94K78m47M09j9m41M83
3951B56k03j78L8K55k35J52j42J3j4n7J40M9j19J70m6k08J76j41L6J36j32K90
3973B36k11m7k30K56K0Q2j97J66j67P5K4r0K35k57J3n8J16J72k00K36m24L89l7
3996A02k58J29K46m4lj67q8K26j77J87Jj03j04O4o3n0J12j74K7K19m9J04l4P2
4020A75l30K9J10J06P5r4p0q5j28p7J00L06l63L82k92J95l54M87OJ17o17J63O
4043a53J46J08J3k6j78j8M13m32K55l03K73q3n5K15j95M4j13J28J18j56J34j1
4065A24k98J18K82l55J62O4j12j76K17j88K85k00j48K30pj81K09P9j23n9K54r1
$$ plain form
4087 86 138 224 -155 -56 441 143 195 -103 -93 -2 78 -78 -144 -16 16 -217 -82 -100 -45 106 -44 -178 21 338
4111 338 -132 309 -84 103 71 -149 14 147 -20 -152 101 -36 179 -87 -178 -102 -79 162 93 110 45 105 -298
4134 -298 -111 -59 2 26 -125 -216 150 -45 26 107 7 -88 -79 -289 -184 58 -2 195 138 116 34 173 -195 418
4158 418 24 133 -179 -10 -149 -140 -117 110 35 -121 235 -15 99 142 95 -177 44 123 176 200 185 46 221
4181 221 -110 -24 -177 22 194 51 -93 265 20 17 -281 -131 129 -50 165 -225 128 -38 255 -9 152
4202 152 -88 140 110 71 68 353 -209 40 299 -67 146 115 140 270 13 162 -277 247 132 -73 157 -445
4224 -445 -95 -145 -191 -38 8 -102 159 18 -98 -220 -252 111 124 46 206 100 -183 -138 -83 -139 -100 -30 111 -171
4248 -171 -366 -296 87 29 -80 314 -196 41 -110 138 -166 -288 325 -205 -30 224 -54 -19 68 -246 49
$$ packed form
4087H6N2Q6l79R9M97k98N2k98J0R1Q0j56o6J28L2k33J35j8N5J51j50j34J99L17
4111C38m70M41l93J87l2k20J63J33j67j32K53j37K15k66r1P6K3K41o9J7o5O0m03
4134b98J87N2O1K4j51r1L66j95P1Q1j00r5Rk10J05K42o0J97n7k2q2J39l68O13
4158D18l94J09l12J69j39RK3K27p5j56L56k50J14M3m7k72K21P9N3K4j5j39J75
4181B21l31Q6j53J99J72j43j44L58k45lk98J50K60j79K15l90L53j66K93k64J61
4202A52k40K28l0l9lK85n62K49K59l66K13l1K5J30k57J49m39N24j15k05K30o02
4224d45L50n0m6J53M6j10K61j41j16j22l2L63J3p8J60j06k83M5N5n6L9P0J41k82
4248a71j95P0L83n8j09L94n10K37j51K48l04j22O13n30J75K54k78L5Q7l14K95
$$ plain form
4269 49 123 -375 -1 80 -58 -20 -212 2 248 169 -380 23 -22 100 -207 -7 -83 -9 136 -112 -120 187 -85
4292 -85 157 -110 -162 278 255 68 111 120 -145 -426 230 330 168 71 -144 -143 -38 44 -9 145 -4 -17 -234 -187
4316 -187 87 443 33 156 222 9 66 -166 11 64 -123 -73 -154 132 -303 -360 58 45 -212 17 -225 -115
4338 -115 12 129 101 -167 128 32 210 -36 -305 32 -254 -129 137 -119 -252 14 -111 -57 146 -307 68
4359 68 -97 -88 -114 318 -10 -105 78 98 -94 22 203 373 -94 13 188 -21 12 -126 -104 -15 130 -170 2
4382 2 40 121 -245 -43 96 257 -72 30 -348 -37 161 -157 -225 155 195 -62 -37 20 101 -130 148 -243 -60
4405 -60 112 -24 -169 76 94 24 224 45 -124 215 -11 245 -185 -97 117 -131 272 -159 14 57 -280 217
4427 217 18 312 -29 -303 -106 187 -258 -121 -130 114 -32 -186 137 -127 -37 -344 106 -50 -67 -29 122 -221
$$ packed form
4269D9P4m98L74Q1j38L8j92K14K46p9n49M03m5J22l07K00p6P4J45k48qL07k72
4292h5K42k67n2M40k3j87M3Rk65k81O56J00j62r7k15JJ05Q2n3J54j49j3k17M7
4316a87K74L56m10J23O6k13N7k32J77N3j87N0q1K86m35n7M18j3k57K29k42J10
4338a15J27J17k8k68K95r6J78k46k69L37k86J25K66k56j33K66j25N4K03m53L75
4359F8j65Rk6M32l28r5J83K0j92J16J81J70m67J07J75k09L3j38K2Q9J45l00J72
4382BL8Q1l66K02J39J61l29J02l78L11J98l18o8L80M0k57K5N7Q1k31K78l91J83
4405f0J72j36j45K45J8p0K00j79j69L39k26K56m30Q8K14k48M03m31J73M3l37M97
4427B17j99K94l41k74J97K93m45J37rK44j46j54L23k64R0l07M50j56j7L8J51l43
$$ plain form
4449 -221 -157 -274 -117 -41 45 62 -175 73 201 18 -6 186 -53 -70 -156 182 42 128 -60 -130 -311 70 36
4472 36 -140 211 -80 142 -79 120 -95 295 19 9 227 6 87 78 -5 73 37 -90 107 -198 -21 -21 -333
4495 -333 -288 -202 -116 -224 -233 -188 -58 190 -93 19 -70 -100 231 -200 -199 -75 -91 -126 -152 -244 -26 68 39 -127 -28 62
4521 62 17 -46 10 102 -137 194 -67 257 -67 -69 -209 6 -14 -277 117 66 76 48 224 -87 191 -122 1 18
4545 18 127 157 132 -27 0 -161 -7 153 -92 -142 108 170 82 195 158 -30 -71 -317 45 106 93 -2 -68 78
4569 78 -2 -199 -259 125 179 9 6 86 242 -48 -44 12 -156 24 117 132 -32 161 -131 -122 301 -57 -140 -200 90
4594 90 33 48 32 81 34 -12 85 111 -1 -6 -118 62 -178 -116 290 20 -59 -212 -280 37 60 386 -5 139 54
4619 54 70 -181 -192 -219 114 -50 -91 -143 -28 -72 198 -141 -180 250 116 158 26 -51 -19 -42 108 -205 -44 114
$$ packed form
4449b21O4j17J57P6Q6J7k37K48J28j83k4J92k39j7q6L38j40Q6j88p0j81L81l4
4472C6j76L51k91K22k21J99k15L90k76j0K18k21Q1rq3P8l6j27J97l05J77%l12
4495c33M5Q6Q6j08rM5J30K48k83J12q9l0L31m31JJ24j6l5k6r2K18R4k9j66R9R0
4521F2m5o3N6R2k39L31k61L24l24kj40K15k0k63L94n1J0k8J76l11K78l13J23J7
4545A8J09L0k5j59K7j61J54J60k45n0K50O2q8J13l7j88m1k46L62O1j3r5o6J46
4569G8q0j97o0L84N4j70lQ0J56k90MN6j68J80R3J5j64J93k92RM23l58q3o0K90
4594I0n7J5j6M9m7m6R7K6j12nj12J80k40O2M06k70p9j53o8L17K3L26l91J44q5
4619E4J6k51j1k7L33j64m1n2J15m4K70l39l9M30j34M2j32p7L2k3J50l13J61J58
$$ plain form
4643 114 136 237 210 78 -92 -161 -283 35 -58 61 26 -182 -141 -28 18 33 -142 21 -139 17 -310 -37 -200
4666 -200 130 -11 128 134 124 -250 -1 199 278 118 -45 -300 140 -121 -129 -107 -139 -75 35 75 -12 -65 -112 -225
4690 -225 -198 119 24 -57 -280 -51 112 -39 173 81 -10 -214 88 -250 57 30 215 -26 115 -93 181 244
4712 244 -73 422 190 -211 -180 17 6 -141 1 -210 0 10 163 111 9 186 -101 -54 163 -4 22 -221
4734 -221 105 77 110 27 -204 -376 -46 6 -120 98 196 176 -69 172 149 187 75 15 -167 174 -211 -115 -128 -74
4758 -74 -73 -198 91 -19 224 -153 -10 -65 35 -135 -156 -39 240 157 71 216 115 222 -69 13 39 -54 -22 -180
4782 -180 -21 -121 8 -249 16 58 -87 358 123 -164 -126 145 -10 236 97 -69 78 -310 58 137 -139
4803 -139 -151 -97 84 7 192 -141 28 8 -16 79 33 -74 -27 96 -212 -176 5 -235 -30 71 -130 -184 -7
$$ packed form
4643A14K2J01k7j32j70o9j22L18r3J19l5k08M1J13M6J5j75J63j60J56l27K73j63
4666b00L30j41J39Oj0l74K49K00P9j60j63k55M40k61qK2l2O4J10M0q7n3m7j13
4690b25K7L17r5q1k23K29J63j51K12r2r1k04L02l38L07k7J85k41J41k08K74O3
4712B44l17M95k32m01L1J97j1j47J42k11K10J0J53n2j02J77k87M7K17j67K6k43
4734b21L26k8L3q3k31j72L30N2j26K18R8k0k45K41k3L8j12o0j82L41l85R6j3N4
4758g4Jj25K89j10K43l77J43n5J00j70k1J17K79q3q6J45j01J07k91Q2K6r3L2j58
4782a80J59j00J29k57K65M2j45M45k35k87L8K71j55K46j39j66J47l88L68P9k76
4803a39j2N4J81p7J85l33J69k0k4R5m6j07M7J23l08L6J81k40K05J01k01n4J77
$$ plain form
4826 -7 -5 115 -145 -112 60 83 -15 -140 -228 -77 -133 -216 -251 237 -79 64 80 -50 -194 255 158 56 -54 -60 117
4851 117 128 -31 -251 -99 -90 -22 -57 -18 43 -134 -169 57 -235 108 91 -127 -58 -20 23 -83 32 84 -193 -68
4875 -68 93 -9 48 -171 100 -147 159 226 107 -18 -153 -44 -237 47 7 -39 -26 228 24 23 224 -124 239
4898 239 139 -84 -215 238 -61 -172 94 -142 -239 -42 -25 28 -106 98 123 -93 -102 103 41 47 -45 -42 276 274 95
4923 95 -20 51 89 -111 -238 43 131 86 -302 -89 -119 -187 -88 140 -35 109 319 -75 91 -135 254 -40 38
4946 38 -131 -35 145 -63 -139 -129 307 12 -208 -268 326 -117 -290 85 -50 -109 -23 17 -23 83 349 142 34
4969 34 81 126 72 -237 45 176 -85 -24 -77 94 67 143 -1 -120 -171 -97 135 -146 -29 -39 -28 13 45 17 -39
4994 -39 139 179 38 -230 -416 -169 -127 -119 -298 -183 -29 -128 -87 147 127 14 46 7 300 20 93 -314 -187 39
$$ packed form
4826gKJ20k60L3J72K3r8j25q8J51n6q3l5M88l16J43J6j30j44M49r7j02j10oJ77
4851A17J1j59k20J52RO8l5L9O1j77l5K26k92L43j7k18O9L8M3j06J15N2k77J25
4875f8J61j02N7k19K71k47L06O7j19j25j35J09j93K84m0m6J3K54k04jK01l48L63
4898B39j00k23j31M53k99j11K66k36r7J97J7N3j34K04K5k16rK05o2Or2LL18kj79
4923I5j15P1L8k00j27K81Q8m5l88K13l0o8R9K28j75J44K10l94J66k26L89k94P8
4946C8j69R6J80k08p6J0M36k95k20o0N94m43j73L75j35n9Q6M0m0J06K66k07j08
4969C4M7M5n4l09K82J31k61O1n3J71k7P6j44j19n1P4K32k81J17j0J1M1L2k8n6
4994c9J78M0j41k68j86K47M2Qj79J15J54r9M1K34k0j13L2l9K93k80P3m07J27K26
$$ plain form
5018 39 10 -127 101 122 -20 -22 171 -44 -193 191 61 -135 -208 -148 205 -113 -202 37 107 -305 -212 278 -69
5041 -69 98 -104 38 -77 -9 38 50 123 -264 168 -289 -140 -28 185 215 16 -83 -36 441 -338 -100 -226 -141
5064 -141 96 84 -23 -136 -363 196 -23 -195 -140 -67 5 -50 -25 -85 -78 39 -45 -114 -148 -31 -127 27 128 -70
5088 -70 70 17 -35 -53 -152 -73 -42 -224 264 36 77 178 276 -217 278 124 -97 131 102 56 126 308 -114 -190
5112 -190 244 -130 111 -20 -76 -222 -71 172 57 70 125 20 -113 -28 -279 -122 -145 66 -117 173 78 51
5134 51 316 74 303 67 -63 -82 151 132 -166 -48 -144 211 -149 -117 186 11 65 -62 155 -6 -48 -101 25
5157 25 -180 107 50 141 232 -77 -48 -70 -249 208 -28 -46 30 113 19 -59 178 -41 112 -77 -213 208 256 2
5181 2 -263 -70 299 -12 63 -61 33 2 -155 257 -145 -251 -174 271 45 168 -31 16 223 -93 61 -47
$$ packed form
5018C9k9j37K28K1j42kJ93k15j49L84j30j96p3O0L53l18q9K39P0m12R3M90l47
5041f9J67k02J42j15O8M7J2P3l87M32m57J49J12K13L0j99r9M7M77p79K38j26Q5
5064a41K37j2j07j13k27N59k19j72N5P3P2n5K5o0PJ17q4o9l4J17r6J54J01j98
5088g0J40n3n2j8r9P9L1j82M88k28M1J01R8m93M95j54k21K28k9m6P0J82m22p6
5112a90M34l74K41j31n6j46J51K43j15J3N5j05j33Q5k51J57k3K11j83K90r5k7
5134E1K65k42K29k36j30j9K33j9k98J18r6L55l60L2L03j75N4j27K17j61m2n3J26
5157B5k05K87n7R1R1l09K9k2j79M57k36j8P6Q3r4p8K37k19J53j89j36M21M8k54
5181Bk65J93L69l11P5j24R4l1j57M12m02j06P7M45k26J23j99M7K07l16J54j08
$$ plain form
5203 -47 90 76 45 161 183 -152 115 -89 -171 -104 108 -8 10 -34 16 -53 -151 -44 175 33 151 -174 96 3
5227 3 -34 -53 29 61 149 -29 315 165 104 -48 119 -291 152 35 47 257 7 84 93 -71 -161 206 131 -119 -80
5252 -80 1 -107 27 -26 -43 127 333 -2 -221 -64 269 120 38 66 -30 -65 -216 74 92 99 120 8 109 272
5276 272 -138 -178 -22 34 -155 -68 -19 35 118 168 39 102 22 86 -41 204 -194 -161 -400 -101 -82 361 -133 -117
5300 -117 -170 32 31 54 -149 342 164 9 116 -188 351 125 -36 -39 237 268 58 10 16 -220 -60 -17 28 24 235
5325 235 -64 -25 -46 -189 147 32 -131 -253 29 -180 184 280 146 67 213 76 63 -10 40 2 -6 -161 16
5348 16 280 41 125 -36 281 67 48 -181 91 -210 -40 3 -113 40 -193 -160 -5 -130 -33 -21 -215 69
5370 69 -31 -124 130 -37 -82 213 6 153 88 -68 -148 -6 27 -81 -228 41 73 -46 56 75 -162 -19 -350
$$ packed form
5203d7J37j4l1J16K2l35K67k04q2O7K12j16J8m4N0o9r8J07K19j42J18l25K70r3
5227Cl7j9Q2L2Q8j78L44j50o1j52J67m10M43j17J2K10k50P7Rj64r0L67p5k50L9
5252h0Q1j08J34n3j7J70K06l35k19J57L33j49q2K8r6l5j51K90J8PK1j12J01J63
5276B72m10m0J56N6j89Q7M9N4Q3N0j29O3q0O4j27K45l98L3k39K99J9M43m94J6
5300a17n3K02jK3k03M91j78j55J07l04N39k26j61lK76L1k10m8Ok36J60M3M5mK11
5325B35k99L9k1j43L36j15j63j22K82k09L64R6j34p9J46j37j3p3N0l8qj55J77
5348A6K64k39Q4j61L17k14j9k29K72l01J70M3j16J53k33L3J55j25R7J2j94K84
5370F9j00r3K54j67m5K95k07J47o5j56q0J42L3j08j47K69L2j19J02J9k37J43l31
$$ plain form
5393 -350 71 8 -68 22 184 254 233 228 107 3 94 -286 125 112 16 -69 -200 -26 173 -154 -126 61 -70 33
5417 33 -91 -21 65 142 -5 -319 -263 177 -65 32 -12 -171 65 242 -200 -203 177 26 145 10 102 -131 10
5440 10 -168 240 29 214 -21 62 -43 66 82 55 -184 -5 -208 -29 112 187 209 -193 -36 -155 -103 -12 105
5463 105 -89 -45 -67 189 -165 59 130 406 -8 270 -92 -88 -159 18 194 -11 40 -352 252 32 147 -155
5485 -155 -106 -58 21 124 -49 2 -150 66 167 -201 -77 229 -46 38 -174 71 18 -152 18 171 -210 -85
5507 -85 40 245 -88 -127 -7 67 -130 -29 160 -147 127 88 -222 58 23 -111 186 151 284 334 -11 -31 -128
5530 -128 -231 66 122 145 -91 287 -109 -222 -71 46 -177 -90 -2 -160 -143 -47 -223 104 -17 -156 -10 -402
5552 -402 57 -192 -20 315 233 13 -245 -181 47 205 -236 -89 -100 202 186 -150 -98 117 -275 -83 172 148
$$ packed form
5393c50M21o3p6R0J62P0k1nj21j04R1l80M11j3r6q5j31J74J99l27K8J87j31J03
5417C3j24P0Q6P7j47l14N6M40k42R7m4j59K36J77m42lL80j51J19j35R2k33J41
5440A0j78M08k11J85k35Q3j05J09J6k7k39J79k03J79J41P5K2m02J57j19N2R1J17
5463A05j94M4k2K56l54K24P1K76m14K78l62Mp1J77J76k05N1l92O04k20J15l02
5485a55M9M8P9J03j73N1j52K16J01l68J24L06k75Q4k12K45n3j70J70J53l81J25
5507h5J25K05l33l9J20P4j97J01J89l07K74l9l10K80l5j34K97l5J33N0l45k0r7
5530a28j03K97N6K3k36L78l96j13J51J17k23Q7Q8j58J7R6j76L27j21j39J46l92
5552d02M59k49J72L35q2k20k58O4K28J58m41J47j1L02j6l36N2K15l92J92K55k4
$$ plain form
5574 148 22 -110 -17 8 -49 -61 -66 81 184 -122 62 -200 115 -165 -97 -30 137 53 -53 198 89 -26 -14
5597 -14 -151 -12 105 -154 198 -66 -169 -133 -94 36 84 71 -2 -145 35 -164 148 471 229 -31 89 -223
5619 -223 143 148 75 69 -20 67 -155 -187 -18 -58 -169 -69 143 23 212 215 -98 -159 -256 -14 -63 263 -26 225 239
5644 239 -166 -183 190 204 100 -57 85 194 -89 50 -37 -55 381 254 12 111 57 -194 50 8 -118 44
5666 44 -148 -165 -11 90 61 -16 -355 -41 303 -171 -13 -157 35 -163 -213 -100 -85 -138 28 -133 228 36
5688 36 -93 -85 -37 -14 -109 189 -48 -125 -226 80 135 -38 -168 30 251 38 103 63 -73 172 -160 -112 -140 -342
5712 -342 108 82 -219 103 119 -250 -201 -26 -234 -40 -327 4 -95 -194 72 173 -95 -18 3 -38 -429 -156 140
5735 140 -180 -163 -113 -2 -181 15 12 147 -125 -52 61 140 106 -18 56 -77 157 65 9 -81 -72 -88 -172 -24 92
$$ packed form
5574A48j26j32R3K5n7j2nJ47J03l06J84k62L15k80O8O7J67q4j06K51j09j15J2
5597a4j37J39J17k59L52k64j03L6L9J30M8j3p3j43J80j99L12L23k42k60J20l12
5619b23L66Np3oq9Q7k22l2J69m0j11J00K12j20J89Ll13o1r7K42m9L26k89K51J4
5644B39m05j7L73J4j04j57J42J09k83J39q7j8M36j27k42R9n4k51K44m2j26J62
5666D4j92j7J54J01k9p7l39L14L44m74J58j44J92j98n0J13J5n3J66j61L61j92
5688C6j29QM8K3r5K98k37p7j01L06N5j73j30J98K21k13O5m0j36K45l32M8k8k02
5712c42M50k6l01L22J6l69M9J75k08J94k87L31r9r9K66J01k68P7K1m1l91K73K96
5735A40l20J7N0J11j79J96lJ35k72P3J13P9l4j24P4j33K34r2n6r0Rj6q4J48J16
$$ plain form
5760 92 -117 164 57 -119 10 22 134 -34 -135 135 89 -147 4 -20 -153 -121 30 125 105 113 -35 81 244
5783 244 -51 144 -298 -291 48 -216 -49 -90 72 -135 311 -290 10 60 269 18 -73 -6 -176 -16 -16 66 125
5806 125 -264 -221 -90 -85 150 -187 -9 130 157 -56 -108 298 99 -2 96 307 -145 -269 -270 -147 150 -136 -7
5829 -7 -18 -65 -53 56 155 269 -30 147 65 -41 97 34 -238 -306 6 -39 7 -128 25 -32 -188 4 95 3 173
5854 173 -22 83 95 -179 -248 -14 9 1 94 126 -17 97 61 92 -123 -240 -205 -2 -162 -205 -168 -103 -171 -10 -125
5879 -125 359 5 -16 -118 98 228 -198 143 -69 -295 -140 -113 55 58 236 -176 -54 -39 1 295 69 -307
5901 -307 90 161 -24 137 -64 -255 -213 -49 -42 44 133 -86 -89 -245 -3 -135 -317 107 78 150 -236 -19 -85 144
5925 144 27 85 -34 -69 122 57 97 80 -94 -149 -294 -131 42 -40 -36 -333 -37 -185 116 108 7 65 211 -51
$$ packed form
5760I2k09K81j07j76J29J2J12j68j01K70m6k36J51k4j33L2J51R5k0Qj48J16J63
5783B44k95J95m42PL39k64J67m1J62k07M46o01L00N0K09k51r1O7j70J60%Q2N9
5806A25l89M3J31NK35l37J78J39K7k13n2M06j99j01R8K11m52j24jJ23K97k86J29
5829gj1m7J2J09R9J14k99J77q2j06J38o3k72o8L12m5M6j35J53n7j56J92R1r2J70
5854A73j95J05J2k74o9K34K3qR3L2j43J14l6L1k15j17L5K03j60m3L7O5o8J61j15
5879a25M84l54k1j02K16J30m26L41k12k26J55K7J68LJ78m12J22J5M0K94k26l76
5901c07L97P1j85J61k01j91M2J64PQ6Q9k19lj56K42j32j82M24k9P2l86K17o6K29
5925A44j17N8j19l5J91o5M0j7j74n5j45J63J73q2Mk97K96j48L01qj01N8J46k62
$$ plain form
5949 -51 139 -144 -82 -195 -140 177 208 87 -111 46 101 -5 -97 65 99 167 179 -44 2 -99 -32 -47 -64 -261
5973 -261 -28 -241 98 132 19 -149 10 -188 -57 -24 241 315 -67 257 -27 50 -228 -34 -225 -140 -35 -75
5995 -75 40 2 -130 -27 -177 -176 100 89 153 -107 65 -203 74 269 -92 -16 -68 23 -46 -173 -117 4 -62 -305
6019 -305 -154 -91 -48 7 -25 197 -96 91 61 6 346 103 249 41 131 -58 -79 -46 -224 68 106 -63 -175
6042 -175 168 49 -227 -143 65 110 179 6 -202 89 -22 95 58 -29 -252 -162 117 -98 192 -197 -258 -41
6064 -41 134 4 26 -5 135 153 -268 -4 -216 -111 57 -230 -228 148 61 -74 246 102 57 262 -49 2 -33
6087 -33 65 -156 257 -121 52 -87 -319 -133 -24 -28 -6 10 -217 -63 -19 -63 -146 22 255 -168 170 -46 106
6110 106 -151 -98 -227 208 112 72 -225 -22 296 93 168 -188 -84 -216 -152 60 -5 -115 201 142 -169 -221 -376
$$ packed form
5949e1J90k83O2j13N5L17L1j21j98J57N5j06r2J62L4O8J2k23M6j01O7j5j7j97
5973b61K33k13L39L4j13j68J59j98J31L3K65P4l82L24k84P7k78J94j91Q5J05m0
5995g5J15l8j32J03j50JK76j1O4k60J72k68K77J95l61P6n2R1o9j27N6J21o6k43
6019c05J51O3M3N5l2K22k93J87l0n5L40k43J46k08R0j89k1L3j78K92L8j69j12
6042a75L43j19k76Q4K08M5O9j73k08K91j11J17l7q7k23R0K79k15K90l89o1K17
6064d1J75j30K2l1J40J8m21K64k12J05J68k87KL76q7j35L20j44m5K05l11N1l5
6087c3R8k21M13l78J73j39k32J86J09mK2J6k27J54M4m4q3J68K33m23L38k16J52
6110A06k57N3j29M35r6m0k97K03L18k03P5l56J04j32O4K12o5j10L16n9l11n2j55
$$ plain form
6133 -376 45 -169 36 220 -79 132 -101 -112 73 -212 335 -68 274 -244 51 121 -136 -138 -187 150 25 -42
6155 -42 56 -109 55 -238 264 173 -37 193 -158 143 -132 265 52 123 136 57 169 59 -70 109 184 -49
6177 -49 103 -139 93 115 -57 -125 -83 -130 19 -122 137 13 -13 84 -103 54 1 -62 196 173 -189 101 -70
6200 -70 249 -102 -54 -80 347 -166 195 -29 -81 164 -12 70 88 294 121 10 4 -169 27 -24 -117 -281 -9
6223 -9 78 158 -272 -137 145 57 74 70 80 85 -183 -85 -8 87 311 37 139 -123 -249 58 69 -53 380 18 -109
6248 -109 -45 -32 54 -84 -325 309 -66 24 37 183 183 49 487 -73 -52 -91 200 -18 -229 271 103 -196 6
6271 6 -218 177 390 26 -199 -32 91 17 0 253 135 -76 34 85 -205 -132 -48 128 -3 137 -13 -131
6293 -131 -215 31 -139 -19 3 -70 -47 29 -68 -24 -121 202 38 -39 -19 137 292 -2 258 -111 72 -68 28 -93
$$ packed form
6133c76M21k14K05J84k99K11k33j1J85k85N47m03L42n18K95P0k57km9L37j25o7
6155d2R8j65J64k93N02r1k10K30l51L01k75L97k13P1J3p9J12j10j29J79P5k33
6177d9J52k42K32K2j72o8M2m7J49j41K59j24k6R7j87J57n3o3K58k3l62K90j71
6200g0L19l51M8k6M27n13L61k24n2K45j76Q2J8K06j73j11oj73J96n1r3j64K72
6223iQ7Q0m30J35K82q8J7mJ0Nk68R8P7R5K24k74J02k62j26L07J1j22M33l62j27
6248a09O4J3Q6j38k41O34l75R0J3J46%j34M38n60K1l9K91k18k11N00j68k99K02
6271Fk24L95K13l64k25J67J23p4j7K53j18k11J10N1k90P3Q4J76j31J40j50j18
6293a31q4K46j70J20K2p3K3P6r7M4r7L23j64p7K0J56J55k94K60l69J83j40R6j21
$$ plain form
6317 -93 -109 154 -34 157 217 -168 4 28 92 27 -1 -41 -85 138 -60 94 103 -99 67 -6 -25 -186 -35 198
6341 198 -414 96 -27 136 50 -166 -135 80 -271 33 241 -80 40 32 -129 -82 -90 5 59 9 -184 40 138 190
6365 190 -188 46 -2 61 116 -151 216 -318 191 -80 15 -193 36 -6 64 111 -29 -174 -84 229 179 142 45 -76
6389 -76 -134 -70 198 -372 -42 -7 253 19 -182 81 -5 -71 -238 220 -108 24 198 -319 149 133 -141 75
6411 75 64 24 254 1 -95 72 -55 41 116 -108 174 -14 101 -104 277 52 -137 -93 -87 296 60 -66 119
6434 119 -155 -184 25 272 -49 -180 207 -251 -194 199 -188 63 -21 -9 -85 -14 -40 -139 46 -51 -161 66 195
6457 195 136 26 -101 -41 -139 56 195 -59 51 -153 -215 -373 29 -329 124 86 -46 -27 4 82 -28 113 60
6480 60 -88 116 29 -21 43 55 -62 -78 61 -39 -126 19 38 -66 -305 97 8 -18 -106 210 129 -21 161 8
$$ packed form
6317i3j6K63j88J91O0l85J72K4O4o5k8m0m4K23j98J54Rk02J66p3j9j61J51K33
6341A98o12N10j23J63q6k16L1K15l51L04K08l21J20qj61M7qR5N4n0j93K24R8N2
6365A90l78K34m8O3N5k67L67n34N09k71R5k08K29m2P0M7j40j45R0L13n0l7r7j21
6389g6n8O4K68n70L30L5K60k34k01K63q6o6j67M58l28J32J74n17M68j6k74K16
6411G5j1m0K30k53r6J67j27R6P5k24K82j88J15k05L81k25j89M4OL83k36j26J85
6434A19k74k9K09K47l21j31L87m58N7L93l87K51q4J2p6P1k6r9J85r7j10K27J29
6457A95n9j10j27O0r8J95J39k54J10k04o2j58M02l58M53l8j32J9L1P8j10J41n3
6480F0j48K04q7n0O4J2j17j6J39j00q7J45J9j04k39M02q9k6q8L16q1j50J82j53
$$ plain form
6504 8 -127 63 16 80 311 -52 -205 -265 3 196 197 59 40 -26 13 60 107 -129 -46 -144 13 -34 -203 134 125 -59
6530 -59 51 -24 4 227 78 148 -130 152 47 58 -189 0 122 80 -105 -167 -70 -85 -269 306 131 172 51
6553 51 178 50 -273 -80 -141 206 10 199 -131 82 -135 -37 -29 51 150 -170 -21 156 -166 229 -161 269
6575 269 -71 -103 106 24 -115 452 55 -20 254 318 -105 -204 125 -52 291 2 145 82 126 -224 22 -109
6597 -109 -70 105 49 -51 -59 -191 269 188 52 80 109 2 285 59 -45 -63 144 191 119 41 -127 1 116 1
6621 1 -84 -73 -62 -2 -77 -273 6 427 -78 161 -12 -387 9 49 75 141 -18 145 -314 76 -95 -224 123
6644 123 260 128 -387 -118 185 -47 -39 11 -147 147 -27 69 248 -462 -180 94 441 -111 171 24 -166
6665 -166 192 -100 -56 -21 -244 -91 -48 53 152 -165 -149 -8 45 -25 -143 46 42 -294 58 -133 -69 109 196 -325
$$ packed form
6504Hj35J90m7O4K31l63j53o0K68J93Jj38j9o6L9M7M7k36Q3r8J57m7j69L37rj84
6530e9J10p5K8K23j49P0k78K82j05J1k47J89J22m2j85o2R7j5j84N75j75M1j21
6553E1J27j28l23J93o1L47j96J89l30K13k17R8QQ0R9l20J49J77l22L95l90M30
6575B69l40l2K09q2j39N67l97p5K74O4m23r9L29j77L43k89J43o3M4l50K46j31
6597a09L9J75n6j00qj32M60q1j36K8K9j07K83k26j04j8K07M7p2p8j68J28J15j15
6621Aq5J1J1O0p5j96K79M21n05K39j73l75L96M0K6O6j59J63m59L90j71j29L47
6644A23J37j32n15K69L03k32QN0j58K94j74R6J79p10K82K74L47n52K82j47j90
6665a66L58k92M4L5k23J53M3J01R9l17J6J41N3p0j18J89ml36L52j91O4J78Q7n21
$$ plain form
6689 -325 -280 71 20 -166 175 128 -81 -195 -28 286 98 -103 70 -19 -55 121 -28 195 -174 190 221 -53
6711 -53 66 141 28 -37 229 199 -56 95 55 95 -147 160 43 -90 -36 -154 -210 -150 257 -3 -133 -199 -156 10
6735 10 16 89 -267 -249 -46 170 -32 -283 -144 29 40 210 14 228 -36 253 -226 -19 -127 -101 -211 -152 -107
6758 -107 -320 -129 -175 -63 -222 -160 100 -63 68 -57 -70 145 108 -37 -383 18 -93 -59 -217 146 -331 164
6780 164 -207 -175 43 -152 129 -195 -6 88 98 -243 136 25 113 152 -50 25 409 178 36 0 -61 -1 -122
6803 -122 -28 11 -109 50 38 -31 23 125 184 63 44 118 66 -368 -183 -41 116 -137 -87 283 -178 -333 154
6826 154 -28 -43 146 -163 -182 7 106 104 -184 2 154 27 4 228 234 140 -129 170 209 -129 186 -262 -6
6849 -6 205 -54 108 289 236 295 -469 -153 44 -28 20 -213 64 6 -265 -129 105 -62 -171 -7 -114 -53 -36
$$ packed form
6689c25M5L51n1j86L41m7k09j14J67L14j88k01J73q9l6J76j49K23l69L64L1k74
6711e3J19P5j13o5K66l0k55J51m0M0k42L07j17j33N4j18n6O0M07k60j30o6M3J66
6735A0OP3l56J8K03K16k02k51J39J73J1J70j96K14k64K89m79K07j08K6j10N9M5
6758a07k13J91m6J12j59O2K60j63J31j25j3K15l7j45l46M01j11L4j58L63m77M95
6780A64l71L2K18j95K81l24J89R4J0l41L79j11Q8L9k02P5L84k31j42l6o1O0j21
6803a22R4L9j20J59j2o9N4J02N9j21j9P4n2m34J85J42J57k53N0L70m61j55M87
6826A54j82j5J89l09j9J89R9kk88J86J52j27k3K24Or4k69K99L9l38L15m48K56
6849fK11k59J62J81n3N9p64L16J97p2M8k33K77n8k71J36K34j67j09J64j07O1J7
$$ plain form
6872 -36 -220 -19 -80 -116 -176 -143 35 356 143 153 48 -116 -146 -43 -129 -28 118 118 -227 -242 -117 -265 20 -109
6896 -109 -40 -130 75 -13 -134 44 74 -136 -330 -217 210 183 150 -90 -42 -36 -292 138 79 40 -273 30 112 473
6920 473 12 -154 -77 48 -148 249 274 103 -9 -240 -72 8 -55 -9 -8 -82 -193 106 -1 -110 -119 160 13
6943 13 394 41 -101 88 16 -191 -143 -7 -189 118 106 -115 261 -324 -319 28 93 125 -196 46 81 221 -224
6966 -224 -24 92 26 -83 20 5 6 -26 -18 -111 -131 -29 -223 -137 162 84 -93 120 -31 128 158 -106 152 -25
6990 -25 36 -167 -150 -165 170 -95 -95 140 65 118 216 23 147 108 141 41 34 -34 31 -78 0 -74 -34 207 159 41
7016 41 -174 254 -238 -126 282 224 84 61 -235 160 135 169 221 -110 146 72 -172 324 347 -68 1 76 -7 16
7040 16 -94 28 133 -20 167 82 -32 119 -50 284 125 -58 99 -231 -2 129 -85 -43 150 83 236
$$ packed form
6872c6j84K01o1l6o0L3J78L21k13J0j05j64l0J03q6J01J46%l45j5J25j48K85j29
6896a09O9r0K05q8j21J78L0k10j94J13M27k7l3k40M8Ok56M30n9l9l13L03Q2L61
6920D73m61j66P7J25j96L97K5j71j12k31J68Q0o3M6Jp4j11K99j07j09rK79j47
6943A3L81l53j42J89p2k07M8J36j82L07j2k21L76n85NL47O5L2l21K42L5J40m45
6966b24K00J16o6j09J03j5Jl2Qr3k0J02j94Q6K99p8j77K13j51J59L0k64K58j77
6990b5O1k03J7j5L35k65%K35p5N3R8j93J24l9L3j00po8O5j09P8p4M0K41m8j18
7016D1k15M28m92J12M08n8j40k3k96L95k5L4N2l31K56p4k44M96K3m15O9P5q3K3
7040A6j10J22J05j53J87q5j14J51j69L34j59j83J57l30K29J31k14M2J93o7J53
$$ plain form
7061 236 188 53 21 -154 -29 110 -165 175 -17 -84 109 224 22 12 -47 46 -94 105 -39 -199 -54 -49 -65
7084 -65 16 -129 1 -15 -100 -36 111 -62 -271 74 -126 10 -61 -114 -371 -26 -26 -152 -139 -376 140 -154 200
7107 200 25 25 305 299 45 48 -109 -100 31 -171 -70 -159 -125 -242 -36 288 146 -15 -82 245 142 -18 -138 -102
7131 -102 148 -184 178 26 -109 37 203 311 -189 33 -193 56 -162 -138 -253 10 -143 58 57 -97 142
7152 142 52 -93 101 86 229 167 -36 -112 -62 310 89 -34 -167 -37 304 -144 233 -278 -67 313 65 28
7174 28 -161 129 142 103 295 119 -326 157 124 88 -52 189 49 -232 89 -45 -98 -179 80 240 -138 121
7196 121 53 -162 20 -39 -29 -70 55 37 74 60 114 -182 -209 -199 -231 -135 16 -17 59 239 25 -178 -89 127 -115
7221 -115 -8 96 126 -41 -134 -36 -105 270 101 -40 25 -182 -82 -89 305 -65 204 -134 -241 35 -155 3
$$ packed form
7061B36m8j35l2j75J25J39k75L40j92o7J93J15k02j0n9R3j40J99j44j60J45Nj6
7084f5Q1j45J30j6q5O4J47j73k09L45k00J36p1n3k57L45%j26J3k37N16k94L54
7107B00j75%K80ok54Lj57RJ31k02J01q9L4j17K06L24j42j61o7L27j03j60j20L6
7131a02K50l32L62j52j35J46J66J08n00K22k26K49k18K4j15K63j53K01jj54K39
7152A42r0j45J94j5J43o2k03p6N0L72k21j23j33J30L41m48L77n11K11L80k48l7
7174B8j89K90J3l9J92j76m45M83l3l6j40K41j40k81L21j34n3q1K59J60l78K59
7196A21o8k15J82n9J0m1J25j8L7j4N4k96k7J0l2R6J51l3P6J80k14k03Q9K16k42
7221a15J07J04L0j67r3R8o9L75j69j41O5k07J00pL94l70K69l38j07K76j90J58
$$ plain form
7243 3 -183 46 -178 146 -106 85 9 58 239 35 229 46 -76 -381 114 68 -164 -25 -139 -18 162 40
7265 40 64 65 -383 -71 -120 -192 32 169 -148 55 -178 109 4 -45 -259 -52 175 16 -64 -83 104 -129 198
7288 198 98 -4 11 -61 -232 -123 9 144 157 -158 76 247 198 -204 116 82 18 171 -77 13 308 -176
7310 -176 -176 163 -66 -33 113 -60 -77 -97 -121 -8 -119 -152 77 -30 31 63 -61 211 -108 273 -152 120 246
7333 246 122 75 60 -131 -49 246 102 240 74 -84 244 -140 -185 222 -220 -177 2 -100 -224 369 -222 81
7355 81 -120 -229 291 -156 -114 300 112 24 360 -68 -49 42 26 -159 -36 -30 2 105 -200 -151 -230 -82 -23 253
7379 253 -46 17 -17 124 145 52 52 -168 -55 -61 -59 -136 219 87 -85 -33 -6 -21 -128 -378 -7 130 46 34 -197
7404 -197 208 66 -161 -156 374 217 243 170 -276 457 176 -40 -5 -80 -113 -121 185 282 -51 15 68 215 -19 21
$$ packed form
7243Cj86K29k24L24k52J91p6M9J81k04J94j83j22l05M95m6k32J39j14J21J80j22
7265D0K4Jm48L12m9p2K24J37l17K03k33K87j05m9k14K07K27j59q0j9J87k33L27
7288A98j00j02J5p2j71J09J32J35J3l15K34J71m9m02L20l4o4J53k48R0K95m84
7310a76%L39k29L3J46j73j7k0k4J13j11l3K29j07O1L2j24K72l19L81m25K72J26
7333B46j24m7j5j91Q2K95j44J38j66j58L28l84m5M07m42M3J79j02j24N93n91L03
7355H1k01j09N20m47M2M14j88q8L36m28J9R1j6j85J23OL2J03l05M9p9J48N9K76
7379B53k99O3l4J41K1r3%k20J13oKp7L55j32j72N2K7j5j07k50L71J37q4j2k31
7404a97M05j42k27NN30j57K6p3m46P33k81k16L5p5l3qL06R7l33O6N3J47k34M0
$$ plain form
7428 21 345 -264 -267 -80 35 -150 -27 -42 142 -68 -27 32 52 -84 -135 165 18 -202 54 -66 52 -151 299
7451 299 -28 201 70 116 135 -117 -254 1 -69 25 120 -79 -36 -93 -64 -53 -20 -263 -300 152 137 83 -101 -69 31
7476 31 -37 3 9 -166 -55 -1 -26 59 13 105 17 255 -223 262 122 -224 35 -19 180 171 108 214 -10 -54 -66 156
7502 156 118 -20 24 30 60 175 -144 35 102 163 23 -199 -251 -230 -247 -109 -292 -214 -192 -54 -96 -211 -21 -3 138
7527 138 182 -29 -181 14 113 -244 25 81 -85 -32 211 72 -143 -90 134 18 -256 -236 61 -145 184 115
7549 115 -193 -9 152 273 -29 -31 -151 -121 0 -214 2 -71 107 170 -125 35 206 317 -170 -250 -139 -284
7571 -284 87 157 -287 -208 256 149 74 -332 -115 112 -27 158 -83 -9 -509 -40 -173 -46 192 37 138
7592 138 95 -49 24 -39 190 53 124 201 51 -234 95 -91 -85 -17 90 177 89 -76 70 274 63 -197 -80
$$ packed form
7428B1L24o09lJ87J15j85J23j5J84k10M1N9K0j36n1L00j47k20K56j20J18k03M50
7451B99l27K29j31M6J9k52j37K55p0R4R5j99M3n7K9J1L3k43l7M52j5n4j84L2J00
7476C1o8M0Oj75J11N4k5Q5m6R2q8K38m78M85j40l46K59n4J99ro3J06k24m4j2K22
7502A56l8j38M4OL0J15l19J79O7O1j40k22n2K1j7J38j83P8K2J38m2j15J90J8J41
7527A38M4k11j52J95R9l57K69N6j66N3K43j39k15N3K24j16k74K0K97k06L29o9
7549A15l08J84J61J21l02kj20L0J21k14K16p3J78O3k95J60J71J11m87q0J11j45
7571b84L71P0m44P9M64j07p5m06K17K27j39J85k41P4n00M69j33J27K38j55J01
7592A38m3j44P3o3K29j37P1P7j50k85L29j86OO8J07Q7q8j65J46K04k11k60J17
$$ plain form
7615 -80 -37 -181 -149 2 -13 29 174 144 -33 -142 80 28 -26 191 154 120 62 -54 -238 -100 129 -69 133 -82
7639 -82 -131 -67 -21 -203 -29 -42 190 -97 1 -27 -120 166 -319 -31 124 -38 42 -275 -42 2 100 -137 -30 22
7663 22 52 104 -43 202 -55 41 108 50 33 18 76 8 77 46 -212 -163 -34 -100 -11 197 -30 38 -154 66 -62
7688 -62 -42 203 -40 200 -147 321 -226 137 -132 58 -3 -65 -132 45 89 174 -66 109 152 -51 265 155 33
7711 33 -119 26 146 -97 115 -88 -326 -78 81 57 -167 186 -9 122 157 165 97 -118 -152 4 -103 -260
7733 -260 -223 -4 156 64 105 230 -137 74 -333 -33 -287 -331 -86 13 53 -82 28 -150 -2 -130 -23 179
7755 179 161 -128 109 12 104 149 218 165 226 -166 164 110 149 -157 45 -329 42 -78 -42 49 -128 -61 31 136
7779 136 -183 134 106 -8 -58 4 -68 -59 334 339 107 -46 20 -35 88 -125 99 99 -91 -53 173 -29 -52 -33 133
$$ packed form
7615h0M3j44L2J51j5M2J45l0j77j09K22n2n4K17l7l4n8j16j84J38K29j98K02k15
7639h2m9O4M6j82J74j3K32k87R8k8r3K86m85K88J55j62Q0l17K33M4R8k37J07N2
7663B2L0N2j47K45k57R6O7n8j7j5N8o8O9l1k58M9J29o6Q9K08k27O8j92K20j28
7688f2K0K45k43K40l47M68n47L63k69J90o1o2o7J77M4Q5k40J75M3k03L16j10j22
7711C3j52J45J20k43K12k03k38K48J59k4k24L53j95J31L5Qo8k15l4J56j07j57
7733b60L7K19J60r2M1J25l67K11m07L00k54m4K45R9M0j35J10j78J48j28J07K02
7755A79j8k89K37r7R2M5O9n3O1l92L30n4L9l06K02l74L71j20L6R1j77O7R2J05
7779A36l19L17k8j14n0O2p2RL93Nk32j53O6n5J23k13K24%j90L8K26k02k3J9J66
$$ plain form
7804 133 -93 -79 -27 -199 -98 -4 127 -116 165 -22 97 109 -142 49 53 103 219 310 -43 -27 -20 11 182 -181
7828 -181 -93 -273 119 276 109 37 -165 47 -32 -40 -63 108 -9 13 -317 -25 -7 -143 58 -15 89 160 -123
7851 -123 123 -27 -112 -52 -193 -102 194 38 1 -45 -26 67 44 -70 63 -413 -242 24 -63 -152 -2 -120 -277
7874 -277 54 -99 64 -171 -114 119 31 -199 24 102 185 -235 -197 247 171 -197 83 197 124 227 137 81 202
7897 202 -189 -118 -323 -94 84 -92 -94 41 -100 214 201 -196 -45 148 68 -72 -13 -41 340 -10 43 -60 152
7920 152 -97 11 56 307 -203 -207 3 -60 126 86 157 -11 213 44 -196 -61 -120 120 116 -188 -66 90 25
7943 25 169 -1 76 28 3 346 149 -105 -173 -31 78 115 53 -138 -255 -93 -209 -36 -33 60 -56 156 302
7966 302 212 277 301 49 -113 -138 85 61 -78 -131 105 -87 -113 -319 -337 10 -85 -62 106 -104 209 -95 -49 90
$$ packed form
7804A33k26J4N2j72J01R4J31k43K81j87J19J2k51J91MN0J16R1l53J6PL1J71l63
7828a81Q8j80L92J57j67p2k02K12p9qk3J71j17K2l30K92J8j36K01p3J04P1k83
7851a23K46j50q5O0j41R1K96j56l7m6J9R3k3j14J33m76J71K66q7q9J50j18j57
7874b77L31j53J63k35N7K33q8k30K23P8Q3m20L8M44p6l68K80J14p3J03r0n6J21
7897B02l91P1k05K29J78j76kJ35j41L14j3l97J51J93q0j40N9k8L81l50N3j03K12
7920A52k49J08M5K51n10mK10o3J86m0P1j68K24j69k40J35n9K40ml04J22J56o5
7943B5J44j70P7m8k5L43j97k54o8J42J09L7o2j91j17J62j16J73LR3j16K12J46
7966C02r0O5K4k52j62k5K23k4j39n3K36j92k6k06j8L47r5K3J68k10L13l04M6J39
$$ plain form
7990 90 194 -139 -91 -56 -74 -62 -29 51 -216 -34 41 28 17 254 54 -149 283 27 340 -95 -17 -47 -67 -27 43
8015 43 24 -109 -79 -157 75 45 -28 -262 99 -137 169 -57 -336 131 -83 7 77 103 -74 97 251 -91 -140
8038 -140 129 -191 -76 78 -42 -74 55 -106 -105 -12 -66 -95 110 166 -96 -223 12 171 -50 0 162 51 -126
8061 -126 503 -1 12 -2 -55 109 -29 152 -10 -117 233 21 67 -192 -53 -61 -99 38 312 71 117 -55 -371
8084 -371 75 -310 57 -6 47 85 103 217 -57 275 136 -188 -164 -97 226 56 35 -9 171 -252 76 -76 -155
8107 -155 -71 -84 -8 -71 322 364 13 205 -219 -103 -177 -103 257 -15 161 -229 -40 32 232 -145 155 103 -110
8130 -110 -40 92 176 106 188 74 -144 -133 -212 -103 32 -105 112 54 209 132 49 -140 112 -179 205 -196 -249
8153 -249 -78 96 405 -28 18 5 77 -105 264 -115 -102 209 -238 60 185 49 -52 -71 -230 -87 155 -15
$$ packed form
7990I0J04l33M8L5j8J2L3Q0k67J82P5j3j1K37k00k03M32k56L13m35P8l0k0M0P0
8015D3j9j33L0p8K32l0p3k34L61k36L06k26k79M67k14R0P0K6j77J71J54l42m9
8038a40K69l20J15J54j20l2J29j61JR3n4k9K05N6k62j27K35J59k21N0J62j11j77
8061a26O29n04J3j4n3J64j38J81j62j07L50k12M6k59J39ql8J37K74k41M6j72l16
8084c71M46l85L67o3N3L8J8J14k74L32j39l24K4O7L23j70k1m4J80m23L28j52p9
8107a55Q4j3P6o3L93M2l51J92m24J16p4P4L60k72J76l90J89P2K00l77L00n2k13
8130a10P0J32Q4p0Q2j14k18J1p9J09J35j37K17n8J55p7q3j89K52k91L84m01n3
8153b49J71J74L09m33M6j3P2j82L69l79J3L11m47K98J25j36j01j9j59J43K42j70
$$ plain form
8175 -15 34 62 -89 68 -107 -73 114 -199 -37 -278 135 128 -142 46 -172 135
$$ packed form
8175a5M9K8j51J57j75L4J87l13J62k41M13pk70J88k18L07
8191A35
$$ Imaginary data points
##PAGE= N=2
##DATA TABLE= (X++(I..I)), XYDATA
$$ plain form
0 0 0 0 0 0 0 0 0 0 0 0 0 0 0 -8 8 -8 8 -8 16 -16 17 -24 27 -32 40 -47 51 -59 71 -80 91 -105 118 -134 151
35 151 -171 191 -213 239 -267 298 -330 365 -404 447 -494 545 -601 662 -729 804 -886 976
53 976 -1076 1190 -1318 1464 -1629 1824 -2052 2328 -2663 3089 -3644 4403 -5508 7274 -10560
68 -10560 18795 -88785 -101189 24668 -33339 -55818 -28575 66950 86661 13211 -15403 45517
80 45517 62235 35343 -29523 -20740 65332 52089 -39788 -35382 9413 21313 -23281 -71086 -22698
93 -22698 40333 9613 -22142 -18242 18568 47625 -18359 -70145 -6924 29994 -3894 -32320
105 -32320 -9589 57695 58138 -13420 -15447 20086 19925 -5191 -53668 -38592 36509 20633 -34632
118 -34632 -16749 30226 45128 -6417 -48578 5531 37730 -4143 -26869 -19533 16090 34199
$$ packed form
0@%%%%%%%%%%%%%qJ6j6J6j6K4l2L3m1N1n9P2q7R8j10J30j51J71j96K23k52K85
35A51l22L62m04M52n06N65o28O95p69Q51r41J039j146J263j391J533j690J862
53I76k052K266k508K782l093L453l876M380m991N752o733Q047r911J2782j7834
68a0560K9355j07580j2404J25857n8007k2479K7243R5525J9711p3450k8614O0920
80D5517J6718k6892o4866Q783Q6072j3243r1877M406M4795J1900m4594m7805M8388
93b2698O3031l0720l1755L900L6810K9057o5984n1786O3221L6918l3888k8426
105c2320K2731O7284M43p1558k027L5533j61k5116m8477J5076P5101j5876n5265
118c4632J7883M6975J4902n1545m2161N4109L2199m1873k2726P336L5623J8109
$$ plain form
130 34199 -29032 -53014 5976 25826 -4059 -29137 -2228 65063 51865 -7870 6148 32899
142 32899 22111 -14477 -60370 -36310 12950 -16591 -48602 -25083 18516 35615 -13489 -37767
154 -37767 20496 34969 -5794 -16951 106 39372 43327 -11123 -15626 24955 24950 -8901 -42866
167 -42866 -18463 35659 6632 -36854 -6327 23647 18654 -14992 -44852 -8458 22068 -12647
179 -12647 -32046 -8734 31411 41478 -10733 -20696 32771 29173 -13995 -29139 -12392 25911
191 25911 15556 -28588 -10405 26203 23628 -4138 -33063 -4426 35680 -3245 -37212 -6850
203 -6850 19530 15325 -20789 -36235 6841 19209 -15306 -24523 -5239 31573 35462 -12231 -7509
216 -7509 39543 30172 -8181 -24884 -6273 24370 -2305 -38208 -13548 13613 11071 -14401 -36159
$$ packed form
130C4199o3231k3982N8990J9850k9885k5078K6909O7291j3198n9735J4018K6751
142C2899j0788l6588m5893K4060M9260k9541l2011K3519M3599J7099m9104k4278
154c7767N8263J4473m0763j1157J7057L9266L955n4450m503M0581nl3851l3965
167d2866K4403N4122k9027m3486L0527K9974m993l3646k9860L6394L0526l4715
179a2647j9399K3312M0145J0067n2211r963N3467l598m3168j5144J6747L8303
191B5911j0355m4144J8183L6608k575k7766k8925K8637M0106l8925l3967L0362
203f850K6380m205l6114j5446M3076J2368l4515r217J9284L6812L889m7693M722
216g509M7052r371l8353j6703J8611L0643k6675l5903K4660K7161k542k5472k1758
$$ plain form
229 -36159 -55 29210 -10242 -29665 76 27417 24955 -11933 -15212 28509 26261 -9836 -19385
242 -19385 -5775 23265 13772 -29421 -14191 24242 14234 -14520 -28635 -2958 24599 -8316
254 -8316 -31753 -2059 19080 16376 -6616 -19691 17127 30369 -8359 -21397 -787 20216
266 20216 12692 -24391 -16072 22946 12618 -14298 -18754 -3613 20809 3342 -29142 -6334 21881
279 21881 13118 -9485 -18809 11479 29030 -8273 -22214 3822 16830 9508 -16116 -19500 16661
292 16661 17806 -14397 -19350 -860 18905 6155 -27051 -8738 23593 9100 -11332 -11978 7013
305 7013 25761 -2 -22049 2506 18297 7584 -13466 -19595 12593 20233 -15872 -19501 4191
318 4191 12881 3200 -20852 -13310 18386 10422 -12848 -10680 6228 23357 4938 -21636 1562
$$ packed form
229c6159L6104K9265l9452j9423K9741K7341k462l6888l279M3721k248l6097r549
242a9385J3610K9040r493m3193J5230L8433j0008k8754j4115K5677K7557l2915
254h316k3437K9694K1139k704k2992j3075L6818J3242l8728j3038K0610K1003
266B0216p524l7083Q319L9018j0328k6916m456J5141K4422j7467l2484K2808K8215
279B1881q763k2603r324L0288J7551l7303j3941K6036J3008p322k5624l384L6161
292A6661J145l2203m953J8490J9765j2750l3206J8313L2331j4493k0432o46J8991
305G013J8748k5763k2047K4555J5791j0713k1050o129L2188P640l6105l629K3692
318D191Q690r681k4052P542L1696p964k3270K168J6908J7129j8419k6574K3198
$$ plain form
331 1562 22907 4600 -13429 -12117 9726 20569 -8929 -18954 5657 13578 1814 -18647 -17713
344 -17713 14092 11993 -18261 -13367 9225 17703 3691 -18747 -2888 21292 4150 -14173 -9753
357 -9753 7656 20494 -1766 -19013 7447 20013 985 -14716 -12547 11534 13435 -15778 -14792
370 -14792 8311 11997 631 -17387 -10738 16653 6114 -18153 -8858 10395 18794 1671 -15519
383 -15519 6547 21197 -634 -14603 -10008 6184 13849 -10858 -16917 9843 16846 783 -13713
396 -13713 -7749 16445 9234 -17810 -9408 10984 11786 -1426 -17543 -4418 15551 -1464 -19383
409 -19383 -8482 9567 17173 -1564 -10912 15557 22526 6 -11382 -7605 7168 5936 -18692
422 -18692 -16217 7836 9800 -2982 -15163 -5717 15423 1145 -20126 -6773 10369 12604 1297
$$ packed form
331A562K1345j8307j8029J312K1843J0843k9498j0025K4611P921j1764k0461R34
344a7713L1805k099l0254M894K2592Q478j4012k2438J5859K4180j7142j8323M420
357i753J7409J2838k2260j7247K6460J2566j9028j5701K169K4081J901k9213R86
370a4792K3103L686j1366j8018O649K7391j0539k4267R295J9253Q399j7123j7190
383a5519K2066J4650k1831j3969M595J6192P665k4707o059K6760P003j6063j4496
396a3713N964K4194p211k7044Q402K0392Q02j3212j6117J3125J9969j7015j7919
409a9383J0901J8049P606j8737r348K6469O969k2520j1388L777J4773j232k4628
422a8692K475K4053J964j2782j2181R446K1140j4278k1271J3353J7142K235j1307
$$ plain form
435 1297 -8122 11645 24147 3501 -9135 -1768 10155 11447 -11730 -14932 9883 9871 -10007 -18160
449 -18160 -11522 3093 -4723 -25561 -13259 8725 11042 3255 -3344 12300 29128 8410 -9540
462 -9540 1982 11707 7956 -9199 -14760 7099 11663 -7814 -13619 -5593 6617 4289 -17027 -11508
476 -11508 12590 10175 -4827 -9633 727 13228 -1650 -19263 -5137 8584 6142 -2156 -7136
489 -7136 11536 22251 79 -10670 306 8025 3375 -13976 -12352 11457 10132 -6207 -7127
502 -7127 807 10343 1321 -19177 -9624 8832 3555 -7624 -9178 5849 17328 -1550 -12428
515 -12428 3658 12087 7199 -3108 -4791 14767 18012 -3868 -10190 -2230 2275 -6660 -25556 -17693
529 -17693 5151 1495 -8572 -3603 9319 19814 8096 -7180 4412 14208 5443 -6209 -9266
$$ packed form
435A297r419J9767J2502k0646j2636P367J1923J292k3177l202K4815j2j9878q153
449a8160O638J4615p816k0838J2302K1984K317p787o599J5644J6828k0718j7950
462i540J1522R725l751j7155n561K1859M564j9477n805Q026J2210k328k1316N519
476a1508K4098k415j5002m806J0360J2501j4878j7613J4126J3721k442q298m980
489g136J8672J0715k2172j0749J0976P719m650j7351J624K3809j325j6339r20
502g127P934R536r022k0498R553J8456n277j1179j554J5027J1479j8878j0878
515a2428J6086Q429m888j0307j683J9558L245k1880o322P960M505q935j8896P863
529a7693K2844l656j0067M969J2922J0495j1718j5276J1592R796q765j1652l057
$$ plain form
542 -9266 6670 13579 -7842 -13964 1179 5438 -1047 -12385 -9163 11102 9591 -5689 -4386 5032
556 5032 11204 795 -17498 -7077 9566 -502 -9709 -5120 7753 15293 -314 -10062 4452
569 4452 9934 1079 -9229 -9097 9216 11693 -6753 -6663 7195 9185 233 -13219 -6681 9433
583 9433 1320 -11359 -7556 1753 8307 -2611 -15554 -891 10890 880 -5667 -203 14637
596 14637 18921 1390 -2996 9566 8319 -2575 -13928 -13579 2483 -911 -16970 -11243 2898
609 2898 6564 -1799 -11463 511 13728 3079 -5142 889 10534 14619 406 -8329 6423 10349
623 10349 -2484 -10562 -7141 6198 5610 -10932 -7905 6158 5514 -2787 -11571 -5589 8865 1783
637 1783 -10406 -3056 7857 11211 520 -8196 5398 12044 -1871 -9004 -4055 5021 7043 -6945
$$ packed form
542i266J5936O909k1421o122J5143M259o485j1338L222K0265j511j5280J303R418
556E032O172j0409j8293J0421J6643j0068r207M589J2873P540j5607r748J4514
569D452N482q855j0308J32J8313K477j8446R0J3858J990q952j3452O538J6114
583I433q113j2679L803R309O554j0918j2943J4663J1781j0010o547N464J4840
596A4637M284j7531m386J2562j247j0894j1353L49J6062l394j6059N727J4141
609B898L666q363r664J1974J3217j0649q221O031R645M085j4213q735J4752L926
623A0349j2833q078L421J3339n88j6542L027J4063o44q301q784N982J4454p082
637A783j2189P350J0913L354j0691q716J3594O646j3915p133M949R076K022j3988
$$ plain form
651 -6945 -9007 6110 7703 -2153 -8262 -3302 10058 4569 -10282 -3560 7830 6127 -2199 -9887
665 -9887 -766 9543 -1645 -10255 -2203 6910 8635 -3172 -7798 7751 10440 -3271 -7967 -2966
679 -2966 6049 3963 -10337 -6669 7257 5420 -2786 -7965 -1293 10581 1272 -10306 -966 7962
693 7962 5918 -2552 -7535 4147 9813 -3321 -8723 -1954 5133 5550 -7055 -7255 8105 7388 -3722
708 -3722 -6504 -571 8016 2453 -10325 -3115 7578 4317 -3076 -7345 1547 9550 -2096 -10385
722 -10385 -613 6284 3791 -5397 -7181 6542 8577 -3868 -5774 739 7031 4145 -8574 -4772
736 -4772 8593 4962 -5213 -6590 606 8662 -705 -10508 -711 6561 2362 -4201 -6567 4102
750 4102 9345 -3222 -7247 1829 6635 3256 -6726 -5350 7475 5302 -5624 -5366 567 6294 1332
$$ packed form
651f945k062J5117J593r856o109M960J3360n489j4851O722J1390j703q326p688
665i887R121J0309j1188q610Q052R113J725j1807m626J5549K689j3711m696N001
679b966R015k086j4300L668J3926j837q206n179O672J1874r309j1578R340Q928
693G962k044q470m983J1682N666j3134n402O769P087M17j2605k00J5360p17j1110
708c722k782N933Q587n563j2778P210J0693l261p393m269Q892Q003j1646q289
722a0385R772O897k493r188j784J3723K035j2445j906O513O292k886j2719L802
736d772J3365l631j0175j377P196Q056r367r803R797P272m199o563k366J0669
750D102N243j2567m025R076M806l379r982J376J2825k173j0926K58N933N727m962
$$ plain form
765 1332 -9423 -2513 7685 2452 -4842 -5413 2966 9121 -2124 -8107 2117 6862 1863 -5293
779 -5293 -5912 5265 6350 -6068 -6612 2002 5678 1489 -8046 -3417 8325 3100 -5896 -3757 2792
794 2792 7729 28 -7833 1406 7884 1569 -4838 -5218 3637 6708 -5583 -7693 2471 4818 377
809 377 -6327 -4513 6573 4158 -6034 -3668 3474 6850 1902 -6645 656 9195 1889 -5044 -3913
824 -3913 2703 6090 -3892 -8733 1436 4773 -1223 -6375 -4920 4268 4841 -6418 -4793 4372 6560
839 6560 1782 -4705 -53 9265 3350 -5276 -2357 2918 5633 -1502 -8364 854 6469 -1601 -6513
854 -6513 -4240 2785 4122 -5836 -6538 3360 4794 5 -4566 -2011 7185 4076 -5902 -2463 4795
869 4795 5506 673 -5143 1296 8562 557 -5768 -2402 1779 3247 -4755 -7979 1916 5181 -1848
$$ packed form
765A332j0755O910J0198n233p294n71Q379O155j1245n983J0224M745m999p156
779e293o19J1177J085j2418n44Q614L676m189r535M629J1742n225q996K139O549
794B792M937p701p861R239O478o315o407l80Q855L071j2291k110J0164K347m441
809C77o704J814J1086k415j0192K366P142L376m948q547P301Q539p306o933J131
824c913O616L387r982m841J0169L337n996n152J455R188N73j1259J625R165K188
839F560m778o487M652R318n915q626K919N275K715p135o862R218N615q070m912
854f513K273P025J337r958p02R898J434m789m571K555R196l109r978L439P258
869D795P11m833n816O439P266q005o325L366M181J468q002l224R895L265p029
$$ plain form
884 -1848 -5437 -2515 5069 4286 -6149 -3982 5161 4774 94 -3842 724 8359 2287 -5858 -1654
899 -1654 3551 3682 -2753 -7308 1580 6103 -2703 -6007 -2540 3145 3107 -5702 -5645 4577 5338 -723
915 -723 -3145 504 7610 3675 -5858 -1738 4585 2482 -2405 -5828 -3 6612 -1012 -6261 -882
930 -882 3379 3327 -3090 -5241 4361 6107 -2000 -3846 -353 4310 1994 -6725 -4362 4388 2720 -2342
946 -2342 -4177 680 7501 1916 -5451 217 5037 3270 -1935 -4606 2851 6159 -2226 -5121 -577
961 -577 2640 1291 -6386 -5894 3850 3120 -3524 -4023 618 6111 2389 -4905 91 6603 3563 -872
977 -872 -3041 2311 7070 -1202 -6523 -711 2340 -268 -5976 -6664 2134 3083 -4539 -4148 1185 5226
993 5226 3374 -3704 -894 7115 4088 -2199 -2370 1818 6229 -123 -6438 -240 3799 315 -3915
$$ packed form
884a848l589K922P584p83j0435K167R143l87m680l936M566P635o072q145M204
899a654N205J31o435m555Q888M523q806l304L467N685l8q809N7J0222P61o061
915g23k422L649P106l935r533M120O323k103m887l423N825O615p624n249N379
930h82M261n2o417k151R602J746q107j846L493M663k316q719K363Q750j668n062
946b342j835M857O821n585p367N668M820j767n205k671P457L308q385k895M544
961e77L217j349p677M92R744p30o644m99M641N493l722p294M996O512l040m435
977h72k169N352M759q272n321N812L051k608n708o88Q798R49p622L91N333M041
993E226j852p078K810Q009l027o287j71M188M411o352o315O198M039l484m230
$$ plain form
1008 -3915 -4901 2005 4711 -3421 -5162 1239 3639 1176 -4779 -3645 5026 3171 -3767 -2560 2298
1023 2298 4764 849 -5123 -533 5757 1540 -2900 -2887 2154 5669 -1953 -5340 1627 4073 215
1038 215 -4042 -3837 3064 3379 -4345 -3939 1445 3418 923 -5052 -1513 6148 2230 -3327 -1672 2558
1054 2558 5177 -461 -5379 906 4321 -583 -4123 -3946 1726 3768 -4151 -5147 2427 3844 311
1069 311 -3711 -1702 5901 3520 -3409 -1621 2636 3892 235 -5408 -390 5465 -74 -4623 -2611
1084 -2611 1822 3511 -2745 -5178 2218 4281 -358 -2687 -1948 4112 3917 -3900 -3248 2899 2983 -409
1100 -409 -4897 -1236 4774 546 -4486 -1441 2303 3781 -556 -4293 1766 5336 -78 -3058 -1299
1115 -1299 3018 3606 -3824 -4424 2617 2369 -1606 -3960 -2272 3981 1978 -4393 -1821 3018 3303 -241
$$ packed form
1008c915r86O906K706q132j741O401K400k463n955J134Q671j855o938J207M858
1023B298K466l915n972M590O290m217m440J3N041L515p622l387O967K446l858
1038B15m257K05O901L15p724M06N384J973k495n975L539P661l918n557J655M230
1054B558K619n638m918O285L415m904l540J77N672K042p919r96P574J417l533
1069C11m022K009P603k381o929J788M257J256l657n643N018N855n539m549K012
1084b611M433J689o256k433P396K063m639k329P39O060j95p817O52O147Q4l392
1100d09m488L661O010m228n032L045L744J478m337l737O059L570n414k980J759
1115a299M317N88p430o00P041k48l975k354J688O253k003o371K572M839K85l544
$$ plain form
1131 -241 -3810 769 6120 378 -3490 -406 2518 3093 -2440 -4751 1751 3386 -1852 -3751 -1734
1146 -1734 3283 2305 -4271 -2893 3625 2818 -788 -2935 74 5170 908 -3988 -590 3120 2378 -1701
1162 -1701 -4697 1008 4376 -1948 -3834 -654 2541 2363 -3414 -3385 3283 3286 -1545 -2465 -301 4327 1906
1179 1906 -4067 -1295 3825 2021 -1433 -3746 536 4558 -756 -4238 -57 2423 1906 -2608 -4357
1194 -4357 2420 3646 -1833 -2935 -133 3229 2386 -3524 -1687 3609 2279 -1631 -2540 357 3883
1209 3883 346 -4383 -861 2726 1317 -1842 -3708 1300 3733 -1747 -2978 830 2922 2143 -2295
1224 -2295 -2586 3463 2894 -1897 -2535 158 3350 324 -4733 -1266 3174 562 -2203 -3146 442 3931
1240 3931 -842 -3767 923 3038 1668 -1874 -2631 3071 3901 -2160 -2449 707 2508 1018 -3867 -2107
$$ packed form
1131b41l569M579N351n742l868L084K924N75n533k311O502J635n238j899K017
1146a734N017r78o576J378O518q07l606k147L009N096m262m896L398L710p42m079
1162a701k996N705L368o324j886L180L195j78n777K9O668Lm831r20K164M628k421
1179A906n973K772N120j804l454k313M282M022n314l482M181K480n17m514j749
1194d357O777J226n479j102K802L362q43n910J837N296j330l910r09K897L526
1209C883l537m729L522L587j409l159j866N008K433n480j231L808K092p79m438
1224b295k91O049n69m791o38K693L192l026n057L467M440k612k765r43L588L489
1240C931m773k925M690K115j370l542p57N702Q30o061k89L156J801j490m885J760
$$ plain form
1256 -2107 3080 1098 -2384 -2475 334 3408 -514 -4170 23 3273 626 -1652 -2024 2004 4052 -1419
1272 -1419 -2685 1128 2810 1028 -2999 -2068 3098 2171 -2872 -2193 526 2535 454 -4041 -970 3430
1288 3430 715 -1798 -1749 1302 3701 -854 -3723 1268 2814 307 -2437 -2126 2401 2774 -2549 -2133
1304 -2133 1130 2251 644 -3043 -1224 3549 1013 -2448 -1478 1247 3178 205 -3740 469 3100
1319 3100 -352 -2313 -2020 1872 3348 -1952 -3080 1573 2167 -320 -2482 -1466 2883 1895 -2774 -895
1335 -895 1981 2541 275 -3063 -292 3054 -78 -3144 -1104 1266 2698 -1241 -3173 1292 2495
1350 2495 -477 -2007 -1000 2632 2613 -2354 -1478 2566 2263 -370 -2846 -1069 2932 234 -3099 -879
1366 -879 1279 1886 -469 -3062 772 2987 -824 -2357 -805 1895 2466 -1668 -1695 2448 2478 -383 -1713
$$ packed form
1256b107N187j982l482r1K809L074l922l656M193L250k647k278l72M028K048n471
1272a419j266L813J682j782m027R31N166r27n043O79K719K009k081m495L071M400
1288C430k715k513M9L051K399m555k869M991J546k507k744L11M527L73n323M16
1304b133L263J121j607l687J819M773k536l461R70K725J931k973l945M209K631
1319C100l452j961K93L892J476n300j128M653N94k487k162J016M349r88m669J879
1335h95K876N60k266l338K771L346l132l066K040K370J432l939j932M465J203
1350B495k972j530J007L632j9m967Q76M044l03k633k476J777M001k698l333K220
1366h79K158O07k355k593L834K215l811j533J552K700N71m134k7M143L0k861j330
$$ plain form
1383 -1713 -650 2794 1163 -2874 -1212 1584 1401 -861 -3080 -503 2498 -943 -2970 -647 1457
1398 1457 2237 -930 -2178 2377 3162 -1014 -2046 -866 1964 1571 -2377 -1501 2306 1543 -892 -2002
1414 -2002 -444 2691 -66 -3416 -567 1641 1359 -596 -2576 910 2761 -922 -2107 -167 1957
1429 1957 1772 -1534 -1641 2633 2229 -1076 -2265 -915 1693 -82 -3207 -1101 2202 1376 -668 -1627
1445 -1627 941 3160 -251 -2670 -57 1395 975 -1387 -1976 1838 2125 -1397 -2123 37 1841 937
1461 937 -2703 -1346 2507 1347 -1201 -1618 41 2155 -263 -3242 -270 2408 1237 -622 -1333 1495
1477 1495 3053 -1237 -2546 -183 632 63 -2484 -1949 2080 1690 -1074 -1210 516 2348 621 -2423
1493 -2423 -714 2465 834 -1006 -1610 471 2179 -1388 -3131 -162 1377 252 -1306 -1097 2259
$$ packed form
1383a713J063L444j631m037J662K796j83k262k219K577L001l441k027K323K104
1398A457P80l167j248M555P85m176j032J180K830l93l948Q76L807p63k435j110
1414b002J558L135k757l350K849K208k82j955j980L486J851l683j185J940K124
1429A957j85l306j07M274m04l305j189J350K608j775l125K106L303q26k044r59
1445a627K568K219l411k419K613J452m20k362n89L814K87l522p26K160J804r04
1461I37l640J357L853j160k548m17J659K114k418k979K972K678j171j859p11K828
1477A495J558m290j309K363Q15n69k547N35M029l90k764j36J726J832j727l044
1493b423J709L179j631j840o04K081J708l567j743K969J539j125j558K09L356
$$ plain form
1508 2259 2359 -1437 -1508 864 1260 -151 -2338 -1159 2468 1091 -1097 -768 1164 2498 -214 -2914
1524 -2914 -53 1570 -232 -1505 -1399 1163 2243 -1195 -1959 755 1355 578 -1706 -843 2607 1999
1540 1999 -1599 -753 969 1619 -526 -3202 -1002 2047 83 -1884 -753 984 2108 -824 -1902
1555 -1902 776 1436 -189 -1591 -738 1875 2125 -1636 -1095 1409 1194 -150 -2192 -633 2231 584
1571 584 -1856 -662 1116 1373 -677 -2561 193 1800 -225 -1217 -673 1568 2262 -1149 -1446 1355
1587 1355 1365 -749 -2136 -1091 1631 743 -2178 -666 1345 1193 -316 -2050 -81 2438 70 -1516
1603 -1516 -394 1361 1781 -980 -1917 1133 1470 -874 -1381 -781 1767 1193 -1937 -1494 1586 1214 -381
1620 -381 -2020 -331 1880 -18 -1816 -153 1384 1420 -506 -1670 820 1790 -280 -1431 -245 1110
$$ packed form
1508B259J00l796p1K372L96j411k187J179L627j377k188L29J932J334k712k700
1524b914K861J623j802j273J06K562J080l438p64K714O00p77k284Q63L450o08
1540A999l598Q46J722O50k145k676K200L049j964j967J131J737J124k932j078
1555a902K678O60j625j402Q53K613K50l761N41K504k15j344k042J559K864j647
1571E84k440J194J778K57k050j884K754J607k025r92N44K241O94l411k97K801
1587A355J0k114j387J045K722q88k921J512K011j52j509j734J969K519k368j586
1603a516J122J755M20k761r37L050L37k344n07O00K548n74l130M43L080l72j595
1620c81j639J689K211j898j798J663J537L6j926j164K490R70k070j151J186J355
$$ plain form
1636 1110 1218 -1471 -1605 1326 1131 -821 -1581 -270 1746 882 -1936 -262 1837 1137 -180 -1191
1652 -1191 462 2353 -207 -2072 -10 977 835 -1251 -2088 953 1709 -1211 -1077 -415 1597 1174 -1747
1669 -1747 -710 2040 1041 -714 -1265 211 1922 84 -1938 -84 1418 626 -652 -1634 781 1765
1685 1765 -1305 -1744 -17 1253 963 -1686 -1249 1769 1315 -1025 -754 437 1775 696 -1849 -469
1701 -469 1412 504 -938 -1596 164 1701 -718 -1815 126 1148 731 -971 -1292 1384 1424 -884 -949
1718 -949 364 1731 340 -2217 -1014 1824 545 -1195 -1037 257 1551 -162 -2038 127 1277
1733 1277 151 -1016 -1274 987 1936 -838 -1366 714 1549 609 -1534 -1298 1648 1016 -1438 -943 531
1750 531 1397 -335 -2092 -201 1719 49 -1029 -793 673 1758 -527 -1544 733 1501 112 -1386
$$ packed form
1636A110J08k689j34K931j95j952p60J311K016q64k818J674K099p00j317j011
1652a191J653J891k560j865K062R87j42k086q37L041P56k920J34O62K012m23k921
1669a747J037K750r99j755n51J476J711j838k022J854J502p92j278r82K415R84
1685A765l070m39J727J270k90k649M37L018m54k340K71J191J338j079k545J380
1701d69J881r08j442o58J760J537k419j097J941J022m17j702l21K676M0k308o5
1718i49J313J367j391k557J203K838j279j740J58J294J294j713j876K165J150
1733A277j126j167k58K261R49k774n28K080Q35r40k143K36K946o32k454M95J474
1750E31Q66j732j757J891J920j670j078K36J466J085k285j017K277P68j389j498
$$ plain form
1766 -1386 -1058 1056 1290 -1237 -1027 737 1019 128 -1591 -697 1657 302 -1482 -712 932 1806 53
1783 53 -1581 502 1572 -300 -1337 -1066 871 1301 -954 -1357 1095 1424 397 -1381 -935 1560 684
1800 684 -1533 -617 928 1474 237 -1327 361 1943 7 -1650 -850 664 1159 -696 -1413 616
1816 616 1410 -88 -1781 -851 925 888 -1585 -514 1464 1509 370 -955 113 1809 192 -1759 -659
1833 -659 206 965 -603 -1625 362 1537 -349 -1439 -723 985 1072 -1014 -1181 1410 1195 -251 -1211
1850 -1211 -269 1267 423 -1660 -615 1534 1298 81 -1154 199 2003 -457 -2119 -1079 -33 304
1866 304 -1336 -1493 1013 1973 57 -591 55 1354 917 -1442 -931 1492 1068 -350 -1162 -227 1419
1883 1419 -400 -2079 -713 674 421 -365 -1166 662 1927 -408 -1104 -524 694 551 -1276 -974 1592
$$ packed form
1766a386L28K114K34k527K10J764K82q91j719Q94K354j355j784P70J644Q74j753
1783E3j634K083J070j872j037K71J937M30k255m03K452L29j027j778M46K495q76
1800F84k217R16J545N46j237j564J688J582j936j657Q00J514M95j855p17K029
1816F16P94j498j693R30J776l7k473J071J978M5j139j325J068J696j617j951J100
1833f59Q65P59j568j022J987J175j886j090P16J708Q7k086j67K591k15j446r60
1850a211R42J536q44k083J045K149k36j217j235J353J804k460j662J040J046L37
1866C04j640j57K506R60j916o48O46J299m37k359N11K423m24j418q12R35J646
1883A419j819j679J366J387k53p86q01J828J265k335o96N80J218j43j827L02K566
$$ plain form
1900 1592 1411 -156 26 32 1731 337 -1943 -568 716 -121 -1124 -1388 149 1579 -320 -1516 171
1917 171 1197 955 -470 -876 1570 1701 -513 -932 -254 488 -75 -1964 -947 1183 1031 -449 -558
1934 -558 669 1564 299 -1319 -267 617 -15 -571 -1215 640 1460 -292 -1092 27 419 177 -1497
1951 -1497 -1284 1062 885 -651 -552 358 1054 253 -1557 -365 1447 629 -281 -425 710 1611 -253 -1485
1969 -1485 -115 580 -463 -1587 -1348 701 1160 -528 -388 560 1266 756 -1032 -576 1300 418 -961
1986 -961 -493 238 1459 -154 -1674 -19 807 -151 -820 -733 609 1528 -424 -909 684 655 154 -1453
2004 -1453 -1179 986 490 -768 -545 660 1505 103 -1333 -334 944 -32 -1170 -518 344 1163 -255
2021 -255 -1481 508 936 -322 -961 -734 829 1142 -907 -495 620 812 483 -1124 -317 1235 129
$$ packed form
1900A592j81j567J82OJ699j394k280J375J284q37j003k64J537J430j899j196J687
1917A71J026k42j425m06K446J31k214m19O78P42n63j889J017K130j52j480j09
1934e58J227Q95j265j618J052Q84o32n56o44J855Q20j752q00J119L92k42j674
1951a497K13K346j77j536R9R10O96q01j810J192J812q18r10j44J135R01j864j232
1969a485J370O95j043j124K39K049M59j688J40R48P06n10j788M56J876q82j379
1986i61M68P31J221j613j520J655Q26r58o69Q7J342R19j952m85J593k9n01j607
2004a453K74K165m96j258K23J205Q45j402j436R99J278r76j138O52Q62Q19j418
2021b55j226J989M28j258o39K27J563L13k049M12J115J92l29j607Q07J552j106
$$ plain form
2038 129 -1080 -444 266 1317 -166 -1073 46 919 -532 -1306 -877 588 1183 -636 -850 890 1237
2055 1237 -13 -533 -420 1121 721 -1079 -459 334 753 -195 -1278 -449 1223 -533 -972 -298 344 1285
2073 1285 -348 -989 1008 1026 157 -873 -503 931 290 -1114 -883 793 381 -467 -870 -495 865 -18
2091 -18 -1291 -143 596 1092 -253 -634 634 1481 -134 -828 -341 694 416 -546 -1066 679 634 -314
2109 -314 -722 -121 864 322 -1224 -557 880 781 -197 -854 378 1520 -39 -947 -43 628 708 -376 -1117
2128 -1117 547 1069 -668 -1063 -422 813 404 -1304 -592 993 281 -94 -598 141 1353 203 -1094
2145 -1094 -345 974 420 -490 -1024 350 1063 -639 -593 38 444 593 -739 -904 814 589 -625 -700
2163 -700 18 1059 190 -1368 -142 984 384 -580 -825 173 1371 -224 -945 192 551 231 -935
$$ packed form
2038A29j209O36P10J051j483r07J119Q73j451p74M29J465N95j819k14J740L47
2055A237j250n20J13J541m00j800O20P93M19r48j083Q29J672j756m39O74O42R41
2073A285j633o41J997J8q69j030L70J434o41j404K31J676m12q48m03L75J360q83
2091a8j273J148P39M96j345l81J268Q47j615o94M87J035k78r62n20J745m5r48
2109c14m08O01R85n42j546O67J437r9r78o57J232J142j559r08R04O71Q0j084p41
2128a117J664N22j737l95O41J235m09j708P12J585p12l75n04P39J212j150j297
2145a094P49J319n54r10n34J374P13j702M6O31M06J49j332j65J718k25j214p5
2163g00P18J041q69j558J226J126o00r64k45R98J198j595p21J137L59l20j166
$$ plain form
2180 -935 -1080 307 748 -648 -244 692 919 640 -1056 -347 1245 -30 -523 -945 -208 798 -167 -1573
2198 -1573 62 666 382 -363 -667 720 1404 -147 -782 598 869 364 -733 -521 922 298 -1003
2215 -1003 -837 -162 829 112 -1110 -8 809 96 -670 -713 197 853 -99 -759 638 835 154 -678 -718
2234 -718 986 616 -729 -898 389 431 326 -1426 -434 798 -122 -665 -529 -13 861 -86 -856 260
2252 260 1265 393 -214 -349 793 644 -695 -654 498 543 176 -804 -650 780 84 -1057 -610 252 746
2271 746 214 -1099 318 1360 171 -791 -572 538 701 -320 -870 776 921 147 -498 -782 567
2288 567 564 -1115 -899 311 442 -26 -741 -57 918 -18 -872 -346 424 806 -168 -971 354 1132 45
2307 45 -532 -520 517 537 -744 -800 828 759 225 -481 -182 1108 449 -1150 -452 330 213 -390 -886 137
$$ packed form
2180i35j45J387M41j396M04R36K27k79j696P09J592j275m93m22P37J006r65j406
2198a573J635O04k84p45l04J387O84j551o35J380K71n05j097K12J443o24j301
2215a003J66O75R91p17j222J102Q17p13p66m3R10O56r52o60J397J97o81q32m0
2234g18J704l70j345j69J287M2j05j752R92J232r20n43J36N16Q74r47p70J116
2252B60J005q72o07j35J142j49j339M1J152M5l67r80J54J430o96j141M47Q62M94
2271G46n32j313J417J042j189r62K19J110J63j021n50J646J45p74o45k84J349
2288E67lj679K16J210J31m68p15O84R75r36q54N26P70L82r74q03J325P78j087
2307D5n77J2J037K0j281n6J628o9n34p06K99J290o59j599O98P82j17o03m96J023
$$ plain form
2327 137 1077 154 -1009 -230 470 643 -595 -739 676 608 -27 -231 -280 741 313 -1014 -666 602 397
2346 397 -489 -736 37 1344 161 -1187 -223 122 131 -483 -1096 531 1079 515 -417 248 856 701 -886
2365 -886 -1040 677 361 -568 -543 -170 582 338 -967 -369 768 282 -158 -775 491 1132 -64 -919 -443
2384 -443 299 379 -759 -844 498 757 -247 -79 171 829 626 -825 -394 565 106 -405 -609 11 985
2403 985 -232 -898 265 280 169 -343 -575 613 1170 -142 -31 309 640 391 -835 -412 294 290 -349
2422 -349 -663 -272 526 -60 -885 -182 592 79 -394 -859 470 1214 4 -173 490 694 526 -23 -701
2441 -701 337 280 -699 -452 23 397 219 -891 -689 795 113 -166 -75 268 1263 331 -505 55 607 -42
2461 -42 -808 -831 55 639 -644 -730 321 522 63 -479 -564 628 327 -410 -293 195 755 247 -762 -86
$$ packed form
2327A37R40r23j163P79P00J73j238j44J415o8o35k04m9J021m28j327L48J268k05
2346C97q86k47P73J307j183j348R64L45Ro14o13J627N48n64r32O65O08j55j587
2365h86j54J717l16r29K5L73P52k44j305N98J137m86m40o17J266O41j196q55M76
2384d43P42Q0j138q5J342K59j004J68K50O58k03j451M31R59m59n11k04O20R74
2403I85j217o66J163J5j11n12k32J188N57j312J11L40L31k49j226M23P06mo39
2422c49l14L91P98n86q25P03P74n13m73m65J329P44j210j77O63K04j68n49o78
2441g01J038n7r79K47M75L74j78j110K02J484o82k79R1L43R95r32q36N60N52o49
2461d2p66k3Q86N84j283q6J051K01m59n42q5J192l01p37J17M88N60n08j009O76
$$ plain form
2481 -86 613 -8 -606 -469 89 779 -306 -809 20 529 236 -528 -349 542 641 -734 -287 630 602 138
2501 138 -609 -394 609 118 -619 -383 356 631 -51 -1015 271 715 179 -457 -251 609 394 -306 -518
2520 -518 156 630 -184 -599 -258 416 286 -646 -579 301 389 -11 -774 107 924 -145 -613 -397 -68 400
2540 400 -430 -584 395 243 130 -339 -230 593 613 -574 -422 309 300 85 -652 -25 864 -127 -587 -79 353
2561 353 228 -309 -572 206 535 -93 -299 -93 625 525 -514 -341 792 479 -385 -509 -396 440 240
2580 240 -523 -182 527 294 286 -440 290 784 163 -356 -35 382 332 -332 -616 247 539 -354 -325 -79 377
$$ packed form
2481h6O99o21n98J37N58O90j085n03Q29N09k93p64J79Q91R9j375M47R17k8m64
2501A38p47K15J003m91p37K36P39K75o82r64J286M44n36o36K06Q60k15p00k12
2520e18O74M74q14m15L41O74j30r32O7Q80Q8m00p63Q81Q17j069m68K16L29M68
2540D00q30j54R79j52j13m69J09Q23K0j187J52P31rk15p37O27Q89r91m60N08M32
2561C53j25n37k63P78L29o28k06K06P18j00j039J73J133l13q64j24J13Q36k00
2580B40p63L41P09k33qp26P30M94o21n19L21M17n0o64k84Q63K92q93K9K46M56
$$ [...]
8191a37
##END NTUPLES=NMR FID
##END=
