##TITLE=1H_DE-81k-TFA
 200.13MHz, CDCl3
 8 sc
 
 19ns.21.2.2025
##JCAMPDX= 6.0         $$ Bruker NMR JCAMP-DX V2.0
##DATA TYPE= NMR FID
##DATA CLASS= NTUPLES
##ORIGIN= UXNMR, Bruker Analytische Messtechnik GmbH
##OWNER= pz
$$ XWIN-NMR		Version 3.5
$$ Mon Feb 24 14:18:34 2025 Russian Standard Time (UT+4h)  new_Human@DPX200
##.OBSERVE FREQUENCY= 200.1313
##.OBSERVE NUCLEUS= ^1H
##.DELAY= (6, 6)
##.ACQUISITION MODE= SIMULTANEOUS
##.ACQUISITION SCHEME= undefined
##.AVERAGES= 8
##.DIGITISER RES= 18
##SPECTROMETER/DATA SYSTEM= spect
##.PULSE SEQUENCE= zg30
##.SOLVENT NAME= CDCl3
##.SHIFT REFERENCE= (INTERNAL, CDCl3, 0, 14.3821)
##AUDIT TRAIL= $$ (NUMBER, WHEN, WHO, WHERE, WHAT)
$$ ##TITLE= Audit trail, XWIN-NMR		Version 3.5
$$ ##JCAMPDX= 5.01
$$ ##ORIGIN= Bruker BioSpin GmbH
$$ ##OWNER= new_Human
$$ C:/Bruker/XWIN-NMR/data/yarkov/nmr/H-C/1/audita.txt
$$ ##AUDIT TRAIL=  $$ (NUMBER, WHEN, WHO, WHERE, WHAT)
(   1,<2025-02-24 14:14:38.75 +0400>,<new_Human>,<DPX200>,
      <created by zg, POWCHK disabled, PULCHK disabled
       configuration hash MD5:
       00 E9 B6 7A A2 85 ED C7 34 08 36 98 17 FE 4E 26
       data hash MD5: 16K
       3B FB 46 0C 32 C3 46 E5 92 D7 90 38 BA 33 03 BA>)
$$ ##END=
$$ 
$$ hash MD5
$$ 0D 00 00 59 92 13 E6 D6 C1 FB 2A B3 75 3B 32 CE
##$RELAX= 
##$RELAX= 
##$RELAX= 
##$RELAX= 
##$RELAX= 
##$RELAX= 
$$ Bruker specific parameters
$$ --------------------------
##$DU= <C:/Bruker/XWIN-NMR>
##$EXPNO= 1
##$NAME= <H-C>
##$PROCNO= 1
##$TYPE= <nmr>
##$USER= <yarkov>
##$AMP= (0..31)
100 100 100 100 100 100 100 100 100 100 100 100 100 100 100 100 100 100 
100 100 100 100 100 100 100 100 100 100 100 100 100 100 
##$AQSEQ= 0
##$AQ_mod= 1
##$AUNM= <au_zg>
##$AUTOPOS= <>
##$BF1= 200.13
##$BF2= 200.13
##$BF3= 200.13
##$BF4= 200.13
##$BF5= 200.13
##$BF6= 200.13
##$BF7= 200.13
##$BF8= 200.13
##$BYTORDA= 1
##$CFDGTYP= 0
##$CFRGTYP= 5
##$CHEMSTR= <none>
##$CNST= (0..31)
1 1 145 1 1 1 1 1 1 1 1 1 1 1 1 1 1 1 1 1 1 1 1 1 1 1 1 1 1 1 1 1 
##$CPDPRG= <>
##$CPDPRG1= <>
##$CPDPRG2= <>
##$CPDPRG3= <>
##$CPDPRG4= <mlev>
##$CPDPRG5= <mlev>
##$CPDPRG6= <mlev>
##$CPDPRG7= <mlev>
##$CPDPRG8= <mlev>
##$CPDPRGB= <>
##$CPDPRGT= <>
##$D= (0..31)
0 0.7 0 0 0 0 0 0 0 0 0 0.03 0 0 0 0 0 0 0 0 0 0 0 0 0 0 0 0 0 0 0 0 
##$DATE= 1740392078
##$DBL= (0..7)
120 120 120 120 120 120 120 120 
##$DBP= (0..7)
150 150 150 150 150 150 150 150 
##$DBP07= 0
##$DBPNAM0= <>
##$DBPNAM1= <>
##$DBPNAM2= <>
##$DBPNAM3= <>
##$DBPNAM4= <>
##$DBPNAM5= <>
##$DBPNAM6= <>
##$DBPNAM7= <>
##$DBPOAL= (0..7)
0.5 0.5 0.5 0.5 0.5 0.5 0.5 0.5 
##$DBPOFFS= (0..7)
0 0 0 0 0 0 0 0 
##$DE= 6
##$DECBNUC= <off>
##$DECIM= 32
##$DECNUC= <off>
##$DECSTAT= 4
##$DIGMOD= 1
##$DIGTYP= 9
##$DL= (0..7)
0 120 120 120 120 120 120 120 
##$DP= (0..7)
150 150 150 150 150 150 150 150 
##$DP07= 0
##$DPNAME0= <>
##$DPNAME1= <>
##$DPNAME2= <>
##$DPNAME3= <>
##$DPNAME4= <>
##$DPNAME5= <>
##$DPNAME6= <>
##$DPNAME7= <>
##$DPOAL= (0..7)
0.5 0.5 0.5 0.5 0.5 0.5 0.5 0.5 
##$DPOFFS= (0..7)
0 0 0 0 0 0 0 0 
##$DQDMODE= 0
##$DR= 18
$$ [...]
##$SUBNAM0= <"">
##$SUBNAM1= <"">
##$SUBNAM2= <"">
##$SUBNAM3= <"">
##$SUBNAM4= <"">
##$SUBNAM5= <"">
##$SUBNAM6= <"">
##$SUBNAM7= <"">
##$SUBNAM8= <"">
##$SUBNAM9= <"">
##$SW= 18.0517328524113
##$SWIBOX= (0..15)
0 0 2 0 0 0 0 0 0 0 0 0 0 0 0 0 
##$SW_h= 3612.71676300578
##$TD= 16384
##$TD0= 1
##$TE= 0
##$TE2= 300
##$TE3= 300
##$TEG= 300
##$TL= (0..7)
0 120 120 120 120 120 120 120 
##$TP= (0..7)
150 150 150 150 150 150 150 150 
##$TP07= 0
##$TPNAME0= <>
##$TPNAME1= <>
##$TPNAME2= <>
##$TPNAME3= <>
##$TPNAME4= <>
##$TPNAME5= <>
##$TPNAME6= <>
##$TPNAME7= <>
##$TPOAL= (0..7)
0.5 0.5 0.5 0.5 0.5 0.5 0.5 0.5 
##$TPOFFS= (0..7)
0 0 0 0 0 0 0 0 
##$TUNHIN= 0
##$TUNHOUT= 0
##$TUNXOUT= 0
##$USERA1= <user>
##$USERA2= <user>
##$USERA3= <user>
##$USERA4= <user>
##$USERA5= <user>
##$V9= 5
##$VALIST= <valist>
##$VCLIST= <CCCCCCCCCCCCCCC>
##$VD= 0
##$VDLIST= <DDDDDDDDDDDDDDD>
##$VPLIST= <PPPPPPPPPPPPPPP>
##$VTLIST= <TTTTTTTTTTTTTTT>
##$WBST= 1024
##$WBSW= 4
##$XGAIN= (0..3)
0 0 0 0 
##$XL= 0
##$YL= 0
##$YMAX_a= 90623
##$YMIN_a= -96831
##$ZGOPTNS= <>
##$ZL1= 120
##$ZL2= 120
##$ZL3= 120
##$ZL4= 120
##$ABSF1= 10
##$ABSF2= 0
##$ABSG= 5
##$ABSL= 3
##$ALPHA= 0
##$AQORDER= 0
##$ASSFAC= 0
##$ASSFACI= 0
##$ASSFACX= 0
##$ASSWID= 0
##$AUNMP= <proc_1d>
##$AZFE= 0.1
##$AZFW= 0.1
##$BCFW= 1
##$BC_mod= 2
##$BYTORDP= 1
##$COROFFS= 0
##$CY= -3
##$DATMOD= 1
##$DC= 2
##$DFILT= <>
##$DTYPP= 0
##$F1P= 0
##$F2P= 0
##$FCOR= 0.5
##$FTSIZE= 0
##$FT_mod= 4
##$GAMMA= 1
##$GB= 0.15
##$INTBC= 1
##$INTSCL= 1
##$ISEN= 128
##$LB= 0.25
##$LEV0= 0
##$LPBIN= 0
##$MAXI= 10000
##$MC2= 0
##$MEAN= 0
##$ME_mod= 0
##$MI= 1.114404
##$NCOEF= 0
##$NC_proc= 0
##$NLEV= 6
##$NOISF1= 3.799351
##$NOISF2= 2.8
##$NSP= 1
##$NTH_PI= 0
##$NZP= 0
##$OFFSET= 14.38212
##$PC= 1
##$PHC0= -1180.613
##$PHC1= 4.39225
##$PH_mod= 1
##$PKNL= yes
##$PPARMOD= 0
##$PSCAL= 0
##$PSIGN= 0
##$REVERSE= no
##$SF= 200.129724274929
##$SI= 16384
##$SIGF1= 3
##$SIGF2= 2
##$SINO= 400
##$SIOLD= 16384
##$SREGLST= <1H.CDCl3>
##$SSB= 0
##$STSI= 0
##$STSR= 0
##$SW_p= 3205.1282051282
##$SYMM= 0
##$S_DEV= 0
##$TDeff= 0
##$TDoff= 0
##$TI= <>
##$TILT= no
##$TM1= 0
##$TM2= 0
##$TOPLEV= 0
##$USERP1= <user>
##$USERP2= <user>
##$USERP3= <user>
##$USERP4= <user>
##$USERP5= <user>
##$WDW= 1
##$XDIM= 8192
##$YMAX_p= 0
##$YMIN_p= 0
$$ End of Bruker specific parameters
$$ ---------------------------------
##NTUPLES= NMR FID
##VAR_NAME=  TIME,          FID/REAL,        FID/IMAG
##SYMBOL=    X,             R,               I
##VAR_TYPE=  INDEPENDENT,   DEPENDENT,       DEPENDENT
##VAR_FORM=  AFFN,          ASDF,            ASDF
##VAR_DIM=   8192,          8192,            8192
##UNITS=     SECONDS,       ARBITRARY UNITS, ARBITRARY UNITS
##FACTOR=    0.0002768,     1,               1
##FIRST=     0,             0,               0
##LAST=      2.2672688,     0,               0
##MIN=       0,             -96831,          0
##MAX=       2.2672688,     90623,           0
$$ Real data points
##PAGE= N=1
##DATA TABLE= (X++(R..R)), XYDATA
0 0 0 0 0 0 0 0 0 0 0 0 0 0 0 0 0 0 0 0 0 0 0 0 0 -4 7 -8 8 -8 8 -8 9 -12 15 -16 17 -20 21 -24 28 -29 35 -36 43 -45
44 -45 51 -56 62 -68 73 -82 91 -101 109 -122 135 -150 166 -186 212 -240 274 -319 376 -453 565
65 565 -737 1030 -1619 3219 -16640 -31783 58712 90623 66220 39538 21097 58560 53360 -24477
79 -24477 -33438 -1982 19967 15200 -54294 -49670 32840 3231 -60405 -48167 -7683 32975 4245
92 4245 -41736 14218 52401 16918 -16145 -39340 1154 44032 -21125 -44582 26955 55697
104 55697 32128 -13580 -17167 41722 18721 -52598 -42950 -12652 14263 12118 -41041 -9653 60958
117 60958 25834 -26202 -24636 10644 38176 -18619 -53671 11011 32980 2787 -20056 -31590
129 -31590 18861 40084 -27319 -31162 28411 50205 30760 -17740 -6780 49557 7790 -55520
141 -55520 -45164 -23464 -1714 -19017 -56744 -3848 51051 22040 -7506 -7598 29775 49933 -15037
154 -15037 -33516 27429 35830 9863 -12590 -16305 29147 22678 -40564 -39175 -2619 14642 -1415
167 -1415 -41899 -7966 48203 7503 -32118 -16213 3455 19958 -11899 -40259 12693 43722
179 43722 16393 -4833 -6789 30929 36242 -32244 -37490 12617 13386 -5607 -25465 -11935 36997
192 36997 18399 -27867 -14886 7155 17328 -5469 -43674 -3199 37791 -2656 -25719 -9711
204 -9711 12373 22988 -16522 -28281 21468 31726 10536 -3637 -3190 35215 28568 -32270 -26230
217 -26230 8929 3407 -16789 -37439 -12835 28116 677 -26724 -7012 11113 22051 -4403
229 -4403 -30687 15510 39293 2335 -11344 975 24671 23634 -24151 -25166 15119 10025 -9549
242 -9549 -21840 -12737 26172 11392 -32202 -12758 14448 10766 -9163 -28561 5538 34881 -729
255 -729 -15389 4795 16949 21431 -11495 -27543 14437 20103 -12058 -19777 -6969 20606 12970
268 12970 -29289 -13776 19442 8161 -7793 -18490 -2091 29980 5430 -23412 57 18490
280 18490 15160 -9694 -25564 11729 25085 -12919 -19516 -1119 13317 13163 -20473 -20295 19191
293 19191 14449 -10506 -15976 -2253 26103 9342 -26075 -2060 22792 9676 -6610 -18255
305 -18255 3993 24993 -7487 -23873 -1594 11453 9598 -15820 -22906 16625 18304 -14919 -14583
318 -14583 1249 16676 10857 -20101 -7339 23699 12408 -5912 -12174 2013 24881 -1204
330 -1204 -27477 -358 15391 3842 -11412 -18126 10065 19871 -13463 -18688 225 10782 7897
343 7897 -17742 -14251 23465 16160 -10682 -8334 4945 19183 2915 -24015 -3232 18497 4393
356 4393 -7798 -11797 6393 22814 -7466 -23093 2032 10715 1060 -15083 -15464 15642 15130 -13889
370 -13889 -10528 3982 11453 5427 -19069 -6916 23070 9739 -8068 -5392 8026 19511 -3949
383 -3949 -23745 302 11449 -2487 -10868 -11680 10843 19610 -10086 -13965 7620 10844 1156 -17063
397 -17063 -10540 18582 8254 -15127 -6872 4993 11024 -736 -20988 -1578 19525 4451 -6270
410 -6270 -1787 13829 21355 -7072 -18778 4327 5321 -8941 -17545 -14086 10399 11078 -13484 -7224
424 -7224 9617 11291 1633 -16312 -3440 21663 5664 -8745 2462 13304 17772 -741 -16276
437 -16276 4262 10634 -7634 -15281 -11924 5338 9253 -17673 -17396 5501 3245 -8052 -15597 -5587
451 -5587 19405 12679 -4494 8196 21019 20724 5990 -13051 1509 14078 -8708 -19293 -8857
464 -8857 3356 6829 -12655 -17009 6874 7666 -6722 -10968 -5496 13406 11592 -12218 -4502 13759
478 13759 8424 -4306 -14045 -2547 15857 537 -10741 3721 13135 14186 -752 -13365 5432
491 5432 10648 -10533 -16009 -6361 7316 8319 -11729 -7954 13406 6987 -6442 -11583 -5745 11275
505 11275 3269 -14437 -874 14259 10935 -719 -9721 5976 16663 -4326 -10931 2259 9176
518 9176 8458 -8520 -14240 4513 2468 -15947 -18170 -9342 6426 4674 -11255 2891 22787 15120
532 15120 4433 -1196 4937 14705 -2151 -15889 -2851 5433 2549 -8785 -14614 4865 9962
545 9962 -10566 -11312 643 7843 7022 -7577 -4232 14072 7246 -7111 -9352 -3383 8950 -412
559 -412 -15579 662 14646 6820 -1212 -5171 6218 12816 -6865 -13438 251 5985 4077 -7251
573 -7251 -8445 11543 9051 -9657 -8960 -671 5637 -259 -14687 -4182 12225 3521 -5154 -5229 2948
588 2948 12943 144 -10020 7106 15277 7340 -1680 -4357 8070 7255 -14017 -16013 -5568 -2734
602 -2734 -4612 -14732 -8251 12903 8039 -5134 -620 7872 14070 3669 -8811 5156 14832 3383
616 3383 -3582 -4454 4073 8853 -9647 -15911 -100 3672 -1916 -9338 -6893 10412 6871 -10078
630 -10078 -5176 4054 5666 1209 -10016 -785 14732 5569 -4764 -1159 5670 9771 -4848 -14041
644 -14041 2286 6973 -2949 -6807 -5365 6767 9162 -7463 -7591 5328 5966 14 -8585 -3873
658 -3873 12167 3590 -9907 -3160 4111 5739 -2111 -11618 1370 11271 326 -5360 -1510 6570
672 6570 9919 -6480 -10819 4641 5137 -3935 -7846 -3953 8640 5690 -8985 -3617 6039 5621 -383
687 -383 -9159 -571 12473 1222 -8278 -698 5446 6056 -4632 -10921 3486 7411 -3425 -6345
701 -6345 -2451 6968 7434 -7537 -6206 7101 4815 -3337 -7129 -1991 9885 1992 -9807 -1525
715 -1525 5773 4652 -2355 -9595 1594 10084 -2557 -7185 87 6294 6192 -5846 -7293 7244
729 7244 6163 -3628 -5633 -1989 7065 3777 -10160 -3979 7199 3376 -3388 -7545 339 9974 -1143
744 -1143 -8497 971 5306 4727 -3446 -7780 4999 8316 -4251 -6144 -500 5852 4148 -8131 -5400
759 -5400 7472 3490 -3941 -4992 -382 8540 1775 -9020 -619 7087 3321 -2687 -6531 3462 8809
774 8809 -3994 -7437 762 4384 2631 -5969 -6950 6521 5647 -5081 -4827 408 6946 3122 -8810
789 -8810 -1369 8129 2508 -3492 -4320 1857 8347 -1544 -8829 795 4671 1000 -4926 -7220 4585
804 4585 6825 -5601 -5129 2437 5110 2607 -6554 -3480 8440 4137 -3723 -2718 1993 7309 248
819 248 -9244 -871 5787 -672 -5163 -5943 1769 6604 -4513 -7125 2548 4524 1893 -4331 -3847 8127
835 8127 6756 -4060 -1849 3574 6051 1661 -7678 -1981 6533 -110 -5888 -4453 579 5721 -3010
850 -3010 -8922 1572 4808 -963 -4567 -4174 5178 6754 -4183 -3537 4786 5017 1888 -4977 -2511
865 -2511 8023 3042 -4940 -2015 2704 5081 -767 -8462 -542 5129 -2272 -5652 -4153 2014 5846
880 5846 -3771 -5397 4159 5145 639 -3557 -2262 6998 5096 -5059 -1709 4334 4296 315 -6805 -1567
896 -1567 6201 -660 -6532 -2923 1928 4428 -2800 -7382 2515 5070 -1802 -3667 -1934 4544 5795
911 5795 -3852 -2553 5733 4845 173 -4768 -2422 6148 600 -7465 -2288 2345 3250 -1240 -6389 1219
927 1219 6266 -1381 -4025 -1013 3438 5046 -3471 -5209 4348 3659 -2546 -4205 -2472 4802 2822
942 2822 -5728 -1643 5015 3837 371 -4106 492 7248 -270 -5840 -1004 2573 2774 -3119 -6329
957 -6329 2342 3903 -3399 -4792 -1910 3019 3621 -4843 -2532 6149 4530 -465 -2271 521 6957
972 6957 1650 -5449 -367 3290 1538 -2477 -6685 -355 4128 -4143 -6473 -1466 1808 2829 -3108
987 -3108 -3314 6270 5577 -319 -945 1067 5922 3207 -5115 -1617 4395 1231 -2669 -5025 -799 4604
1003 4604 -2267 -6477 -155 2646 1221 -2407 -4191 3555 4952 -2755 -3092 965 3856 2741 -4573
1018 -4573 -2507 5856 2769 -2536 -2223 381 4685 239 -5844 -203 3964 953 -2078 -3833 1370
1033 1370 5022 -3025 -4716 944 2509 1089 -3745 -3455 4675 3497 -3128 -1646 840 4358 2008
1048 2008 -4733 -922 5462 1232 -2679 -2722 392 4296 -1983 -5446 426 2693 240 -2750 -3195 3406
1064 3406 5043 -2797 -2347 2681 3653 1703 -3577 -1982 4852 1903 -3449 -2182 279 3228 -678
1079 -678 -5898 -173 4044 -170 -2695 -2133 1868 4689 -2195 -3457 2524 2791 465 -2622 -2526 4070
1095 4070 2660 -4165 -1999 1456 2762 271 -4645 -609 4993 537 -2915 -1157 1722 4245 -1094
1110 -1094 -4455 1340 3178 -550 -3093 -2954 2369 2752 -4390 -3069 2398 2372 496 -2722 -1256 4703
1126 4703 1829 -3230 -723 2127 3169 -353 -4437 728 4131 -947 -3255 -1684 1085 2594 -2758
1141 -2758 -4252 2242 2675 -670 -2200 -1438 4273 2926 -3346 -1072 2799 2382 -302 -3541 -464 3983
1157 3983 -277 -3771 -1071 1349 2338 -1624 -4543 1797 3478 -1253 -2464 -903 2741 2956 -3205
1172 -3205 -2254 3115 2185 -118 -2447 -1105 4160 567 -4266 -894 2049 1602 -1189 -3929 679 3992
1188 3992 -1007 -2757 59 2033 2547 -2419 -3398 3224 2767 -1225 -2144 -751 3198 1547 -3878 -1405
1204 -1405 2638 1224 -1174 -3045 -686 3932 -435 -3372 -140 2199 2090 -1096 -2911 2388 3458
1219 3458 -1500 -1956 -188 2392 2113 -3352 -2343 2839 1399 -1622 -2613 -707 3154 459 -4073 22
1235 22 2679 1395 -684 -2454 1490 3914 -955 -2647 394 2074 1981 -2369 -2912 2638 1877 -2287
1251 -2287 -2066 -263 2021 1104 -3770 -1112 2909 872 -968 -1970 348 3802 -145 -3160 501
1266 501 2364 1268 -1318 -2746 1735 2691 -2086 -2196 268 1693 1194 -2989 -1734 3049 1136 -1843
1282 -1843 -1611 75 2693 226 -3277 64 2878 876 -1072 -1894 877 2941 -1872 -3138 685
1297 685 1441 792 -2110 -2233 2867 2174 -2091 -1591 485 2015 888 -2971 -623 3367 585 -1731
1313 -1731 -1255 433 2689 -710 -3141 804 2248 257 -1174 -2061 2050 2814 -1991 -2397 1278 1743
1329 1743 708 -2045 -1146 3353 1299 -2119 -1252 222 1904 -232 -3666 -199 2429 -48 -1669
1344 -1669 -1174 1274 2822 -1151 -2446 1724 2099 219 -1313 -1229 2448 1870 -2759 -1795 872 1010 56
1361 56 -3087 -837 3108 378 -1813 -444 856 2494 -547 -3050 991 2363 -62 -1150 -1045 2027
1377 2027 2582 -2063 -2059 1123 1288 -348 -2407 -1597 2243 835 -2548 -1056 884 1274 -389 -2699 616
1394 616 2976 36 -1236 205 1580 2400 -1566 -2841 1317 1232 -844 -1829 -1032 1966 1686 -2478 -1128
1411 -1128 1414 934 -303 -2422 -549 2671 256 -1820 -327 1247 2008 -769 -2538 1121 2434
1426 2434 -806 -1389 -438 1469 1892 -2020 -1837 1257 445 -1236 -1798 -947 2652 1470 -1629 271 2085
1443 2085 1682 -369 -2332 -120 2074 -1178 -2209 -166 1357 1798 -1276 -1850 1783 1521 -1158 -1206
1459 -1206 -356 2014 1497 -2248 -764 2078 895 -652 -1736 -477 2474 26 -1762 396 1687
1474 1687 1218 -680 -2687 491 1401 -1585 -1934 -152 1392 1455 -1265 -722 2159 1165 -703 -1548 -24
1491 -24 1949 508 -2488 -369 1645 185 -1054 -2075 54 1922 -1140 -1478 899 1843 1909 -1017
1507 -1017 -1380 1396 1326 -1818 -1581 -157 1141 863 -2103 -216 2410 734 -1086 -1712 -117 1747
1523 1747 -568 -2774 46 1420 823 -764 -1068 1065 1994 -1271 -1125 560 1310 1165 -1379 -967 1865
1540 1865 545 -1779 -1404 -203 1363 372 -2146 414 2212 587 -410 -1061 726 2068 -1057 -1863
1556 -1863 381 1366 401 -1050 -1298 1603 1265 -1804 -899 367 1255 311 -1975 -631 2199 419 -1556
1573 -1556 -756 368 1721 -483 -2142 1074 1795 366 -859 -1201 1126 1381 -1663 -1552 360 756
1589 756 197 -1323 -780 1917 920 -1465 -623 604 1322 -140 -1660 208 1864 287 -1027 -652 728
1606 728 1370 -1104 -1707 522 1105 107 -666 -571 1683 1309 -1883 -774 836 909 149 -1423 -12 2268
1624 2268 382 -1236 -343 643 1400 -472 -2197 466 1643 -309 -1050 -595 929 1235 -1226 -1296 1144
1641 1144 744 -173 -1059 -126 2029 636 -1493 -297 460 957 -227 -1972 187 1710 -328 -1331
1657 -1331 -347 841 1336 -800 -1466 915 955 -144 -902 -339 1508 963 -1245 -863 1163 273 -499 -1451
1675 -1451 -256 1846 -260 -1821 -14 720 875 -760 -1512 908 1340 -433 -736 -62 1098 1173 -1166
1692 -1166 -921 1566 833 -403 -1009 -403 1125 35 -2153 -606 904 566 -485 -1232 316 1676
1708 1676 -275 -1091 457 925 846 -620 -1311 1059 1124 -872 -899 -136 1165 412 -1841 -812 1368 579
1726 579 -379 -973 153 1712 -144 -1303 -72 1015 719 -339 -1154 1175 1411 -1002 -782 -45 593
1743 593 621 -1461 -854 1422 387 -900 -530 22 1298 455 -1503 113 1508 562 -114 -916 490
1760 490 1848 -877 -1426 349 656 362 -940 -881 1302 1016 -924 -756 -201 977 566 -1780 -502
1777 -502 1277 462 -470 -580 343 1344 -315 -2029 151 658 -145 -665 -921 1053 1595 -652 -927 451
1795 451 548 214 -1430 -936 1577 655 -1015 -567 337 936 -133 -1648 -397 1377 9 -915 -924 779
1813 779 1439 -672 -1103 346 912 -15 -665 -545 1506 1227 -618 -263 441 833 -127 -1808 -935 1385
1831 1385 37 -1145 -319 667 1310 -174 -1475 592 1279 -22 -551 -525 1012 1317 -1194 -513 412
1848 412 405 -240 -1102 -761 1640 656 -807 33 735 682 -200 -1740 -702 785 -452 -970 -368 956 1585
1867 1585 -54 -875 934 1040 -77 -896 -725 1003 717 -1203 -397 1081 244 -657 -1417 -460 1073
1884 1073 -137 -740 70 798 1125 -298 -1418 607 839 -606 -810 -506 1216 1327 -671 -490 1519
1901 1519 1008 -480 -1334 -909 814 -164 -1512 -68 858 809 348 -972 355 1638 -301 -861 107
1918 107 526 823 -684 -1075 847 494 -1209 -1152 -655 992 921 -1061 -93 1410 762 -72 -1005 -579 956
1937 956 -584 -1628 -53 754 609 -369 -1139 611 1179 -761 -1070 -66 489 809 -860 -1051 1336
1954 1336 408 -205 -702 -94 1159 91 -1139 -146 1150 194 -333 -934 -12 621 -710 -1567 -70 487
1972 487 695 -402 -381 1499 1254 -372 -461 -259 735 -169 -1747 -789 875 442 -551 -687 -54 1056 -400
1991 -400 -1467 202 1099 483 -499 -562 677 1079 -1073 -1202 250 690 290 -888 -455 1611 636 -496
2009 -496 -544 7 1096 -235 -1758 -99 1049 260 -435 -402 337 1514 -492 -1046 390 424 684 -372
2027 -372 -472 1166 818 -772 -584 109 394 -6 -1331 -450 1086 17 -670 -415 -236 1004 -413 -1523
2045 -1523 255 1009 223 -282 -590 797 1226 -648 -770 532 627 129 -1230 -967 1059 304 -682 -526
2063 -526 317 843 -174 -1349 112 1126 154 -462 -220 564 997 -557 -1160 354 485 -151 -800 -890
2081 -890 892 615 -988 -687 568 383 218 -941 -2 1029 183 -597 -155 522 856 -169 -1334 407
2099 407 396 -138 -832 -507 362 983 -805 -701 283 547 204 -851 -438 1260 462 -627 -341 363 536
2118 536 50 -688 288 1026 -240 -591 -393 264 851 -577 -1131 503 761 -453 -371 -190 1037 1156 -788
2137 -788 -163 429 410 -6 -644 -246 1083 -204 -761 -245 471 324 -151 -665 661 977 -212 -481 -213
2156 -213 517 932 -1144 -896 812 579 -26 -391 -203 861 358 -1164 -140 465 262 -29 -1164 55
2174 55 1024 -127 -816 -292 236 747 -599 -793 724 781 -358 -453 -66 632 391 -1174 -360 628 55
2193 55 -191 -634 -19 1031 -235 -710 256 651 441 -266 -800 262 1261 -608 -570 -102 291 344 -899
2212 -899 -477 609 216 -427 -368 -90 1008 187 -875 -98 603 308 -196 -891 560 1193 -310 -460 106
2231 106 672 213 -755 -523 272 628 -732 -521 168 549 316 -899 -319 986 207 -251 -179 187 1053
2250 1053 300 -931 247 610 33 -405 -647 323 676 -647 -483 -139 83 83 -813 -572 740 28 -80
2269 -80 -83 229 1105 -69 -646 30 775 2 -377 -314 219 878 -844 -901 344 66 -150 -637 -625 642 572
2290 572 -332 -230 573 676 428 -384 8 938 -250 -614 -196 476 763 -184 -894 273 465 -264 -416
2309 -416 -131 440 594 -466 -564 605 493 -270 -748 -761 267 -12 -1048 -249 251 347 191 -549 301 839
2329 839 -129 -422 -108 64 887 -658 -541 552 557 -5 -693 -541 463 214 -946 -263 522 309 13
2348 13 -829 -144 534 145 -567 -317 282 695 -49 -529 338 581 -99 -865 -589 94 263 -659 -628 342 214
2369 214 -207 -336 -176 1027 -21 -644 -80 483 597 107 -431 475 610 -570 -461 -48 233 670 -193
2388 -193 -538 885 541 -178 -456 -335 24 -124 -1117 -557 406 217 31 -444 354 960 -143 -431 210
2407 210 533 390 -89 -659 503 760 -544 -631 -329 140 284 -423 -474 964 41 -189 -410 -376 247 -21
2427 -21 -604 43 597 294 83 -432 305 926 -225 -594 -128 313 148 -660 -748 635 250 -465 -222 -128
2447 -128 856 345 -817 16 1095 568 -221 -347 21 775 -339 -1153 -338 288 -13 -514 -502 429 701
2466 701 -351 -196 404 543 447 -658 -273 474 493 -88 -219 -130 580 -34 -901 -85 681 -92 -276 -249 78
2487 78 1162 -178 -641 71 468 358 -439 -599 638 827 -279 -396 75 219 143 -909 -283 507 3
2506 3 -321 -410 172 525 110 -736 245 585 112 -225 -472 513 474 -610 -671 141 -22 171 -816 -647 796
2527 796 329 -739 -262 102 355 53 -951 31 385 -102 -350 -314 116 479 -191 -861 333 469 -34
2546 -34 -311 -495 544 507 -503 -399 278 404 1 -799 -194 701 -107 -556 -73 91 504 -113 -669 382
2566 382 604 32 -25 -503 284 480 -665 -83 122 372 60 -249 -225 493 452 -716 -133 246 380 337 -695
2587 -695 1 484 -193 -290 -317 386 600 -310 -996 200 269 -140 -470 -164 461 516 -615 -431 356 403 574
2608 574 -272 -197 544 11 -590 284 -131 66 -45 -868 79 382 -398 -201 -245 227 496 -241 -181 576 585 -94
2630 -94 -236 -151 490 127 -826 -472 194 243 -135 -815 149 698 -68 -402 -184 223 426 -298 -684 247 364
2651 364 17 -151 -90 567 847 -588 -246 449 278 22 -461 -435 249 -166 -681 -427 4 71 -172 -587 556
2672 556 758 -47 -176 201 664 159 -230 -512 641 322 -53 -510 48 716 285 -529 -428 380 121 -17
2692 -17 -549 94 479 -117 -297 121 215 176 -364 -291 171 425 -224 -245 8 285 342 -518 111 613 -12 -489
2714 -489 -263 -301 679 103 -901 -61 278 -74 -214 -248 1 762 -311 -491 -154 450 322 -244 -427 620
2734 620 296 -258 -391 -297 653 511 -188 -19 620 -268 -128 -552 114 525 -337 -444 84 419 -1 -333
2754 -333 -590 419 158 -122 -95 298 82 184 -382 -329 499 98 -96 -98 -54 677 -107 -885 100 205 -189
2775 -189 -378 -644 268 643 -471 -454 378 548 415 -222 -332 726 472 -499 -146 -172 278 154 -780 -303
2795 -303 533 16 -423 -449 -114 93 -18 -396 0 335 78 10 -393 248 734 -138 -389 237 394 328 -361
2816 -361 -271 372 56 -532 -256 -294 272 15 -432 16 779 156 -167 -303 407 568 -168 -411 16 29 -142
2837 -142 -192 -345 463 148 -432 -136 225 378 188 -566 -227 428 95 -330 -512 90 270 -69 -773 17
2857 17 439 -47 -317 -214 99 710 -296 69 208 169 160 -247 -249 385 56 -486 -266 80 307 -299 -694 225
2879 225 639 -222 -135 -230 30 509 -88 -125 359 266 0 -133 -103 254 105 -443 -145 177 -19 -96 -326 76
2901 76 564 87 -226 -124 -1 321 -12 -776 -63 221 -191 -345 78 119 384 -241 -232 360 348 -9 -267 111
2923 111 777 487 -532 75 148 199 32 -573 -284 464 0 -428 -127 150 286 -45 -579 310 252 -80 -237
2944 -237 -229 604 345 -392 -54 -92 158 -40 -517 -65 425 -28 -384 -121 -76 440 -41 -162 431 449 -8 -253
2966 -253 -196 287 327 -601 -512 371 68 -266 -217 -353 276 -74 -341 127 341 155 23 -24 -32 828 104 -153
2988 -153 81 192 80 -148 -645 -30 315 -326 -344 77 280 161 -515 -346 442 75 272 -331 133 661
3008 661 -127 -647 -39 354 57 -36 -397 303 275 -272 -363 81 138 67 -311 -604 482 335 19 -294 85
3029 85 442 114 -517 176 353 -99 75 -389 -78 148 -45 -473 111 316 264 -466 -460 300 375 -439 -253 312
3051 312 377 261 -41 -16 449 187 -253 -164 -96 578 53 -612 239 132 291 -408 -339 68 541 -326 -324 140
3073 140 182 187 -318 -207 559 365 -372 -121 -11 515 182 -380 -106 645 155 -223 -174 125 431 -103 -462
3094 -462 406 304 267 -64 -255 529 77 -453 -369 216 304 178 -471 -319 201 -103 -279 -380 -69 515 -245
3115 -245 -532 249 646 116 -12 -64 -14 442 -450 -474 319 36 -173 -256 -297 559 345 -468 19 -7 413 200
3137 200 -401 -130 608 -228 -143 -207 111 370 -331 -633 -158 41 -179 -196 -117 41 -145 -627 -392 368 69
3158 69 241 -246 255 377 204 -269 370 158 210 42 -408 -108 487 26 -207 -114 141 348 -492 -371 465
3179 465 76 3 -153 -179 526 5 -304 -34 366 245 306 -475 21 617 22 -620 -352 -156 299 -326 -579
3200 -579 -53 120 -312 -412 11 485 284 -498 -93 240 440 113 -164 48 314 -84 -301 51 216 77
3220 77 -10 -320 -273 134 -198 -257 -44 178 252 -597 -257 511 278 -164 -229 -115 543 86 -290 -131 145 115
3242 115 -154 -424 147 404 -161 -243 88 262 253 -31 -125 105 361 -212 161 102 455 260 -457 -55 724 278
3264 278 -228 13 -16 606 231 -634 73 441 96 -369 -259 322 196 -393 -82 -29 -65 88 -200 -331 421
3285 421 410 -327 -65 42 236 -34 -468 -375 330 346 -260 -227 9 792 -48 -105 219 231 65 -81 -426 159
3307 159 185 -593 -453 85 258 81 -467 -344 675 -80 -161 -100 298 424 -150 -412 354 262 -78 -86 -384 -29
3329 -29 270 -69 -501 92 93 302 -290 -416 357 373 10 262 -228 510 351 -89 182 334 -2 -202 -165 -9
3351 -9 428 -96 -336 206 156 -294 -83 16 -30 267 -306 -173 26 372 213 -329 -162 411 200 -192 -60 -47
3373 -47 392 15 -468 -7 49 -279 -27 -76 129 434 -231 -124 215 265 43 -412 -153 201 262 -351 -234 197
3395 197 8 212 -538 127 651 244 -84 -220 64 478 51 -182 190 13 3 20 -140 -21 328 -424 -331
3416 -331 -145 34 150 -188 -147 380 -150 -415 -133 6 114 -225 -159 82 391 113 -302 -188 107 487 -280
3437 -280 -123 380 462 -83 -452 -67 -10 280 -509 -249 444 -255 -139 -391 -96 543 -8 -361 -106 143 304
3458 304 -214 -199 357 323 -59 -143 -183 208 36 -421 -411 296 165 163 -256 -414 368 135 -268 -129 214 158 214
3481 214 -145 18 76 24 -386 -86 244 213 -140 -302 42 63 91 57 -99 181 -26 -387 -52 384 173 130
3503 130 -308 -289 456 223 -287 42 115 166 -249 -262 241 85 -183 -322 -86 187 269 -251 -305 285 412 -275
3525 -275 -265 -79 159 -91 -646 214 303 107 121 -258 260 435 -236 -183 149 176 130 77 -255 365 366 -64 -16
3548 -16 -7 440 239 -366 80 46 -12 -524 -630 -313 457 27 -582 141 -57 225 -109 -266 237 720 -239 -186
3570 -186 149 440 353 -509 -157 389 107 -56 184 -142 276 -33 -347 -228 307 -172 71 -138 162 241 -37
3591 -37 -164 122 117 288 125 12 256 231 -508 -226 72 193 34 -566 1 302 73 252 23 194 354
3612 354 -293 -349 40 154 -76 -298 -145 282 94 -256 -171 191 157 161 -183 -116 282 151 -211 -384 -153 379
3634 379 171 -5 139 315 61 -567 -184 115 250 -277 -171 169 23 182 -166 -402 99 320 -590 -236
3654 -236 52 119 96 -315 -148 255 -97 -205 -310 91 192 74 -221 -17 118 -149 -4 5 -127 289 -156
3675 -156 -212 287 80 55 -13 -298 380 195 -319 -18 -112 118 -154 -423 2 633 -9 -313 -262 38 571 -150
3697 -150 -321 356 282 -93 -173 -116 84 34 -407 65 106 -164 -20 -223 -272 317 -183 -178 89 118 276 -11 -141
3720 -141 110 486 328 -293 114 279 284 92 -167 216 188 355 -317 86 302 238 -256 -216 223 -131 56 -404
3742 -404 -19 468 -161 -235 -187 -23 11 -310 -292 -88 217 47 -206 -74 271 187 -326 -286 384 64 34 -210
3764 -210 -121 422 2 -2 -81 252 160 31 -532 169 485 -199 -75 18 -126 -41 -51 -92 420 134 -119 -488 -51
3787 -51 27 77 -296 162 302 247 -90 -294 69 319 -135 -151 324 201 15 -293 -254 -190 5 -208 -40 -10 65
3810 65 -162 -282 -114 165 166 39 42 129 452 202 -21 85 61 -110 -15 -166 176 155 -199 160 -101 299 231
3833 231 -209 -196 571 387 69 -7 -332 158 113 -248 -67 562 -13 -331 -157 114 379 -366 -193 71 -29
3854 -29 65 -81 120 24 34 -205 107 267 294 174 -408 -245 353 15 -261 -32 233 187 -93 -72 170 -13
3876 -13 -24 80 -211 92 219 -158 166 238 -108 141 -233 74 159 29 -270 -400 -111 364 -306 -274 205 326
3898 326 5 6 -125 224 211 -187 72 -31 324 12 -18 -188 198 60 -82 -260 -68 -1 34 -260 -148 45
3920 45 -70 -223 -116 197 260 -93 0 19 242 -38 -166 -119 -95 243 -151 -133 133 -105 -290 65 -68 271
3942 271 117 -180 -85 143 174 66 -254 258 49 -210 -117 -386 179 447 -10 -218 90 -75 -110 -116 -63 184
3964 184 -117 -222 -136 87 -52 229 -62 -128 89 -1 -108 19 68 -37 -228 -192 -107 29 -64 79 -49 52
3986 52 176 -132 -192 8 301 41 -132 167 178 36 -96 -208 18 198 -214 -289 16 523 122 -350 244
4007 244 35 39 2 -7 348 322 -17 -351 -182 325 -44 -187 51 186 196 -335 -241 135 666 -175 -236 -244 200 172
4031 172 -407 -163 64 25 28 -137 -108 135 4 -72 158 51 60 -169 -150 -140 248 -59 -348 176 74 -32 -229
4054 -229 -221 -75 163 -221 -112 225 257 290 -120 -17 199 47 -86 -19 23 114 360 -176 -314 362 -224 8
4076 8 -161 -339 59 -39 -174 214 204 -66 81 -107 319 113 -226 -129 23 -84 18 -237 -214 81 365 -46
4098 -46 10 -77 -18 70 -111 43 0 187 2 -262 206 -76 -77 -30 -50 -4 139 -141 -159 112 -13 -233 -440 -29
4122 -29 38 -143 -144 70 330 124 -204 -114 21 362 54 -128 152 15 -22 120 -68 238 8 148 -199 75
4144 75 159 224 161 -15 210 145 6 390 41 313 -66 -205 94 285 -179 -132 -58 59 -128 -106 135 -32 210
4167 210 25 -88 121 -39 -114 34 -248 28 216 -45 -189 -82 320 -144 -200 -117 -86 190 -209 -60 -151 15
4189 15 41 -42 -30 43 -52 20 -83 135 224 -480 -64 -284 106 64 -115 -21 276 169 -46 -305 -127 122 -114
4212 -114 -106 -137 171 52 -62 -77 267 -129 -12 118 18 79 -90 -130 28 -79 -294 -4 142 -135 -133 -78 131
4235 131 61 144 134 -320 -190 185 205 0 -86 216 270 113 -93 190 -25 147 94 -36 -114 65 -261 -286 -184
4258 -184 105 -44 105 -229 -236 -141 -184 -148 -36 146 -156 -165 -208 258 48 31 -133 75 109 93 -22 266 119 -128
4282 -128 -67 -137 -3 40 19 -67 81 -196 360 57 92 -105 139 221 -60 100 -172 73 -229 155 152 423 174
4305 174 -44 188 -101 -14 -173 45 0 212 53 -260 260 -114 -256 -132 86 -21 104 89 -48 122 -109
4326 -109 -286 -40 -163 -317 -50 -244 -33 100 8 -34 -66 123 73 195 -50 80 -91 -122 57 109 -32 -73
4348 -73 19 105 108 -32 -8 -59 -46 -106 2 64 119 158 -230 -163 -131 23 255 -36 -11 80 -39 212 275 -144 -170 119
4374 119 33 -73 -8 -249 66 -128 -72 44 97 172 170 -78 -68 187 410 119 -38 131 13 -204 14 -44 -130
4397 -130 -91 58 -58 6 -101 -62 70 57 -31 -29 45 71 -27 129 79 23 -132 -82 -14 -220 189 175 256 -58 -14 -222
4423 -222 95 -205 -31 75 94 1 10 89 -218 -104 -130 71 100 68 214 225 -127 387 -77 18 41 26 58 -181
4447 -181 160 -127 -176 58 -18 -50 34 -160 154 170 -165 -21 -78 -195 -5 -45 34 306 131 -36 -89 -6 85 1
4471 1 -206 -42 60 146 85 323 451 -93 247 -156 -118 76 -130 -282 105 189 -103 -161 80 -5 157 -93 -225
4494 -225 16 102 -166 -118 -9 -167 -201 87 105 272 169 -140 -188 -26 261 80 294 29 -58 -239 191 -152
4516 -152 -90 -58 83 -217 -28 93 171 243 -251 -165 50 157 -15 -17 -81 12 99 -95 48 -151 57 -52 109
4539 109 253 -15 -27 12 -38 -54 145 -116 96 152 67 -260 -43 159 -40 -31 86 31 -21 -112 -180 12 -238 -127
4563 -127 44 -145 175 135 180 -59 96 -149 179 -213 -2 198 57 -31 -99 61 -269 -50 -40 -137 270 -170
4585 -170 15 104 48 46 -179 216 28 77 -143 -106 58 23 -298 100 241 -101 29 228 1 -160 -102 -68 295
4608 295 -271 -230 149 297 388 -7 57 -3 -30 -32 48 63 94 297 68 -201 -198 -278 -259 -83 39 -100 84 157 -122
4633 -122 34 64 -299 -50 34 201 50 -241 23 -132 9 -72 335 -24 -348 317 41 -89 2 87 -46 -93
4655 -93 384 155 208 37 -135 165 -26 290 32 28 29 272 42 254 103 110 -80 -234 31 -241 27 -301 -197
4678 -197 130 -43 78 208 72 -88 18 -33 -257 32 155 -197 325 -198 295 -69 24 -250 -90 -133 92
4699 92 72 -60 22 -92 51 207 119 -47 38 -64 20 52 50 -247 -266 -76 -164 -113 211 -32 -189 49 15 -48 -195
4724 -195 154 -230 -8 -17 11 120 -32 -106 354 1 -79 -389 -11 111 142 157 -94 -47 -249 -25 141 119 -71
4747 -71 -27 104 -138 -52 -206 -68 47 130 94 116 58 115 -56 145 -48 -200 37 142 -113 -153 186 41 103
4770 103 223 -78 177 118 28 65 -66 -4 -100 -49 -6 -85 20 91 -131 -52 -46 -104 49 -73 -381 238 -177 244
4794 244 -16 -63 -59 94 100 -186 -195 -57 -14 -41 -134 -15 -5 35 -37 60 -421 -74 -19 -224 260 62 -132 -58 161
4819 161 -62 60 -76 -108 -85 -59 82 -178 -3 82 31 167 -271 -42 76 -130 10 -96 296 146 -97 112
4841 112 -102 -109 -42 -45 195 169 13 -76 208 118 49 87 -65 111 161 340 48 -47 -139 -80 -95 -468 -55 173 -7
4866 -7 46 27 382 91 57 22 -152 29 -114 -196 117 -126 -155 -204 -136 375 259 -315 -19 -41 -199 -21 -57 22
4890 22 388 -287 -52 416 219 -94 55 87 10 60 102 -82 -14 107 -167 183 -31 86 -200 135 99 124 103
4913 103 -23 41 -94 -120 78 -110 -113 33 238 131 -67 137 95 180 142 50 -138 152 -56 74 -58 29 -19
4936 -19 -75 -339 268 -141 -98 197 -147 -118 -12 131 -73 6 -349 187 8 83 -83 171 -37 -89 65 13 191
4959 191 229 -114 288 97 -21 -109 187 89 -1 45 148 -199 34 -76 -149 1 -59 -34 -91 242 203 -15 -128
4982 -128 -15 -7 -47 35 23 222 32 -80 10 5 50 -119 -45 -62 12 34 -179 -162 82 -138 -74 50 12 139 4
5007 4 -20 32 154 -15 334 132 77 148 -140 -27 -64 57 251 -182 -49 -21 362 -69 147 35 287 -224 -172
5030 -172 -272 -137 47 -78 -233 52 -79 -33 -182 83 217 -67 -60 -93 -91 355 227 39 165 -175 -138 -26
5052 -26 206 126 122 -67 -269 232 -75 18 101 -84 -34 -94 66 178 -45 -99 -68 233 88 188 250 178 86 -170
5076 -170 122 277 195 -151 -51 -141 -112 -84 -105 -207 -342 7 -188 73 -44 -261 -78 43 -73 -75 81 79 21
5099 21 -150 -231 -162 -14 -106 -24 -131 -108 -17 -19 -85 72 -7 37 -127 70 193 -30 147 -299 32 318 90 -363
5123 -363 111 58 163 -78 -33 254 80 -215 -171 27 -90 74 64 -101 -70 -82 -172 -237 -150 44 -190 -58 56
5146 56 218 242 53 81 -118 -339 -61 -23 86 47 234 69 -195 23 314 -113 -73 32 94 145 -158 122 10
5169 10 -212 281 206 243 177 -63 115 -5 -170 64 291 89 272 -191 -62 7 -210 -90 187 -307 -70 229
5191 229 -61 -61 268 -192 -56 25 -238 -23 70 130 -10 -23 -181 179 -31 252 -229 -131 179 -204 -9 -43 169
5214 169 -277 -113 -131 22 315 37 -170 105 -41 -27 -300 -3 -175 -309 -241 -174 24 52 -49 -32 -45 -183
5236 -183 156 90 -112 194 -150 216 46 18 -85 152 246 133 148 -43 -42 -91 19 -49 17 -56 76 -434 -175
5259 -175 -17 -120 47 191 -16 -249 221 -203 7 291 8 28 -158 96 8 107 36 64 -196 -167 -64 -106
5281 -106 -100 121 -98 -222 -57 -59 340 79 164 81 199 -188 81 144 -55 -118 -69 112 -39 299 165 112 -50
5304 -50 -149 169 83 17 119 1 19 67 212 -133 227 28 -156 31 121 -82 124 -139 322 -3 120 -9
5326 -9 52 187 -184 -210 -78 64 41 55 -293 -44 325 -110 -69 109 238 -27 21 -3 231 -140 52 -80 -228
5349 -228 -13 -44 -163 25 -8 -170 101 89 -4 250 -151 -193 -23 106 -119 98 -63 -23 288 97 -32 -56
5371 -56 332 -261 19 -44 66 -266 -14 -277 -176 -9 -309 -98 274 149 -402 -167 -3 -91 44 -5 129
5392 129 -183 -245 21 -252 -236 -30 339 41 140 -177 -22 39 -143 107 102 180 46 -13 73 110 -62 141 59 -119
5416 -119 149 -263 -311 -86 15 -184 52 -20 73 -77 -137 -12 103 176 -112 -22 -110 -77 114 112 187 -94 61 -225
5440 -225 91 408 43 -136 -12 97 80 -71 -175 62 63 -73 -87 219 77 -3 39 58 219 -62 125 -270
5462 -270 45 47 29 -27 -190 -98 91 103 -275 -146 -53 -59 78 -307 1 2 16 -139 -75 -118 -204 36 73 187 40
5487 40 -2 -259 -113 -113 -39 90 -271 73 -42 -59 -99 188 -21 -150 77 302 -64 -60 53 -231 106 -76 242
5510 242 -18 57 -218 42 -167 90 -172 115 -216 -158 26 -70 -108 -169 126 -29 -107 -106 34 -172 -79 78 -30
5533 -30 -70 160 37 -298 64 88 116 -333 -151 161 66 150 -11 -70 12 231 162 -106 74 43 132 191 -76 39
5557 39 185 -53 77 79 111 -86 -66 91 145 7 140 -11 31 -124 -37 22 -51 0 285 -229 -161 -11 80 -65
5581 -65 275 -72 366 -29 -166 100 102 -99 -69 -72 -72 187 305 -41 189 -80 -98 3 59 -88 6 87 -60 66
5605 66 125 121 -25 -126 87 -7 -318 -82 -48 -110 54 -118 103 111 -126 -172 -154 -3 -223 -211 -71 124 150 0
5629 0 26 17 111 91 -62 148 -76 -19 -151 -285 215 53 -12 33 -156 -70 -208 20 144 189 -34 25 -121 -162 146
5654 146 61 -26 -98 -87 35 -45 161 76 383 239 -9 -81 -112 -142 -67 241 -14 91 100 84 259 -79 -181 -35
5678 -35 -85 287 -12 -53 -155 84 28 -113 -323 -277 -147 32 -95 225 -33 79 -12 68 307 94 -86 49
5700 49 -349 -15 -148 189 103 -123 -141 143 130 -6 72 -18 26 -31 133 -74 21 78 -99 112 193 65 -46 -167
5724 -167 -97 -16 12 3 -51 198 -47 -100 340 -151 77 146 -99 148 167 -311 -70 139 82 -31 -170 -43 84
5747 84 77 -317 -118 191 7 248 189 -28 -97 -188 170 -241 27 28 10 -219 132 269 -95 171 37 -51 -41 62
5771 62 -81 -123 -175 61 106 230 -58 -195 -154 166 -259 24 -2 -20 49 192 -240 -43 -215 137 -175 206 -28
5794 -28 200 -205 -276 -63 -335 -187 -151 233 3 -107 42 72 -44 -57 44 32 25 76 -180 -146 83 -126 -92 159
5818 159 -88 101 -308 40 176 -123 -64 -45 56 79 -2 -53 137 88 -41 -14 -6 -155 98 196 -118 60 -134
5841 -134 111 -168 -133 -124 69 -127 -239 -74 184 -165 47 1 -178 319 -20 -39 118 136 25 84 -79 178
5863 178 5 -87 140 41 105 -138 64 -46 67 5 41 154 -179 74 -214 -4 -122 -239 57 -7 -291 -23
5885 -23 -80 -178 3 -385 -183 175 -4 -63 -78 -317 59 131 149 -32 24 93 -204 -233 57 -127 128 56 7 -88
5909 -88 -17 -1 28 56 98 10 -124 -96 79 63 10 47 -99 -112 227 1 57 100 338 91 82 -49 -32 162 119 155
5935 155 -121 33 8 244 51 193 156 191 179 -177 61 -55 97 78 -66 63 -53 37 151 -190 -131 -155 -466
5958 -466 -28 -102 148 -191 29 -208 31 312 135 194 39 62 132 236 -136 15 -113 -90 -95 -53 82 -66 -38
5981 -38 -103 0 12 -42 -250 -91 -191 -226 -55 -75 -74 -118 26 -94 20 -39 51 -114 -190 -58 -50 -183 -115 -66 328
6006 328 83 335 -91 86 62 80 -164 -109 -45 -14 -51 -54 21 145 5 -188 51 -185 -31 -131 36 65 57 -23
6030 -23 115 245 -16 61 75 -29 -6 -22 2 -80 225 68 30 9 -128 -51 -81 0 -36 84 -273 -95 15 79 -145
6055 -145 78 -60 129 50 240 -210 -143 -184 21 25 -88 38 -114 -114 107 148 94 124 -88 -4 -159 -277 -1 36
6079 36 24 83 -33 -106 151 -165 -219 -137 -56 -14 182 -9 332 -20 18 10 -10 -332 78 152 -51 -37 114 -210 217
6104 217 306 -91 -221 -7 152 -37 -120 -134 138 -24 110 -265 -167 -266 -320 144 -27 32 -201 22 -70 -155 0
6127 0 163 -120 108 -105 117 49 -6 -11 149 -125 -60 -6 160 -84 -100 134 222 -100 -79 149 201 60 -100 180
6151 180 169 18 -197 21 -206 124 141 -19 223 -45 -162 -151 47 -26 232 -7 -138 -447 -75 51 88 -194
6173 -194 -374 -131 85 -145 19 -80 68 -154 -133 90 50 -490 -170 -142 -248 -206 43 -46 44 253 -68 475
6195 475 -179 -134 47 -252 -89 -51 8 -8 -1 -98 -101 26 -210 -372 -133 0 -141 31 6 22 -307 154 -46 10
6219 10 87 132 -217 -147 211 230 -15 -59 392 -201 22 0 23 167 130 21 -120 -52 244 195 -151 -44 402 -70
6243 -70 103 0 -68 -289 37 198 -162 75 85 -227 46 -60 -1 124 8 343 286 -166 -231 41 67 -85
6265 -85 203 163 -19 97 277 -119 -102 -136 -194 -215 -15 156 37 -62 -135 173 53 -57 140 -81 56 -163 174
6288 174 12 86 -95 -215 -99 69 63 -277 -108 22 62 -110 -83 -197 412 256 125 6 -10 -46 -42 -203 32
6311 32 -383 -117 -43 -314 -18 -64 28 -23 70 68 -64 -190 -67 5 -265 507 121 43 69 -193 98 -71 -49 -410
6335 -410 -178 -110 -129 107 227 52 -360 4 37 110 -146 -253 -45 -135 -20 -118 16 -139 64 135 217 159 -133
6358 -133 -94 -54 -36 22 219 77 -11 -44 27 90 52 -56 2 -41 -180 -47 -60 97 -150 352 21 162 -122 211
6382 211 38 -94 15 38 342 120 84 -27 46 -11 -43 116 151 47 345 176 208 124 -47 210 72 -160 146
6405 146 -134 132 124 -83 53 -76 -32 -14 -107 37 16 45 373 125 -280 74 -78 208 -65 -87 -156 -132 -88 -61
6429 -61 -57 -42 15 -196 -75 -230 182 -201 158 147 -163 282 -200 -50 312 -201 -57 323 199 120 9 205
6451 205 -155 -216 97 -219 182 52 88 -8 204 -256 115 -126 -211 112 32 175 118 -130 -98 16 -48 16 -16
6474 -16 83 215 -252 -177 -54 -16 111 -7 135 -161 212 -1 -177 98 -29 113 113 8 -77 -480 151 -159
6496 -159 -121 -139 -47 -61 132 321 -142 -52 94 -281 -80 -66 -19 209 16 -192 215 98 33 94 100 -26 -84 -195
6520 -195 -55 -63 -99 49 -245 -89 75 43 -244 108 219 -100 -358 -81 69 175 -167 -8 132 -91 192
6541 192 -289 78 -160 120 -280 -70 -7 167 -64 134 -214 79 -266 65 -36 -211 126 -196 -57 148
6561 148 205 -150 -150 -30 -44 -96 158 -203 -1 -214 -78 5 -224 24 141 -58 -260 110 -19 251 340 -201
6583 -201 188 147 -104 -198 13 -25 -15 -78 20 50 101 88 113 -324 130 27 16 -62 -77 -104 -64 -165 104 211 281
6608 281 78 -159 -20 -134 163 219 45 9 -172 142 76 140 -415 -395 -132 -93 232 -38 -11 238 18 -275
6630 -275 135 -122 -137 271 -19 -93 98 -21 -194 -256 164 72 219 -101 -207 -36 -42 -47 183 -170 -127 -6 324
6653 324 -47 211 160 88 -96 -24 -64 5 238 126 -64 183 -150 -146 -187 -110 31 -217 -139 2 -274 -362 68 -274
6677 -274 307 61 8 22 -348 -21 214 -26 -32 195 -106 -327 -7 -152 -51 -48 -38 -39 -150 36 273 45 -255
6700 -255 8 -129 16 -132 4 -93 234 21 -102 -50 71 -24 95 95 -46 -158 -19 -183 169 -42 -31 -36 -199
6723 -199 -169 -229 -155 -98 -72 86 215 -216 -70 220 71 -182 -32 -21 -109 112 31 168 89 196 -147 -14 229
6746 229 -31 12 84 -125 102 -243 44 -83 227 -116 -43 141 -69 -26 -60 58 -7 194 -80 181 -237 -72
6768 -72 289 12 200 -1 -40 -329 -57 129 -121 59 53 -83 207 84 61 23 -10 8 214 406 266 74 124
6791 124 -109 -19 163 192 35 -58 -101 44 -137 30 -88 -70 192 -50 -149 -297 -177 -295 -25 6 71 -42 345
6814 345 -48 53 83 -121 4 13 247 50 -256 239 239 -105 -155 -37 3 14 33 -44 -50 -185 139 -94 -152 159
6838 159 313 -67 216 -91 -98 261 -264 -18 -29 -183 80 -23 -33 -240 -4 -212 339 -102 -223 -262 -78 -80
6860 -80 202 71 -107 280 436 118 -139 292 -198 -170 -4 297 329 121 122 199 -256 -382 30 -221 14 -4
6882 -4 -151 -14 -134 -142 -105 -204 -258 36 73 -133 -95 -134 -63 161 35 30 250 101 50 -189 74 238 37 -122 181
6907 181 -163 131 -305 -52 121 11 53 272 16 189 114 82 127 37 -103 9 -17 -41 1 72 -78 -110 295
6930 295 -103 -52 -134 11 234 228 146 196 -44 64 65 -101 149 -4 19 -20 27 132 80 -17 -70 33 19 -90 102
6955 102 0 -41 -209 -2 364 -41 -121 218 -209 104 -231 61 19 -533 -88 -69 -127 38 -73 225 -63 38
6977 38 -208 -19 66 -278 -37 -159 -127 -9 -18 -60 -168 291 -85 -121 28 -35 7 134 44 51 -174 68 18 48 -284
7002 -284 193 -215 160 -161 84 210 38 229 -281 17 85 66 -126 238 -57 -114 -289 50 180 -35 34
7023 34 124 83 204 -121 0 40 233 -17 7 197 61 16 -29 -122 57 -200 127 85 214 109 -32 127 30
7046 30 -186 -73 166 43 94 236 24 179 -89 -8 -122 -14 -82 -49 -50 -309 31 95 118 28 -79 -48 -114 -63
7070 -63 -344 329 7 6 190 -154 36 -102 -128 69 83 18 194 -13 -116 251 211 305 -31 73 -63 57 -37
7093 -37 -34 197 -127 39 -129 133 121 20 -125 -119 -13 -175 -63 285 -285 12 148 123 228 99 -48 8 -180
7116 -180 154 361 13 -273 -79 1 -135 125 -100 -24 -47 -249 118 -140 -248 -41 -140 187 81 246 56
7137 56 -219 85 111 99 -186 -159 10 222 -59 100 -96 21 -85 -104 -133 11 -17 159 -53 -88 -29 -224 51
7160 51 17 12 22 14 -67 6 109 -12 153 64 29 -19 -164 -145 22 1 -22 -68 -72 283 83 -18 -6 89 -107 42 187
7187 187 86 83 112 -331 -409 232 135 -153 -74 -59 63 156 -119 -37 -335 -77 49 -90 -80 -249 -187 38 97 225
7211 225 -223 -62 -105 -196 15 227 224 -171 -40 -196 -46 12 163 -145 -71 94 35 -188 106 -115 -8 50 -96
7234 -96 4 108 -303 -12 -201 212 -111 -168 149 213 58 284 55 -159 -104 -8 -113 -221 73 18 175 187
7256 187 -55 -364 66 -87 -31 148 -14 -72 82 278 -16 -52 -168 -87 -63 -169 -67 -174 -158 9 -180 75
7278 75 -393 -268 -28 -77 -158 136 186 153 -129 -41 -173 8 -3 43 139 101 126 -115 73 86 4 -117 -213 -81 -28
7303 -28 -67 -103 129 113 106 113 -166 45 -293 59 97 7 68 -296 127 66 57 -327 42 33 -128 -212 5 -89 -175 -142 242
7330 242 -92 -10 154 -138 -24 -132 -24 202 -240 -35 14 -29 231 20 -103 -225 -153 -74 -307 85 174 -74
7352 -74 10 452 13 -102 41 38 -10 -188 -2 -164 -181 -13 215 -65 -176 57 -203 -76 391 48 165 78
7374 78 281 -24 -51 -185 49 -56 153 83 -28 115 12 -94 -114 -97 95 328 276 -132 -102 22 -100 181
7396 181 80 -95 -30 -97 -69 77 56 -12 87 125 157 -317 83 33 -219 97 82 -214 -30 -296 131 -4 -260
7419 -260 -96 -125 -37 -6 -50 103 -151 178 -102 149 177 38 -137 -4 -200 -146 181 331 -56 67 -183 60
7441 60 -139 10 140 -149 459 166 -120 -4 -168 -422 11 14 -185 -22 -216 -88 193 -4 55 42 43 -269
7463 -269 21 33 -196 158 18 0 69 178 225 254 112 -36 -42 70 0 18 -130 -110 -101 -181 9 293 44 -200
7487 -200 348 -4 201 263 -271 -209 -34 -150 11 -39 28 24 59 -34 -204 -95 -27 -64 -169 -24 85 54 -66 -242
7511 -242 -190 -95 57 -224 -107 -46 -119 -162 258 -88 -314 -56 -120 -166 76 150 -258 -121 266 -77 43 319 -29
7534 -29 -135 -56 -134 84 -270 -20 -175 -43 174 61 -201 112 -92 -195 -163 151 -312 161 78 13 152 136
7556 136 -54 -75 135 42 267 216 164 49 59 -82 101 -166 26 -181 104 -1 -34 71 -114 8 -67 -35 14
7579 14 187 -74 -46 -94 -62 22 152 22 -93 -5 220 124 -51 -205 -192 335 34 -97 71 -111 -47 183 79
7602 79 320 -55 38 -15 328 201 15 81 57 200 -36 210 44 156 204 -8 -170 56 -35 16 32 -89 51
7625 51 139 -105 -93 -89 -199 -159 -156 24 56 -69 -67 24 -32 -45 122 13 44 44 82 145 164 378 -206 -212 -59 -81 20 71
7653 71 -31 106 -100 -208 -161 -43 61 -72 -14 97 12 48 79 -30 100 -435 -162 -158 114 53 6 -322 121
7676 121 -160 32 58 292 225 369 -334 125 -94 89 62 259 -51 158 -85 -40 115 22 40 -157 -120 224
7698 224 -167 -61 -11 151 -64 188 -134 40 46 133 -23 -275 165 -17 -210 -111 -58 319 41 -144 -69 -305
7720 -305 -21 57 23 235 250 14 12 1 5 89 461 -109 -210 7 -8 54 238 30 -214 -52 -121 -95 172 -5
7744 -5 -9 9 218 -34 -219 -163 -69 92 199 -56 -64 -29 257 145 98 -27 202 238 -125 -134 164 37 97 -58 -250
7769 -250 -199 -134 49 -149 54 108 79 -194 86 -208 36 -32 0 -268 -70 -82 10 27 -34 -118 -273 -4 -5 -194
7793 -194 -177 134 -37 -121 -104 201 47 50 -8 -54 -276 -78 -140 -31 59 -32 -46 188 13 -9 5 -155 -79 107 173
7818 173 -54 -153 -29 -228 219 -134 23 -101 20 -163 -130 17 37 -147 48 -10 120 26 -208 -71 112 -24
7840 -24 143 -158 103 -65 190 -138 -169 179 -175 -34 61 79 165 32 -153 -68 -109 -131 -149 25 -311 -47 116
7863 116 -97 52 111 -73 109 -119 -67 -93 24 -91 153 -96 69 -78 -96 22 134 50 -113 -9 -62 -220
7885 -220 184 -7 43 88 -110 11 -155 -218 131 -13 300 110 -101 128 123 -78 49 158 -345 90 252 -138
7907 -138 -25 162 -113 52 5 21 -133 38 42 144 125 -31 5 35 21 56 -30 86 -42 39 225 53 -34 150
7931 150 -8 46 -173 -88 128 -172 -213 143 -87 29 -19 57 55 23 264 -162 -320 -299 -134 125 -58 -133 333
7954 333 -101 47 58 -140 18 249 27 261 -145 279 -242 -1 171 71 -86 -219 276 153 -328 161
7974 161 63 145 -30 102 -31 -172 108 -26 -4 137 76 345 -32 64 -6 256 27 258 -192 155 -55 182
7996 182 -35 -116 114 -25 102 -161 59 126 180 -44 5 -18 -259 112 -84 -56 -125 -61 202 -126 -244 -95 75
8019 75 -33 -40 -60 151 133 23 95 -127 -133 210 8 -96 155 -15 191 300 -61 203 126 5 30 6 306 31
8043 31 -289 -232 -41 154 109 -14 -70 43 -190 224 -46 -68 -96 -290 27 -25 -53 151 -66 -74 -34 46 142 144 -158
8068 -158 114 -69 -196 112 92 44 75 -18 106 -211 -148 -216 272 176 153 -51 216 50 55 135 -116 219 75 -61
8092 -61 -69 -158 354 126 110 -102 73 -91 148 89 -35 -59 7 113 -10 29 -10 -116 -26 28 29 110 -93 -93 -29 -97
8118 -97 -87 37 33 217 209 -190 48 -122 222 -185 -125 220 -224 275 -18 143 67 78 -117 -134 85 -96 255
8141 255 -54 -260 83 103 -91 -39 -129 50 223 322 -45 29 -125 0 -164 -206 -16 -123 19 284 196 363
8163 363 90 374 169 4 -138 175 165 -130 238 -159 9 57 37 -151 -82 126 16 -26 223 71 308 4
8185 4 -25 -52 71 114 -141 -25
8191b5
$$ Imaginary data points
##PAGE= N=2
##DATA TABLE= (X++(I..I)), XYDATA
0 0 0 0 0 0 0 0 0 0 0 0 0 0 0 -8 8 -8 8 -8 16 -16 17 -24 26 -32 40 -47 51 -59 71 -80 89 -104 119 -135 152
35 152 -168 192 -214 239 -267 297 -329 365 -405 448 -494 546 -602 662 -729 805 -887 977
53 977 -1078 1191 -1319 1463 -1630 1825 -2053 2327 -2664 3088 -3641 4394 -5495 7249 -10505
68 -10505 18656 -89866 -96831 21608 -33941 -46884 -32198 55585 86088 14991 -13900 43156
80 43156 54412 38403 -23262 -24232 63424 50935 -39382 -29440 7029 17271 -19644 -70551 -22332
93 -22332 40360 4912 -19928 -15023 15406 47522 -18503 -69726 -2044 27094 -7326 -28035
105 -28035 -9794 57474 57850 -16254 -11292 22888 15760 -4069 -52475 -38485 38317 16027 -36027
118 -36027 -11024 28466 42288 -5991 -49428 8438 36734 -9551 -23998 -17604 14729 35278
130 35278 -31040 -51441 10249 20914 -6650 -27085 -3791 64614 49408 -10499 11881 34918
142 34918 20216 -11401 -58731 -33516 14930 -21246 -48645 -21297 15534 34256 -14178 -38495
154 -38495 23760 32584 -9911 -14672 -614 37372 42937 -14364 -12784 28732 21702 -8429 -40458
167 -40458 -17975 37254 3433 -37845 -739 22731 16949 -12753 -45183 -6421 22169 -17933
179 -17933 -31044 -7272 28489 40156 -12557 -19760 36662 26586 -15303 -25522 -12332 26164
191 26164 14642 -31291 -6752 27900 20042 -2971 -31842 -3439 37057 -7772 -37094 -2811
203 -2811 17547 14118 -19982 -36384 10088 18028 -19622 -22575 -4591 29428 34652 -14706 -5733
216 -5733 43072 27168 -7983 -21428 -5749 25297 -3895 -39921 -9369 13827 8136 -13481
228 -13481 -35907 1671 29433 -14903 -28626 2790 24798 24065 -12634 -14877 31790 24211 -12082
241 -12082 -16317 -4765 23089 13214 -31750 -11104 26213 10624 -14450 -26774 -2087 25370
253 25370 -11649 -32422 1899 17419 14071 -6476 -19858 19434 29702 -11691 -19128 1594
265 1594 18962 12125 -25769 -14686 25914 9593 -15441 -16069 -3631 21286 2287 -30830 -2946
278 -2946 22390 9945 -8955 -18245 12454 29447 -11268 -21670 6959 15192 8663 -16251 -19247
291 -19247 19382 16042 -17481 -16417 187 17660 5734 -28767 -6931 25334 5931 -11425
303 -11425 -10232 6914 25912 -1914 -22522 6012 17748 5418 -12831 -19012 14190 19777 -18630
316 -18630 -17483 5941 11317 2787 -21425 -12705 20812 7703 -14559 -8876 6254 22760 4182
329 4182 -22720 4104 23301 1156 -12431 -11059 10058 20789 -11096 -18295 8500 12498 807
342 807 -17804 -17185 15692 11186 -20438 -11155 9784 16121 3413 -19048 -1187 22601 1237
355 1237 -14427 -7747 6873 20583 -2975 -19519 10652 19704 -933 -13369 -11896 12095 12783
368 12783 -18440 -13100 10029 10070 -77 -17546 -10426 18021 3648 -19547 -6795 10336 17272
381 17272 1516 -16217 8320 21771 -2700 -13805 -8655 5859 13415 -12383 -16994 12663 15392
394 15392 -732 -12191 -7088 16823 8194 -19860 -7464 11441 9869 -1529 -17595 -3293 16846
407 16846 -3800 -19645 -6819 8829 16136 -2405 -10863 17711 22334 -1482 -9689 -6195 7239
420 7239 5925 -20268 -15273 9270 7938 -3508 -14446 -5392 16268 -459 -21434 -4830 9957
433 9957 10537 595 -8870 12813 24472 1396 -8042 258 10495 11485 -12127 -14464 12098 8810
447 8810 -10995 -16161 -10796 3464 -5433 -27127 -12069 8664 8330 2606 -3690 12318 29529 6566
461 6566 -9429 4514 11493 6990 -9009 -14326 8663 11610 -9342 -11920 -4534 5974 3931 -17732
475 -17732 -10657 13807 8183 -4959 -8420 577 13810 -2486 -19626 -3266 8088 4367 -2245
488 -2245 -7068 11914 22217 -1381 -9557 2107 7296 3054 -14281 -11956 12660 8709 -7606
501 -7606 -5727 1029 9850 1029 -19845 -8270 9425 1366 -7751 -8413 5890 17368 -2784 -12451
515 -12451 5356 11258 5756 -3301 -4971 15271 17178 -5271 -8202 -187 2104 -6152 -25290 -16670
529 -16670 5823 -1098 -9880 -2674 8270 19024 7219 -7807 6195 14403 3552 -5786 -8004
542 -8004 6958 13125 -9134 -12787 2821 4327 -1755 -12002 -8677 11740 8527 -7304 -3116 5383
556 5383 10721 241 -17934 -5766 9821 -2530 -9896 -4421 7242 15022 -1167 -9555 6495
569 6495 9761 -2 -8597 -8450 9587 11180 -8547 -5348 7824 8334 35 -12847 -6139 10148
583 10148 -223 -12075 -6070 1968 7452 -3466 -15352 694 10573 -1107 -5510 320 14034
596 14034 18117 210 -2357 11291 7815 -2503 -12813 -12729 3153 -1692 -17671 -9754 3130 5650
610 5650 -1550 -11593 1217 13682 1373 -5273 1735 9547 14153 -262 -8257 8119 9930 -3429
624 -3429 -9472 -7015 6071 5210 -11891 -6650 7047 4319 -3203 -10904 -5136 9430 406 -11221
638 -11221 -2050 7590 9900 276 -8292 6118 12010 -3594 -8233 -3338 4565 6801 -7699 -8767
652 -8767 7409 6596 -2807 -7488 -3144 10035 3909 -11422 -2127 8044 5181 -2139 -9395 -167
666 -167 9991 -3473 -10047 -955 6117 7667 -3584 -7524 8938 9894 -4550 -6752 -2138 5795
680 5795 3489 -10999 -5750 8168 4181 -3349 -7354 -1111 10688 220 -11085 136 7729 4853
694 4853 -2652 -7233 5298 9739 -4476 -8121 -536 4788 4853 -7518 -6738 9358 6209 -4854 -5662
709 -5662 -112 8004 1956 -10950 -1775 7854 2769 -3288 -6572 1749 10142 -3284 -9917 774
723 774 5649 3134 -5556 -6994 7898 7926 -5123 -4636 1544 6769 3779 -8879 -3693 9369 3037
738 3037 -5208 -5581 614 8393 -1373 -10932 999 6657 1378 -3823 -6220 4944 9389 -4655 -6462
753 -6462 2507 5722 2717 -6690 -5031 8455 4352 -6468 -4289 1359 6224 854 -9954 -1378
767 -1378 8014 1331 -4631 -4602 2904 9038 -2651 -7600 3730 6608 1469 -4889 -5504 5719 5711 -6987
783 -6987 -5556 2303 5036 1448 -8305 -3102 8705 1548 -6199 -2637 2586 7108 -418 -8121 2723
798 2723 7736 369 -4382 -4722 3852 6658 -6565 -7094 3491 4233 14 -6132 -4017 7122 3275
813 3275 -6715 -2674 3782 6008 1429 -6697 1320 9832 750 -4777 -2668 2455 5786 -4252 -8303
828 -8303 2423 4587 -1987 -5585 -4608 4730 4298 -7473 -4191 5174 5204 1482 -4435 386 10003 2220
844 2220 -5602 -997 3270 5221 -1936 -8255 2069 6413 -2627 -5646 -3429 2731 4013 -6720 -6217
859 -6217 4444 4123 -984 -3851 -2147 7125 3256 -6387 -1224 4777 4520 356 -5253 1833 8611
874 8611 -675 -5422 -1562 1765 2980 -4817 -7892 2921 4470 -2771 -4620 -1845 4769 3797 -6403
889 -6403 -3174 5596 3910 -26 -3386 784 8479 1483 -6219 -532 3676 2999 -2456 -6888 2194
904 2194 5890 -3233 -5247 -1428 2601 2841 -5904 -5299 5173 4234 -1192 -2298 102 7511 3476 -6403
920 -6403 -1316 4504 1781 -2430 -5639 553 6391 -2112 -5767 168 3007 2907 -3278 -5184 4852
935 4852 5354 -2874 -3295 84 3866 2021 -6750 -3856 4512 1583 -2487 -3357 407 7118 857 -5577
951 -5577 1478 4934 2168 -1924 -4443 3256 6057 -2985 -4640 -54 2084 910 -6132 -5629 4060
966 4060 2293 -3938 -2971 168 5693 2453 -4875 1109 6396 2563 -750 -2097 2324 6709 -1654
981 -1654 -5867 -13 1791 -667 -5571 -6381 2260 2642 -4777 -3447 1310 4262 3014 -3648 -487 6978
997 6978 2986 -2042 -1231 1813 5759 -473 -6206 817 3560 -711 -3746 -4439 1700 4240 -3761 -4568
1013 -4568 1652 2900 1125 -4325 -2888 5147 2370 -3748 -1878 1769 4046 1311 -4574 151 5461
1028 5461 730 -2767 -2364 1762 5110 -1980 -4967 2316 3154 -294 -3455 -3324 3202 2877 -4754 -3074
1044 -3074 1483 2752 796 -4377 -1118 5889 1426 -3318 -686 2138 4659 -260 -4946 1340 4077
1059 4077 -1066 -3331 -3105 1579 3256 -4348 -4212 2877 3187 186 -3119 -1369 5274 2672 -3826 -949
1075 -949 2335 3029 51 -4901 -153 4932 -746 -3983 -1526 1472 3285 -2438 -4604 2491 3247 -717
1091 -717 -2329 -1542 3701 3302 -4042 -2513 2877 2158 -403 -4238 -1261 4633 -47 -4153 -707 2253
1107 2253 2674 -346 -3990 1928 4819 -732 -2367 -745 2768 2945 -3917 -3894 2909 1822 -1422 -3410
1123 -3410 -1563 3675 1240 -4413 -950 2969 2153 -231 -3367 1358 5376 -315 -2807 157 2232
1138 2232 2541 -2295 -3894 2033 2836 -2309 -2568 -1445 2659 1992 -4325 -1892 3062 1905 -757 -2302
1154 -2302 -23 4795 657 -3707 376 2597 1675 -1291 -4004 1393 3693 -2163 -3219 -342 1857
1169 1857 1990 -3189 -2913 3470 2177 -1884 -1996 -87 3823 1482 -4145 -414 3400 1535 -1372 -2655
1185 -2655 718 3878 -1513 -3439 61 1847 1185 -2232 -3506 2569 2861 -2225 -1952 455 2879 1846
1201 1846 -3379 -1394 3723 1491 -1639 -1889 139 3398 -352 -4206 -92 2098 647 -1598 -2902
1216 -2902 1506 3500 -2165 -2203 592 2445 1723 -2256 -1757 3635 2467 -2177 -1540 286 2812 359
1232 359 -4202 -722 3056 18 -2013 -2246 140 3518 -1292 -3161 1270 2453 924 -1609 -2157 3137
1248 3137 3154 -2373 -1950 953 1933 629 -3298 -1819 3132 585 -2521 -1670 354 2912 -342 -3740
1264 -3740 559 2668 164 -1428 -1951 1988 3030 -1709 -2225 1393 2352 552 -2500 -1961 2996 1578
1280 1578 -2838 -1361 649 1848 29 -3543 -677 3203 178 -1598 -1072 1640 3209 -951 -3028
1295 -3028 1486 2298 -276 -1763 -1858 2387 2274 -2533 -1660 1572 1725 309 -2887 -1064 3199 695
1311 695 -2346 -889 1225 2335 -561 -3197 625 2757 -783 -2154 -1104 1401 2467 -1893 -2384
1326 -2384 1900 1672 -526 -2490 -1412 2710 1435 -2645 -602 2168 2001 51 -3110 12 2948
1341 2948 -621 -2800 -863 872 1970 -1283 -2985 1451 2299 -397 -1383 -794 2191 2157 -1959 -1146
1357 -1146 2168 1422 -196 -2438 -1107 2379 -76 -3120 -606 1273 1745 -700 -2845 838 2542
1372 2542 -1344 -1949 -508 1597 2229 -1460 -1602 2433 2197 -564 -1337 -756 2262 1112 -2732 -1162
1388 -1162 1695 584 -990 -3047 -467 2166 -1060 -2735 16 1740 1923 -884 -2027 2145 2762
1403 2762 -1059 -1323 -628 1606 1212 -2424 -1591 2453 1285 -842 -1543 -419 2403 -360 -3162 -421
1419 -421 1504 800 -540 -2031 1187 2558 -868 -1736 179 1577 1610 -1409 -1452 2477 1537 -947 -1533
1436 -1533 -879 1269 165 -2990 -1108 2011 849 -144 -1144 702 2908 -278 -2040 362 1450
1451 1450 463 -1136 -2109 1516 2117 -1415 -1849 -52 1319 684 -2488 -1095 2247 702 -1240 -1210 -194
1468 -194 2003 -120 -2529 131 2180 914 -436 -1072 1356 2570 -1301 -1959 84 484 -55 -1880
1484 -1880 -1678 2006 1360 -1358 -697 575 1917 396 -2234 -140 2269 314 -826 -1036 216 1949
1500 1949 -1018 -2868 226 1112 219 -1058 -1236 1944 1969 -1214 -1181 658 979 182 -2302 -1125 1909
1517 1909 786 -1018 -345 961 1822 -301 -2747 35 1261 -442 -1612 -1073 1083 2156 -1350 -1524
1533 -1524 850 1134 393 -1094 -635 2203 1418 -1507 -827 720 1057 -413 -2495 -914 1579 -187
1549 -187 -1409 -151 1043 1988 -332 -1800 1037 1293 -113 -1511 -1035 1736 1600 -1545 -1097 1313
1565 1313 1027 -274 -1845 -853 1573 436 -1807 -544 715 998 -345 -2086 561 1721 -190 -1163
1581 -1163 -609 1343 2135 -819 -1329 944 869 -456 -1390 -1011 1612 507 -1822 -910 1178 1065 -152
1598 -152 -1725 -270 2077 -188 -1273 -38 1302 1343 -797 -1725 1109 1099 -915 -1237 -897 1320 1171
1615 1171 -1522 -1076 1604 889 -174 -1391 -407 2039 81 -1969 133 1327 1125 -622 -1436 842
1631 842 1775 -747 -1184 -173 747 1044 -1269 -1488 1237 798 -1145 -1273 -487 1436 578 -1809 -321
1648 -321 1515 1217 -26 -1207 12 1894 -367 -1646 -81 919 855 -1101 -1584 808 1246 -893
1664 -893 -897 32 1540 978 -1519 -964 1763 736 -512 -875 -269 1640 -67 -1817 -315 1071 231
1681 231 -619 -1640 584 1532 -847 -1519 2 1055 729 -1502 -1279 1682 1026 -708 -402 373 1467
1698 1467 438 -1647 -220 1549 406 -948 -1143 163 1508 -588 -1692 584 880 323 -820 -1131
1714 -1131 1297 1462 -640 -568 473 1114 737 -1629 -1093 1433 377 -904 -666 56 1305 -55 -1714
1731 -1714 91 1326 101 -686 -1282 674 1699 -771 -774 594 768 436 -1337 -680 1410 781 -1263
1748 -1263 -460 311 1017 326 -1704 -67 1424 -361 -989 -511 565 1298 -412 -1128 653 1172 224
1765 224 -757 -1332 938 823 -1146 -663 736 879 -152 -1536 -979 1279 101 -1114 -327 668 1078
1782 1078 334 -1469 531 1344 -511 -1290 -770 488 775 -676 -963 1268 924 -91 -1128 -675 1234
1799 1234 488 -1357 -593 890 952 241 -1176 259 1650 65 -918 -373 289 1010 -721 -1262 619
1816 619 1444 -429 -1147 -930 953 610 -1240 -538 1291 940 426 -698 -41 1579 -131 -1594 -324
1833 -324 468 566 -278 -1533 578 1503 -314 -904 -542 697 843 -1093 -1173 1325 1127 134 -737 -552 1168
1852 1168 555 -1531 -506 1213 963 203 -986 325 1740 -394 -1494 -621 -107 294 -1161 -1164 1104
1869 1104 1098 -189 -487 4 1088 885 -1318 -623 1242 611 -329 -743 -265 1196 -111 -1639 -385 370
1887 370 422 -290 -1104 718 1271 -579 -759 -203 213 451 -1075 -919 1447 1026 -157 -237 78 1283 323
1906 323 -1532 -899 619 -445 -672 -1312 296 1399 -161 -1236 429 782 882 -335 -583 1280 1611
1923 1611 -429 -738 -9 387 -56 -1852 -981 1104 567 -312 128 463 1658 207 -1352 31 666
1940 666 -41 -719 -934 515 1387 -714 -854 444 759 242 -1081 -996 1328 815 -657 -363 468 1269
1958 1269 218 -1380 -120 1318 115 -323 -294 861 1414 -209 -1471 319 223 -497 -1315 -1513 479
1975 479 929 -524 -138 649 938 564 -1253 -360 1133 218 -750 -786 267 829 -145 -1352 127 700
1993 700 -96 -599 -681 614 1387 -496 -810 669 670 11 -1096 -737 907 412 -685 -447 628 1097 280
2012 280 -1006 -14 942 6 -833 -477 369 1212 -310 -994 296 678 -217 -676 -1129 988 963 -874 -389
2031 -389 870 932 16 -879 -457 1230 87 -856 -106 342 828 176 -1198 71 888 -678 -1042 -709
2049 -709 542 1049 -398 -630 998 956 97 -751 -544 723 480 -1199 -502 533 399 -215 -1160 -239
2067 -239 1103 -494 -892 35 436 1041 -478 -768 1027 791 -152 -630 -331 915 575 -1115 -703 637
2085 637 399 -143 -1015 -416 735 327 -1244 -34 655 492 -59 -1039 309 1047 -358 -634 79 259
2103 259 633 -567 -885 918 670 -409 -702 -466 735 270 -1144 -342 733 426 -29 -913 205 1285
2121 1285 -161 -986 47 491 460 -549 -1128 680 717 -737 -732 131 538 341 -1275 -645 956 355 -193
2140 -193 -477 273 1182 250 -1301 78 520 183 -273 -949 318 948 -367 -706 223 793 524 -485
2158 -485 -631 702 427 -402 -356 49 875 180 -1286 -263 764 327 -95 -506 83 1118 -93 -1240
2176 -1240 77 433 36 -661 -712 803 696 -603 -459 3 540 780 -884 -304 789 185 -532 -497 47
2195 47 822 67 -711 194 577 102 -322 -503 339 1034 -232 -495 586 657 359 -648 -631 597 245 -744
2215 -744 -624 198 496 127 -751 -219 790 -268 -499 -337 316 1037 -166 -847 575 669 262 -228 -386
2234 -386 857 834 -723 -667 433 421 40 -923 -197 930 208 -1010 -361 -63 346 17 -895 714 1010
2253 1010 7 -3 -372 382 606 -408 -634 217 323 -37 -818 -359 343 224 -1028 -483 55 222 24
2272 24 -734 -32 927 122 -551 -241 337 750 -404 -826 674 618 119 -401 -552 464 171 -1111 -518
2291 -518 281 401 -213 -457 -124 1034 34 -529 -356 499 381 -216 -936 298 780 88 -146 -252 -24
2310 -24 404 -855 -779 819 670 -48 -391 -1 846 400 -1031 -524 480 18 -564 -603 -23 912 -191
2329 -191 -569 106 256 528 -284 -806 492 706 -77 -163 -259 427 665 -999 -696 521 -27 -176 -621 -155
2349 -155 706 130 -1003 -246 243 190 -31 -731 576 931 80 -266 7 508 515 -506 -697 683 230 -485
2369 -485 -417 -163 574 228 -773 -148 579 49 -133 -462 64 964 -213 -938 51 194 134 -773 -841 588
2389 588 703 -354 -255 139 635 526 -760 -190 691 -166 -677 -570 -125 489 -105 -704 74 715 315 -196
2409 -196 -482 531 1110 -164 -334 376 330 596 -363 -394 696 344 -360 -724 -113 462 -155 -894 -213 411
2429 411 48 -301 -482 218 1099 1 -269 534 541 282 -458 -725 438 619 -851 -429 147 222 115 -829
2449 -829 -301 907 148 -388 -85 305 909 206 -347 236 476 102 -422 -799 413 630 -440 -459 462
2468 462 249 254 -439 -421 794 622 -560 115 315 506 358 -871 -117 889 -383 -812 -452 58 350
2487 350 -367 -618 291 684 202 -172 -483 569 599 -563 -347 287 343 -107 -413 -321 579 -272 -726 42
2507 42 -12 347 57 -650 197 834 -58 -355 -263 325 366 -411 -613 613 290 -18 -613 -433 734 197 -613
2528 -613 -367 358 574 136 -781 -50 624 114 -645 -139 198 597 -220 -1106 367 441 -96 -344 -175 525
2548 525 354 -408 -226 597 550 58 -543 -276 787 -90 -685 -233 -65 260 87 -491 96 677 -312 -241
2568 -241 -224 506 389 -406 -501 428 458 -257 -245 -285 530 161 -550 -237 434 304 -3 -456 82 843 81 -508
2590 -508 65 342 190 -93 -708 431 550 -257 -391 -446 505 364 -558 -487 678 402 -325 -522 -63 875
2610 875 377 -505 24 306 265 -29 -422 328 684 -341 -600 -259 401 176 -484 -554 413 427 -488 106 -253
2631 -253 592 590 -629 51 529 127 -23 -422 -19 889 -318 -764 51 30 35 -289 -566 160 228 -337 -656
2652 -656 136 133 305 -709 -71 558 575 -30 -248 414 801 101 -410 5 413 -88 -319 -500 -57 487 -362
2673 -362 -578 -109 416 43 -243 -377 443 529 -357 -373 -35 524 246 -486 178 858 173 -151 -382 -186 506
2694 506 -25 -501 60 588 199 -85 -506 305 651 -547 -494 149 299 382 -600 -111 435 424 -527 -363 -99
2715 -99 353 56 -568 116 630 99 -456 -498 204 218 -124 -567 306 346 -30 -329 -590 270 388 -358 -242
2736 -242 186 533 267 -431 -76 592 387 -238 -229 97 422 116 -796 56 165 7 -244 -534 316 431 -585
2757 -585 -484 204 365 52 -511 2 525 327 -438 -256 266 429 90 -215 72 745 139 -280 -353 -105
2777 -105 656 -369 -531 65 24 -315 -44 -170 428 670 -170 -166 -49 542 41 -285 -111 734 234 -310 -384
2798 -384 234 396 -210 -813 -226 131 48 -358 -331 72 490 -389 -426 289 273 203 -230 -241 796 255 -335 -100
2820 -100 72 108 -410 -674 -207 399 -103 -471 14 -35 343 -77 -612 357 117 -12 -169 -101 561 441 -559
2841 -559 -273 38 92 -464 -366 -207 385 138 -270 27 572 203 87 -590 173 313 -210 -730 78 199 162
2862 162 -417 -538 112 113 106 -250 -226 490 302 -614 -168 373 215 -106 -491 -141 338 -171 -159 -187 -81 318
2884 318 -345 -639 128 319 -242 -212 83 484 320 -456 -256 587 293 -206 -147 -336 280 91 -520 139 345
2905 345 348 32 -288 335 547 -371 -250 69 386 238 -148 -455 344 218 -86 -140 -97 361 427 -483 -32 808
2927 808 205 -87 -163 99 565 -233 -460 -153 431 340 -195 -481 244 285 -73 -369 -110 510 260 -245 -125
2948 -125 444 126 103 -392 -122 385 -75 -547 -73 286 -71 18 -356 25 411 -515 -294 187 360 382 -13
2969 -13 -481 458 497 -255 -1 -64 157 -56 -569 -424 315 -182 -131 -519 216 1037 110 -396 230 571 215
2990 215 -212 -204 467 530 -348 -206 -82 127 52 -603 -394 207 -54 -251 -316 -7 527 29 -665 34 513 2
3012 2 154 -220 112 402 70 -272 -137 380 71 -422 -381 298 179 -719 -455 42 148 -73 -465 139 826
3033 826 -76 -251 -201 14 574 -100 -512 2 230 157 164 -316 308 339 -652 -40 204 249 -154 -398 -64 488
3055 488 137 -474 -308 20 483 -123 -402 47 558 -40 -466 -301 419 434 -352 -331 296 199 -174 -246 -312 439
3077 439 263 -293 -262 20 210 -156 -422 35 636 223 -203 -71 375 203 -60 -602 249 629 -156 -285
3097 -285 -262 153 409 -308 157 259 156 356 -258 -18 83 -180 -657 -211 210 67 -162 -624 176 685
3117 685 -94 0 -112 399 249 -389 -344 424 68 -46 -6 -285 153 125 -713 -477 108 273 -13 -544 22
3138 22 549 -294 -596 -173 190 333 -45 -230 370 714 -210 -185 -68 177 268 -554 -451 378 -6 -132 -256
3159 -256 -153 595 -225 -690 -68 88 123 157 -180 -183 803 51 -407 22 349 683 -187 -626 476 163 -339
3180 -339 -230 -27 328 139 -122 -487 148 -207 -8 -267 -24 656 114 -157 -141 270 238 15 -212 206 396
3201 396 -17 -276 -133 61 52 -603 -435 421 160 -131 -320 -32 438 277 -241 -35 283 64 -58 -484 17
3222 17 730 -123 -358 32 299 -68 -415 -160 232 342 -374 -255 19 654 60 -365 -29 466 216 -254
3242 -254 -477 110 425 -62 -692 -86 241 298 -107 -151 246 495 -427 -306 2 316 240 -317 -345 446 121
3263 121 -94 -9 -295 412 232 -391 92 292 -85 -62 -334 145 456 -536 -149 150 105 77 11 -698 313
3284 313 215 -405 -322 -40 98 248 -295 -230 605 131 -606 -312 156 221 -185 -439 590 292 129 -12 -121
3305 -121 265 43 -245 -297 -5 256 271 -408 -419 276 119 -511 -155 209 91 30 -290 134 428 -51 110
3326 110 -195 99 274 -382 -491 416 359 218 -110 -434 329 341 -350 -602 115 64 49 -42 -96 472 52 -65
3348 -65 -269 329 391 -85 -399 359 504 -88 -109 -391 86 198 -240 -425 305 1 -19 25 38 823 558 -389
3370 -389 215 310 108 202 -326 -112 376 -16 -219 -32 -70 151 -132 -445 192 329 238 -120 23 340 129
3391 129 -298 -186 248 127 27 -266 -194 261 -74 -311 -186 30 200 -67 -179 191 319 -260 -81 -142 -37
3412 -37 102 -355 -548 448 37 -200 -81 -222 530 131 -313 167 258 243 66 -346 172 438 -3 -231 -209
3433 -209 132 275 -441 -557 426 324 -66 -255 -141 326 47 -130 -207 338 -66 -143 -117 -442 466 -16 -148
3454 -148 -103 301 -158 197 -307 86 419 -170 -162 40 200 304 -211 -138 436 364 -57 -172 -282 325 78 -541
3476 -541 -152 453 -91 100 -153 -186 423 -151 -280 -10 224 -238 -10 -363 165 462 -239 -38 -280 133
3496 133 -3 -210 -140 337 124 -31 -28 -3 347 21 -239 -39 302 86 -451 -304 -101 308 -63 -138 64 402
3518 402 382 -330 -256 583 22 -161 -216 6 -14 252 -410 190 403 -74 138 -124 -37 261 62 -682 355
3539 355 208 64 -26 -197 319 145 -354 -271 -3 256 365 -351 -115 157 120 -11 -173 128 79 -333 -511
3560 -511 -104 339 41 -329 -322 -98 428 -304 -468 100 114 215 -159 -186 361 376 -351 -225 124 92 -8 -400
3582 -400 -84 346 -61 -154 120 140 72 31 -424 423 310 28 65 -78 213 328 -45 -135 416 135 -67 -386
3604 -386 -175 97 22 -274 -332 65 81 119 -221 313 292 18 -104 -85 276 334 -218 -29 130 -373 -127 -192 -106
3627 -106 420 366 -82 -155 590 71 115 -139 -105 438 381 20 63 161 -18 -92 -428 275 184 -145 -325 -207 104
3650 104 320 -293 -228 243 -169 36 -362 -90 236 155 -127 -64 233 131 367 -184 -181 148 -64 -293 65 113
3672 113 158 -177 -476 74 62 -151 -188 -359 159 -3 -419 -13 285 262 -219 -352 132 351 264 -81 -5 -37
3694 -37 41 -103 -495 300 220 -127 21 -146 184 362 -229 296 581 -73 109 -141 17 230 216 -247 9
3715 9 135 21 -188 -320 -51 304 -73 -262 87 -10 -64 -3 -41 78 38 -183 -199 91 455 65 -291 108 193
3738 193 142 -169 152 -14 207 -96 -281 24 -133 388 -205 -341 299 336 -46 52 -171 182 204 -284 98
3759 98 420 192 117 -84 -82 100 123 -221 -249 50 9 -4 -311 210 80 16 -437 -89 19 132 -178 -360 95
3782 95 171 -311 103 -20 253 -186 -208 84 91 -236 -199 -19 80 223 -157 -418 40 -99 88 98 -289 173 319
3805 319 -12 -249 51 -110 -65 -47 -342 325 -70 -176 -378 86 151 -236 -210 -135 278 8 -6 -117 106 135
3827 135 -27 -355 242 127 5 -300 -201 187 309 -343 -106 147 80 15 -355 -95 300 -290 -11 62 119 247
3849 247 -138 -193 -37 55 -267 -328 30 370 512 -53 -326 115 240 -325 154 163 258 -185 -372 57 248 213
3871 213 -94 -14 8 388 -48 -323 109 207 129 -286 -337 320 75 -2 -203 117 464 182 -274 -133 29 73
3893 73 -21 -128 -223 472 -97 -72 11 148 154 121 -137 80 137 -149 -280 -189 138 62 -228 -105 -12 151 -55 1
3917 1 105 517 -90 -279 77 -120 174 -177 -317 67 99 33 154 -16 143 418 24 -32 147 114 73 -21 78
3940 78 426 -184 -557 -184 35 139 -110 -337 213 342 38 -214 -8 -134 -96 -115 -194 -12 217 -7 -295
3961 -295 -150 -135 130 -140 -368 161 89 -76 142 292 44 81 -498 -176 -54 -251 -32 1 202 -22 -467
3982 -467 -216 -102 -181 9 -266 -550 80 1 -92 -323 48 241 239 -271 -41 464 -108 122 -251 -138 208 -75
4004 -75 -269 419 -11 -111 -14 -15 110 298 -22 -2 19 -188 17 -306 -315 229 35 252 -29 -118 -120 5 53 74
4028 74 -30 -52 -230 -254 179 141 -92 -92 110 -3 -71 261 -483 191 104 127 -284 79 -128 -77 -25 247 46 89
4052 89 -475 -433 -180 238 113 -168 -95 16 -272 -167 57 -48 152 -111 171 131 69 73 -22 22 78 -78 -164 -102
4076 -102 145 144 -207 -70 128 213 -7 101 253 45 -17 -28 -218 280 230 265 -263 -189 156 285 81 -456 -42
4099 -42 124 71 -249 40 212 220 -74 34 51 179 -101 18 146 144 -40 -73 77 166 178 -56 24 -113 -68 1
4123 1 -145 -100 301 114 8 108 118 212 -44 56 -40 322 -272 -87 -94 -133 79 -223 -52 -40 86 -79 208
4146 208 -253 6 1 -96 -68 201 -149 108 -100 77 327 -114 -313 -117 -73 -111 -122 82 119 -47 -235 -83 -203
4169 -203 234 366 12 -176 239 180 27 142 -73 421 132 -176 -44 -101 132 -51 -386 -123 200 -10 -56
4190 -56 -46 116 121 245 -36 126 184 53 -72 85 274 -110 -212 -72 112 -258 3 106 276 177 196 -224
4212 -224 100 -76 347 221 -9 -131 77 14 -15 -159 111 16 40 111 31 61 -251 -280 49 -48 -52 -62 49 -222
4236 -222 -132 -17 -14 33 -2 -60 17 -23 -318 -60 -167 -260 89 -166 -296 325 31 192 -310 -178 -7 302 -48
4259 -48 138 -313 195 119 13 -270 337 -241 -21 -244 -295 44 86 -9 -472 65 15 -133 156 -5 -21 -221
4281 -221 -113 -95 34 184 119 -400 91 -6 219 -128 -145 127 140 -74 32 95 248 -232 -143 -288 -11 -45 -171
4304 -171 -157 173 -87 40 -7 -134 259 46 36 -136 -89 -230 290 -173 58 -13 73 -219 5 1 73 180 64
4327 64 1 179 -72 -293 24 213 -180 -3 4 131 -195 -154 -160 -17 196 33 2 36 -182 21 30 -157 37 -21
4351 -21 9 95 -75 105 51 -125 74 -57 -107 -76 -243 230 393 -56 62 -90 122 102 -207 -129 -141 -52 -154
4374 -154 -155 22 -41 229 131 154 221 -198 -8 152 -239 45 -8 -62 -126 -31 90 -19 189 121 265 -325 -301 -202
4398 -202 -162 28 -88 15 54 -154 -29 -124 105 -103 204 7 -183 141 136 14 161 37 48 -193 -204 153
4420 153 218 32 84 -196 -6 -30 -85 207 -73 107 122 112 102 -119 -140 54 31 140 -31 183 24 34 73 181
4444 181 197 1 -71 -88 -121 290 307 -87 -71 -168 -177 -18 22 13 -104 -8 135 112 -40 -108 135 125 66 -322 -73 486
4470 486 148 295 45 396 119 -103 -215 -32 -24 12 146 -106 -64 -20 -62 171 -241 268 34 -243 423 110
4492 110 68 131 272 124 357 125 71 -229 -132 -188 -67 136 77 -134 367 -338 146 142 -219 -80 208 91 -40
4515 -40 28 72 31 -8 38 -168 109 -51 -76 82 -131 243 -90 -283 138 20 428 98 -7 -26 -61 -151 -136 51
4539 51 -20 -173 -58 -88 195 85 -323 -126 181 28 -12 -36 -58 91 200 -35 113 -59 178 30 -30 255
4561 255 -69 -197 80 -97 -126 -317 -41 3 -29 13 172 192 348 10 -138 38 63 -28 -220 -76 -16 -68 -54
4584 -54 102 -128 -63 93 -151 -124 -149 -21 91 -27 -90 -129 -117 -72 -111 31 -250 27 -31 90 -224 -153 -18 -107
4608 -107 -189 4 -111 -196 -58 37 110 47 186 -57 -33 -70 -60 -19 23 -20 13 -257 102 401 69 223 -208 -22
4632 -22 -176 41 393 -49 119 66 -121 134 -166 208 209 -172 18 -118 -2 -233 52 -156 293 7 55 -186
4654 -186 -119 158 -108 200 -96 -49 143 117 -23 137 -175 264 66 130 124 187 -49 38 307 -79 0 -44 -92 -105
4678 -105 -230 -86 -204 37 55 -91 -105 -58 83 -308 -220 -30 182 43 31 -17 -184 17 -80 223 217 60 67 -323
4702 -323 -27 201 474 237 -13 -129 -48 -290 218 -29 28 -44 -129 -144 -42 123 -66 47 14 -15 52 8 -154
4725 -154 178 89 62 73 34 87 62 -97 -250 -7 -292 -95 14 136 -61 47 169 38 283 31 -65 -5 212
4748 212 -80 -137 178 63 -10 -141 -252 -301 70 162 -64 -7 43 313 109 -80 -265 167 194 -144 -11 -131
4770 -131 -66 -19 -182 -67 -198 -63 24 -17 146 -116 189 73 11 55 276 -33 -176 -148 36 -7 34 101 356
4793 356 -180 124 -124 26 -21 115 402 -69 110 -29 -30 19 -33 10 60 -189 5 64 12 -117 -310 199 146
4816 146 202 328 -156 140 176 164 -141 -46 274 95 99 204 -12 71 90 123 -78 -110 -197 82 -149 65 -10 -6 -31
4841 -31 221 106 24 180 -26 -61 -2 46 -81 198 216 -55 -27 -13 31 -47 159 -247 14 39 -252 -47 179 51
4865 51 -230 -20 67 183 -214 -260 -62 212 -82 27 0 332 53 -186 -63 -192 -54 78 -41 186 219 167
4887 167 59 -283 94 91 -130 -358 160 36 -233 42 -63 -79 -162 114 209 -297 -94 233 11 -123 67 -29
4909 -29 -218 30 -78 47 -11 250 58 33 90 -177 -187 150 -147 -270 -63 -270 99 20 -57 -138 -187 -82 -194
4932 -194 157 -20 -24 205 -127 80 63 -126 114 29 27 74 -97 -47 -6 -118 87 261 -86 -64 -6 87 11 -257
4956 -257 -50 -126 350 86 209 -154 18 -147 19 -47 -61 -40 158 170 40 387 -85 -201 -1 -187 -7 -93
4978 -93 -113 171 -265 -105 53 -258 -69 -103 163 -382 -5 16 126 -105 25 198 -50 189 -73 -374 -198
4999 -198 383 20 13 -181 -196 89 -29 -103 -46 68 125 -43 -23 125 -128 103 162 -283 -61 89 37 -40 176
5022 176 -78 86 -283 59 50 -382 -90 -86 -54 -119 -27 53 56 -180 -123 202 99 -177 267 -19 12 -146 -47 30 -167
5047 -167 33 -79 94 80 60 61 -141 -72 134 -35 321 46 -45 -160 -75 102 316 -44 -4 242 -31 -33 268
5070 268 170 160 150 -72 309 193 -12 63 -179 8 91 -20 -101 92 209 -61 227 177 223 102 -175 143 32
5093 32 -103 66 -4 -112 78 36 -39 222 161 -141 -115 -94 -134 84 97 75 -94 164 -80 -140 134 52 51 -17 93
5118 93 138 39 -267 -284 70 102 1 65 -120 226 146 64 129 -87 132 -66 88 -98 219 157 -389 -61 -52 -101
5142 -101 5 -185 33 60 -215 -65 210 20 -174 -302 -94 98 42 -132 -237 157 123 109 -61 200 33
5163 33 -167 -87 -250 -90 43 -141 -1 30 -71 65 -286 110 -113 273 103 -6 172 136 -166 135 51 -8
5185 -8 52 -95 123 146 93 178 -5 18 18 -104 138 -199 218 -214 -215 49 128 96 -89 -199 -139 -338 -151 162 -47
5210 -47 -8 196 -174 -202 70 3 263 -277 -255 -37 320 -27 -110 73 -36 197 -72 37 10 195 -24 -81 32
5233 32 -51 11 -289 288 98 -157 302 -22 53 117 154 92 107 97 -145 87 -233 99 144 -222 -99 2 157
5256 157 -141 -120 245 28 70 -215 31 -140 59 -134 223 -87 220 154 296 -173 -171 -304 -32 -424 38 -1
5278 -1 -42 5 -130 113 122 353 328 -44 110 259 -64 -272 526 12 27 -17 -158 -72 -22 42 133 -95 -92 90 173
5303 173 115 -181 -183 -131 -69 -185 -49 99 -10 17 -318 7 -89 -65 -78 12 -147 -167 -36 -23 -126 -293 -107 -187
5327 -187 77 149 -254 64 88 -153 86 10 147 3 59 104 334 167 83 -16 -5 -270 -47 -17 172 -120 -13
5350 -13 75 8 -134 259 -46 -236 -92 -57 -201 -109 98 -58 -1 277 186 228 113 -78 148 103 67 -195 -236 14
5374 14 36 -158 -157 -107 163 282 78 198 -39 154 39 -25 69 270 -27 -68 176 -30 75 249 -225 -105 78
5397 78 6 -21 6 -274 108 61 -117 71 24 42 -177 100 -19 -63 -147 -129 162 213 37 16 90 -21 142 -179
5421 -179 365 -84 155 310 -128 -2 48 -39 -16 314 -38 -127 21 332 70 126 -49 -79 -249 16 111 148 72
5444 72 -47 149 -173 -265 103 -183 -50 88 -118 -90 206 306 -214 86 52 139 16 -44 -90 89 -70 -118 58
5467 58 324 145 -91 -209 30 255 -284 -31 -64 155 -327 -216 40 -30 -135 67 -143 74 154 5 -203
5488 -203 -5 1 136 -262 100 -22 58 155 -218 152 21 -139 -106 256 -45 -45 -115 -15 -109 -172 97 17 109 -10
5512 -10 -50 62 146 -37 -44 116 154 -108 -59 -2 49 -69 51 179 82 -94 -36 -29 41 80 40 156 -58 12 39 -145
5538 -145 48 -27 -57 -296 171 21 113 79 -41 225 -99 -25 18 63 -45 269 103 375 123 277 77 52 -103
5561 -103 -90 -15 -55 73 -131 238 71 185 85 91 -93 177 140 407 -220 88 -240 -96 -131 -78 -128 -139 -224 -108
5585 -108 367 -274 -49 -427 116 141 -112 -16 42 46 182 -45 75 -52 -100 169 -35 128 277 1 -18 -140
5607 -140 -57 -112 85 -43 53 -136 129 143 -102 -39 9 -16 -59 178 -85 -97 198 -69 -64 -115 194 -163 -35 -102
5631 -102 123 162 -24 -87 -243 145 -127 119 -70 22 -80 102 214 -86 217 97 -254 -44 55 -93 -107 -118
5653 -118 -117 -105 -61 87 327 22 259 -211 39 -116 -88 5 -100 52 -305 -41 74 8 46 61 -20 -45 -20 -12 98
5678 98 -38 -15 157 13 316 -228 -18 9 -84 108 -99 -132 -4 -113 -113 37 137 -96 10 -25 42 87 -295
5701 -295 -116 48 -152 69 -20 -30 84 -61 87 58 88 -75 -29 71 196 40 325 128 179 207 99 245
5723 245 -100 -18 -24 148 188 77 -8 215 -31 -165 -353 -88 -90 14 -272 52 -74 52 -32 57 42 -82 73
5746 73 86 -325 -78 142 128 -318 8 -89 -186 -51 -19 -50 -2 -172 131 -95 -105 -51 92 106 288 16 -53 -11
5770 -11 85 8 -353 6 -55 59 -60 111 239 -33 10 -105 116 -118 56 106 -59 -30 260 -134 35 104 -67
5793 -67 131 116 201 -34 203 11 190 1 -213 -11 9 -169 -92 -350 -90 -175 -62 65 -236 -10 -72 176
5815 176 96 -69 -299 -133 196 -298 -32 -97 -287 50 -306 -76 -34 5 159 192 -67 39 -159 -152 48 -30 -112
5838 -112 -20 -118 -62 50 80 154 44 290 -92 -83 173 120 145 -262 -296 -45 -100 -275 -58 32 -191 -22 -122 -45
5862 -45 217 9 -260 174 -60 -273 23 79 82 -223 84 219 25 212 -222 40 176 83 -142 -191 -25 -6
5884 -6 -20 -141 53 -263 127 30 -57 225 -194 -231 -18 -118 -25 -85 98 -13 348 228 145 419 263 -280 90
5907 90 -80 -75 -112 190 -94 -68 140 -117 2 -348 168 -16 -263 159 91 107 -139 -157 124 154 332 127 160
5930 160 1 273 96 142 143 -17 271 163 -43 -278 105 -109 129 -14 -267 20 -166 12 -112 293 -94
5951 -94 235 196 79 103 -79 -205 139 1 89 18 -111 -27 146 220 51 40 -57 -21 -113 -2 378 -271 -43 66
5975 66 46 68 186 -57 -206 27 96 24 184 355 -125 -47 -33 -63 -135 25 -90 81 -145 -170 -153 6 -18 203
5999 203 117 -171 -136 0 -200 -170 150 234 -121 187 -59 334 -148 -77 -129 69 167 -36 264 -92 116 -117
6021 -117 -75 29 114 69 -276 -105 -105 -145 -25 88 -60 84 2 166 -37 126 -30 -27 24 187 -194 -3 131
6044 131 -81 137 203 -29 -11 -58 20 6 -151 -62 -31 -12 -47 6 -75 27 213 -33 51 228 -212 117 -93 84
6068 84 -412 -107 30 -188 -169 -58 -168 100 -45 -120 136 -280 137 -182 -126 -73 -39 -43 -225 -44 120 -22 -67
6091 -67 205 4 63 -67 -304 38 -70 -180 -161 -129 -55 -128 -6 92 -226 177 -10 183 27 -358 308 144
6113 144 99 67 -177 251 242 -76 -118 -235 138 162 -257 -41 46 -98 -30 59 112 129 177 -144 21 -122 -217 -80
6137 -80 197 81 -130 -200 -68 -223 -68 161 222 -100 -282 -41 226 40 15 -217 133 -20 -75 -156 108 -18
6159 -18 137 -155 -11 -167 -55 378 157 -171 59 402 -160 -59 -127 330 -231 21 172 -73 154 -192 277
6180 277 37 -88 121 41 105 -187 -167 23 -149 64 0 -64 -116 -95 -122 65 -16 223 234 60 34 -162 284 -175
6204 -175 -157 62 -261 -118 126 50 -62 29 -140 -221 -19 -95 0 41 -97 -74 323 128 134 1 217 -125 -152 -23
6228 -23 -76 -191 -93 183 94 -54 257 -44 237 -214 -215 -83 -108 -157 -39 -45 -74 -97 179 30 168 187 -106 -39 -63
6253 -63 137 143 -73 183 -85 150 253 -156 299 1 159 196 208 197 95 37 -192 -300 63 98 -14 -281 46
6276 46 275 -155 -53 26 -43 76 52 -37 63 -249 -90 -19 -142 66 201 59 -83 38 108 70 9 -308 -111
6299 -111 223 -294 -194 199 31 86 49 85 323 -192 -59 344 7 226 225 164 16 74 -201 76 246 -314
6321 -314 154 164 240 -151 -200 352 -89 -27 204 17 -134 30 -122 -171 22 -173 -71 143 260 -55 100 7
6343 7 -77 40 119 438 108 139 51 33 21 51 -227 190 -60 -96 -165 7 58 106 -109 131 -139 119 66 12 -75
6368 -75 -153 288 -48 -92 -132 -113 -56 -48 187 -226 -61 -28 55 250 77 152 134 -101 89 62 -208 41 9 -12 -116
6393 -116 -162 73 277 232 -13 435 -183 10 358 -148 -61 230 43 -126 -123 96 44 -101 180 30 2 280
6415 280 196 -193 204 61 -30 58 82 242 -102 189 -16 233 -11 72 137 6 272 94 -195 -38 -39 -125 287
6438 287 211 -272 173 53 -110 122 -178 73 -15 109 -291 -208 -11 144 328 164 -73 -1 198 15 42 -67
6460 -67 124 201 293 58 -143 -49 11 11 40 -155 185 43 -175 438 -16 154 -65 -185 191 -192 121 113 -136
6483 -136 16 -140 292 -157 160 -168 10 56 179 -194 164 -141 -21 -177 150 -226 12 163 -9 23 327
6504 327 230 -279 -222 -64 -197 -156 -174 162 117 -143 135 136 49 179 -160 405 125 45 68 -277 -104 3 -183
6527 -183 -199 -312 -91 135 -161 210 36 251 -262 -42 -125 -54 -21 -62 133 -46 -28 -45 -50 -66 346 -92 -69 -16
6551 -16 121 79 106 -204 -79 36 0 -7 270 110 93 218 162 173 -44 -21 171 -279 247 207 -10 77 -115 33
6575 33 -46 -54 115 -131 49 77 -235 -86 101 -60 -193 -81 -134 -154 70 17 231 50 85 144 109 -78 -170 143
6599 143 22 -67 129 -24 197 -208 -99 -169 -94 -43 209 -112 159 60 -136 -194 137 -177 -455 -20 -91 -96 -156
6622 -156 -33 -26 -104 -175 353 14 -190 -14 71 92 115 -41 -91 131 140 -241 1 85 -81 -159 -112 116 70 -82 6
6647 6 -16 18 191 -183 54 94 175 322 -182 -8 -213 32 -81 -9 -116 -323 -40 -45 -62 235 -19 202 133 -274
6671 -274 198 -156 23 -258 -154 -131 -360 -140 -212 73 97 -66 -20 -141 454 102 92 340 8 43 -27 208
6693 208 -79 3 -290 -126 -92 -269 -25 -231 42 -60 148 171 -38 121 -251 132 -161 55 7 130 -182
6714 -182 -17 14 117 205 100 170 -78 201 238 -209 19 5 -189 -30 -145 46 171 -20 49 36 -28 -21 -92 -158
6738 -158 -87 -454 -9 -29 242 210 70 76 109 170 -140 -47 -30 -213 -217 -176 15 -181 -187 -110 28 123 -30 38 91 -124
6764 -124 17 60 -80 -94 436 -18 -133 63 250 310 89 -48 11 -64 -136 146 -9 17 -163 -200 -159 23 96
6787 96 -2 61 -174 -3 -138 -132 175 126 270 5 -61 -251 29 -24 -64 238 1 -64 54 88 -7 -6 -100 198 -206
6812 -206 36 78 -275 -67 174 -248 235 166 230 -113 -205 115 -65 -73 10 251 -130 -1 -157 -237 -16 -88 114
6835 114 -50 91 -45 32 5 273 -40 -227 233 -29 -83 -253 134 9 69 101 -296 -158 -42 97 24 -132
6857 -132 56 -101 -266 109 -313 326 -126 175 40 -37 -423 51 102 -260 -164 342 40 259 122 235 38
6878 38 333 309 30 -202 -240 -231 22 -41 36 -36 167 6 -71 -181 -34 -253 109 1 -163 -31 61 232 96
6901 96 -80 -124 168 160 108 321 -324 -53 200 294 377 -41 163 -114 142 -118 -21 -171 227 -10 -130 -163 -241
6924 -241 101 -6 -62 236 24 -239 -195 150 61 190 62 169 150 72 -283 -46 111 -30 -44 -168 127 -16
6946 -16 -80 -42 -162 113 -92 -167 -150 36 72 169 11 -16 -74 -242 -84 279 51 -85 -26 178 -78 -111 171 -123
6970 -123 138 26 182 20 37 -160 138 -173 9 55 44 257 -9 138 -132 -117 -46 -26 305 -69 17 -111
6992 -111 -89 -47 -146 7 77 -19 40 3 -68 -195 155 66 -229 -38 169 -59 74 37 41 -120 -222 -195 -174 -6 121
7017 121 -17 53 -132 166 -2 -142 60 -4 102 -9 -95 -94 190 -52 -13 125 -42 312 35 107 -164 -181 40
7040 40 -89 111 235 -13 -76 -133 91 -52 45 160 -91 49 -157 -35 159 285 274 0 -68 175 -69 243
7062 243 -144 192 144 2 69 37 139 370 -117 -86 28 13 164 36 -213 -87 -128 180 -19 8 99 128 27
7085 27 -117 -373 60 -77 -257 -18 -58 107 123 52 -26 -23 102 -9 -228 256 -235 34 148 -160 131 9
7107 9 186 -91 -134 358 116 103 -87 5 -95 -141 168 91 -180 -12 -71 70 -26 -36 -58 -13 -22 -348 168 -51 -182
7132 -182 414 -41 129 -108 -26 259 -10 -214 -198 115 -9 -80 325 159 94 22 77 -99 143 5 -18 -84 94
7155 94 111 -376 -7 143 -2 195 22 -174 -103 19 307 -142 -192 -70 -74 35 182 -78 -148 38 -115 -5
7177 -5 -23 -139 -97 19 10 -14 -271 -86 47 46 9 -156 117 91 -94 -200 40 -112 -17 -109 107 193 115 320 132
7202 132 -89 257 13 -90 147 -149 -55 117 50 400 186 13 -193 -109 65 76 5 78 -87 -72 -107 -206 -90
7225 -90 -273 151 -72 -262 -106 -238 -36 -7 -176 -226 -117 -127 143 51 -50 -40 -180 123 -65 -156 181 -120
7247 -120 -84 -66 240 -174 -273 81 -44 17 -299 -29 -65 49 23 245 12 -49 -68 6 -15 -191 -26 33 315 68
7271 68 40 25 102 107 79 16 -31 24 90 75 -144 -35 72 81 150 177 -52 -245 130 209 203 -32 123 124 -50 -51 105 -1
7299 -1 13 118 166 77 83 -84 -170 -199 -72 -150 -244 12 61 -38 -102 204 -120 -134 -165 1 -60 -77 40 -373 8 16 105
7326 105 -173 -89 -263 -37 -119 268 -46 -22 -44 -271 -123 -117 -124 -115 1 0 -113 57 244 -5 -76 229 -67 292
7350 292 -97 -247 120 -303 79 80 -112 62 63 55 -205 93 121 -42 180 3 92 -11 116 135 149 -490 -396 -132
7374 -132 -186 -52 287 6 -109 -92 201 -75 147 104 -31 -61 68 1 131 65 3 106 172 9 120 314 -24
7397 -24 -130 26 133 -66 19 78 -181 20 182 -64 -14 103 152 -87 68 -147 -83 -107 -222 74 -79 78
7419 78 -94 -73 -106 96 9 -168 152 301 -344 237 -28 -22 137 -48 -142 -41 -226 -7 257 114 107 53 101 50
7443 50 45 -69 -76 -300 -60 -128 -164 162 -303 204 -181 228 -93 -300 -260 -73 92 -133 -68 -20 26 165 -45 -6
7467 -6 220 111 -138 -167 -94 128 -268 179 -36 -186 69 -120 278 32 -27 211 81 -130 175 95 -81 -6
7489 -6 30 151 -45 118 168 -96 -193 -43 83 28 395 87 4 -87 -89 89 122 -149 -47 -321 71 -212 114 -168
7513 -168 91 16 -148 147 16 149 -4 -43 102 142 148 96 223 -61 -159 -221 -97 204 -35 -136 56 -124 -124
7536 -124 18 -92 71 -480 -102 -219 104 175 -90 -10 0 173 -23 -246 30 66 36 -92 210 -3 -77 6
7558 6 41 -60 -18 34 -121 78 -123 262 -211 -285 -135 116 -6 149 -48 32 157 -6 -128 18 148 -121
7580 -121 54 61 56 -184 106 26 31 -202 152 -70 -72 247 -85 47 30 199 -161 -78 -122 264 129 307 39 -34
7604 -34 36 84 156 -147 240 -55 85 -201 38 309 167 1 106 50 -240 68 -55 -4 76 15 11 43 -13 43
7628 43 20 -120 -125 -69 -60 256 181 29 90 26 -64 15 -131 -22 255 -141 -322 -108 86 27 -64 -111 66 -56 244
7653 244 69 79 -268 66 223 1 20 53 -96 79 69 210 107 24 39 131 -100 78 -3 -17 -176 -180 85 -124
7677 -124 -176 8 -38 -38 -139 146 159 -83 -156 -152 -110 -123 -116 -178 57 252 -19 -98 1 78 -153 195 -244 160 64 43
7703 43 -139 28 199 5 242 -98 -37 -239 -12 -160 68 99 -2 -174 -108 -96 -229 -210 -160 -206 67 -91 -142
7726 -142 -188 136 49 0 129 -107 251 91 162 27 91 66 50 123 85 46 -22 -181 -85 -125 92 -56 -80 223 144
7751 144 74 33 -154 74 -144 99 178 52 -141 -37 -87 -82 -173 -154 167 -240 56 -35 24 415 -68 130 121 -178
7775 -178 1 113 -38 19 136 335 -202 210 226 -217 -22 175 -94 -89 125 221 -21 -3 283 -27 -12 242
7797 242 -33 -142 -135 -96 86 51 17 -149 -113 301 93 8 9 -147 195 -192 -21 -120 284 -169 137 -104 70
7820 70 -19 -233 -127 -157 52 119 -60 124 24 -274 130 11 -14 94 217 23 -62 -14 -140 -98 -162 -97 282
7843 282 56 107 90 217 4 273 -101 -52 143 34 -33 -55 150 -236 -151 208 235 -116 307 210 -113 -161 37
7866 37 276 -22 157 -80 112 -16 -150 -3 35 -43 96 -173 -29 -96 -407 -16 152 96 -138 -223 19 92
7888 92 77 186 -130 146 241 85 -226 62 -115 129 -110 -57 -85 0 -142 -136 103 -107 -83 -161 -223 -246 139 27
7912 27 -16 -20 -216 -100 -132 117 -3 121 198 -11 -41 -234 -190 -137 -53 -244 -191 -168 2 -32 -59 -64 129 49 -57 -112
7938 -112 196 67 253 -74 183 20 265 20 -159 97 -46 56 -53 116 -226 -9 157 -110 -168 111
7958 111 -29 -185 -72 136 190 -116 -108 269 -71 253 -16 55 190 -103 84 102 121 145 15 -45 -21 -56 -139 44
7982 44 109 214 -171 19 -87 166 72 -17 -115 -198 -233 -120 -44 274 145 24 59 43 104 -46 -233 201 -132 -75
8006 -75 -110 -164 188 -148 57 309 58 111 -94 -203 -67 42 -26 449 -13 -174 -257 92 147 101 32 -162 -30
8029 -30 156 -120 57 -84 38 8 -124 269 -235 -245 -283 -218 68 -46 -58 167 -159 -206 -40 -180 241 78
8051 78 -208 -209 89 83 342 -50 125 76 20 -230 29 -167 241 -65 -202 120 254 410 11 -81 -69 -201 146
8074 146 -95 -62 256 -101 -11 120 -2 14 37 -39 7 -182 -97 -38 -123 217 -43 369 -18 -108 -104 -100 132 206 -45
8099 -45 -24 31 -126 132 -71 122 -68 -133 267 171 -96 -37 290 294 -169 -35 -137 -143 -188 -169 165 58 57 103 -32
8124 -32 -1 112 91 9 -180 -168 46 212 -71 -177 108 118 -335 -105 -117 12 -7 153 119 28 -67 11 -56 -140 209
8149 209 -22 57 207 -8 244 250 -155 28 55 11 253 89 99 -63 -49 -62 -24 252 -143 -41 85 88 9 24
8173 24 211 62 27 -103 -191 275 -164 26 166 -12 121 -9 71 56 -245 -34 138 56
8191E6
##END NTUPLES=NMR FID
##END=
