##TITLE=1H_DE-80H_X3
 200.13MHz, d2o
 8 sc
 
 19ns.26.2.2025
##JCAMPDX= 6.0         $$ Bruker NMR JCAMP-DX V2.0
##DATA TYPE= NMR FID
##DATA CLASS= NTUPLES
##ORIGIN= UXNMR, Bruker Analytische Messtechnik GmbH
##OWNER= pz
$$ XWIN-NMR		Version 3.5
$$ Fri Sep 19 15:05:07 2025 Russian Standard Time (UT+4h)  Yarkov@DPX200
##.OBSERVE FREQUENCY= 200.1313
##.OBSERVE NUCLEUS= ^1H
##.DELAY= (6, 6)
##.ACQUISITION MODE= SIMULTANEOUS
##.ACQUISITION SCHEME= undefined
##.AVERAGES= 8
##.DIGITISER RES= 18
##SPECTROMETER/DATA SYSTEM= spect
##.PULSE SEQUENCE= zg30
##.SOLVENT NAME= CDCl3
##.SHIFT REFERENCE= (INTERNAL, CDCl3, 0, 14.3821)
##AUDIT TRAIL= $$ (NUMBER, WHEN, WHO, WHERE, WHAT)
$$ ##TITLE= Audit trail, XWIN-NMR		Version 3.5
$$ ##JCAMPDX= 5.01
$$ ##ORIGIN= Bruker BioSpin GmbH
$$ ##OWNER= Yarkov
$$ C:/Bruker/XWIN-NMR/data/yarkov2/nmr/H-C/1/audita.txt
$$ ##AUDIT TRAIL=  $$ (NUMBER, WHEN, WHO, WHERE, WHAT)
(   1,<2025-09-19 15:04:04.73 +0400>,<Yarkov>,<DPX200>,
      <created by zg, POWCHK disabled, PULCHK disabled
       configuration hash MD5:
       00 E9 B6 7A A2 85 ED C7 34 08 36 98 17 FE 4E 26
       data hash MD5: 16K
       08 2F 95 C9 41 B4 4C 1D E6 71 36 71 EC 5D 79 D3>)
$$ ##END=
$$ 
$$ hash MD5
$$ 66 21 8D A3 74 35 99 0C 8D 49 AE 42 91 9A C7 EF
##$RELAX= 
##$RELAX= 
##$RELAX= 
##$RELAX= 
##$RELAX= 
##$RELAX= 
$$ Bruker specific parameters
$$ --------------------------
##$DU= <C:/Bruker/XWIN-NMR>
##$EXPNO= 1
##$NAME= <H-C>
##$PROCNO= 1
##$TYPE= <nmr>
##$USER= <yarkov2>
##$AMP= (0..31)
100 100 100 100 100 100 100 100 100 100 100 100 100 100 100 100 100 100 
100 100 100 100 100 100 100 100 100 100 100 100 100 100 
##$AQSEQ= 0
##$AQ_mod= 1
##$AUNM= <au_zg>
##$AUTOPOS= <>
##$BF1= 200.13
##$BF2= 200.13
##$BF3= 200.13
##$BF4= 200.13
##$BF5= 200.13
##$BF6= 200.13
##$BF7= 200.13
##$BF8= 200.13
##$BYTORDA= 1
##$CFDGTYP= 0
##$CFRGTYP= 5
##$CHEMSTR= <none>
##$CNST= (0..31)
1 1 145 1 1 1 1 1 1 1 1 1 1 1 1 1 1 1 1 1 1 1 1 1 1 1 1 1 1 1 1 1 
##$CPDPRG= <>
##$CPDPRG1= <>
##$CPDPRG2= <>
##$CPDPRG3= <>
##$CPDPRG4= <mlev>
##$CPDPRG5= <mlev>
##$CPDPRG6= <mlev>
##$CPDPRG7= <mlev>
##$CPDPRG8= <mlev>
##$CPDPRGB= <>
##$CPDPRGT= <>
##$D= (0..31)
0 0.7 0 0 0 0 0 0 0 0 0 0.03 0 0 0 0 0 0 0 0 0 0 0 0 0 0 0 0 0 0 0 0 
##$DATE= 1758279844
##$DBL= (0..7)
120 120 120 120 120 120 120 120 
##$DBP= (0..7)
150 150 150 150 150 150 150 150 
##$DBP07= 0
##$DBPNAM0= <>
##$DBPNAM1= <>
##$DBPNAM2= <>
##$DBPNAM3= <>
##$DBPNAM4= <>
##$DBPNAM5= <>
##$DBPNAM6= <>
##$DBPNAM7= <>
##$DBPOAL= (0..7)
0.5 0.5 0.5 0.5 0.5 0.5 0.5 0.5 
##$DBPOFFS= (0..7)
0 0 0 0 0 0 0 0 
##$DE= 6
##$DECBNUC= <off>
##$DECIM= 32
##$DECNUC= <off>
##$DECSTAT= 4
##$DIGMOD= 1
##$DIGTYP= 9
##$DL= (0..7)
0 120 120 120 120 120 120 120 
##$DP= (0..7)
150 150 150 150 150 150 150 150 
##$DP07= 0
##$DPNAME0= <>
##$DPNAME1= <>
##$DPNAME2= <>
##$DPNAME3= <>
##$DPNAME4= <>
##$DPNAME5= <>
##$DPNAME6= <>
##$DPNAME7= <>
##$DPOAL= (0..7)
0.5 0.5 0.5 0.5 0.5 0.5 0.5 0.5 
##$DPOFFS= (0..7)
0 0 0 0 0 0 0 0 
##$DQDMODE= 0
##$DR= 18
##$DS= 0
$$ [...]
##$SUBNAM2= <"">
##$SUBNAM3= <"">
##$SUBNAM4= <"">
##$SUBNAM5= <"">
##$SUBNAM6= <"">
##$SUBNAM7= <"">
##$SUBNAM8= <"">
##$SUBNAM9= <"">
##$SW= 18.0517328524113
##$SWIBOX= (0..15)
0 0 2 0 0 0 0 0 0 0 0 0 0 0 0 0 
##$SW_h= 3612.71676300578
##$TD= 16384
##$TD0= 1
##$TE= 0
##$TE2= 300
##$TE3= 300
##$TEG= 300
##$TL= (0..7)
0 120 120 120 120 120 120 120 
##$TP= (0..7)
150 150 150 150 150 150 150 150 
##$TP07= 0
##$TPNAME0= <>
##$TPNAME1= <>
##$TPNAME2= <>
##$TPNAME3= <>
##$TPNAME4= <>
##$TPNAME5= <>
##$TPNAME6= <>
##$TPNAME7= <>
##$TPOAL= (0..7)
0.5 0.5 0.5 0.5 0.5 0.5 0.5 0.5 
##$TPOFFS= (0..7)
0 0 0 0 0 0 0 0 
##$TUNHIN= 0
##$TUNHOUT= 0
##$TUNXOUT= 0
##$USERA1= <user>
##$USERA2= <user>
##$USERA3= <user>
##$USERA4= <user>
##$USERA5= <user>
##$V9= 5
##$VALIST= <valist>
##$VCLIST= <CCCCCCCCCCCCCCC>
##$VD= 0
##$VDLIST= <DDDDDDDDDDDDDDD>
##$VPLIST= <PPPPPPPPPPPPPPP>
##$VTLIST= <TTTTTTTTTTTTTTT>
##$WBST= 1024
##$WBSW= 4
##$XGAIN= (0..3)
0 0 0 0 
##$XL= 0
##$YL= 0
##$YMAX_a= 106450
##$YMIN_a= -105187
##$ZGOPTNS= <>
##$ZL1= 120
##$ZL2= 120
##$ZL3= 120
##$ZL4= 120
##$ABSF1= 10
##$ABSF2= 0
##$ABSG= 5
##$ABSL= 3
##$ALPHA= 0
##$AQORDER= 0
##$ASSFAC= 0
##$ASSFACI= 0
##$ASSFACX= 0
##$ASSWID= 0
##$AUNMP= <proc_1d>
##$AZFE= 0.1
##$AZFW= 0.1
##$BCFW= 1
##$BC_mod= 2
##$BYTORDP= 1
##$COROFFS= 0
##$CY= 83.5205535888672
##$DATMOD= 1
##$DC= 2
##$DFILT= <>
##$DTYPP= 0
##$F1P= 10.8118882576601
##$F2P= -7.23987719738617
##$FCOR= 0.5
##$FTSIZE= 0
##$FT_mod= 4
##$GAMMA= 1
##$GB= 0.15
##$INTBC= 1
##$INTSCL= 1
##$ISEN= 128
##$LB= 0.25
##$LEV0= 0
##$LPBIN= 0
##$MAXI= 10000
##$MC2= 0
##$MEAN= 0
##$ME_mod= 0
##$MI= 1.114404
##$NCOEF= 0
##$NC_proc= 0
##$NLEV= 6
##$NOISF1= 3.799351
##$NOISF2= 2.8
##$NSP= 1
##$NTH_PI= 0
##$NZP= 0
##$OFFSET= 14.38212
##$PC= 1
##$PHC0= -1348.02
##$PHC1= -1.209074
##$PH_mod= 1
##$PKNL= yes
##$PPARMOD= 0
##$PSCAL= 0
##$PSIGN= 0
##$REVERSE= no
##$SF= 200.129724274929
##$SI= 16384
##$SIGF1= 3
##$SIGF2= 2
##$SINO= 400
##$SIOLD= 16384
##$SREGLST= <1H.CDCl3>
##$SSB= 0
##$STSI= 0
##$STSR= 0
##$SW_p= 3205.1282051282
##$SYMM= 0
##$S_DEV= 0
##$TDeff= 0
##$TDoff= 0
##$TI= <>
##$TILT= no
##$TM1= 0
##$TM2= 0
##$TOPLEV= 0
##$USERP1= <user>
##$USERP2= <user>
##$USERP3= <user>
##$USERP4= <user>
##$USERP5= <user>
##$WDW= 1
##$XDIM= 8192
##$YMAX_p= 0
##$YMIN_p= 0
$$ End of Bruker specific parameters
$$ ---------------------------------
##NTUPLES= NMR FID
##VAR_NAME=  TIME,          FID/REAL,        FID/IMAG
##SYMBOL=    X,             R,               I
##VAR_TYPE=  INDEPENDENT,   DEPENDENT,       DEPENDENT
##VAR_FORM=  AFFN,          ASDF,            ASDF
##VAR_DIM=   8192,          8192,            8192
##UNITS=     SECONDS,       ARBITRARY UNITS, ARBITRARY UNITS
##FACTOR=    0.0002768,     1,               1
##FIRST=     0,             0,               0
##LAST=      2.2672688,     0,               0
##MIN=       0,             -105187,         0
##MAX=       2.2672688,     106450,          0
$$ Real data points
##PAGE= N=1
##DATA TABLE= (X++(R..R)), XYDATA
$$ plain form
0 0 0 0 0 0 0 0 0 0 0 0 0 0 0 0 0 0 0 0 0 0 0 0 0 0 0 0 0 -1 3 -4 5 -8 8 -8 8 -9 11 -13 13 -17 19 -20 22 -25 29 -32 34 -40
48 -40 41 -49 52 -57 62 -69 74 -83 90 -96 107 -117 128 -133 141 -145 139 -107 13 291 -1493
69 -1493 13612 106450 25395 -36033 44602 8890 -86647 -31171 38942 -21033 -15022 79461 21630
82 21630 -91266 -12921 60135 -26114 -33202 60809 30033 -43275 241 27324 -31393 -6908
94 -6908 70999 6662 -81953 -16534 24382 -45622 -27725 55468 28061 -25099 1526 -1360 -52459
107 -52459 -12768 67572 35730 -6042 49651 48739 -37901 -39861 14523 4796 -6501 26075 16164
120 16164 -31755 -18063 18149 -15466 -36048 18197 29981 -17060 -13862 17503 9227 -1203
132 -1203 12310 7564 -19472 -16890 2102 -18329 -30784 9028 24303 -10149 -25384 -13663 -13845
$$ packed form
0@%%%%%%%%%%%%%%%%%%%%%%%%%%%jMpRj3J6j6J6j7K0k4K6l0L6l9M2m7N4o1O6p4
48d0Q1r0J01j09J19j31J43j57J73j86K03k24K45k61K74k86K84k46J20K78j784
69a493J5105R2838q1055o1428Q0635l5712r5537N5476P0113n9975O011R4483n7831
82B1630j12896P8345P3056q6249p088R4011l0776p3308M3516K7083n8717K4485
94f908P7907o4337q8615O5419M0916p0004J7897Q3193k7407n3160K6625k886n1099
107e2459L9691Q0340l1842m1772N5693r12q6640j960N4384r727j1297L2576r911
120A6164m7919J3692L6212l3615k0582N4245J1784m7041L198L1365q276j0430
132a203J3513m746k7036K582J8992k0431j2455L9812J5275l4452j5235J1721j82
$$ plain form
145 -13845 -18796 -1804 21065 18565 16492 28362 9089 -19333 -2606 16980 1322 -5375 15803
158 15803 22119 -1589 -10652 2047 -7438 -15543 7361 6562 -16988 -1994 21323 3350 -14647
171 -14647 3286 11688 -13526 -14507 13027 6068 -5476 19113 15415 -18915 -12672 5461 -16676
184 -16676 -31156 -914 15885 -6936 -5795 15475 -5413 -20868 8857 11213 -11087 8306
196 8306 30014 7213 -9328 9062 8989 -19425 -13978 9897 -5173 -11100 17016 11211 -13459
209 -13459 636 12755 -8665 -15967 5962 10087 -6457 3853 19011 -2805 -12264 6947 -1127
222 -1127 -16076 2670 14379 -413 -3600 9040 3309 -15370 -9258 2019 -10189 -7250 13418
235 13418 6945 -4554 5511 6345 -7586 -8977 1334 905 -6049 3075 11406 -399 -2314 6167
$$ packed form
145a3845m951J6992K2869k500k073J1870j9273k8422J6727J9586j5658o697K1178
158A5803O316k3708r063J2699r485q105K2904p99k3550J4994K3317j7973j7997
171a4647J7933Q402k5214r81K7534o959j1544K4589l698l4330O243J8133k2137
184a6676j4480L0242J6799k2821J141K1270k0888j5455K9725K356k2300J9393
196H306K1708k2801j6541J8390p3k8414N447K3875j5070n927K8116n805k4670
209a3459J4095J2119k1420p302K1929M125j6544J0310J5158k1816r459J9211q074
222a127j4949J8746J1709j4792l187J2640n731j8679O112J1277j2208K939K0668
235A3418o473j1499J0065Q34j3931j391J0311m29o954R124Q331j1805j915Q481
$$ plain form
249 6167 -2251 -7517 2804 6099 1667 2530 6575 3041 -6554 -6099 -3770 -10991 -7824 2795 1866
264 1866 2083 7348 5881 1611 -181 1346 1993 -1480 1438 5045 -674 -2402 -1566 -7438 -9160 -6045
280 -6045 -3742 -89 2642 6103 8380 4389 3526 3734 -1620 -1868 701 -324 1160 1988 292 -534
296 -534 -3795 -4429 -2652 -4243 -1706 2236 1259 2706 3167 -87 -362 -1562 -1961 949 877 2468 4655
313 4655 1464 401 -558 -4647 -4430 -4000 -4060 -354 634 1419 3514 810 143 1045 -1580 -143 1914
330 1914 805 2727 2447 580 912 -1625 -2193 -249 -1583 646 3274 781 1831 1862 -2048 -2244 -2503
347 -2503 -3074 -1469 -1487 440 1679 -1056 711 972 -3234 -512 2155 -200 1783 4164 3221 1995
363 1995 726 1266 -700 -3417 637 379 -4297 191 2035 -3804 -3308 -313 -1894 -2700 96 3293
$$ packed form
249F167q418n266J0321L295m432Q63M045l534r595M55K329p221L167J0619r29
264A866K17N265j467m270j792J527O47l473K918L607n719j728Q36n872j722L115
280f045K303L653K731L461K277l991q63K08n354k48K569j025J484Q28j696q26
296e34l261o34J777j591K537L942r77J447M61l254k75j200l99K910p2J591K187
313D655l191j063r59m089K17M30o0L706R88P85K095k704o67R02k625J437K057
330A914j109J922k80j867L32k537n68J944j334K229K628k493J050L1l910j96k59
347b503n71J605j8J927J239k735J767K61m206K722K667k355J983K381r43j226
363A995j269N40j966k717M054k58m676M488J844n839M96K995j581q06K796L197
$$ plain form
379 3293 940 207 5600 2282 -3901 1898 2747 -4784 -2720 2074 -1115 -3551 -203 974 -3957 -2726
395 -2726 4334 -381 -4365 5412 6153 -2470 582 4951 -511 -2765 2588 3374 -1853 1576 7284 -1176
411 -1176 -5270 4514 2378 -6907 -2524 1603 -3919 -5072 169 -308 -4246 1826 7462 -800 -2395
426 -2395 7322 4048 -3898 554 2895 -2841 -5193 -3356 -5265 -7835 -1588 3332 -3210 -2855 6132
441 6132 3354 -2626 1251 4806 3546 2410 2495 942 -2414 168 3206 -1572 -1190 5755 3481 -3571
457 -3571 -4364 -505 1897 -100 -256 2338 -456 -1649 1421 -1490 -2628 5323 8525 1430 -4115 -372
473 -372 1630 -6052 -6288 2008 -1160 -5448 -913 -4483 -10271 -962 8391 1781 -4004 4896 7103 -6504
489 -6504 -5890 6357 1573 -2310 7115 1589 -11164 -2585 8101 -1100 -4431 12015 13234 -6469
$$ packed form
379C293k353p33N393l318o183N799Q49p531K064M794l189k436L348J177m931J231
395b726P060m715l984R777P41q623L052M369n462k254N353P86n227L429N708q460
411a176m094R784k136r285M383M127n522j153N241m77l938O072N636q262j595
426b395R717l274p946M452K341n736k352J837j909k570O247M920o542L55Q987
441F132k778n980L877L555j260j136Q5j553l356K582L038m778L82O945k274p052
457c571p93L859K402j997j56K594k794j193L070k911j138P951L202p095n545L743
473c72K002p682k36Q296l168m288M535l570n788R309R353o610n785Q900K207j3607
489f504O14J2247m784l883R425n526j2753Q579J0686r201l331J6446J219j9703
$$ plain form
503 -6469 -5923 5411 -4384 -6090 10493 4979 -10154 524 8989 -7528 -10260 12276 13268 -5899
517 -5899 -28 9091 -8675 -10667 8255 724 -12913 2875 8662 -14423 -16450 8033 6926 -8633
531 -8633 4405 12223 -8939 -9194 8588 -2137 -11417 10406 15713 -8522 -10012 8920 822 -12571
545 -12571 5234 13285 -5275 -2375 10252 -6140 -14214 8372 12981 -6538 -3268 12855 1344
558 1344 -10874 5513 10102 -5287 1364 11095 -7129 -14478 4003 5150 -10316 -3335 10921
571 10921 -1241 -12212 467 2437 -7723 3409 13036 -2288 -7632 5160 2141 -11131 -3789
584 -3789 9167 1358 -5861 3127 1278 -8537 -471 6739 -2718 -3761 6789 4059 -7106 -3121
598 -3121 7409 3273 -1771 4949 3683 -4623 -86 5141 -905 -1666 5876 4387 -5977 -6536 1512
$$ packed form
503f469N46J1334r795j706J6583n514j5133J0678Q465j6517k732K2536R92j9167
517e899N871R119j7766j992J8922p531j3637J5788N787k3085k027K4483j107j5559
531h633J3038P818k1162k55J7782j0725r280K1823N307k4235j490J8932q098j3393
545a2571J7805Q051j8560K900J2627j6392q074K2586M609j9519L270J6123j1511
558A344j2218J6387M589j5389O651R731j8224p349J8481J147j5466O981J4256
571A0921j2162j0971J2679J970j0160J1132R627j5324n344J2792l019j3272P342
584c789J2956p809p219Q988j849r815Q066P210r457j043J0550k730j1165L985
598c121J0530m136n044O720j266q306M537N227o046p61P542j489j0364n59Q048
$$ plain form
613 1512 -638 -4930 2318 4843 -2168 -1532 1500 -3511 -5243 2527 6316 -1136 -3376 3756 870
628 870 -6695 -922 3616 -2351 -2056 2905 -969 -5578 466 5474 -1584 -3612 5517 3204 -5853 -147
644 -147 5678 -305 -108 5954 1522 -5999 -1217 4125 -3032 -4120 6535 4139 -5728 -761 3357
659 3357 -4343 -3821 4369 1861 -4286 1019 4932 -4359 -5994 4375 2122 -5502 1275 4919 -3047
674 -3047 -2401 4990 1443 -4465 1219 4473 -4261 -4512 5075 1742 -4555 2570 4900 -2960 -2088 3945
690 3945 257 -3778 2667 5414 -2800 -3199 3522 -1231 -6097 878 2657 -3152 -1166 3407 -465
705 -465 -4257 446 2055 -3938 -2512 3818 254 -2869 2564 2951 -1613 129 3347 531 -2001 1736
721 1736 3012 -1685 -942 2889 -825 -3175 891 1047 -1579 261 2889 1189 -840 1349 1729 -2313
$$ packed form
613A512k150m292P248K525p011O36L032n011j732P770L789p452k240P132k886
628H70p565N773M538n967K95M961l874m609O044N008p058k028R129k313r057N706
644a47N825n983J97O062m432p521M782N342p157j088J0655k396r867M967M118
659C357p700N22Q190k508o147N305L913r291j635J0369k253p624O777L644p966
674c047O46P391l547n908N684L254q734k51R587l333o297P125K330p860Q72O033
690C945l688m035O445K747q214l99O721m753m866O975J779n809J986M573l872
705d65l792M703J609n993J426O330l564l123N433L87m564J742L218k816k532L737
721A736J276m697P43L831l714k350M066J56k626J840K628j700k029K189L80m042
$$ plain form
737 -2313 -1740 1363 -1101 -2130 741 194 -2079 -1348 -131 -900 -2146 -76 1378 -934 -141 2070
753 2070 -272 -1335 517 274 -611 142 1336 1232 65 1016 1789 -605 -380 1165 -493 -724 719
770 719 233 -284 -388 -127 -3 -998 -176 1021 -163 397 1637 153 -323 16 -812 -786 -820 -359 344 -426
790 -426 1 788 -552 -440 274 -555 -266 320 109 497 50 -126 363 -610 -418 441 -286 23 654 117
810 117 152 -161 -597 -344 -923 -729 319 -304 83 940 200 195 532 20 365 413 513 995 289 407 753
831 753 -611 -535 115 -746 -377 216 -145 71 55 -13 -151 -894 -98 242 -815 69 801 -390 -52 335
851 335 -570 -436 -2 2 -294 -416 657 343 -945 145 296 -1011 208 826 -209 421 1236 776 -199
870 -199 44 1001 10 -870 762 326 -999 426 304 -1461 -721 329 -463 -1191 -190 906 -286 -623
$$ packed form
737b313N73L103k464j029K871n47k273P31J217p69j246K070J454k312P93K211
753B070k342j063J852k43q85P53J194j04j167R51P73k394K25J545j658k31J443
770G19m86n17j04K61J24r95Q22J197j184N60J240j484m76L39q28K6l4M61P03p70
790d26M27P87j340J12P14q29K89N86k11L88m47j76M89r73J92Q59p27L09O31n37
810A17L5l13m36K53n79J94J048o23L87Q57p40nL37n12L45M8J00M82p06J18L46
831G53j364P6O50q61L69N93l61K16j6o8j38p43P96L40j057Q84P32j191L38L87
851C35r05J34M34Mk96j22J073l14j288J090J51j307J219O18j035O30Q15m60r75
870a99K43R57r91q80J632m36j325J425j22j765P40J050p92p28J001J096j192l37
$$ plain form
888 -623 1164 61 -870 1146 517 -1016 454 1360 95 -592 281 763 -736 -710 759 -445 -598 1457
906 1457 250 -1006 598 804 -419 -528 418 897 -132 -226 509 -726 -705 629 -860 -1365 284 46
924 46 -698 -706 -457 303 117 -270 155 -160 257 767 -222 134 1032 440 493 -89 -839 593 909 -381 -81
945 -81 555 401 -422 -735 41 -168 -48 1519 195 -1310 1077 1204 -1382 -511 1458 463 -955 -109
963 -109 258 -1627 -777 1673 -929 -2400 1670 1083 -2947 -888 2048 -127 -1220 1351 811 -2491
979 -2491 -241 2642 -1508 -2008 3628 1800 -3268 -324 2258 -1331 -1520 2605 1019 -2716 805 2802
995 2802 -2983 -2266 4365 1647 -2895 1354 2904 -2180 -1492 3030 476 -2719 2109 2776 -4387 -2889
1011 -2889 3523 -210 -3576 1969 2455 -3100 -1744 2252 -1286 -3151 3163 3140 -3936 -1653 3442 -1641
$$ packed form
888f23J787j103r31K016o29j533J470R06j265o87Q73M82j499K6J469j204j53K055
906A457j207j256J604K06j223j09R46M79j029r4P35j235K1J334j489n05J649k38
924D6p44qK49P60j86l87M25l15M17N10r89L56Q98n92N3n82p50J432L16j290L00
945h1O36j54q23l13P76k09J20J567j324j505K387J27k586Q71J969r95j418Q46
963a09L67j885Q50K450k602j471M070n87m030K059K936k175j093K571n40l302
979b491K250K883m150n00N636j828n068K944K582l589j89M125j586l735L521J997
995B802n785P17O631k718m542M249J550n084O88M522k554l195M828O67p163J498
1011b889O412l733l366N545M86n555J356L996l538j865O314k3p076K283N095n083
$$ plain form
1027 -1641 -3733 2727 2764 -1951 78 2536 -2179 -3384 3077 2673 -3105 346 3971 -1998 -3552 2151
1043 2151 1741 -1249 1785 3399 -1590 -2842 2068 1057 -3152 1022 3995 -1538 -3066 551 -614
1058 -614 -2337 1074 2771 -720 -1724 1423 -297 -3750 203 3482 -30 -889 1235 -470 -2410
1073 -2410 -160 1763 191 -149 2251 367 -3483 -1026 1739 -261 -402 1722 677 -1565 -1173 408
1089 408 -175 -373 2503 1998 -1854 -1159 997 -708 -1316 1189 1915 -309 -1130 197 -867 -2099 1157
1106 1157 2342 -883 -576 1577 -489 -2397 64 2052 63 -569 1677 20 -2708 266 1871
1121 1871 -1421 -591 2473 228 -2696 -482 1279 -1121 -1105 2382 747 -2430 519 1630 -2104 -897
1137 -897 2872 817 -1929 520 1757 -1733 -1586 2211 472 -2206 1177 1665 -2649 -1431 2094 -11
$$ packed form
1027a641k092O460L7m715K029K458m715j205O461m04n778L451L625n969j554N703
1043B151m10k990L034J614m989j252M910j011m209M174K973n533j528L617j165
1058f14j723L411J697l491j004L147j720l453L953L279l512q59K124j705j940
1073b410K250J923j572l40K400j884l850K457K765k000j41K124j045k242L92J581
1089D08n83j98K876n05l852O95K156j705o08K505P26k224q21J327j064j232L256
1106A157J185l225L07K153k066j908K461J988j989o32K246j657k728K974J605
1121A871l292Q30L064k245k924K214J761k400J6L487j635l177K949J111l734J207
1137h97L769k055k746K449J237l490J47L797j739k678L383M88m314J218L525k105
$$ plain form
1153 -11 -1909 1057 2040 -1592 -1285 2202 87 -2041 1780 1973 -1972 -739 1906 -565 -2141 817
1169 817 1709 -1516 -916 1976 -427 -2197 1367 1474 -1632 -34 1983 -333 -1605 790 1348 -1260
1185 -1260 -449 1956 -303 -1816 1057 663 -1803 -260 1331 -645 -1543 333 594 -1473 -517 1765
1201 1765 -115 -1069 1385 877 -1154 217 1285 -149 -782 511 602 -1259 -626 1132 -380 -953 1067
1218 1067 593 -881 159 909 -72 -477 612 776 -697 -319 1029 -276 -790 833 504 -696 0
1235 0 414 -390 -848 -118 233 -927 -657 558 -444 -766 630 417 -235 352 730 222 -313 249 458
1254 458 -601 -364 453 -456 -804 271 27 -386 61 399 281 -83 318 605 -138 -18 692 -42 -272
1273 -272 403 146 -50 31 185 184 -269 -105 234 -560 -473 150 -394 -477 17 -67 -129 -48 223 466 -22 171 570
$$ packed form
1153a1j898K966R83l632L07L487k115k128L821J93l945J233K645k471j576K958
1169H17Q92l225O00K892k403j770L564J07l106J598K017k316j272K395N58k608
1185a260Q11K405k259j513K873l94k466J543J591j976q98J876K61k067R56K282
1201A765j880r54K454n08k031J371J068j434o33J293R1j861O33J758j512n73K020
1218A067m74j474J040P50r81m05J089J64j473L78J348j305n14J623l29j200O96
1235@M14q04m58P30L51j160K70J215j002l22J396k13o52N87L78n08n35N62K09
1254D58j059K37Q17r09l48J075k44m13M47L38j18l64M01K87p43J20P10p34k30
1273b72O75k57j96Q1J54jm53J64L39p94Q7O23n44q3M94q4o2Q1K71K43m88J93L99
$$ plain form
1296 570 -182 -143 209 -336 -462 -223 -286 -256 -326 -70 241 -254 55 543 -74 89 557 112 61 274 195 150
1318 150 -38 203 234 -253 89 312 -389 -144 273 -395 -351 -47 -99 -104 -149 150 164 -189 398 457 -288 227 463
1341 463 -319 -126 114 -223 -284 -201 -107 -319 -423 142 -63 -586 327 419 -340 182 481 -22 151 317 222 -102
1363 -102 88 451 -58 -407 402 40 -644 177 94 -439 -103 206 -197 -295 209 323 -304 -204 596 -10 -372
1384 -372 481 80 -427 246 233 -390 -195 250 83 -482 -133 388 -382 -266 434 -178 -252 640 232 -223 311
1405 311 511 99 -232 183 172 -348 -10 168 -682 -356 302 -527 -494 275 135 -138 106 232 -60 -91 434
1426 434 78 -516 412 535 -660 -121 581 -150 -155 392 21 -467 137 440 -487 -506 813 163 -962 218
1446 218 438 -616 144 945 -76 -319 680 340 -1116 -418 892 -413 -977 626 51 -1283 138
$$ packed form
1296E70p52L9L52n45j26K39o3L0p0K56L11m95L09M88o17J63M68m45n1K13p9m5
1318A50j88K41L1m87L42K23p01K45M17o68M4L04n2nm5K99J4l53N87N9p45N15K36
1341D63p82J93K40l37o1Q3R4k12j04N65k05n23R13R2p59N22K99n03J73J66r5l24
1363a02J90L63n09l49Q09l62o84Q21q3n33L36L09m03r8N04J14o27J00Q00o06l62
1384c72Q53m01n07O73j3o23J95M45j67n65L49N21p70J16P00o12p4Q92m08m55N34
1405C11K00m12l31M15j1n20L38J78q50L26O58q29L3P69j40k73K44J26k92l1N25
1426D34l56n94R28J23j195N39P02p31nN47l71m88O04L03r27j9J319o50j125J180
1446B18K20j054P60Q01j021k43R99l40j456O98J310j305n64J603n75j334J421
$$ plain form
1463 138 642 -746 -188 1342 427 -975 298 1157 -734 -546 1280 11 -1092 712 484 -1309 -98
1480 -98 1582 10 -1078 605 711 -1474 -635 1221 -459 -882 1256 268 -1696 1 1288 -478
1496 -478 -662 1417 852 -1298 -216 836 -1122 -724 1532 143 -1296 509 896 -1016 -640 1416
1512 1416 699 -839 471 757 -1220 -504 1365 -94 -880 841 571 -1190 -681 761 168 -574 728
1529 728 537 -1369 -659 433 -748 -751 989 727 -527 -221 506 -82 -413 734 794 -335 168 533 -727
1548 -727 -674 424 336 -228 -91 382 -73 -561 140 509 -44 261 469 -228 -498 -83 194 20 -126 411
1568 411 316 -570 -440 35 -272 -209 409 300 -303 -339 196 -69 -631 295 833 -206 -107 585 -78 -553 188
1589 188 413 -383 -317 631 -45 -969 263 648 -635 -255 807 -226 -828 304 590 -401 -56 1055
$$ packed form
1463A38N04j388N58J530r15j402J273Q59j891J88J826j269j103J804k28j793J211
1480i8J680j572j088J683J06k185Q39J856j680m23K138r88j964J697J287j766
1496d78j84K079n65k150J082J052j958L98K256j389j439J805L87j912L76K056
1512A416p17j538J310K86j977P16J869j459p86J721k70j761N09J442n93p42J302
1529G28j91j906P10J092j181lJ740k62j254L06P27n88l31J147O0j129N03L65j260
1548g27N3J098q8n64J37M73m55m88P01L69n53L05K08o97k70M15K77j74j46N37
1568D11r5q86J30M75l07O3O18j09o03l6N35k65n62R26N38j039R9O92o63m75P41
1589A88K25p96O6R48o76r24J232L85j283L80J062j033o02J132K86r91L45J111
$$ plain form
1607 1055 81 -955 431 579 -852 -78 1202 -77 -673 441 307 -948 -405 959 -66 -803 741
1624 741 649 -1023 -206 827 -339 -635 644 465 -765 -169 894 -339 -883 685 387 -1046 -80
1641 -80 693 -565 -590 653 280 -790 -81 721 -417 -569 960 558 -578 306 751 -542 -448 543 188
1660 188 -600 86 628 -381 -544 569 62 -757 312 651 -338 -212 554 109 -533 42 554 -309 -361
1679 -361 579 142 -474 223 427 -433 -335 188 -129 -627 -113 396 -361 -380 439 -4 -528 127 367 -100 46
1700 46 562 244 -328 -17 232 -394 -432 364 84 -323 235 306 -122 -61 331 293 -94 130 543 -58 -24 440
1722 440 61 -273 65 78 -155 -162 95 40 -298 -154 128 -471 -476 23 -80 -243 161 259 2 -130 115 87 -240
1745 -240 -12 265 -114 -161 182 -45 -280 22 111 61 0 220 404 40 70 358 -14 -141 181 -29 -155 20
$$ packed form
1607A055r74j036J386J48j431P74J280j279n96J114j34j255N43J364j025p37J544
1624G41r2j672Q17J033j166k96J279j79j230N96J063j233n44J568k98j433R66
1641h0P73j258k5J243l73j070P09Q02j138j52J529m02j136Q84M45j293R4R91l55
1660A88p88O86N42j009j63J113n07q19J069L39r89J26P66m45o42N75N12q63n2
1679c61R40m37o16O97K04q60R8N23l17m98N14N09p57j9Q19m43n24O55K40m67J46
1700D6N16l18n72L11K49o26l8P96k80m07N58P1m28O1L92l8l87K24M13o01L4M64
1722D40l79l34L38J3k33pK57n5l38J44K82n99nM99j03j63M04R8k57j32K45k8l27
1745b40K28K77l79m7L43k27k35L02Q9n0o1K20J84l64L0K88l72j27L22k10j26J75
$$ plain form
1767 20 102 89 -94 53 135 -256 -143 141 -217 -191 142 -70 -257 -129 -38 -176 -262 58 152 -154 135 360 -66
1790 -66 -122 129 -82 -120 -15 108 34 -86 123 123 -178 -3 242 -166 -42 266 8 -2 198 107 -42 -88 176
1813 176 72 -163 139 134 -210 -42 26 -244 -199 15 -63 -144 -26 155 63 -22 193 83 -171 186 142 -151 48
1836 48 99 -138 -170 -17 -43 -204 -32 142 -93 -79 192 28 -174 148 130 -164 33 134 76 2 183 144 -123
1859 -123 -23 231 -83 -223 181 -81 -228 71 7 -192 -81 127 26 -116 240 306 -159 39 330 -73 -143
1880 -143 152 -86 -250 75 82 -164 -114 175 -5 -263 89 232 -193 31 305 -113 -70 264 88 -148 36
1901 36 272 -79 -185 195 -7 -322 36 117 -292 -19 236 -87 -149 143 168 -170 33 271 -81 -184 237
1922 237 30 -329 128 238 -236 -94 254 -29 -216 181 229 -108 -64 274 -133 -406 289 152 -366 59 242
$$ packed form
1767B0Q2j3j83J47Q2l91J13K84l58K6L33k12j87J28R1j38q6L20R4l06K89K25m26
1790f6n6K51k11l8J05J23p4j20K09%l01J75K45m08J24L08k58j0K00r1j49m6K64
1813A76j04k35L02nl44J68O8k70M5K14p8q1J18J81r2q5K15j10k54L57m4k93J99
1836D8N1k37l2J53k6j61J72J74k35J4K71j64k02L22j8k94J97J01n8p4J81l9k67
1859a23J00K54l14j40M04k62j47K99o4j99J11K08j01j42L56O6m65J98K91m03p0
1880a43K95k38j64L25Pk46N0K89j80k58L52J43m25K24K74m18M3L34j76k36J84
1901C6K36l51j06L80k02l15L58Q1m09K73K55l23o2K92K5l38K03K38l52j03M21
1922B37k07l59M57J10m74J42L48k83j87L97M8l37M4L38m07k73O95j37n18M25J83
$$ plain form
1943 242 -199 -208 236 120 -127 108 405 -178 -278 378 -70 -361 140 121 -350 -153 145 -138 -348 255 234
1964 234 -280 3 419 -107 -256 355 124 -287 79 250 -258 -285 220 74 -452 -26 280 -247 -251 298 -24
1985 -24 -159 246 289 -107 -16 309 -28 -259 182 183 -346 -172 129 -211 -267 117 25 -108 42 280 4 -149
2007 -149 148 157 -206 84 246 -191 -42 65 -7 -131 47 86 -76 -108 60 25 -143 14 73 -68 11 -1 -8 -8
2031 -8 77 121 99 -48 72 -17 -99 -67 -28 1 52 -76 1 44 -133 -79 89 -58 -83 126 -8 -17 -114 27 53 -119
2057 -119 150 162 -153 68 256 -95 -43 163 9 -199 -102 102 -64 -181 205 134 -229 21 204 -223 -77
2078 -77 261 59 -118 94 123 -153 -306 134 -18 -304 107 212 -140 -30 253 -90 -197 72 133 -198 -81
2099 -81 195 -45 -267 226 227 -225 30 294 -12 -156 155 130 -151 -122 205 -144 -423 133 44 -229 93 306
$$ packed form
1943B42m41rM44j16k47K35K97n83j00O56m48k91N01j9m71J97K98k83k10O03k1
1964B34n14K83M16n26j49O11k31m11L66J71n08k7N05j46n26M26L06n27mN49l22
1985b4j35M05M3l96R1L25l37k31M41Jn29J74L01l40n6L84r2j33J50K38k76j53
2007a49K97Rl63K90J62m37J49J07p2j24J78L9j62l2J68l5j68J57N9j41P9j2p%
2031hQ5M4k2j47J20q9q2L2L9K9N1j28P7M3j77N4J68j47k5K09j34rr7J41K6j72
2057a19K69J2l15K21J88l51N2K06j54k08R7K04j66j17L86p1l63K50J83m27J46
2078g7L38k02j77K12K9k76j53M40j52k86M11J05l52J10K83l43j07K69O1l31J17
2099h1K76k40k22M93Jm52K55K64l06j44L11k5k81K9L27l49k79N56q9k73L22K13
$$ plain form
2121 306 -48 -95 104 61 -212 -54 257 -15 -231 126 -81 -373 -85 72 -137 -44 148 101 -160 -80 151 -98
2143 -98 -97 272 115 -119 169 237 -23 5 106 147 -177 -50 95 -146 -64 189 62 -199 76 11 -46 24 233
2166 233 177 -14 95 110 -166 -203 19 -85 -193 58 88 -100 -73 91 114 -65 23 214 11 -70 155 -21 -83
2189 -83 56 28 -82 -107 10 93 -1 86 197 -47 -58 54 -72 -191 -12 33 36 -67 34 56 -126 -50 146 5
2213 5 42 178 60 42 40 33 -66 -106 18 25 -52 -61 98 -68 -40 82 -87 -121 -42 -2 27 10 37 160 -45 -10 62 -101
2241 -101 -39 118 83 -30 -38 -20 -54 -131 -142 12 -106 -7 121 32 18 86 30 -4 -23 27 36 -48 74 74 -98 -19 118
2268 118 -100 -114 30 49 -22 9 107 2 -98 22 86 -45 99 118 -25 30 62 20 -107 -69 -21 -43 -91 23 -31
2293 -31 -127 12 -20 -115 -23 -10 27 18 56 53 -8 26 19 -93 -93 54 76 -61 66 9 -164 0 -24 -37 -70 -16 31 -6 87
$$ packed form
2121C06l54m7J99m3k73J58L11k72k16L57k07k92K88J57k09R3J92m7k61Q0K31k49
2143i8JL69j57k34K88O8k60K8J01M1l24J27J45k41Q2K53j27k61K75o5n7P0K09
2166B33n6j91J09J5k76l7K22j04j08K51L0j88K7J64K3j79Q8J91k03q1K25j76o2
2189h3J39k8j10k5J17Q3r4Q7J11k44j1J12j26j19J79M5Lj03J01K2j82P6J96j41
2213EL7J36j18j8kpr9m0J24Pp7rJ59j66K8J22j69l4P9M0K9j7K7J23k05L5P2j63
2241a01O2J57l5j13qJ8l4p7j1J54j18R9J28q9j4O8n6l4j9N0Rq4J22%j72P9J37
2268A18k18j4J44J9p1L1R8j05j00J20O4j31J44J9j43N5L2m2j27L8M8k2m8J14n4
2293c1r6J39l2r5R2J3L7rL8lo1L4pj12%J47K2j37J27n7j73J64k4j3l3N4M7l7R3
$$ plain form
2322 87 72 -44 5 54 -39 -99 51 21 33 -34 54 -15 -81 -90 -39 -140 -32 97 -11 -48 155 -27 -33 49 -28 7 -28
2349 -28 92 30 -47 46 86 -60 -19 137 -11 5 56 40 -34 9 -38 -52 -111 -28 69 -57 119 39 -136 -9 -2 -91 -48
2376 -48 58 27 -28 23 77 2 -131 62 -29 -143 55 76 -25 86 100 -13 -14 43 79 -4 41 175 46 -16 88
2401 88 17 -177 17 -45 -123 -24 20 -24 -51 14 92 -56 -40 100 -15 -90 97 44 -111 -29 -25 -105 -63 -58 51 -101 17
2428 17 201 -43 -22 62 -58 -71 88 61 -10 74 79 -12 -96 32 84 -95 42 123 -74 -52 72 -71 -104 -51 33 -31
2454 -31 -42 131 31 -91 62 60 -96 -46 91 -52 -68 47 71 -33 -87 54 10 -102 19 134 -152 36 90
2477 90 -121 -18 33 24 -52 24 127 -5 -25 97 -1 -74 -9 60 -51 49 14 -6 -28 24 53 -51 -67 50 -1 -40
2503 -40 147 46 -38 100 7 5 -39 -9 -22 -33 -26 44 -35 -47 52 2 -38 27 -50 4 43 -33 -30 -24 -80 -35 -58 33 84 23 98
$$ packed form
2322H7j5j16M9M9r3o0J50l0J2o7Q8o9o6rN1j01J08J29j08l7K03j82oQ2p7L5l5
2349b8J20o2p7R3M0j46M1J56j48J6N1j6p4M3m7j4n9Q3R7j26J76q0j75J27Pq9M3
2376d8J06l1n5N1N4p5j33J93r1j14J98K1j01J11J4j13jN7L6q3M5J34j29o2J04
2401H8p1j94J94o2p8R9M4m4k7O5P8j48J6J40j15p5J87n3j55Q2Mq0M2NJ09j52J18
2428A7J84k44K1Q4j20j3J59k7p1Q4Nr1q4J28N2j79J37Q1j97K2J24j43l3N3Q4o4
2454c1j1J73j00j22J53kj56N0J37j43j6J15K4j04n4J41m4j12J21J15k86J88N4
2477I0k11J03N1rp6P6J03j32k0J22r8p3O5O9j11J00l5k0k2N2K9j04j6J17n1l9
2503d0J87j01q4J38r3km4L0j3j1PP0p9j2R9n0m0O5p7N4L9p6LOn6M5k3R1N1o1P5
$$ plain form
2534 98 48 -6 -7 19 -41 -68 -34 -85 -77 -24 48 -45 -20 34 70 -27 42 51 -84 31 120 -14 -72 17 -41 -143 -56 86 -30
2563 -30 -32 52 32 -125 28 22 -16 52 131 30 -58 28 82 -84 -45 121 43 -58 101 0 -101 -31 44 -13 -49 82
2589 82 29 -93 -21 106 -29 6 103 57 -67 -27 41 -69 -34 63 14 -82 -17 27 -67 -23 104 54 -10 70 26 -45 -76
2616 -76 17 56 -52 -22 70 -64 -89 53 0 -7 85 33 -51 -35 -38 -3 -51 -35 53 -101 -58 63 -18 12 96 11 0 -37 -18
2645 -18 -26 -65 49 56 -56 -3 11 -7 -56 44 22 -34 -1 52 -1 -49 45 78 -56 18 5 -20 -4 -12 -15 -45 2 -29 -3 -122
2675 -122 -51 79 25 8 15 13 -3 3 -2 50 -22 -13 18 -66 0 85 -30 -18 36 -20 27 -43 13 11 -35 18 54 -29 18 68 -30 39
2707 39 67 5 34 -32 13 -78 -30 22 4 -52 -33 12 -51 -71 -31 70 -24 -25 66 82 12 36 103 -74 7 32 0 6 40 -9
2737 -9 -17 -14 24 7 -52 18 74 -60 1 18 -15 50 44 51 8 17 71 1 -39 71 4 -60 24 -1 -61 -13 101 40 7 7 73 -96
$$ packed form
2534I8n0n4jK6o0k7L4n1QN3P2r3K5N4L6r7O9Rj35J15Q9j34n8Q9n8j02Q7J42j16
2563c0kQ4k0j57J53ol8O8P9j01q8Q6N4j66L9J66p8j01J59j01j01P0P5n7l6J31
2589H2n3j22P2J27j35L5R7m6j24M0O8j10L5R7m9r6O5M4r4M4J27n0o4Q0m4p1l1
2616g6R3L9j08L0R2j34k5J42n3pR2n2q4J6lL5m8J6Q8j54M3J21q1L0Q4q5j1l7J9
2645a8ql9J14Pj12N3J4j8m9J00k2n6L3N3n3m8R4L3j34P4j3k5J6qll0M7l1K6j19
2675a22P1J30n4j7Pkj6OnN2p2RL1q4O6Q5j15J2N4n6M7p0N6km6N3L6q3M7N0r8O9
2707C9K8o2K9o6M5r1M8N2j8n6J9M5o3k0M0J01r4jR1J6p0K4O7j77Q1K5l2OL4m9
2737iqLL8j7n9P0N6j34O1J7l3O5oPm3RN4p0m0J10o7o4Q4k5o0M8J14o1l3%O6j69
$$ plain form
2769 -96 -19 63 24 -6 11 22 -36 -2 20 -15 -43 -10 -20 -37 16 44 -58 -42 80 -38 -67 65 -75 1 9 21 -5 21
2797 21 60 17 -10 27 50 -12 -55 51 -5 -107 9 -19 -26 -33 33 9 -16 60 39 -20 24 83 -2 80 64 -11 6 34 50 -5
2827 -5 -16 46 42 -115 29 3 -61 36 79 -12 -12 41 4 13 33 42 -18 -21 64 -37 -113 -25 23 -68 -10 23 -36 11 27 6 -42 15
2859 15 110 22 -24 71 -28 -41 53 28 -27 -36 58 -15 10 60 33 -36 -39 70 -54 -25 41 -2 -43 0 36 40 -51 84 26 -37
2889 -37 78 64 -63 -39 60 -39 19 109 33 -79 0 50 20 -28 6 37 -46 36 16 -127 -41 81 -12 -4 31 74 -44 -60
2917 -60 -7 -42 -74 -6 43 -121 -26 40 -70 18 12 3 4 32 49 -7 -50 93 15 -86 57 -34 -127 -49 43 -2 -40 -24 6
2946 6 25 3 57 6 -29 113 72 -85 54 89 -48 -14 1 16 -22 35 56 4 -60 8 17 -31 43 -19 -89 93 43 -63
2974 -63 31 94 26 -51 31 39 -25 -45 71 -10 -82 64 13 -83 -10 91 -17 7 47 -47 -4 34 54 -45 52 89 8 -22 49
$$ packed form
2769i6P7Q2l9l0J7J1n8L4K2l5k8L3j0j7N3K8j02J6J22j18k9J32j40P6QJ2k6K6
2797B1L9m3k7L7K3o2m3J06n6j02J16k8ppO6k4k5P6k1n9M4N9q5Q2j6p5J7K8J6n5
2827ej1O2mj57J44k6o4R7M3r1%N3l7RK0Ro0lQ5j01p6Q8M8r1N8L3n9M7J6k1m8N7
2859A5R5q8m6R5r9j3R4k5n5rR4p3K5N0k7o9lJ09j24K9O6m3m1M3L6Mr1J35n8o3
2889c7J15j4j27K4R9r9N8R0p6j12P9N0l0m8L4L1q3Q2k0j43Q6J22r3QL5M3j18j6
2917f0N3l5l2O8M9j64R5O6j10Q8orJK8J7n6m3J43p8j01J43r1r3P8R2m5l8J6L0
2946FJ9k2N4n1l5J42m1j57J39L5j37L4J5J5l8N7K1n2o4O8Rm8P4o2p0J82n0j06
2974f3R4O3o8p7Q2Qo4k0J16q1p2J46n1r6P3J01j08K4M0r4M3L8K0r9R7L7q1l0P1
$$ plain form
3003 49 24 -48 -27 0 4 1 48 14 -39 14 22 -33 -23 3 50 -17 27 20 38 19 22 -27 -39 46 15 -44 76 107 3 -31 -26 19
3035 19 20 32 34 -20 -6 74 -76 -41 19 28 13 25 19 -45 -34 -36 -4 -33 -40 77 -28 -95 37 11 22 9 45 -2 10 21 -35
3066 -35 -16 0 50 -78 -1 69 5 23 70 -41 -75 13 1 -61 3 -69 -21 -25 18 35 -24 7 37 15 -21 64 -28 17 -1 -29
3096 -29 -8 6 25 67 -5 45 4 -70 -30 37 1 2 23 30 51 -16 3 -21 -23 110 62 -27 -18 25 -30 -25 -2 -27 -5 -34 5 -17
3128 -17 -38 21 5 -16 -4 -34 -16 35 81 -4 22 20 56 -56 -42 -28 20 -5 99 28 -1 21 -27 2 50 60 24 -16 -12 41
3158 41 12 -37 67 16 -1 41 -44 -20 -22 -31 -10 18 35 -14 27 -26 59 -2 24 99 -5 20 -6 27 25 -54 1 16 -24 -67 21
3189 21 -37 4 50 -3 2 11 2 33 -30 -15 29 31 23 -4 -4 35 67 -10 -5 -6 -75 -15 -12 -28 2 20 6 47 -5 27 -61 -10 45 15 -13
3224 -13 38 58 -8 2 9 16 -32 -13 11 13 -6 8 -52 0 4 24 -8 44 54 -2 -2 41 63 16 -7 65 -29 47 15 21 0 -9 45 -28
$$ packed form
3003D9k5p2K1K7MlM7l4n3N3Qn5J0K6M7o7M4pJ8j9Lm9j2Q5l1n9J20L1j04l4NM5
3035A9JJ2Kn4J4Q0j50L5O0Rj5J2oo4J1kL2k9pJ17j05o7J32k6J1j3L6m7J2J1n6
3066c5J9J6N0j28P7P0o4J8M7j11l4Q8j2o2O4p2M8mM3J7n9L1L0k2l6Q5r2M5j8k8
3096b9K1J4J9M2p2N0m1p4M0O7l6JK1PK1o7J9k4kJ33m8q9RM3n5NK3k5K2k9L9k2
3128a7k1N9j6k1J2l0J8N1M6q5K6kL6j12J4J4M8k5J04p1k9K2m8K9M8J0l6m0MN3
3158D1k9m9J04n1j7M2q5K4krK1K8J7m9M1n3Q5o1K6P5j04K5k6L3kp9N5J5m0m3Q8
3189B1n8M1M6n3NRrL1o3J5M4Kqk7%L9L2p7Njo9O0Lj6L0J8j4M1n2L2q8N1N5l0k8
3224a3N1K0o6J0PPm8J9K4Kj9J4o0N2MK0l2N2J0n6%M3K2m7k3P2r4P6l2Ok1rN4p3
$$ plain form
3258 -28 -4 14 -15 -30 -17 -10 -13 -61 86 -1 -23 73 -25 -50 41 12 28 7 23 -15 -30 16 2 -6 -43 55 1 -51 52 -44 -8
3289 -8 31 35 -29 -28 18 42 -58 2 46 -29 -43 107 -12 -57 -14 10 24 -55 56 -13 -36 59 -42 -22 29 63 -7 19 25 60
3319 60 -2 -35 11 40 -21 32 16 -28 64 84 -9 101 20 -25 -3 -1 23 -48 28 30 -42 16 11 7 -46 28 34 -52 41 -5 25 -45
3351 -45 44 69 -35 23 23 -29 41 53 -20 -11 1 110 -49 -83 41 42 -33 3 25 -40 32 25 -17 28 42 -4 -28 39 39 -36 -18
3382 -18 25 -28 -46 49 31 -98 15 10 -51 23 9 -9 -84 -27 16 -54 40 32 -36 -9 32 72 -32 -10 55 53 12 50 8 -60
3412 -60 17 53 -16 -6 12 -5 4 50 28 1 -12 -15 30 1 -64 90 -26 -32 4 -52 -26 22 41 -39 -38 -3 -10 25 23 3 21 13 28
3445 28 -54 -39 39 -29 -12 72 20 11 10 31 -19 -39 22 -30 -81 -1 16 -100 10 64 6 21 49 -11 -39 -27 18 28 -70 44
3475 44 1 -4 25 43 -7 -24 -1 25 21 -16 47 -23 25 11 -15 -4 29 8 -35 33 17 -5 2 -44 56 -26 -54 47 -13 -67 38
$$ packed form
3258b8K4J8k9j5J3Plm8J47q7k2R6r8k5R1k9J6k1J6l8j5M6j4ql7R8n4n2J03r6L6
3289hL9Mo4JM6K4j00O0M4p5j4J50j19m5M3K4J4p9J11o9k3R5j01K0N1L4p0K6OL5
3319F0o2l3M6K9o1N3j6m4R2K0r3J10q1m5K2KK4p1P6Kp2N8nmn3P4Oq6R3m6L0p0
3351d5Q9K5j04N8%n2P0J2p3RJ2J09j59l4J24Jp5L6K2o5P2pm2M5J4m6k4O7%p5J8
3382a8M3n3j8R5j8j29J13no1P4j4j8p5N7M3p0R4qo8K7M1M0j04K2O5km1L8m2o8
3412f0P7L6o9J0J8j7RM6k2k7j3lM5k9o5J54j16oL6n6K6M8J9q0JL5pL5kk0J8qJ5
3445B8q2J5P8o8J7Q4n2rjK1n0k0O1n2n1Q0J7j16J10N4n8J5K8o0k8J2M5J0r8J14
3475D4m3nK9J8n0j7K3K6ml7O3p0M8j4k6J1L3k1m3O8j6k2Pm6J00q2k8J01o0n4J05
$$ plain form
3506 38 43 -28 34 22 64 6 67 7 -18 32 51 -29 -34 44 4 -60 -7 -33 -11 46 33 42 -18 -60 28 -8 -15 26 -10 9 62 1
3538 1 -15 -4 28 9 -21 -16 21 -32 -27 35 -8 -11 -14 5 -24 11 19 -18 26 6 -7 12 9 11 -4 27 -2 -69 14 29 -31 34 -9 -17 -25
3573 -25 -68 -13 -16 55 14 -6 -88 61 3 -13 68 9 35 1 12 -19 14 15 48 -23 6 21 24 35 39 -2 -77 2 -6 -35 -55 2
3605 2 90 8 51 9 -27 -59 9 -7 43 53 13 16 -58 14 -9 -4 -17 50 -33 23 22 15 31 35 72 -36 -27 32 -55 -12 -11 56 -20 -38
3639 -38 -8 -45 -33 -48 -20 33 22 -10 -12 -4 -35 44 -12 4 52 -44 39 43 6 -28 -42 5 -34 -57 3 -53 -49 -16 40 -7 21 38
3671 38 -44 -27 41 12 0 -35 29 -5 -26 22 17 -54 -23 13 -32 -37 -9 -6 5 53 35 47 14 14 27 -8 -23 23 31 12 19 35 -24
3704 -24 -6 -41 32 -47 28 41 -22 -27 -46 22 -34 -43 29 22 -13 -2 19 -13 40 -21 41 -13 45 -9 -34 6 22 -11 -9 34 58 -21
3736 -21 -44 5 -23 6 7 31 14 -6 30 29 -34 -13 48 38 -4 15 -1 7 0 40 55 26 -7 -82 -56 -25 27 -58 2 29 -30 0
$$ packed form
3506C8Np1O2j2M2n8O1o0k5N0J9q0nP8m0o4N3k6K2N7j3Ro0m2Q8l6pM1l6J9N3o1
3538Aj6J1L2j9l0NL7n3NO2m3llJ9k9L5Ql7M4k0j3J9lKj5L1k9o7Q3J5o0O5m3qq
3573b5m3N5lP1m1k0q2J49n8j6Q1n9K6l4J1l1L3JL3p1K9J5LJ1Mm1p5P9qk9k0N7
3605BQ8q2M3m2l6l2O8j6N0J0m0Lp4P2k3Nj3O7q3N6jpJ6ML7j08RN9q7M3JO7p6j8
3639c8L0l7J2j5K8N3j1l2kQl1P9n6J6M8r6Q3Ml7l4j4M7l9k3O0n6ML3N6m7K8J7
3671C8q2J7O8k9j2l5O4l4k1M8np1L1L6m5nK8LJ1M8j8J2l3%J3l5j5M6Qj9PJ6n9
3704b4J8l5P3p9P5J3o3nj9O8n6rP2pl5J1K1l2N3o1O2n4N8n4k5M0J6l3KM3K4p9
3736b1k3M9k8K9JK4j7k0L6jo3K1O1j0m2J9j6QpM0J5k9l3p5K6L1N2q5O0K7n9L0
$$ plain form
3768 0 -20 24 2 -4 13 25 -39 29 35 -24 30 -31 -19 -31 49 40 -2 37 35 24 15 41 13 3 12 -20 -28 -36 -31 -18 6 36 29 10 -9 -32
3804 -32 18 -28 -26 6 -56 -8 20 -6 -53 18 28 -56 34 50 8 13 -14 30 9 12 25 23 -35 0 32 2 -2 8 -56 26 62 -43
3836 -43 -41 -15 -45 -15 5 -6 -40 -27 11 31 -14 38 18 -21 -17 36 49 29 82 -14 22 51 -45 16 30 41 4 -25 10 35 -41
3867 -41 14 3 -29 43 21 11 25 35 20 34 3 18 -18 -15 46 -14 10 63 -9 -50 -2 -9 20 22 6 49 6 -14 49 -41 5 55
3899 55 -42 26 -7 19 -8 -21 -21 -39 -48 -28 35 13 -58 55 -21 0 16 7 -2 -20 49 4 31 13 39 -10 31 55 -58 -26 -11
3930 -11 -57 4 45 26 -20 -57 -26 40 0 25 28 -25 0 -6 12 5 -3 50 -14 1 43 -38 5 37 20 55 8 61 -5 4 -17 -7 1
3963 1 -18 38 70 -7 35 -57 -27 63 -9 0 -13 10 -67 -35 -56 -87 -13 -64 25 -39 45 -33 -65 4 -51 5 25 -7 8 -2 -37
3994 -37 -39 3 2 -54 43 -40 -20 4 -52 -22 7 -1 -6 -36 43 -6 10 8 61 33 7 75 -27 -61 28 -39 -21 -6 -86 29 -12 -9
$$ packed form
3768@k0M4k2oJ7J2o4O8On9N4o1J2j2Q0rm2L9kj1rK6k8j0Rl2qqNJ3K4L0pj9j9k3
3804c2N0m6KL2o2M8K8k6m7P1J0q4R0J6m2Nk7M4k1LJ3kn8L5L2l0mJ0o4Q2L6j05
3836d3KK6l0L0K0j1l4J3L8K0m5N2k0l9MN3J3k0N3r6L6K9r6O1J4J1l7k9L5K5p6
3867d1N5j1l2P2k2j0J4J0j5J4l1J5l6LO1o0K4N3p2m1M8pK9Kj6M3m3k0O3r0M6N0
3899E5r7O8l3K6k7j3%j8rK0O3k2p1J13p6K1J6rrj8O9m5K7j8K6m9M1K4j13L2J5
3930a1m6O1M1j9m6l7L1O6m0K5Ln3K5oJ8pqN3o4J5M2q1M3L2j7L5m7N3o6Rk1J0Q
3963Aj9N6L2p7M2r2L0R0p2Rj3K3p7L2k1l1P4n1Q9o4Q4p8l2O9n5N6K0l2J5j0l5
3994c7kM2jn6R7q3K0K4n6L0K9qnl0P9m9J6kN3k8k6O8j02l4Q9o7J8J5q0J15m1L
$$ plain form
4026 -9 12 -1 -39 51 -31 37 57 -67 24 -24 54 -10 18 22 -25 23 12 22 -9 -23 17 10 11 -43 -36 35 11 -26 -56 -55 51 -31
4058 -31 -15 38 5 -51 27 -9 -28 16 27 -24 -5 10 11 -55 -51 3 -60 41 20 47 -15 51 16 15 13 54 -11 -29 5 17 -28 -33
4090 -33 27 9 -13 32 -1 -26 39 38 24 19 -16 17 -1 -7 54 -18 -21 12 -26 -1 0 20 11 -48 -17 35 12 14 29 -67 11 43 -12 -45
4124 -45 -3 -2 -19 -83 8 27 -69 -11 33 -11 -46 62 56 -38 2 22 41 -30 48 26 3 -17 -15 24 -73 12 -29 -1 -16 51 -16
4155 -16 -46 4 34 -59 23 28 5 52 62 18 -31 3 26 -9 -30 96 42 -3 -9 -18 19 2 -9 -37 44 -33 4 -32 29 76 -33
4186 -33 28 -3 9 -32 28 -23 11 15 35 48 14 18 -5 9 3 3 12 38 -17 -16 15 -50 38 21 -9 -30 -39 53 -10 1 -17 -29 -59 -15
4220 -15 2 -12 34 16 -63 -17 7 71 -45 9 32 -38 9 39 21 -8 13 39 -4 -3 0 -65 -6 22 19 16 -39 34 6 -35 5 4
4252 4 -61 -3 89 -16 -6 -4 27 -30 -11 40 15 1 -81 18 10 -7 -24 -20 -36 27 -32 -5 -8 31 -25 -30 70 60 -44 39 28 -16
$$ packed form
4026iK1j3l8R0q2O8K0j24R1m8P8o4K8Mm7M8j1J0l1j4M0pJn4PP1k4l7l0JJ06q2
4058c1J6N3l3n6P8l6j9M4J1n1J9J5Jo6MN4o3J01k1K7o2O6l5jkM1o5j8L4J2m5n
4090c3O0j8k2M5l3k5O5jj4nl5L3j8oO1p2lL3l8K5JK0rn9L1N2k3KJ5r6P8L2n5l3
4124d5M2Jj7o4R1J9r6N8M4m4l5J08or4M0K0J9p1P8k2k3k0KL9r7Q5m1K8j5O7o7
4155a6l0N0L0r3Q2Nk3M7J0m4m9L4K3l5k1J26n4m5orL7j7j1k8Q1p7L7l6O1M7j09
4186c3O1l1J2m1O0n1L4MK0J3l4Mk3J4o%RK6n5JL1o5Q8j7l0k1rR2o3J1j8j2l0M4
4220a5J7j4M6j8p9M6K4O4j16N4K3p0M7L0j8k9K1K6m3JLo5N9K8lln5P3k8m1M0j
4252Do5N8R2j05J0KL1n7J9N1k5j4q2R9qj7j7Mj6O3n9K7lL9n6nJ00j0j04Q3j1m4
$$ plain form
4284 -16 83 28 -37 -11 30 -15 -41 -18 58 -25 -44 -1 39 4 22 36 -4 30 19 76 -28 -21 5 10 53 18 -54 -11 -18 -21 -20 5
4316 5 -6 -8 5 8 -13 8 21 -3 -16 50 31 3 -10 8 -27 21 14 -12 19 -33 -2 3 -19 -26 29 -36 -34 26 0 -14 -39 -12 -2 -21
4350 -21 -24 5 2 20 28 -38 -12 34 -60 -12 9 -53 -19 -6 4 22 -71 64 33 -16 40 38 -19 6 17 -17 -8 21 -26 49 10 17 -28
4383 -28 -84 36 30 -5 -7 -26 -8 -13 3 -40 -53 -12 68 13 6 35 16 -53 -2 21 -35 -6 14 10 -23 -11 -14 -11 -25 57 -44 -50 39
4416 39 -8 34 42 -39 31 53 -8 17 4 -9 -7 -25 -25 26 -24 -19 45 -31 -24 12 25 9 16 18 -2 -32 -41 37 -33 -30 26 -51 -25 -21 53
4451 53 -34 38 68 -7 -39 21 66 38 30 58 -29 -13 -18 6 -24 -20 10 -45 -1 6 35 -13 70 66 -4 6 16 -5 6 38 -14 17 -25
4484 -25 -13 27 30 17 9 -36 4 19 21 -21 37 -7 13 24 27 37 5 -8 37 -43 61 18 -53 24 -66 58 -18 -31 30 -47 2
4515 2 30 29 27 -9 18 13 29 38 12 13 -50 -25 6 -1 18 21 0 28 19 -6 7 1 -48 37 -25 -5 4 -7 -16 14 -22 16 -42 35 76 -64
$$ packed form
4284a6R9n5o5K6M1m5k6K3P6q3j9M3M0l5J8J4m0L4j1N7j04PK6NM3l5p2M3plJK5
4316Ej1kJ3Lk1K1J3k4j3O6j9k8j3J8l5M8pk6L1n2L1Nk2pN5o5KO0k6j4k5K7J0j9
4350b1lK9lJ8Qo6K6M6r4M8K1o2L4J3J0J8r3J35l1m9N6kn7K5J1l4RK9m7P5l9Pm5
4383b8n6J20ol5kj9J8nJ6m3j3M1Q0n5pK9j9o9N1K3n6K9K0ml3J2lLj4Q2j01oQ9
4416C9m7M2Qq1P0K2o1K5j3j3Kj8%N1n0NO4p6PL6J3j6PKk0l0rP8p0LN6p7K6MP4
4451E3q7P2L0p5l2O0M5k8qK8q7J6nK4l0ML0n5M4PK9m8Q3mp0J0J0k1J1L2n2L1m2
4484b5J2M0Lj3qm5M0J5Km2N8m4K0J1LJ0l2j3M5q0J04m3p1P7r0J24p6j3O1p7M9
4515BK8jkl6K7nJ6Rk6Jo3K5L1pJ9Lk1K8rk5J3om9Q5o2K0Rj1rL0l6L8n8P7M1j40
$$ plain form
4551 -64 -24 -32 -57 23 66 -35 -12 21 -12 -84 -20 11 2 -55 11 41 -50 -38 29 -35 50 23 13 3 -63 31 21 -13 -20 -19 -68 0
4583 0 20 -54 -20 2 -9 -16 23 41 29 -58 20 19 -51 66 26 -46 -12 27 3 24 -65 27 -55 -52 47 28 -12 43 -15 9 -32 -18
4615 -18 3 -19 3 14 -13 -22 30 9 -19 23 8 -34 -23 1 42 -35 -28 -33 -18 -30 31 -13 33 26 37 25 -8 19 26 -30 -58 35 -77
4648 -77 -6 44 -16 -38 -2 -21 -56 -33 -15 18 16 -40 -9 4 -49 -10 -21 -4 3 48 -14 10 2 -26 -15 -29 21 13 23 -9 24 -21
4680 -21 40 33 21 -12 11 48 -18 -67 51 39 -29 46 3 -42 -20 -21 4 -9 -39 37 -44 -11 37 -30 -35 33 82 -25 -20 1 62
4711 62 28 29 61 -57 -9 61 -59 -64 -13 30 -31 30 69 32 -59 11 96 -27 -34 64 -25 3 32 -56 -29 -10 68 32 27 5 11
4742 11 -93 16 89 -12 38 28 14 17 24 -24 -46 -20 33 -38 -22 -25 39 33 -14 24 -30 -63 46 4 -80 12 57 30 -34 27
4772 27 33 -25 37 9 -26 -17 6 -18 12 32 41 -9 -5 2 40 -46 39 28 23 19 -5 -20 -7 8 60 -13 -2 59 27 -17 -36 -11 37 59
$$ packed form
4551f4M0qk5Q0M3j01K3L3l3p2O4L1rn7O6L0r1J2O7o4Q5k7j0j0o6R4j0l4pJm9O8
4583@K0p4L4K2j1pL9J8j2q7P8jp0J17m0p2L4L9k4K1q9R2q2LR9j9m0N5n8K4m1J4
4615a8K1k2K2J1k7rN2k1k8M2j5m2J1K4M1p7PnJ5j2O1m4M6pJ1j2l3K7Pn6k8R3j12
4648g7P1N0o0k2L6j9l5K3J8L3kn6L1J3n3L9j1J7PM5o2K4qk8J1j4N0qJ0l2L3m5
4680b1O1pj2l3K3L7o6m9J18j2o8P5m3m5K2jK5j3l0P6q1L3M8o7nO8M9j07NK1O1
4711F2l4JL2j18M8P0j20nN1M3o1O1L9l7r1P0Q5j23pR8q9K8K9q8K7J9P8l6nk2O
4742A1j04J09P3j01N0j0j4LPm8k2K6N3p1J6lO4om7L8n4l3J09m2q4R2M5k7o4O1
4772B7On8O2k8l5RK3k4L0K0Rn0MPL8q6Q5j1nmk4j5J3J5N2p3J1O1l2m4j9K5M8K2
$$ plain form
4806 59 8 -38 12 -15 -22 72 -44 -50 10 -36 84 8 18 18 -3 18 54 33 -18 22 -70 -9 -26 26 51 29 -6 15 -60 -1 77
4837 77 -31 27 42 26 55 22 -82 20 -42 73 6 -61 -6 40 -55 -40 13 10 10 41 -28 -86 -24 -15 -24 -21 96 15 7 33 34
4868 34 26 46 9 -5 -26 -12 -13 -7 -77 53 47 -22 -36 -8 -55 48 44 11 5 1 43 -11 -34 20 -14 -37 -6 -77 -37 3 35 -7 55
4901 55 34 -69 -42 -62 23 -18 -3 6 -22 11 9 -32 -11 -13 23 26 -69 -24 -24 -40 -18 3 -62 0 74 -77 -42 -12 14 -72 10 10
4933 10 8 26 -31 23 -3 14 42 -42 -14 24 -20 7 -8 2 24 -24 64 18 -45 14 47 -7 39 -49 39 -5 25 2 -43 -14 3
4964 3 21 -42 21 -22 -56 33 -16 -12 -24 55 19 6 46 -55 -1 49 31 21 1 62 15 -1 -10 -68 21 -8 -43 0 -11 32 14
4995 14 66 27 7 20 46 23 -85 -49 20 -37 -4 7 -41 21 -8 -4 12 -22 -13 30 2 17 30 -95 28 8 -21 -48 -22 9
5025 9 23 -91 -42 1 -50 -23 15 23 -36 40 13 -11 0 50 34 25 112 11 7 14 44 -20 -3 14 -18 -19 28 38 -27 -47 -13 -6 -57
$$ packed form
4806E9n1m6N0k7pR4j16oO0m6J20p6J0%k1K1L6k1n1M0r2O1j7N2K5k2l5K1p5N9P8
4837G7j08N8J5j6K9l3j04J02o2J15o7o7N5M6r5J5N3l%L1o9n8O2RrLJ17q1qK6J
4868C4qK0l7j4k1J4jOp0J30oo9j4K8m7J03ml3omM2n4k3N4l4k3L1p1M0M0L2m2O2
4901E5k1j03K7k0Q5m1J5Rk8L3km1K1kL6Lr5M5%j6K2K1o5O2P4j51L5L0K6q6Q2%
4933A0kJ8n7N4k6J7K8q4K8L8m4K7j5J0K2m8Q8m6o3N9L3n4M6q8Q8m4L0k3m5K9J7
4964CJ8o3O3m3l4Q9m9Mj2P9l6j3M0j01N4N0j8j0k0O1m7j6rn8Q9k9l5M3j1M3j8
4995A4N2l9k0J3K6k3j08L6O9n7L3J1m8O2k9MJ6l4RM3k8J5J3j25J23k0k9k7K6L1
5025IJ4j14M9M3n1K7L8Qn9P6k7k4J1N0j6rQ7j01mPL0o4J7J7l2jM7J0o5k0L4Pn1
$$ plain form
5058 -57 30 19 14 22 17 20 -24 10 77 -11 -6 31 11 -39 -6 4 -17 -9 81 -49 -34 29 -7 0 -12 21 62 -15 35 21 -48 27 81
5091 81 -33 -18 -14 -23 -22 -6 -19 -29 0 16 -29 -41 -7 52 8 -14 18 5 28 -34 42 -9 -55 50 19 -44 38 15 -15 -43 11
5122 11 -13 8 5 59 -20 -44 -8 32 -12 18 11 52 43 -28 -25 5 16 36 -19 -6 -28 -15 -52 -31 3 -35 -14 -6 25 -41 -34 52 38
5155 38 7 -1 -22 -43 10 65 9 -51 54 36 6 -2 55 -8 -8 39 -39 9 -8 9 -7 -30 -6 18 15 -65 32 -30 -25 37 -1 -45
5187 -45 -2 9 6 -22 -21 25 -1 -72 63 -54 -55 31 31 1 -40 40 35 -51 -11 24 -83 -22 63 -30 -33 29 50 25 27 70 27 -50
5219 -50 44 3 -61 -21 52 -49 21 39 -41 -67 -15 47 -55 -18 -14 70 -89 -23 36 -16 11 8 -14 -25 19 15 7 -25 40 -55 1
5250 1 30 14 -31 19 -1 17 -34 14 30 17 -21 36 -7 -22 -23 62 -44 -13 32 4 -46 7 -20 0 2 -18 38 -25 27 33 -28 -25
5282 -25 14 6 7 -21 60 4 -8 -7 38 -84 6 31 -19 -9 7 56 5 -92 -30 16 -48 -16 24 23 13 36 -63 7 -28 116 -5
$$ packed form
5058e7Q7j1nQnLm4L4O7q8NL7k0n0L3J0k1QR0j30J5O3l6Pj2L3M1p7N0j4o9P5N4
5091H1j14J5MrJJ6j3j0K9J6m5j2L4N9m4k2L2j3K3o2P6n1m6J05l1o3Q2k3l0k8N4
5122A1k4K1lN4p9k4L6M0m4L0pM1rp1LL0J1K0n5J3k2J3l7K1L4l8K1QL1o6PQ6j4
5155C8l1qk1k1N3N5n6o0J05j8l0qN7o3%M7p8M8j7J7j6k3K4K4lq0R7o2NO2l8m4
5187d5M3J1lk8JM6k6p1J35j17jQ6%l0m1Q0nq6M0L5j07O1Q5r3lO2K1k5KM3m3p7
5219e0R4m1o4M0P3j01P0J8q0k6N2O2j02L7MQ4j59O6N9n2K7lk2j1M4mql2O5r5N6
5250AK9j6m5N0k0J8n1M8J6j3l8N7m3j5jQ5j06L1M5k8n0N3k7K0Kk0N6o3N2Oo1L
5282b5L9qJk8Q1n6j2JM5j22R0K5n0J0J6M9n1r7O2M6o4L2M0jj0K3r9P0l5J44j21
$$ plain form
5313 -5 -44 -4 32 -11 -8 29 -44 12 -4 17 -28 25 -12 5 5 66 50 -14 -18 65 -52 -29 25 46 -43 -41 21 55 -50 -68 34
5344 34 -30 45 71 -11 17 21 -60 -25 -25 25 -47 -43 42 7 -7 19 27 -53 26 -48 -5 -79 15 8 -52 -47 43 -26 26 22 13 -2 -3 -40 -42
5379 -42 0 2 42 1 -19 26 -43 -12 30 13 -47 -55 -21 -2 0 19 -18 3 -16 36 10 29 15 -35 -28 61 -28 -37 72 4 -34 18
5411 18 41 11 -62 -30 9 32 27 -49 22 -40 56 -1 24 -16 -6 -25 -44 -17 11 -13 -4 33 -33 19 -5 24 -24 -20 -52 81 43
5442 43 14 -1 20 42 -2 -22 25 21 -16 30 -46 -30 32 -50 43 -74 2 18 -54 20 36 -7 10 23 25 2 -36 32 -60 -35 -21
5473 -21 -63 -51 -60 36 -68 -17 54 -69 -17 13 33 43 -22 -32 20 -41 17 -8 -4 -31 -42 -48 -8 23 -8 43 -11 17 -16 -19 13
5504 13 34 31 14 5 36 -38 68 2 -7 -1 28 -17 -31 -26 51 -33 0 -1 17 -12 -26 82 -2 -32 38 -13 -26 -9 -22 8 22 -43
5536 -43 -14 28 22 24 -4 -19 34 -12 -63 52 -32 22 10 43 -32 -26 6 -16 41 62 -29 25 -26 34 4 -17 19 -2 -34 -1 -11
$$ packed form
5313el9M0L6m3LL7p3N6j6K1m5N3l7J7%O1j6o4mQ3j17K3N4K1q9KO2L4j05j8J02
5344C4o4P5K6q2K8Mq1L5%N0p2MQ5l5j4K6Qq0P9p4M3p4R4po0NR0o9N2mrj5jl7k
5379d2M2KM0m1k0M5o9L1M2j7o0qL4J9KJ9l7K1j9N2k6J9j4n0PQ9q9rJ09o8l8N2
5411A8K3l0p3L2L9K3np6P1o2R6n7K5m0J0j9j9K7K8k4RL7o6N2k4K9m8Ml2J33l8
5442D3k9j5K1K2m4k0M7ml7M6p6J6O2q2R3j17P6J6p2P4J6m3J7J3Kk3l8O8r2K5J4
5473b1m2J2rR6j04N1P1j23N2L0K0J0o5j0N2o1N8k5Mk7j1oM0L1l1N1n4K8l3lL2
5504A3K1lj7rL1p4J06o6rOK9m5j4NP7q4L3jJ8k9j4J08q4l0P0n1j3J7j3L0J4o5
5536d3K9M2oKk8j5N3m6n1J15q4N4j2L3p5OL2k2N7K1r1N4n1O0l0k1L6k1l2L3j0
$$ plain form
5567 -11 -19 -9 61 -4 5 -69 -17 40 -36 32 5 13 12 -27 -42 7 2 38 11 -12 55 -18 -27 8 -75 -30 -23 -45 11 5 -9 48 -28 19
5601 19 3 -3 -65 11 -47 -109 -16 -6 0 59 6 -37 -24 -48 -8 8 12 44 -31 -2 37 -7 6 -28 5 25 21 2 -20 -78 -15 -20 -32
5634 -32 3 8 -22 22 9 -55 9 0 9 55 -67 -27 7 -19 21 5 -40 25 -36 -23 -16 -2 23 44 42 -34 15 30 -37 -1 46 43 -40
5667 -40 35 4 -54 -16 49 -24 11 36 -24 -15 -18 7 -24 -11 20 33 -20 -90 56 6 -54 46 61 -40 -13 19 1 -3 50 46 -24
5698 -24 9 -1 -63 -19 -3 40 27 21 59 1 -44 35 3 -12 -23 62 -22 -35 18 -10 -66 -12 22 -31 -25 1 62 -52 -29 25 -46
5729 -46 -10 41 -72 -102 12 37 46 -64 13 -35 -16 22 -7 -19 52 1 13 28 20 22 19 -24 29 52 3 17 7 7 -20 -27 6 58
5761 58 26 29 15 0 3 27 -10 -13 2 -17 -22 -22 -26 -28 -23 8 39 -3 -13 -24 -38 -32 43 -31 15 -39 26 -11 9 23 35 -54 -4 15 -9
5796 -9 28 3 -17 -6 -19 -11 13 14 43 -16 -22 -41 14 -13 -45 20 -31 -27 71 -30 -19 8 -8 -4 -67 52 47 -7 13 35 -11 2 -18
$$ packed form
5567a1qJ0P0o5Rp4N2N7p6O8k7Qjl9j5M9nL6k7k3O7p3rL5q3M5Pk2N6oj4N7p6M7
5601A9j6oo2P6n8o2R3J0ON9n3m3J3k4M0J6ML2p5K9L9m4J3l4L3K0mj9k2n8O3nj2
5634c2L5Nl0M4j3o4O4rRM6j22M0L4k6M0j6m5O5o1J3PJ4K5K1kp6M9J5o7L6M7lq3
5667d0P5l1n8L8O5p3L5K5o0RlK5l1J3L1J3n3p0J46n0o0J00J5j01K7L2j8mN3mp0
5698b4L3j0o2M4J6M3j3oL8n8m5P9l2j5j1Q5q4j3N3k8n6N4L4n3OK6O1j14K3N4p1
5729d6L6N1j13l0J14K5Rj10P7m8J9L8k9j2P1n1J2J5qKlm3N3K3m9J4j0%k7pL3N2
5761E8l2Lj4j5LK4l7lJ5j9n%mkNL1L1m2j0j1j4OP5p4M6n4O5l7K0J4J2q9N0J9k4
5796iL7k5k0J1j3QK4JK9n9oj9N5k7l2O5n1MR8j01J1K7j6Mo3J19nn4K0K2m6J3k0
$$ plain form
5829 -18 56 31 -1 28 -4 -55 6 -17 28 7 -20 2 -15 31 6 -30 -42 23 47 -9 0 23 -2 15 -48 -22 -7 -60 30 6 -19
5860 -19 -6 17 14 -56 -42 -35 21 -17 -48 -7 20 5 -42 -12 23 31 -67 -2 -19 -2 36 -81 39 -7 -10 91 4 -21 34 11 -39
5891 -39 42 -17 -11 47 11 -19 28 -80 4 -10 -3 5 -42 70 30 -19 31 26 13 36 -4 -57 -2 7 -19 36 0 26 31 -8 -59 28
5923 28 -7 30 25 -4 -24 44 18 28 -19 3 36 34 7 -38 -9 -14 33 33 17 -13 -12 53 11 -38 -3 -60 9 0 14 10 -4 -14 16 -58
5957 -58 23 30 1 -76 -24 6 107 25 18 60 -50 22 17 -36 -76 65 -10 -9 2 16 17 -2 32 -21 30 32 -28 2 20 -3 -29 1
5989 1 34 -14 -10 -9 -25 -29 -40 70 12 5 38 10 5 -17 -24 26 -3 -9 39 -15 -6 45 1 29 -26 40 -70 -34 -32 -37 8 -16 7 41 5
6024 5 12 18 -11 20 26 27 -12 -42 -7 4 -21 25 -6 -27 -6 -3 -16 -11 4 14 -12 39 -11 -28 -23 21 15 -8 24 16 -55 6 -15 -32 31
6059 31 -64 22 39 12 -6 -19 11 -1 12 -33 24 1 0 0 -21 40 -15 -15 10 -18 -28 -30 15 0 77 7 -53 16 4 2 -38 60 41
$$ packed form
5829a8P4k5l2K9l2n1O1k3M5k1k7K2j7M6k5l6j2O5K4n6RK3k5J7o3K6J5n3R0k4k5
5860a9J3K3lp0J4PN6l8l1M1K7j5m7L0L5Qr8O5j7J7L8j17J20m6lJ01q7k5N5k3n0
5891c9Q1n9ON8l6l0M7j08Q4j4PQm7J12m0m9N0nj3K3m0n3N5Rk6N5l6K6Nl9n1Q7
5923B8l5L7nk9k0O8k6J0m7K2L3kk7m5K9nM7%j6l0JO5m2m9L5n7O9rJ4mj4j0L0p4
5957e8Q1Pk9p7N2L0J01q2pM2j10P2nn3m0J41p5JJ1J4Jj9L4n3N1Ko0L0J8k3k6L0
5989AL3m8MJj6mj1J10n8pL3k8nk2pN0k9oM8n4RN1m4K8n5O6j10L6KnM5k4K3L4l6
6024EPOk9L1OJl9l0L5J1k5M6l1k1K1Lj3NJ5J0k6N1n0j7NM4ok3L2qp1O1k1j7O3
6059C1r5Q6J7k7j8j3L0j2J3m5N7k3j%k1O1n5%K5k8j0kM5j5P7p0o0O9j2km0R8j9
$$ plain form
6092 41 53 1 24 45 -60 30 33 -19 3 4 -49 -7 -5 -4 -4 -14 5 -11 -45 -13 -1 -22 9 -19 -38 4 -4 2 -25 -37 -32 28 8 -16
6126 -16 -38 -13 -5 -5 40 34 -21 45 -11 22 18 15 -24 -27 -39 13 -49 -50 22 4 2 15 19 -51 55 -12 -59 6 -52 10 -15 -56 0 -58
6160 -58 26 33 -76 0 -32 29 -12 60 44 -3 -43 -3 -19 -63 44 46 55 3 25 42 -7 -2 49 49 35 10 51 5 4 -31 -36 -29 -38 -10
6194 -10 12 37 22 -81 -22 -30 -16 -18 -12 6 23 2 45 71 -6 6 -17 -1 7 -21 -13 47 0 46 0 -11 24 -6 -64 -87 -18 70
6226 70 -15 -15 15 -42 24 0 -27 -34 -46 -35 -16 1 37 23 32 8 -27 -14 -39 12 31 -33 2 -28 -13 32 -10 21 -19 -7 12 -44
6258 -44 26 55 -1 -5 32 22 35 19 62 11 31 -34 26 -2 -33 -7 -15 -23 30 -1 -23 65 7 11 3 56 71 -8 9 -31 -32 17 28
6291 28 -43 -29 21 17 31 29 19 -15 -8 20 88 20 -35 -17 -28 -21 37 40 5 -39 -22 13 -13 -13 -40 -33 -30 2 -48 11 -51 -33 -11 -20 24
6326 24 -12 -16 41 13 61 -33 2 50 -3 -15 -24 -46 -55 -12 9 -31 11 58 -27 -23 25 1 -40 3 23 -32 7 6 -91 -41 47 0 -7
$$ packed form
6092D1J2n2K3K1j05R0Ln2K2Jn3M2KJ%j0J9j6l4L2J2k1L1k8j9M2qOk7j2NO0k0k4
6126a6k2K5Q%M5on5O6n6L3mll9lj2N2o2jP2j8kJ3Mp0J06o7m7O5n8O2k5m1N6n8
6160e8Q4Pj09P6l2O1m1P2j6m7m0M0j6m4J07KRn2K2J7m9NN1%j4k5M1m6jl5nPrK8
6194a0K2K5j5j03N9qJ4kOJ8J7k1M3K6p7J2k3J6Qk8QO0m7M6m6j1L5l0n8k3O9Q8
6226G0q5%L0n7O6k4k7pj2J1J9J7L6j4Rk4l5J3k5N1J9o4L5l0J5M5m2L1m0J2J9n6
6258d4P0K9n6mL7j0J3j6M3n1K0o5O0k8l1K6qqN3l1k2Q8n8MqN3J5p9J7m0jM9J1
6291B8p1J4N0mJ4kj0l4PK8O8o8n5J8j1PN8Ll5m4J7L5k6%k7PLL2n0N9o2J8K2rM4
6326B4l6mN7k8M8r4L5M8n3j2rk2rM3K1m0M2M7q5MM8k4m1M3K0n5L9jr7N0Q8m7p
$$ plain form
6359 -7 1 22 -15 27 -32 -22 -28 -30 -4 10 -35 -2 -12 29 36 -13 1 19 23 18 25 40 28 -6 48 -33 -3 21 -28 -11 16 17 -53 10 1
6394 1 38 0 -69 -45 -31 20 -17 4 29 -17 -4 -7 6 16 13 6 0 12 -36 -20 -30 30 -5 -8 -7 -11 6 -23 -6 17 -1 58 8 -26
6428 -26 -12 18 -55 -13 -44 26 3 -12 -1 7 6 32 47 -12 -44 -16 -4 6 -3 -29 -46 4 47 -12 49 -22 85 27 7 -73 -13
6459 -13 4 -2 -21 9 -15 -9 30 57 -47 -43 35 -35 -30 21 28 -4 -50 0 -13 -1 -45 -35 -4 -44 20 14 -57 48 14 -8 -1 -86 27
6492 27 46 27 -22 -47 -32 -23 15 22 16 -35 -65 -7 15 -51 31 -40 -39 13 -37 -70 19 18 38 -7 -14 -6 -20 10 -22 21 8 36 -18 22
6526 22 45 23 -72 -45 10 -25 -17 24 34 -30 3 34 22 53 60 24 0 37 4 20 27 39 46 -9 -41 -33 -16 9 34 4 55 6 0
6559 0 -47 14 -28 -20 -2 -30 -12 4 23 25 -1 15 27 37 14 26 -28 -31 -21 15 -57 1 -6 38 -12 29 -14 -20 53 20 26 39 31 5
6593 5 -16 11 17 -18 15 38 -4 -65 23 -20 -8 -1 29 29 41 -36 21 -14 29 31 -18 37 -31 -24 29 -20 -36 -48 -47 -41 -22 -2 -44 -1
$$ packed form
6359gQK1l7M2n9J0okK6J4m5L3j0M1Pm9J4J8MnPJ5j2l4N4q1L0K4m9J7K7Jp0O3r
6394AL7l8o9K4J4N1l7K1K5m6J3lJ3J0lpoJ2m8J6j0O0l5lJmJ7k9J7K3j8N9n0l4
6428b6J4L0p3M2l1P0k3j5J1QjK6J5n9l2K8J2J0rk6j7N0M3n9O1p1J07n8k0q0O0
6459a3J7oj9L0k4OL9K7j04MP8p0NN1Pl2m6N0j3J2m4J0L1m0O4op1J05l4k2Pq5J13
6492B7J9j9m9k5J5RL8Pon1l0N8K2o6Q2p1JN2n0l3Q9jK0m5pQj4L0l2M3j3K8n4M0
6526B2K3k2r5K7N5l5QM1J0o4L3L1j2L1Pl6k4L7l3J6PJ2Pn5l2QJ7K5K5l0N1m9o
6559@m7O1m2QJ8k8J8J6J9Kk6J6J2J0k3J2n4lJ0L6p2N8pM4n0M1m3oP3l3OJ3qk6
6593Ek1K7Ol5L3K3m2o1Q8m3J2PL0%J2p7N7l5M3Km9N5o8PN3m9j6j2JOJ9K0m2M3
$$ plain form
6627 -1 34 27 40 37 7 4 9 -15 29 9 -10 -19 36 -46 -12 19 80 19 12 1 37 10 -6 11 -18 23 0 3 48 -10 -9 0 -7 -29 -25 -7
6663 -7 -17 15 41 67 2 27 1 37 10 28 13 19 -13 -7 2 4 -18 -43 19 -35 18 -8 -7 -11 -41 25 4 -12 31 -7 -4 26 36 -45
6697 -45 -40 -44 18 -16 -9 22 14 -10 -23 15 20 50 9 30 -43 12 -25 -37 -5 22 29 47 26 7 -27 25 20 42 -43 18 21 1 -38 -4
6731 -4 -9 5 13 55 11 18 4 -26 7 13 -23 -34 6 -11 -14 -22 -14 -7 -25 -19 -7 22 2 -63 13 15 49 -7 -2 -12 9 -47 -5 -48 -26 13
6767 13 -26 -18 -1 3 4 37 -1 -23 -1 -43 55 1 63 -19 -6 -27 30 7 -32 6 52 8 -36 -64 -12 54 23 -32 30 -37 17 8
6799 8 -40 -10 37 5 59 26 -15 23 3 3 -6 -28 93 -26 -29 2 -27 -30 28 -37 -2 -14 39 13 -7 2 24 -12 -10 -25 32 26 18 3
6833 3 59 -6 -23 3 -12 39 19 -16 -102 22 58 18 59 33 -20 -13 12 -45 -21 0 -33 -4 -17 -23 9 -24 -29 0 9 -30 3 38
6865 38 -39 -6 21 -25 21 15 12 -13 43 37 53 72 -15 12 -41 35 10 -63 -7 11 -25 3 -14 -54 37 20 5 -1 0 28 -11 -57 -12
$$ packed form
6627aL5pJ3ll0lNk4M4k0j9rN5q2L4L1O1o1pj1L6k7j6J7k9M1k3LM5n8JRpk2MJ8
6663gj0L2K6K6o5K5k6L6k7J8j5Ol2ORKk2k5O2n4N3k6Jml0O6k1j6M3l8LL0J0q1
6697d5NmO2l4PL1qk4j3L8NL0m1K1p3N5l7j2L2K7PJ8k1j9l4N2nK2q5O1Lk0l9L4
6731dnJ4QM2m4Pj4l0L3Ol6j1M0j7lqQPj8OJ2K9k0o5P6KL4n6Nj0K1n6M2m3K2L9
6767A3l9QJ7MJL3l8k2K2m2R8n4O2q2J3k1N7k3l9L8M6m4m4k8N2O6l1n5O2o7N4r
6799Hm8L0M7l2N4l3m1L8k0%rk2J21j19lL1k9lN8o5L5j2N3k6k0RK2l6Kj5N7oqj5
6833CN6o5j7K6j5N1k0l5q6J24L6m0M1k6n3PK5n7K4K1l3K9j3oL2l3nK9Rl9L3L5
6865C8p7L3K7m6M6olk5N6oJ6J9q7K7n3P6k5p3N6J8l6K8j7m0R1j7j5oJK8l9m6M5
$$ plain form
6898 -12 -56 -21 -21 6 -13 19 23 -4 -35 10 56 3 -24 -3 49 5 -19 12 30 32 10 1 65 -58 -25 -5 29 6 29 -38 -25 -37
6930 -37 -56 11 11 8 -2 31 17 25 -48 4 20 7 3 -8 22 -20 -4 70 -5 -9 25 6 13 42 48 -46 23 -6 32 -50 44 5 26 -29
6964 -29 2 18 48 35 -18 18 -24 -14 -12 -16 5 -33 -25 -3 16 -14 30 -51 4 16 -21 29 -25 0 22 31 90 33 -14 47 0 37
6996 37 27 -40 -1 40 63 -13 34 -3 -29 -23 -24 -44 33 16 -25 -45 78 -10 21 51 -10 4 37 -42 -34 16 45 -14 -15 -12 -39 -20
7028 -20 -9 -6 -8 -8 11 -34 0 38 -31 5 10 37 -35 21 29 5 -61 22 8 36 1 12 -7 3 40 -3 -23 23 10 33 -9 0 81
7061 81 21 1 21 4 -35 56 17 -5 1 -15 2 -8 -35 1 -63 30 -49 -62 -16 -54 36 -64 13 24 47 19 -4 -20 -30 13
7091 13 -44 45 29 -10 -3 6 83 11 1 -35 4 -47 33 22 32 -50 7 -22 -51 -5 -6 -14 -20 -71 21 15 -6 -24 43 24 -42 -44 54 67
7125 67 7 43 -49 -27 37 12 16 38 20 31 15 2 -5 -2 -37 2 -8 23 -5 22 21 26 -71 -67 -16 -19 -35 8 15 -16 -5 -35 1 -48
$$ packed form
6898a2m4L5%K7j9L2Mk7l1M5M6n3k7K1N2m4k4L1J8Kk2rO4j23L3K0L4k3K3o7J3j2
6930c7j9O7%lj0L3j4Qp3N2J6j3mj1L0m2J6P4p5mL4j9PK9Or4O9k9L8q2R4l9K1n5
6964b9L1J6L0j3n3L6m2J0KmK1l8QK2J9l0M4q1N5J2l7N0n4K5K2RN9n7m7O1m7L7
6996C7j0o7L9M1K3p6M7l7k6Ojk0P7j7m1k0J23q8L1L0o1J4L3p9QN0K9n9jLk7J9
7028b0J1Lk%J9m5L4L8o9L6NK7p2N6Qk4o6Q3j4K8l5J1j9J0L7m3k0M6j3K3m2RQ1
7061H1o0k0K0j7l9R1l9k2Oj6J7j0k7L6o4R3p9j3M6l8R0j00P7J1K3k8k3j6j0M3
7091A3n7Q9j6l9PRP7p2j0l6L9n1Q0j1J0q2N7k9k9M6jqon1R2ok1j8O7j9o6kR8J3
7125F7o0L6r2K2O4k5MK2j8J1j6j3pLl5L9j0L1k8K7jNr7MN1lj6M3Pl1J1l0L6m9
$$ plain form
7159 -48 1 -31 -37 -38 -15 -6 -21 -10 37 36 6 34 46 -23 -19 6 32 7 -39 -9 -4 -33 30 6 -46 29 -7 47 4 -34 -45 61 19
7192 19 22 31 32 14 2 -40 -8 -40 -8 17 51 -8 -30 21 -12 -26 -24 51 -19 22 -22 -14 4 -7 9 -33 -10 0 -18 -4 -23 -15 -2
7225 -2 -32 15 35 -17 7 63 -40 -25 37 -10 24 13 -31 33 1 16 -15 -10 -35 16 -89 -44 14 -30 -51 -11 22 -27 17 -18
7255 -18 21 52 -12 -50 -11 44 19 -23 -17 -30 10 -58 -11 27 -2 -41 -6 46 -10 7 -58 8 34 -12 -25 20 -22 22 37 -103
7285 -103 9 15 23 23 -31 12 26 -25 8 9 3 -6 17 19 34 -35 18 -23 -15 12 44 16 -12 -18 -19 42 20 44 6 16 -34 24 -19 3
7319 3 -23 76 -9 -51 18 4 21 -19 -5 -21 42 -7 -46 16 80 0 29 -51 41 23 -43 -13 2 -24 24 24 -46 93 -13 4
7349 4 -23 -11 -42 -38 13 22 8 12 -26 -8 -5 -6 -40 40 6 -44 12 1 -12 -3 -5 21 -64 -25 -18 10 -16 -13 47 8 -9 9 -48 21 -42
7384 -42 -100 10 -2 5 -10 -37 30 26 14 -8 -1 30 14 19 -21 -13 13 -47 -5 -16 47 -4 1 6 7 29 -23 13 1 -36 -40 31 10 -6
$$ packed form
7159d8M9l2ojK3Rj5J1M7jl0K8J2o9MK5K6k5m6L0Nk9O3k4n2P5l6N4m3l8j1J06m2
7192A9LRJj8j2m2L2l2L2K5L4n9k2N1l3j4KP5p0M1m4QJ8j1J6m2K3J0j8J4j9QJ3
7225bl0M7K0n2K4N6j03J5O2m7L4j1m4O4l2J5l1Nk5N1j05M5N8m4k1M0L3m9M4l5
7255a8L9L1o4l8L9N5k5m2Oj3M0o8M7L8k9l9L5N2n6J7o5O6K6m6j3M5m2M4J5j40
7285a03J12OQ%n4M3J4n1L3JorK3KJ5o9N3m1QK7L2k8k8ojO1k2K4l8J0n0N8m3K2
7319Ck6R9q5m2O9j4J7m0J4j6O3m9l9O2O4q0K9q0R2j8o6L0J5k6M8%p0J39j06J7
7349Dk7J2l1MN1Rj4Ml8J8Ljl4Q0l4n0N6j1j3RkK6q5L9PK8k6LO0l9j7J8n7O9o3
7384d2n8J10j2Pj5k7O7mj2k2PL1j6Nm0QK6o0M2j1O3n1NNJK2n2L6j2l7mP1k1j6
$$ plain form
7418 -6 10 -21 -3 27 38 30 -35 1 -11 51 -35 -2 1 -2 46 71 -4 -17 5 -10 0 -13 -65 30 -55 -39 -6 -20 12 -29 -17 50
7450 50 -6 -30 22 -21 -2 14 -18 -2 -45 -9 5 -25 19 -25 -35 -5 -12 -13 -11 10 7 6 -14 -6 19 -2 -19 4 -28 36 -57 -22 48
7483 48 -28 13 -9 -7 -35 12 -9 1 31 -24 34 -20 -44 -23 -2 -87 13 19 15 83 48 51 -15 -8 -29 12 26 -11 -1 39 -33 17
7515 17 6 27 30 -25 21 -4 15 37 -28 -40 -39 66 -21 15 32 9 -27 -18 22 22 -5 -41 -30 -22 24 -67 4 -25 -52 1 7 -11 22
7548 22 11 -12 -2 -65 -60 1 -13 39 4 -4 1 34 32 -13 30 -53 -2 -25 -2 26 -24 67 -5 -15 35 -29 24 -3 -22 -18 1 -46 -42
7581 -42 -8 5 0 34 42 -12 1 -39 -4 8 -19 -72 14 33 -11 -11 34 12 -55 21 -6 -9 2 -25 -19 -29 51 -9 -13 -1 4 -50 21 -45
7615 -45 20 -12 7 -32 -33 5 -14 -16 8 -95 3 21 -47 38 36 -19 -42 20 -4 12 83 100 13 -29 6 39 -40 21 42 27 32 28
7647 28 -4 -26 43 12 -18 -14 10 -66 -104 -65 -30 18 9 -5 -21 9 35 29 -19 -28 -4 -56 -3 47 -21 70 53 21 -60 22 -8 26
$$ packed form
7418fJ6l1J8L0J1qo5L6j2O2q6L3LlM8K5p5j3K2j5J0j3n2R5q5J6L3j4L2m1J2O7
7450E0n6k4N2m3J9J6l2J6m3L6J4l0M4m4j0L0pjKK1ljk0QK5k1j7K3l2O4r3L5P0
7483D8p6M1k2Kk8M7k1J0L0n5N8n4k4K1K1q5J00OmO8l5Lo6Pk1M1J4l7J0M0p2N0
7515A7j1K1Ln5M6k5J9K2o5j2JJ05q7L6J7k3l6RM0%k7l6J1QM6r1P1k9k7N3Oj8L3
7548B2j1k3J0o3NO1j4N2l5qNL3km5M3q3N1k3K3K8n0R1p2j0N0o4N3k7j9MJ9m7M
7581d2L4J3nL4Qn4J3m0L5J2k7n3Q6J9m4%M5k2o7P6k7lJ1k7Oj0Q0o0mJ2Nn4P1o6
7615d5O5l2J9l9jL8j9kK4j03R8J8o8Q5kn5k3O2k4J6P1J7q7m2L5L3p9O1K1j5Nm
7647B8l2k2O9l1l0MK4p6l8L9L5M8rj4j6L0K6om8rK4n2N3N0o8R1j7l2q1Q2l0L4
$$ plain form
7679 26 18 0 9 72 -27 17 2 -57 -26 -32 -3 -18 -1 -25 -59 -11 3 -35 7 45 -61 -39 -27 -2 25 -38 -31 15 4 -21 32 12
7711 12 62 -17 -30 -18 34 -1 2 14 28 -6 -28 -16 3 8 -21 14 11 -36 9 109 37 3 2 20 10 -38 24 -17 11 7 -5 56
7743 56 12 10 -65 7 27 -26 -38 3 0 17 14 -73 -10 29 2 92 16 34 13 9 -68 21 60 23 0 9 21 -18 6 56 2 62 -8
7776 -8 19 -29 16 -24 -41 30 -11 2 84 -1 7 -38 -21 0 7 35 22 15 24 39 15 -3 -71 25 -1 -50 1 -23 38 -11 2 17 -11
7809 -11 -1 14 37 -62 -28 7 -14 -26 30 -8 46 34 6 13 -25 -2 3 -32 16 -6 -14 4 30 -15 49 -2 0 0 8 -37 -52 18 -7
7842 -7 4 55 -18 -12 34 -27 -47 13 17 -75 -17 57 15 -2 22 10 13 -27 7 -24 -25 13 -2 40 20 -8 -13 7 -14 -57 -34 40 -15
7875 -15 -35 -30 -72 -14 32 -8 -5 26 -3 0 -36 6 59 37 49 -42 22 69 -19 -4 28 19 14 2 -40 -18 -19 17 -26 -48 -25 37 10
7908 10 -38 -42 -5 -54 15 10 76 -8 12 -11 25 -25 -5 -37 -17 17 1 -2 5 15 35 -42 21 0 47 38 46 -41 16 35 -15 20 -17
$$ packed form
7679B6qj8RO3r9M4j5n9L1oK9j5J7k4l4M8J4l8M2L8j06K2J2K5K7o3PM6j1k5N3k0
7711A2N0p9j3J2N2l5LJ2J4l4k2J2J9Nk9L5lm7M5J00p2l4jJ8j0m8O2m1K8mj2O1
7743E6m4kp5P2K0n3j2M1lJ7lq7O3L9k7R0p6J8k1mp7Q9L9l7k3RJ2l9K4N0n4O0p0
7776hK7m8M5m0j7P1m1J3Q2q5Qm5J7K1PK8j3pRJ5k4j8o8R6k6m9N1k4O1m9J3J5k8
7809a1J0J5K3r9L4L5k1j2N6l8N4j2k8Pl8K3Nl5M8k2qJ8K6m5O4n1K%Qm5j5P0k5
7842gJ1N1p3OM6o1k0O0Mr2N8P4m2j7K4j2Lm0L4l1jL8j5M2k0k8nK0k1m3K3P4n5
7875a5k0Nm2N8M6m0LL1k9Ll6M2N3k2J2r1O4M7q8J5L2rnj2m2K2jL6m3k2K3O2k7
7908A0m8mL7m9O9nO6q4K0k3L6n0K0l2K0L4j6lPJ0K0p7O3k1M7rQq7N7J9n0L5l7
$$ plain form
7941 -17 17 -16 16 -58 -18 -51 -14 5 -24 2 82 57 -37 -35 19 1 15 -4 16 -18 18 26 3 -18 12 6 -42 59 -34 -21 -5
7972 -5 -82 -2 11 1 -17 -15 24 -6 -10 39 -42 24 -14 -42 17 65 18 -11 22 -58 -42 43 -29 55 -49 3 -16 -33 15 38 -4
8003 -4 -19 -66 -8 -24 65 53 27 17 26 -18 -6 11 0 21 3 30 -14 11 27 12 14 -19 5 28 -54 -11 -18 0 44 -11 5 -27
8035 -27 -30 11 -37 15 12 -32 -11 19 4 6 76 24 15 19 -5 -19 24 19 24 -8 36 34 25 -4 75 -42 45 26 6 12 -3 12 25 -56 56
8070 56 0 -40 -6 5 11 6 17 -28 -50 -11 4 -29 13 -51 33 -37 92 28 -11 16 28 -57 -33 -7 -3 26 19 -3 -39 -1 -16 -25
8102 -25 -50 -10 -28 -6 -2 -20 -23 19 28 -52 -22 4 -37 11 29 40 67 -25 34 12 -1 -10 7 24 20 -58 -25 40 62 -51 3 3 84
8135 84 -42 13 10 5 22 -5 17 -15 24 -14 11 -31 6 -4 -9 11 -36 11 40 -14 44 36 19 -6 -26 2 -39 -42 -66 5 24 26 -66
8168 -66 -22 21 45 13 -9 25 18 49 24 43 37 46 -5 -36 57 7 3 -7 18 -43 -2 53 -58
$$ packed form
7941a7L4l3L2p4M0l3L7J9k9K6Q0k5r4KN4j8J4j9K0l4L6Qk3k1L0om8J01r3J3J6
7972ep7Q0J3j0j8KL9l0mM9q1O6l8k8N9M8m7k9L3q0J6Q5p2Q4j04N2j9j7M8K3m2
8003dj5m7N8j6Q9j2k6j0Rm4J2J7j1K1j8K7m4K5J6j5Kl3K4K3q2M3pJ8M4n5J6l2
8035b7lM1m8N2lm4K1L0j5KP0n2rMk4j4M3nNl2M4krk9P9j17Q7j9k0Oj5J5J3q1J12
8070E6n6m0L4J1OnJ1m5k2L9J5l3M2o4Q4p0J29o4l9K7J2q5K4K6MK9pk2l6L8j5r
8102b5k5M0j8K2Mj8lM2Rq0L0K6m1M8J8J1K7r2N9k2j3rJ7J7mp8L3O5K2j13N4%Q1
8135H4j26N5lnJ7k7K2l2L9l8K5m2L7j0nK0m7M7K9n4N8qj7k5k0K8m1lk4P1J9Kr2
8168f6M4M3K4l2k2L4pL1k5J9oRn1l1R3n0mj0K5o1M1N5j11
8191e8
$$ Imaginary data points
##PAGE= N=2
##DATA TABLE= (X++(I..I)), XYDATA
$$ plain form
0 0 0 0 0 0 0 0 0 0 0 0 0 0 0 8 -8 8 -8 8 -16 16 -16 24 -25 32 -40 48 -50 58 -72 80 -88 104 -119 132 -152
35 -152 168 -191 211 -236 265 -295 328 -362 402 -443 490 -541 597 -657 724 -798 879 -967
53 -967 1070 -1182 1307 -1450 1616 -1810 2038 -2309 2646 -3070 3623 -4379 5484 -7252 10536
68 10536 -18720 84545 94908 -45089 40863 24814 -64361 -29308 60564 -4856 -35023 35839
80 35839 4624 -105187 -26492 75097 -1409 -41721 51964 32155 -56251 -22284 28500 -24891
92 -24891 -25585 41472 -4729 -91941 -21152 51143 -12505 -21096 56326 25009 -51852 -29754 -4968
105 -4968 -39746 -9577 65555 34564 -27526 17067 37883 -33823 -29042 48759 46375 11656 26880
118 26880 17715 -32015 -26120 14373 -9132 -36661 11323 30499 -19472 -20304 22224 17175 -3317
$$ packed form
0@%%%%%%%%%%%%%Qj6J6j6J6k4L2l2M0m9N7p2Q8r8J08j30J52j68J92k23K51k84
35a52L20l59M02m47N01n60O23o90P64q45R33j031J138j254J381j522J677j846
53i67K037k252K489k757L066l426L848m347M955n716O693q002R863j2736J7788
68A0536k9256J03265J0363j39997Q5952j6049q9175L5053Q9872o5420l0167P0862
80C5839l1215j09811P8695J01589p6506m0312R3685j9809q8406L3967N0784n3391
92b4891o94O7057m6201q7212P0789P2295o3648q591P7422l1317p6861K2098K4786
105d968l4778L0169P5132l0991o2090M4593K0816p1706M781P7801k384l4719J5224
118B6880r165m9730N895M0493k3505k7529M7984J9176m9971q32M2528n049k0492
$$ plain form
131 -3317 5866 5040 -18096 -16510 6707 -3541 -18703 12701 25699 -15008 -31720 -8238 1006
144 1006 -3438 7333 21381 9268 -8782 -5900 -16962 -37643 -14900 15420 4410 -3613 17629
157 17629 24714 1675 -7961 9389 8587 -3970 11147 13164 -13353 -6899 15550 -2685 -23521
170 -23521 -4907 10227 -8441 -10693 19547 18814 -1570 13725 15488 -17746 -13767 12574 -1507
183 -1507 -16456 10570 26119 -2773 -14448 5198 -7930 -27946 -464 10435 -14999 -4428
195 -4428 18321 -3665 -22897 -1961 7514 -14374 -9835 19447 10524 -4908 16989 15333 -14156
208 -14156 -4836 12732 -5874 -14816 7555 13789 -5990 -4547 10485 -7263 -20779 1814 4376
221 4376 -10602 6640 22028 5553 -1967 10459 7558 -9871 -5589 9015 -1301 -7114 8741
$$ packed form
131c317R183q26k3136J586K3217j0248j5162L1404J2998m0707j6712K3482R244
144A006m444J0771J4048j2113j8050K882j1062k0681K2743L0320j1010q023K1242
157A7629P085k3039r636J7350q02j2557J5117K017k6517O454K2449j8235k0836
170b3521J8614J5134j8668k252L0240p33k0384J5295J763l3234L979K6341j4081
183a507j4949K7026J5549k8892j1675J9646j3128k0016K7482J0899k5434J0571
195d428K2749k1986j9232K0936R475k1888M539K9282q923j5432K1897j656k9489
208a4156R320J7568j8606q942K2371O234j9779J443J5032j7748j3516K2593K562
221D376j4978J7242J5388j6475p520J2426k901j7429M282J4604j0316n813J5855
$$ plain form
234 8741 1872 -16590 -8235 -1844 -12538 -10416 4738 8358 1859 7011 14462 1834 -5866 3016
248 3016 -1871 -9438 1194 5866 -945 -1521 2399 194 -7004 -5397 1245 -2569 -2090 7469 4381
263 4381 -1970 855 -909 -5151 -3854 608 4260 3363 5009 8551 2394 -2933 -1550 -6081 -8345
278 -8345 -3458 -1018 967 2919 3692 4882 1756 223 3074 364 -295 3344 1146 -1014 -1683 -5386
294 -5386 -6666 -7258 -6183 -960 1038 3688 8514 6795 4894 4422 -669 -3096 -3640 -5178 -3182 -2793
310 -2793 -3025 -397 -1747 -2016 1166 926 3036 6465 6111 7165 6076 1791 168 -3962 -7077 -5321
326 -5321 -5993 -4386 49 -7 1335 2708 477 663 -253 -1576 708 -61 -229 2192 -273 -783 1348
343 1348 -848 -130 2511 2232 3308 2604 1023 225 -4161 -5367 -4226 -7408 -4996 413 -434 1456
$$ packed form
234H741o869j8462Q355O391j0694K122J5154L620o499N152P451j2628p700Q882
248C016m887p567J0632M672o811n76L920k205p198J607O642l814M79R559l088
263D381o351K825j764m242J297M462L652q97J646L542o157n327J383m531k264
278h345M887K440J985J952P73J190l126j533K851k710o59L639k198k160o69l703
294e386j280n92J075N223J998K650M826j719j901m72n091k427n44j538J996L89
310b793k32K628j350k69L182k40K110L429l54J054j089m285j623m130l115J756
326e321o72J607M435n6J342J373k231J86r16j323K284p69j68K421k465n10K131
343A348k196P18K641k79J076p04j581p98m386j206J141l182K412N409q47J890
$$ plain form
359 1456 5660 4763 3687 3231 3418 2410 -571 1354 1786 -3984 -2266 779 -4918 -4891 516 -16 -558
376 -558 2263 4474 2037 -759 2578 753 -6038 -1425 2540 -4189 -2629 4346 1824 -1424 1684
391 1684 2931 -1574 -2524 2979 -515 -7144 26 2344 -7377 -5453 1969 -1542 -3333 3423 5889
406 5889 1476 2632 8046 1425 -4761 3975 4184 -6488 -3311 3260 -2039 -4312 1431 2277 -1761
421 -1761 1663 6973 -129 -4144 5224 4220 -4995 -923 3969 -1729 -4103 -585 -247 -2372 1573
436 1573 5401 -1697 -4833 2728 469 -7266 -3463 1540 -818 -2732 -2100 -1918 -2962 -371 3896 761
452 761 -451 5676 3813 -3580 -2547 2846 4677 1781 -402 1312 -767 -3397 -295 -755 -2415 3955
468 3955 6259 -1166 -5218 445 5190 329 -653 7716 5536 -2370 503 -138 -6070 437 7583 -1158
$$ packed form
359A456M204q97j076m56J87j008k981J925M32n770J718L045n697K7N407n32n42
376e58K821K211k437k796L337j825o791M613L965o729J560O975k522l248L108
391A684J247m505r50N503l494o629P170K318r721J924P422l511j791O756K466
406E889m413J156N414o621o186Q736K09j0672L177O571n299k273N743Q46m038
421a761L424N310p102m015R368j004r215M072M892n698k374L518L38k125L945
436A573L828p098l136P561k259p735L803N003k358j914O32J82j044K591M267l135
452G61j212O127j863p393J033N393J831k896k183J714k079k630L102m60j660O370
468C955K304p425m052N663M745m861r82Q369k180p906K873o41n932O507P146q741
$$ plain form
484 -1158 -9485 -2400 1832 -9193 -9373 5198 3154 -5032 2203 1155 -10229 -2186 10719 2561
498 2561 -4267 8176 9815 -9678 -10715 5539 622 -5941 7722 5069 -12092 -3988 8291 -4524
512 -4524 -8743 12289 15381 -5939 -3823 10947 -1094 -6796 12292 8721 -9293 1150 9419
525 9419 -11291 -15386 9334 10453 -9901 -3009 8893 -8980 -12659 8561 4050 -9398 7318
538 7318 13632 -10990 -15203 6646 3999 -11740 2135 13520 -5671 -8897 7105 -2879 -12960
551 -12960 7669 14075 -7715 -8847 8962 1715 -12078 3234 12862 -2951 -1848 11028 -2227
564 -2227 -10817 8251 12336 -5407 -3338 10493 -341 -14031 -1210 6351 -4693 759 11085
577 11085 -3025 -10959 3404 4671 -8065 -2372 11025 2971 -8328 -195 2259 -7533 -1931 7259
$$ packed form
484a158q327P085M232j1025j80J4571k044q186P235j048j1384Q043J2905q158
498B561o828J2443J639j9493j037J6254m917o563J3663k653j7161Q104J2279j2815
512d524m219K1032L092k1320K116J4770j2041n702J9088l571j8014J0443Q269
525I419k0710m095K4720J119k0354O892J1902j7873l679K1220m511j3448J6716
538G318O314k4622m213K1849k647j5739J3875J1385j9191l226J6002r984j0081
551a2960K0629O406k1790j132J7809p247j3793J5312R628j5813J103J2876j3255
564b227q590J9068M085j7743K069J3831j0834j3690J2821P561j1044N452J0326
577A1085j4110p934J4363J267j2736N693J3397q054j1299Q133K454r792N602R190
$$ plain form
591 7259 -1771 -5976 3966 2583 -8436 -4804 6512 2648 -5500 -49 2103 -5517 -1583 6364 1533
606 1533 -1073 5674 4811 -4563 -4453 4854 4285 -2202 2318 5116 -3135 -4447 573 -2078 -3624 3613
622 3613 6658 -1101 -4532 2652 2277 -5309 -649 5611 -672 -2908 2361 62 -4759 305 5154
637 5154 -1424 -5431 2584 2398 -7045 -2651 5300 -609 -3405 2712 125 -6480 -1426 5678 276
652 276 -2898 6275 5309 -5906 -2496 4502 -2064 -3614 4531 2844 -4507 -830 4230 -3103 -5718
667 -5718 4769 4891 -4303 668 6427 -1284 -2727 5011 2557 -4478 -142 4291 -3195 -5223 4217
682 4217 2623 -5830 -439 3853 -4107 -4432 2819 883 -3871 1356 4891 -2703 -4630 3070 846
697 846 -5063 1322 4825 -1780 -1654 3332 185 -4046 195 3206 -2013 -2151 4470 1939 -2944 1682
$$ packed form
591G259r030m205R942j383j1019L632J1316l864q148N451K152p620L934P947m831
606A533k606O747q63r374J10R307n69o487M520K798q251j312N020k651j546P237
622C613L045p759l431P184l75p586M660O260o283k236N269k299m821N064M849
637E154o578m007Q015j86r443M394P951n909k796O117k587o605N054P104n402
652B76l174R173r66j1215L410O998o566j550Q145j687p351L677N060p333k615
667e718J0487J22r194M971N759p711j443P738k454p035M336M433p486k028R440
682D217j594q453N391M292p960l25P251j936m754N227L535p594j927P700k224
697H46n909O385L503o605J26M986l147m231M241L011n219j38O621k531m883M626
$$ plain form
713 1682 3358 -1819 -944 2965 632 -2192 1110 3057 -1371 -2075 2158 -451 -3884 233 1383 -2058
729 -2058 -978 1519 -273 -2516 -585 729 -2227 -1898 2092 702 -1433 1497 1533 -1211 -479 1212
745 1212 543 -513 1024 2433 86 -476 1758 -58 -1973 379 590 -730 34 923 597 -509 -130
762 -130 989 -772 -1105 1037 17 -927 575 143 -1083 -1008 -805 -727 -1150 -704 766 -133 -344 1161
780 1161 91 -772 301 9 132 674 836 1315 676 243 955 -94 -630 463 -251 -391 334 -21 -79
799 -79 -330 -784 -185 -522 -643 616 166 -5 872 219 -127 5 -523 -160 -190 -344 583 128 -366 395 -246
820 -246 -682 -30 -315 -101 360 262 732 243 -84 552 -313 -599 614 -44 -226 485 -67 -356 -359 -591 -657
841 -657 -987 -431 272 -476 -198 920 -78 -174 812 85 54 920 796 488 246 722 653 -793 -165 601 -896
$$ packed form
713A682J676n177Q75L909k333k824L302J947m428p04M233k609l433M117J150l441
729b058J080K497j792k243J931J314k956L29L990j390k135K930L6k744P32J691
745A212o69j056J537J409k347n62K234j816j915K352K11j320P64Q89l26j106L79
762a30J119j761l33K142j020r44J502m32j226P5K03P8m23M46J470q99k11J505
780A161j070q63J073k92J23N42J62M79o39m33P12j049n36J093p14j40P25l55n8
799g9k51m54N99l37j21J259m50j71Q77o53l46J32n28L63l0j54R27m55m94P61o41
820b46m36O52k85K14M61r8M70m89l27O36q65k86J213o58j82P11n52k89lk32o6
841f57l30N56P03p48K78J118r98r6R86p27l1Q66j24l08k42M76o9j446O28P66j497
$$ plain form
862 -896 -170 895 -287 -287 713 71 -809 -562 519 107 -918 516 855 -858 79 633 -1206 -716
880 -716 653 -307 -1122 -244 607 -391 -1287 378 81 -1263 496 848 -1010 311 1579 206 -515 531
898 531 1018 -191 -593 996 429 -623 1025 441 -1534 30 769 -692 -645 500 927 17 -393 602
916 602 57 -372 1047 192 -832 786 768 -645 -497 -173 124 -124 -782 -428 -425 -484 113 -615 -708 470
936 470 -124 -499 -304 -746 399 1086 -304 -294 653 172 -566 -652 170 348 -60 734 145 -1502 462 1442
956 1442 -1003 -375 2078 1143 -553 354 1223 -133 -75 2105 140 -2152 1196 1487 -2728 -1313 2256
973 2256 23 -1936 330 583 -2372 -1004 2283 -894 -2671 2333 1685 -3990 -1325 2661 -612 -1761
989 -1761 2155 1402 -2643 -363 2653 -2075 -2815 3809 2035 -3887 -139 2935 -1679 -1738 3327 1808
$$ packed form
862h96P26J065j182%J000o42q80K47J081m12j025J434L39j713R37N54j839M90
880g16J369r60q15Q78Q51r98q96J665k97j344J759L52j858J321J268j373p21J046
898E31M87j209m02J589n67j052J648n84j975J564P39j461M7J145M27r10m10R95
916F02n45m29J419q55j024J618j8j413J48L24K97k48o58L54Ln9N97p28r3J178
936D70n94l75J95m42J145O87j390J0R47m81p38q6Q22J78m08P94n89j647J964R80
956A442k445O28K453r35j696R07Q69j356N8K180j965k292L348K91m215J415L569
973B256k233j959K266K53k955J368L287l177j777N004o48n675K665L986l273j149
989a761L916p53m045K280L016m728p40O624j774n922L748L074m614n9N065j519
$$ plain form
1005 1808 -2107 1425 3418 -2899 -2610 4424 1634 -3533 1197 2834 -2954 -2467 2469 283 -2622
1020 -2622 2401 3286 -3771 -2881 3437 -287 -3795 2300 3183 -2663 -1668 1936 -1456 -3112 2784 3320
1036 3320 -3120 -1430 3267 -1707 -4374 1871 2512 -1848 -39 2137 -1906 -3214 2087 2554 -1914
1051 -1914 788 4282 -1061 -3596 1104 1303 -1274 1150 2807 -943 -2556 819 625 -2552 583
1066 583 4177 59 -2306 428 -206 -2064 209 2222 370 -1006 901 55 -3275 -935 2832 596
1082 596 -1064 762 39 -2358 -1538 556 365 -446 1438 1221 -2392 -1781 1677 550 -616 1690 2092
1099 2092 -513 -1596 172 206 -1040 1260 2568 -976 -1651 1049 -208 -2199 390 2462 141 -1413
1115 -1413 632 162 -2455 59 2525 -655 -1060 2082 264 -2785 -466 1934 -329 -1279 1654 775
$$ packed form
1005A808l915L532J993o317K89P034k790n167M730J637n788M87M936k186k905
1020b622N023Q85p057Q90O318l724l508O095Q83n846R95L604l392j656N896N36
1036C320o440J690M697m974k667O245O41m360J809K176m043j308N301M67m468
1051a914K702L494n343k535M700J99k577K424J657l750j613L375j94l177L135
1066E83L594m118k365K734o34j858K273K013j852j376J907q46l330K340L767k236
1082E96j660J826p23k397Q20K094j91q11J884k17l613O11L458j127j166K306M02
1099B092k605j083J768L4j246K300J308l544o75K700j257j991K589K072k321j554
1115a413K045m70k617K514K466l180m05L142j818l049K319K400k263r50K933q79
$$ plain form
1131 775 -2812 -438 1888 -1470 -1246 2683 941 -2366 -84 1876 -965 -1463 2395 1452 -2078 417
1147 417 1969 -2063 -1631 2313 639 -2239 289 1655 -1761 -2110 1650 665 -2214 912 2208 -1790
1163 -1790 -1204 2152 243 -1800 920 2022 -1172 -1503 1568 125 -2274 862 1838 -1577 -744 1852
1179 1852 -173 -1724 698 1597 -870 -771 1834 260 -1795 886 1473 -1265 -143 1791 -188 -1470
1195 -1470 345 770 -1261 -1058 1190 -225 -1942 425 730 -1440 -236 1461 63 -769 675 973
1211 973 -777 -589 1206 37 -1334 559 561 -1289 -382 849 -184 -633 450 821 -501 -474 992
1228 992 128 -851 754 820 -619 70 861 126 -236 346 684 -372 -563 563 -334 -1231 92 147 -868
1247 -868 -355 305 -110 -303 199 688 -69 -194 710 75 -672 201 73 -720 -327 -28 -308 -480 -122 323
$$ packed form
1131G75l587K374K326l358K24L929j742l307K282J960k841m98L858r43l530K495
1147D17J552m032M32L944j674k878K528J366l416l49L760r85k879L126J296l998
1163a790N86L356j909k043K720J102l194l31L071j443k399L136R76l415Q33K596
1179A852k025j551K422Q99k467R9K605j574k055K681N87k738J122J934j979j282
1195a470J815M25k031K03K248j415j717K367L05k170J204J697j398q32J444K98
1211I73j750J88J795j169j371J893Kj850R07J231j033m49J083L71j322K7J466
1228I92q64r79J605O6j439O89P91p35l62N82L38j056j91J126q97q97J323N5j015
1247h68N13O60m15j93N02M89p57j25R04o35p47Q73j28p93L93K99k80j72L58M45
$$ plain form
1267 323 -152 -277 626 82 -399 332 284 -80 156 312 245 40 112 577 85 -98 520 84 -365 -13 -113
1288 -113 -404 -269 -263 -2 -323 -213 418 4 -101 560 232 -84 254 64 -175 -272 -179 -17 -428 -407 162 -350
1310 -350 -454 294 -29 -251 199 210 75 63 163 361 -99 11 578 -74 -81 520 -23 -237 161 37 -281
1331 -281 -267 -204 -130 -432 -119 181 -432 -97 579 -50 6 534 244 60 188 133 20 -197 87 63 -595 -94
1353 -94 248 -519 -281 339 -285 -171 263 84 -131 90 380 15 -388 353 397 -514 52 356 -422 -219 104
1374 104 -395 -492 -97 77 -324 -408 391 130 -506 358 301 -420 270 476 -217 -4 464 256 -267 -104 429
1395 429 -118 -421 364 -18 -558 284 126 -570 -61 294 -80 -205 229 464 19 113 517 -189 -242 435 -268
1416 -268 -616 200 68 -522 -217 -1 -225 -220 252 167 -404 294 635 -456 -309 601 -91 -360 317 63 -434
$$ packed form
1267C23m75j25R03n44m81P31m8l64K36J56o7k05P2M65m92j83O18m36m49L52j00
1288a13k91J35OK61l21J10O31m14j05O61l28l16L38j90k39r7R3J62m11K1N69n12
1310c50j04P48l23k22M50J1j35j2J00J98m60J10N67o52pO01n43k14L98j24l18
1331b81J4O3P4l02L13L00o13L35O76o29N6N28k90j84J28n5j13k17K84k4o58N01
1353i4L42p67K38O20o24J14M34j79k15K21K90l65m03P41M4r11N66L04p78K03L23
1374A04m99r7L95J74m01q4P99k61o36Q64n7p21O90K06o93K13M68k08n23J63N33
1395D29n47l03P85l82n40Q42j58o96N09L55l74j25M34K35m45R4M04p06n3O77p03
1416b68l48Q16j32n90L05K16k24NM72q5n71O98L41j091J47R10o92k69O77k54m97
$$ plain form
1437 -434 100 513 -246 -446 707 312 -1060 -144 546 -656 -229 786 -133 -545 524 504 -650 -60
1455 -60 1380 337 -656 730 542 -1155 -107 769 -696 -627 911 237 -1267 -119 1093 -456 -842
1472 -842 1090 269 -1374 285 666 -1186 -457 1342 -60 -1360 149 914 -1053 -622 1537 133
1488 133 -1122 718 298 -1783 -310 1458 -128 -768 1211 1052 -1113 -209 1473 -133 -502 1620
1504 1620 551 -1458 -4 861 -994 -957 1097 523 -1228 -208 740 -910 -648 1417 205 -1188
1520 -1188 384 516 -1288 -774 980 518 -618 320 605 -1065 -670 956 27 -540 945 671 -903
1537 -903 -662 456 79 -387 624 941 -280 -135 611 -318 -467 711 529 -365 -329 46 -211 -551 -7
1556 -7 477 -157 -167 229 -372 -581 124 425 109 -112 160 145 -601 -509 377 254 -11 459 335 -312 -344 135
$$ packed form
1437d34N34M13p59k00J153l95j372R16O90j202M27J015r19m12J069k0j154N90
1455f0J440j043r93J386j88j697J048Q76j465O9J538o74j504J148J212j549l86
1472h42J932q21j643J659L81j852P29J799j402j300J509P65j967M31K159j404
1488A33j255J840m20k081J473J768j586o40J979j59k165R04J682j606l69K122
1504A620j069k009J454Q65j855L7K054n74j751J020R48j650K62K065j212j393
1520a188J572J32j804N14J754m62j136R38K85j670L95J626r29n67J485k74j574
1537i03K41J118l77m66J011L17j221J45P46r29j49J178j82q94L6L75k57l40N44
1556gM84o34j0L96o01k09P05L01l16k21K72j5p46R2Q86j23k65M70j24o47l2M79
$$ plain form
1578 135 15 -513 181 765 -355 -571 392 -34 -584 239 575 -180 -213 582 242 -719 173 875 -521 -563
1598 -563 560 -97 -993 40 541 -526 -425 645 30 -1146 108 897 -505 -205 1202 142 -797
1615 -797 296 484 -666 -388 1004 185 -952 373 710 -1052 -464 887 -122 -715 625 593 -668
1632 -668 -255 930 26 -865 564 681 -928 -196 994 -303 -685 565 256 -875 -391 548 -271 -843
1650 -843 569 549 -873 -127 696 -445 -548 751 531 -416 121 765 -254 -783 417 238 -815 47
1668 47 671 -350 -423 515 225 -449 80 655 -66 -403 537 319 -501 105 465 -388 -386 256 80 -419 -27
1689 -27 454 -226 -577 211 -92 -755 -54 312 -189 -116 376 231 -341 6 409 -138 -258 439 272 -372 6
1710 6 160 -298 -327 92 101 -147 34 495 21 -231 289 146 -353 6 127 -134 -108 167 200 -177 -88 238 -138
$$ packed form
1578A35j20n28O94N84j120k16R63m26n50Q23L36p55l3P95l40r61Q92P02j396m2
1598e63J123o57q96J033N01j067J01J070o15j176J254P89j402L00J407j060r39
1615g97J093J88j150K78J392q19j137J325L37j762N88J351j009n93J340l2j261
1632f68M13J185r04q91J429J17j609P32J190j297l82J250l09j131M84R39q19n72
1650h43J412k0j422P46Q23j141j03J299k20r47N37O44j019n29J200j79j053Q62
1668D7O24j021p3R38k90o74N29N75p21l37R40k18q20O06L60q53KO42j76m99L92
1689b7M81o80l51P88l03o63P01L66n01P3M92j45n72L47M03n47j20O97j67o44L78
1710FJ54m58k9M19Rk48J81M61m74k52N20j43m99L59J21k61K6K75L3l77Q9L26l76
$$ plain form
1733 -138 -275 256 191 -243 33 80 -278 -256 -70 -22 -195 -17 434 152 -105 324 155 -151 102 180 -42 -135
1755 -135 -7 21 -283 -271 72 -161 -335 113 60 -91 134 217 139 -15 45 124 -138 -165 271 32 -128 208 40
1778 40 -233 -83 0 -99 -112 133 180 -69 -146 278 -32 -163 225 95 -5 163 222 14 -99 -20 20 -300 -255
1801 -255 59 -230 -255 230 -29 -163 24 4 -68 -14 199 170 -62 64 219 -212 -57 123 -162 -118 206 15
1823 15 -57 57 115 -53 -119 61 76 -183 55 148 -101 25 133 -16 -80 125 44 -86 29 101 10 -169 74
1846 74 3 -332 -64 91 -168 -16 177 -10 -46 98 150 -103 3 234 20 -154 238 88 -295 -33 102
1867 102 -168 -149 69 32 -129 -10 168 -155 -105 278 -99 -265 244 95 -117 46 121 -9 -12 158 87 -80
1889 -80 69 308 -182 -127 188 -178 -332 89 -34 -181 63 201 9 -130 173 168 -181 57 253 -159 -54
$$ packed form
1733a38j37N31o5m34K76M7l58K2J86M8j73J78M51k82k57M29j69l06K53P8k22r3
1755a35J28K8l04J2L43k33j74M48n3j51K25Q3p8j54O0P9k62k7M36k39j60L36j68
1778D0k73J50Q3r9j3K45M7k49p7M24l10j31L88j30j00J68N9k08j13P9M0l20M5
1801b55L14k89k5M85k59j34J87k0p2N4K13k9k32J26J55m31J55J80k85M4L24j91
1823A5p2J14N8j68o6J80J5k59K38R3k49J26J08j49o4K05q1j30J15P2r1j79K43
1846G4p1l35K68J55k59J52J93j87l6J44N2k53J06K31k14j74L92j50l83K62J35
1867A02k70J9K18l7j61J19J78l23N0L83l77j66N09j49k12J63P5j30lJ70p1j67
1889h0J49K39m90N5L15l66j54M21j23j47K44J38j92j39L03nl49K38J96m12J05
$$ plain form
1910 -54 297 -75 -266 149 83 -280 -138 148 -62 -236 141 196 -263 96 349 -144 -97 274 105 -176 140
1931 140 207 -117 -220 194 -3 -372 191 205 -334 -63 263 -199 -196 240 184 -199 103 413 -89 -255 316 49
1953 49 -403 63 245 -310 -243 146 -57 -266 131 274 -205 -169 450 20 -325 322 188 -316 -12 171 -226
1974 -226 -360 161 142 -272 27 371 -195 -249 368 114 -270 148 193 -242 -178 160 24 -312 66 299 -233
1995 -233 -181 324 -61 -153 228 165 -100 -93 149 -103 -254 85 131 -196 -12 244 -68 -81 134 68 -94 40 141
2018 141 -21 -55 48 37 -97 53 61 -120 -83 16 -105 -7 -2 44 4 -81 -52 -24 -88 13 140 98 103 16 -20 78 -121
2045 -121 -99 103 -24 -100 51 -67 -158 -83 6 12 -86 70 171 -106 28 281 -55 -86 141 35 -186 -24 92
2068 92 21 -175 72 141 -263 -89 185 -221 -202 224 127 -143 40 99 -162 -147 238 168 -107 154 413 -201 -166
$$ packed form
1910e4L51l72j91M15o6l63J42K86k10j74L77N5m59L59K53m93M7L71j69k81L16
1931A40O7l24j03M14j97l69N63J4n39K71L26m62LM36n6l83L02L10n02j66N71k67
1953D9m52M66J82n55O7L89k03k09L97J43m79L6O19m30l45O47j34n04L04J83l97
1974b26j34N21j9m14K99L44n66n4O17k54l84M18M5m35O4L38j36l36L78K33n32
1995b33N2N05l85r2L81o3k65PK42k52j51L39M6l27J84K56l12j3K15o6j62J34J01
2018A41j62l4J03j1j34J50Qj81L7R9j21R8NM6m0q5K9K8o4J01J27m2Nq7l6R8j99
2045a21K2K02j27p6J51j18r1P5Q9Or8J56J01k77J34K53l36l1K27j06k21J62J16
2068I2p1j96K47O9m04J74K74m06J9M26r7k70J83N9k61J5L85p0k75K61K59o14L5
$$ plain form
2091 -166 160 -80 -300 -53 135 -202 -178 198 102 -272 178 317 -163 -29 380 -33 -150 86 94 -285 -182
2112 -182 111 -149 -342 116 231 -173 -12 234 -41 -167 76 69 -120 -22 340 -3 -179 116 103 -262 32
2133 32 263 27 -87 137 88 -174 -119 184 3 -138 171 80 -230 55 182 -73 -57 120 -31 -177 -128 153
2155 153 -45 -141 167 -15 -207 -53 39 -134 -16 198 166 -110 -124 -11 -148 -137 194 152 13 204 201 42 22
2178 22 101 130 -73 12 123 -17 -161 14 -94 -198 -8 -33 -113 -99 61 95 -11 62 173 -32 -175 -67 -32
2201 -32 -129 29 38 -14 -76 -18 -70 -173 -38 169 16 -14 189 63 -98 74 45 53 100 62 52 -15 5 157 -13 -74
2227 -74 49 -31 -69 -13 20 45 -15 -37 11 -94 -112 75 12 -10 119 40 -74 -70 -27 -56 -129 -33 83 -34 -3 83 -45
2254 -45 -104 47 -37 -51 5 34 107 49 84 35 -15 -17 42 -55 -13 59 2 -13 -4 11 33 -124 -7 23 -44 67 110 -73 -72
$$ packed form
2091a66L26k40k20K47J88l37K4L76r6l74M50J39m80J34M09m13j17K36Ql79J03
2112a82K93k60j93M58J15m04J61K46k75j26K43pj89R8L62l43j76K95j3l65K94
2133C2K31k36j14K24m9k62N5L03j81j41L09r1l10K85J27k55J6J77j51j46M9K81
2155A53j98r6L08j82j92J54R2j73J18K14l2k76j4J13j37J1L31m2j39J91lj59k0
2178B2P9K9k03Q5J11j40j44J75j08j04J90k5q0J4J60L4j06P3J11k05j43J08L5
2201c2r7J58Rn2o2N8n2j03J35K07j53l0K03j26j61J72k9QM7l8j0o7K0J52j70o1
2227g4J23q0l8N6L3K5o0k2M8j05j8J87o3k2J29p9j14MM3k9p3R6J16j17L1Q6j28
2254d5n9J51q4j4N6K9P3n8L5m9n0kN9r7M2P2n7j5RJ5K2j57J17L0o7J11M3j83J
$$ plain form
2283 -72 -18 -81 -65 -3 88 17 -32 -26 75 -74 -24 -18 -110 -3 21 -15 -7 31 -17 -33 -67 -25 -38 -85 93 37 -49 60 55 -137
2313 -137 12 -7 -24 -46 63 39 -12 -57 31 -74 -133 -5 -45 -107 61 48 -37 113 27 -13 -78 -7 69 8 52 79 -39
2340 -39 -98 -5 -81 -113 -14 -52 -41 -13 74 109 26 58 97 -7 -25 92 -15 37 25 -17 -91 -119 -24 -79 -95 4 60 -84
2368 -84 0 90 -127 -95 53 -52 -4 120 84 35 -10 68 -21 -111 57 71 -81 111 70 -80 33 52 -62 -56 31 123
2394 123 -5 4 147 38 -107 -15 -53 -247 5 8 -96 11 41 -3 -48 -78 58 12 -32 139 0 -48 94 17 -134
2419 -134 -16 82 -67 16 67 124 10 68 107 -83 -51 105 -10 -84 43 39 -62 -81 15 -32 -96 33 62 -23 0 95
2445 95 -12 -93 -7 -5 -116 32 112 -19 -77 92 66 -105 -64 71 -92 -9 88 -29 -19 106 129 -23 -18 62 68 -80
2471 -80 70 153 -30 30 -4 -107 -113 -27 -45 -64 34 99 66 -18 88 38 -101 5 60 -9 -10 22 -27 -32 -12 -19 -13 -22 53 36
$$ packed form
2283g2N4o3J6O2R1p1m9OJ01j49N0Or2J07K4l6QL8m8j6l4M2j3m7J78n6q6J09nj92
2313a37J49j9j7k2J09k4n1m5Q8j05n9J28m0o2J68j3q5J50q6m0o5P1P6o1M4K7j18
2340c9n9R3p6l2R9l8J1K8Q7L5q3L2L9j04j8J17j07N2j2m2p4k8R5n5j6R9N6j44
2368h4Q4R0k17L2J48j05M8J24l6m9m5P8q9r0J68J4j52J92m1j50J13J9j14OQ7R2
2394A23j28RJ43j09j45R2l8j94K52Lj04J07L0m4m5l0J36m6m4J71j39m8J42p7j51
2419a34J18R8j49Q3N1N7j14N8L9j90L2J56j15p4J27mj01j9R6m7o4J29K9q5K3R5
2445I5j07q1Q6Kj11J48Q0j31n8J69k6j71M1J35j63Q3R7j17J0J25K3j52NQ0Oj48
2471h0J50Q3j83O0l4j03oQ6j8j9R8O5l3q4J06n0j39J06N5o9jL2m9nK0pOrP5j7
$$ plain form
2501 36 -28 16 55 -58 14 5 -31 32 37 -6 11 32 80 8 8 4 -88 -24 33 -16 -34 15 -30 -60 -26 -24 -11 26 50 75 -42 7
2533 7 48 -136 -47 23 -84 -58 -23 -16 -31 12 0 9 -19 48 9 -56 -2 17 -82 -31 69 5 -50 37 94 0 52 18 51 -45
2563 -45 0 74 -72 -17 101 -64 -42 33 -17 -62 -21 31 -55 1 115 58 -72 6 25 -89 -96 83 24 -31 59 100 -75
2590 -75 -32 98 -1 -91 56 -20 -105 39 106 19 5 99 46 -38 -51 55 -39 -11 87 6 -52 -25 -39 21 -24 27 98 -27
2618 -27 -39 76 -24 -66 89 32 3 -20 7 -14 -50 -14 52 -29 -18 79 -66 -68 11 18 9 59 16 -46 -16 48 34 -24 33 97
2648 97 -36 -51 -72 -15 -2 48 21 -48 0 6 47 -55 13 49 -14 -3 68 34 -29 88 44 11 -27 63 73 -37 -18 36 20
2677 20 7 59 20 -34 -21 -31 -42 -34 41 80 -13 -1 -12 -23 -11 48 35 -17 -47 -16 -90 -60 20 -18 -11 -52 50 -1 -58 1 45
2708 45 4 -47 18 14 -3 44 38 19 -2 45 -52 -45 42 -40 -22 -54 -71 28 -12 -24 23 -50 -3 63 13 41 70 -27 -8 -29 22 -15
$$ packed form
2501C6o4M4L9j13P2rl6O3Nm3J7K1M8p2%mr2O4N7m9j8M9m5l0L4KJ3L7K4K5j17M9
2533GM1j84Q9P0j07K6L5Pj5M3j2Rk8O7l9o5N4J9r9N1J00o4n5Q7N7r4N2l4L3r6
2563d5M5P4j46N5J18j65K2P5n0m5M1N2q6N6J14n7j30P8J9j14pJ79n9n5R0M1j75
2590g5M3J30r9r0J47p6q5J44O7q7j4R4n3q4j3J06r4K8R8q1n8K7j4O0m5N1P1j25
2618b7j2J15j00m2J55n7k9k3K7k1l6L6O6q1J1R7j45kP9PrN0m3o2L0O4j4n8N7O4
2648I7j33j5k1N7J3N0k7o9M8OM1j02O8L6o3J1P1l4o3J17m4l3l8R0J0j10J9N4j6
2677B0j3N2l9n4J3j0j1QP5L9r3J2j1j1J2N9j3n2l0L1p4L0Q0l8Pm1J02n1n7N9M4
2708D5m1n1O5mj7M7oj9k1M7r7PQ7q2J8l2j7R9m0j2M7p3M7O6n0K8K9r7J9k1N1l7
$$ plain form
2740 -15 -83 24 -8 -26 -44 60 -21 -14 35 -9 -71 -26 8 9 -6 71 66 -69 37 82 -38 8 32 -34 32 -12 -52 -3 -82
2769 -82 89 -13 -58 -21 27 -24 0 52 1 78 -41 -30 -10 25 1 -52 -24 -7 -47 -72 28 -15 -72 -2 38 14 -1 -36
2797 -36 -8 -43 -61 47 -38 1 64 42 -42 80 38 -3 -47 4 33 10 -22 33 -37 -1 41 -23 -59 39 -9 12 24 13 -6
2826 -6 -62 26 26 -112 -30 15 -107 -12 31 -26 -51 57 -17 -61 18 -9 23 -10 92 71 -7 95 90 -17 -10 22 -3 -12 15 18
2856 18 -74 -57 -42 -30 -52 -14 -11 -110 22 66 -26 8 -21 -24 -73 21 25 -51 -69 72 -38 -82 -26 39 -135 8 45 33 -15
2885 -15 56 -1 -55 19 33 26 -64 55 9 -62 78 81 -62 10 68 1 -67 31 63 -86 -77 42 -123 -18 70 10 -8 42
2913 42 40 -76 -53 17 -24 -28 48 80 -14 6 43 -63 -53 37 -32 -44 -62 2 27 16 20 17 -132 41 -3 -50 -25 45 -37 -38 -8
2944 -8 -27 -26 -41 61 -30 -145 6 -2 -27 -24 91 -26 -4 33 -24 -53 26 80 -26 -12 91 -5 -19 67 24 -122 -10 51
$$ packed form
2740a5o8J07l2j8j8J04q1PM9m4o2M5L4Jj5P7nj35J06M5j20M6K4o6O6m4m0M9p9
2769h2J71j02m5L7M8n1K4N2n1P7j19J1K0L5k4n3K8J7m0k5J00m3n7P0M0k4j5l5
2797c6K8l5j8J08q5L9O3k2q4J22m2m1m4N1K9k3l2N5p0L6M2o4l6R8m8K1J2j1j9
2826fn6Q8%j38Q2M5j22R5M3n7k5J08p4m4P9k7L2l3J02k1p8J02nj07PL2k5rK7L
2856A8r2J7J5J2k2L8Lr9J32M4r2L4k9lm9R4Mp6j8J41j10m4N6O5j74J43L7j2m8
2885a5P1n7n4P4J4pr0J19m6p1J40Lj43P2N8o7o8R8L2j49RJ19j65J05Q8o0j8N0
2913D2kj16K3P0m1mP6L2r4K0L7j06J0R0o9j2j8O4K5j1Mlj49J73m4m7K5P0q2jL0
2944hj9Jj5J02r1j15J51qk5LJ15j17K2L7n7k9P9N4j06J4J03r6j4Q6m3j46J12O1
$$ plain form
2972 51 17 -5 3 46 -45 -7 41 -23 -26 73 -6 -10 90 28 29 -44 25 1 -41 5 -8 -96 -8 34 -85 -35 47 -65 -56 37 44 -82
3004 -82 -14 -15 16 -65 69 73 -45 -30 51 -13 -32 30 -38 -20 36 59 52 47 56 38 -74 35 53 -18 -30 64 -13 -38 28 -51 -32
3035 -32 -49 -69 14 -77 37 9 -98 -9 2 -37 -17 9 -16 0 12 6 4 -6 50 -14 -45 -5 17 -14 47 84 -72 -26 -11 -42
3065 -42 -43 10 54 -10 -36 45 -24 -69 22 57 11 -30 -5 -26 -64 -69 -6 6 -71 37 -29 -80 9 19 -6 9 55 -11 22 -62 14
3096 14 33 -13 25 -19 -14 41 -5 -77 56 4 -12 7 -32 -71 -70 -2 -36 -64 -2 64 -32 -12 25 -23 20 6 76 -59 -37 -52
3126 -52 -31 -67 7 5 -69 -65 -42 -45 -20 20 -16 39 -19 20 19 -38 15 2 -5 41 24 -38 -39 -19 -40 25 -8 -11 -19 -46 38 -9 -79 32
3160 32 61 0 22 32 -9 -22 32 45 -7 -7 48 47 -64 -3 -31 -22 42 -40 -27 12 34 -28 11 26 19 6 -23 11 -63 -26 -30 -37 -28
3193 -28 11 9 -3 -20 -70 -52 13 -51 1 -18 -4 44 -22 16 39 -9 3 -5 -6 20 23 -10 12 -16 -19 -14 -27 36 -39 -11 56 15 28
$$ packed form
2972E1l4k2QM3r1L8M8o4lR9p9mJ00o2Jp3O9k4m2M6j3q8Q8M2j19N0Q2j12RR3Pj26
3004h2O8jL1q1J34Mj18J5Q1o4j9O2o8J8N6K3pnRj8j12J09J8p1j2R4p7k5O6p9J9
3035c2j7k0Q3r1J14k8j07Q9J1l9K0K6k5J6J2okj0N6o4l1M0K2l1O1L7j56M6J5l1
3065d2jN3M4o4k6Q1o9m5R1L5m6m1K5k1l8nO3J2p7J08o6n1Q9J0k5J5M6o6L3q4P6
3096A4J9m6L8m4NN5m6p2J33n2j6J9l9l9JO8l4k8O2O6r6K0L7m8M3j4P0j35K2j5
3126e2K1l6P4kp4MK3lK5M0l6N5n8L9jn7N3j3pM6j7o2jK0k1O5l3lqk7Q4m7p0J11
3160C2K9o1K2J0m1j3N4J3n2%N5jj11O1k8RO4q2J3L9K2o2L9J5pj3k9L4p4L7mpR
3193b8L9kj2j7n0J8O5o4N2j9J4M8o6L8K3m8J2qjK6Ll3K2k8lNj3O3p5K8O7m1J3
$$ plain form
3226 28 44 25 49 43 11 48 -25 -61 -3 6 -31 -14 -29 -49 -6 13 -23 -11 -8 30 -7 -11 31 -2 -64 28 -2 4 6 -21 -43 15 -17
3259 -17 -22 2 -26 -7 6 11 -1 -30 -30 -34 17 -31 13 14 38 -23 -26 22 -18 -38 32 -15 -3 107 39 -6 4 5 -30 -41 1 25 -50
3292 -50 -7 44 -50 -3 63 -53 63 23 -18 -46 -31 4 -14 -58 11 -59 -120 62 26 -11 18 53 -69 -17 40 -16 -46 68
3320 68 61 -18 -41 29 -55 -37 -17 -24 -109 32 38 -37 35 -10 11 -91 -10 45 24 -53 28 4 -38 52 24 -52 12 -54 -20 12 -18
3351 -18 19 -16 11 67 59 -15 47 13 -49 32 -40 -47 -28 27 6 -13 -29 -45 -12 -44 21 -67 -89 13 -46 -43 -4 25 0 -9 15 40
3383 40 -8 10 33 -34 -29 55 9 -26 28 -6 -41 25 -44 -1 -53 -5 -8 -63 44 22 -68 19 70 -15 19 11 -3 -21 -31 14 29
3414 29 -18 41 53 -5 -43 23 -80 -7 15 -37 1 -14 51 -1 -28 36 22 -20 72 27 -10 5 25 -30 -68 -21 -21 3 58 44
3444 44 -69 -39 44 9 -27 53 -36 -11 -62 -15 -28 1 -27 -2 8 -43 107 -18 -27 31 -39 -18 9 6 -8 -51 14 31 -33 21
$$ packed form
3226B8J6j9K4ol2L7p3l6N8Rl7J7j5k0M3J9l6J2LL8l7mM2l3o2R2l0OKk7k2N8l2
3259a7nK4k8J9J3Nj2k9%mN1m8M4JK4o1lM8m0k0P0m7J2J10o8m5J0Jl5j1M2K4p5
3292e0M3N1r4M7O6j16J16m0m1k8J5L5j8m4O9p0o1J82l6l7K9L5j22N2N7n6l0J14
3320F8pp9k3P0q4J8K0pq5J41Op5P2m5K1j02Q1N5k1p7Q1k4m2R0k8p6O4o6L4L2l0
3351a8L7l5K7N6qp4O2l4o2Q1p2pJ9N5k1j9j6j6L3l2O5q8k2J02n9LL9K9k5rK4K5
3383D0m8J8K3o7NQ4m6l5N4l4l5O6o9M3n2M8ln5J07k2r0Q7N1q5L4qj4j8j0M5J5
3414B9m7N9J2n8l8O6j03P3K2n2L8j5O5n2k7O4j4m2R2m5l7J5K0n5l8M7%K4N5j4
3444D4j13L0Q3l5l6Q0q9K5n1M7j3K9k8K5J0n1J50j25rN8p0K1K7lj4m3O5J7o4N4
$$ plain form
3474 21 0 -21 -54 56 21 5 -1 26 -12 22 29 -30 -45 0 -36 -55 10 -18 -86 -52 24 -20 4 3 76 -11 30 14 -9 -68 15
3505 15 64 -41 -37 -61 -36 -5 19 -21 10 -10 -73 4 -28 18 52 9 25 25 -51 38 46 51 -7 0 -13 23 -44 33 2 -8 16 -9
3537 -9 -41 4 -53 -19 -17 -62 46 -14 21 53 31 -20 13 -58 36 31 -42 -22 49 1 6 18 -26 -25 24 -30 14 5 1 45 9 -6 17
3570 17 -8 9 -8 -9 -33 27 -22 31 -38 7 53 -30 43 1 0 37 -58 1 32 46 24 -27 -37 39 2 -11 29 -2 12 -46 -25
3601 -25 27 49 -2 35 -11 -53 25 -12 -5 31 34 55 9 1 -27 5 66 56 -40 -23 73 -6 -4 8 -16 -7 59 15 -15 33 -23 -30 -14
3634 -14 26 26 -2 -14 49 -18 -8 16 -21 -20 -35 -34 33 -3 4 82 7 -6 8 -11 22 -16 -17 -13 -16 -22 16 -34 8 -30 -28 0 26 34 -26
3669 -26 -2 -61 50 71 -31 13 9 3 13 42 13 63 -6 18 -38 -6 33 13 58 14 -9 -38 -36 -20 5 -20 25 -26 35 17 56
3700 56 6 -1 -27 -41 10 -20 -53 -13 -14 18 -10 -51 29 42 -54 -2 -8 36 19 49 10 17 28 6 29 48 -8 -9 -61 11 35 -6 -33
$$ packed form
3474B1k1k1l3J10l5j6oK7l8L4Pn9j5M5l6j9O5k8o8L4P6m4K4jP3q7M1j6k3n9Q3
3505A5M9j05Mk4K5L1K4m0L1k0o3P7l2M6L4m3J6%p6Q9QNn8Pj3L6o7P7l1j0K4k5
3537il2M5n7L4Km5J08o0L5L2k2n1L3p1R4np3K0P1m8NJ2m4JM9n4M4rmM4l6j5K3
3570A7k5J7j7jk4O0m9N3o9M5M6q3P3m2jL7r5N9L1J4k2n1j0P6l7j3M0l1J4n8K1
3601b5N2K2n1L7m6m2P8l7PL6LK1m6qk8L2O1j0r6J7R6p9KJ2k4RO6m4l0M8n6pJ6
3634a4M0%k8j2O3o7J0K4l7Jj5JO7l6PP8p5j3J4j9L3l8jMloL8n0M2l8KK8K6Qo0
3669b6K4n9J11K1j02M4moJ0K9k9N0o9K4n6L2L9k0M5m4k3k9KJ6K5k5M5n1O1j8L9
3700E6n0pk6j4N1l0l3M0jL2k8m1Q0J3r6N2oM4j7L0l9PJ1k2K3J9n6jn2P2K4m1k7
$$ plain form
3733 -33 34 -39 -6 -33 32 8 -16 36 -24 -2 -42 -9 -84 22 5 23 15 9 -57 -45 -8 5 -31 -74 52 29 -56 19 16 3 6
3764 6 23 2 -6 40 -6 21 31 17 -9 -59 -2 16 -9 -28 73 -17 -15 -15 -40 -62 9 -22 -22 -35 36 -35 14 47 10 -61 25 -2
3796 -2 -12 -10 -14 20 -29 16 25 42 -36 52 19 -17 2 -29 28 3 -34 42 -2 20 81 -27 46 87 -56 17 47 41 -40 -28 35 20
3828 20 -35 30 -23 -26 9 17 -63 8 39 -20 12 -38 -16 -29 34 -39 16 -20 -95 -32 -92 -25 33 27 -13 41 -19 -3 7 42 -45 3
3860 3 22 9 -34 12 34 -40 -11 12 4 -10 3 9 -29 15 60 -14 24 -1 5 -40 55 5 -18 -2 20 17 -38 65 14 46 21 9
3892 9 -4 -15 -7 -8 -6 47 -3 -58 67 19 23 28 10 -32 -25 -9 9 -21 -26 22 -33 -10 15 40 -77 -34 41 48 66 17 -28 -107 -21 56
3926 56 5 45 -42 -26 -49 17 -13 -62 -53 -33 34 18 -12 -54 -2 -58 -18 8 20 -10 -26 -13 11 -45 -24 -53 -21 -38 -74 10 58
3957 58 -20 -44 25 31 -34 -2 62 -7 -13 28 8 -26 4 20 -35 95 33 -32 36 -15 37 -39 -57 -10 15 -14 4 -17 -39 31 22
$$ packed form
3733c3O7p3L3k7O5k4k4N2o0K2m0L3p5J06j7J8qoo6J2L7J3l6m3J26k3q5P5lj3L
3764FJ7k1qM6m6K7J0j4k6n0N7J8k5j9J01r0K%k5k2P1l1%j3P1p1M9L3l7p1Q6k7
3796bj0KmL4m9M5RJ7p8Q8l3l6J9l1N7k5l7P6m4K2O1j08P3M1j43P3L0oq1J2O3j5
3828B0n5O5n3lL5Qq0P1L1n9L2n0K2j3O3p3N5l6p5O3o0O7N8om0N4o0J6J0L5q7M8
3860CJ9j3m3M6K2p4K9K3qj4J3Ol8M4M5p4L8k5Om5R5n0k3J6K2ln5J03n1L2k5j2
3892Ij3j1QjKN3n0n5J25m8MNj8m2PJ6J8l0nM8n5K3K5K5j17M3P5PJ8m9m5p9Q6P7
3926E6n1M0q7J6k3O6l0m9RK0O7j6l0m2N2n6M0K6J2l0j6J3K4n6K1k9L2j7l6Q4M8
3957E8p8k4O9Oo5L2O4o9oM1k0l4L0J6n5J30o2o5O8n1N2p6j8M7K5k9J8k1k2P0r
$$ plain form
3988 22 -33 26 45 29 -19 -4 22 -32 -6 -7 -34 -37 2 -18 -42 76 -12 -7 6 3 -22 -1 -59 12 -35 7 24 32 2 14 -13 2
4020 2 48 14 -13 -10 -17 -3 -28 43 11 -87 -30 22 -2 5 -14 -21 1 18 -11 -53 0 -25 9 25 25 -28 38 47 19 -47 26 -19 -35 23
4054 23 -53 3 -17 -36 -3 39 -4 3 48 -44 50 -10 2 -30 -24 27 16 -22 -18 -49 -39 5 27 -36 10 45 43 -43 -17 59 -68 34
4086 34 27 -37 -14 59 -25 -31 19 -1 -56 -13 -47 11 43 30 49 -17 27 39 9 -68 62 20 -40 -7 45 -21 -91 -11 -18 -24 -47 21
4118 21 -8 -37 -10 -83 -4 30 -19 -4 -85 -9 36 -50 6 24 37 -1 16 -17 -21 -40 -9 -66 -51 19 -29 -50 65 60 1 2 56
4149 56 -6 -54 -15 -8 -25 -64 29 -9 -25 22 13 -53 -63 43 11 -39 -52 5 6 18 25 -30 -52 -72 22 9 1 16 -5 31 -44 -21
4181 -21 17 -21 7 11 -10 -19 16 22 38 45 -28 -15 1 15 4 -34 37 5 3 18 3 -19 2 22 5 -30 -39 -54 -3 9 2 13 -24 -126
4215 -126 -4 -1 -85 -26 57 66 -16 34 13 -38 3 12 0 -22 -5 -36 9 -26 25 -32 7 23 16 -42 -32 -11 3 8 -28 42 -21 -4
$$ packed form
3988B2n5N9J9j6m8J5K6n4K6jk7lL9k0k4J18q8NJ3lk5K1n8P1m7M2J7Ql0J2k7J5
4020BM6l4k7LpJ4k5P1l2r8N7N2k4Pj9pK2J7k9m2N3k5L4J6%n3O6Rk8o6P3m5j6N8
4054B3p6N6k0j9L3M2m3PM5r2R4o0J2l2ON1j1l8Ml1J0M4K2o3M6L5kq6K6P6j27J02
4086C4po4K3P3q4oN0k0n5M3l4N8L2j3J9o6M4J2l0p7J30m2o0L3N2o6p0Q0pok3O8
4118B1k9k9K7p3P9L4m9J5q1P6M5q6N6J8J3l8J7l3mj9L1n7J5P0m8k1J15nn9JN4
4149E6o2m8L9Pj7l9R3l8j6M7ro6j0J06l2n0j3N7JJ2Pn5k2k0R4j3qJ5k1L6p5K3
4181b1L8l8K8Mk1rL5OJ6Pp3J3J6J4j1l8P1l2kJ5j5k2K1K0j7l5rj5N1J2pJ1l7j02
4215a26J22Lq4N9Q3Rq2N0k1n1M1Rj2k2J7l1M5l5N1n7L9J6pn8J0K1J4Nl6P0o3J7
$$ plain form
4247 -4 -23 -21 23 8 -38 -74 14 -25 -31 7 -7 39 5 -9 67 -4 23 58 46 55 -5 25 -8 -30 10 61 -10 16 -4 -66 -15 -25
4279 -25 -21 -25 9 -25 24 36 -40 -40 -40 -22 -36 -54 -14 101 -32 -120 2 -10 -42 33 21 -37 52 -11 13 -38 51 -17 3 36 7
4310 7 -8 20 19 -39 30 2 23 -16 -10 8 8 -5 -3 -11 3 43 -38 -31 -3 -24 -27 10 53 -16 -14 2 40 22 -6 30 -48 -64 1 42 -35
4345 -35 2 -43 4 -38 37 17 5 14 88 7 28 4 -52 -5 -26 24 -45 24 33 -4 -14 -13 25 -45 8 -13 3 0 30 -17 -5 -33
4377 -33 -79 -42 -26 -39 -17 -56 20 -33 -91 -11 16 -14 -3 28 9 -39 21 -16 31 8 27 26 8 55 -39 -27 17 12 -53 -103 0
4408 0 8 0 -52 47 5 -52 49 1 21 -29 -53 -9 -3 -24 24 10 -28 60 8 -24 -13 -48 -34 -22 36 -26 44 -16 18 29 64 -7
4440 -7 -26 30 23 7 -5 22 7 -58 0 8 -27 -10 22 4 -31 -38 -24 -38 -7 49 -12 34 37 -18 -48 16 17 19 -49 7 42 -50 -58 -44
4474 -44 -7 64 40 -5 7 15 20 7 -14 -17 -17 -48 13 13 80 9 -15 -3 -22 -18 -36 19 -37 -18 -29 -81 -48 -48 -34 -39 14 -7 -34 31
$$ packed form
4247dj9KM4j5m6l6Q8l9oL8j4M6l4j4P6p1K7L5j2Ro0L0l3k2M0N1p1K6k0o2N1j0
4279b5MmL4l4M9J2p6%%J8j4j8M0J15j33q8J22j2l2P5j2n8Q9o3K4n1Q9o8K0L3k9
4310Gj5K8jn8O9k8K1l9OJ8%j3KqJ4M0q1PK8k1lL7M3o9KJ6L8j8k8L6p8j6O5M1p7
4345c5L7m5M7m2P5k0j2RP4q1K1k4n6M7k1N0o9O9Rl7j0JL8p0N3k1J6lL0m7J2k8
4377c3m6L7J6j3K2l9P6n3n8Q0K7l0J1L1j9m8O0l7M7k3J9jj8M7r4J2M4no5n0J03
4408@Qqn2R9m2n7J01m8K0n0k4M4Ok1M8j4l8Q8n2l2J1l5J4J2N8o2P0o0L4J1L5p1
4440gj9N6pj6j2K7j5o5N8Ql5J7L2j8l5pJ4j4L1N6o1M6Ln5l0O4JKo8N6L5r2qJ4
4474d4L7P1k4m5J2QNj3k1l%l1O1%O7p1k4J2j9Mj8N5n6J9j1n2L3%J4nN3k1k7O5
$$ plain form
4508 31 37 14 -36 16 35 -18 -17 11 61 -31 0 -6 27 -31 -71 33 -40 -26 1 15 -14 44 -10 3 -54 -31 17 -37 11 9 -67 -53
4540 -53 8 -43 3 -30 8 42 -50 -32 -38 -1 11 7 -5 25 66 27 -44 44 -15 9 -20 -17 -25 -30 32 -46 -55 6 8 12 -79 -21 28 -21
4574 -21 6 54 10 -12 16 35 -10 -8 53 -6 9 59 -23 7 -34 1 -42 -21 21 34 -35 7 17 -1 4 -23 -37 57 49 53 23 -64
4606 -64 -52 -4 -58 2 -1 -50 -15 23 32 -18 -6 32 -46 -59 -19 18 -37 56 87 -4 22 1 16 -40 -10 20 7 -25 29 -35 -7
4637 -7 31 39 -11 -14 45 1 -15 -8 4 69 -33 35 54 -83 -17 10 -8 17 7 -65 -38 -46 -41 -29 -10 28 -4 17 -11 30 -29 -28 25
4670 25 -3 23 -21 39 -36 -118 -3 -5 -36 -33 69 -1 -4 9 -27 -25 -3 37 6 4 40 3 6 -27 71 36 -64 63 13 -16 -25 6
4702 6 36 -19 40 -33 -25 -29 76 15 -15 4 42 -17 -56 69 -46 -10 17 -8 -49 -45 47 16 -34 5 25 -77 30 77 12 -68
4732 -68 41 -17 -22 -36 26 -36 -51 32 55 -34 -20 62 -16 -19 36 -4 -26 -25 -50 -71 -34 49 -14 -30 -13 55 -59 -12 69 -20 -70
$$ packed form
4508C1Ok3n0N2J9n3JK8N0r2L1oL3n8m0J04p3J4K7J4k9N8n4J3n7K3M8n4M8kp6J4
4540e3O1n1M6l3L8L4r2J8oL7J2mj2L0M1l9p1Q8n9K4k9LqnO2p8rO1KMr1N8M9m9
4574b1K7M8m4k2K8J9m5KO1n9J5N0q2L0m1L5m3K1M2J3o9M2J0j8Nk7j4R4qMl0q7
4606f4J2M8n4O0lm9L5L8Rn0J2L8p8j3M0L7n5R3L1r1K6k1J5n6L0L0j3l2N4o4K8
4637gL8Qn0lN9m4j6PJ2O5j02O8J9j37O6K7j8K5j0p2K7qNJ2J9L8l2K1k8M1n9JN3
4670B5k8K6m4O0p5q2J15kl1LJ02p0lJ3l6KK2M0l1kL6l7Ll3R8l5j00J27n0k9rL1
4702FL0n5N9p3QmJ05o1l0J9L8n9l9J25j15L6K7k5m1MR2l1n0L9K0j02J07M7o5q0
4732f8J09n8nj4O2o2j5Q3K3q9J4Q2p8lN5m0k2Jk5k1L7Q3o3j6J7O8j14M7Q1q9n0
$$ plain form
4763 -70 -43 -3 -65 2 0 -2 0 18 7 58 -33 31 1 3 76 30 -14 -29 13 -17 12 52 51 -96 -11 -20 -14 -57 41 27 -15 -38 -15
4796 -15 -34 -25 -55 20 -18 -18 -1 -34 39 13 11 3 25 29 -29 -26 -44 -19 -23 12 -34 -16 37 33 15 35 13 -16 34 10 -37 -60 -38 -41 3
4831 3 12 55 -29 25 56 30 -74 -2 -9 -48 -30 -43 1 -3 3 5 11 55 45 -47 -45 26 17 4 48 -6 -19 -37 40 21 -55 24 -3 -45
4865 -45 -38 26 -17 24 42 -18 -18 -14 62 23 -46 74 41 -67 -49 18 -67 -10 112 23 -13 -10 -17 -43 3 18 33 -66 48 54 -27
4896 -27 29 52 -70 7 -32 60 -3 6 -38 11 -26 16 6 -25 44 5 5 47 -26 -37 -16 5 -30 13 -18 19 -7 0 24 -16 -34
4927 -34 22 16 9 -65 12 10 -9 -12 -6 -12 22 17 7 -27 19 33 12 12 -8 13 -13 18 -9 -36 -4 -25 -42 -57 0 34 -29 81 4 -11
4961 -11 -37 -6 -21 -23 13 8 -27 -5 -42 7 -11 2 29 28 -4 -29 49 -4 9 -56 21 31 -30 24 -27 43 10 6 -1 36 49 -66
4993 -66 -85 -41 -5 12 1 29 3 17 25 -8 11 16 -49 -69 14 -1 10 -6 22 -32 -6 -32 -76 17 -36 -17 46 9 37 20 -8
$$ packed form
4763g0K7M0o2O7kkKJ8j1N1r1O4l0KP3m6m4j5M2l0K9M0jj47Q5rOm3R8j4m2k3K3
4796a5j9Rl0P5l8%J7l3P3k6kqK2Mn8Lj8K5mL5m6J8N3mj8K0k2k9N0k4m7k3K2lM4
4831CRM3q4N4L1k6j04P2pl9J8j3M4mOKOM4j0r2KP1rj3M4n4j3j8P7j9p6P9k7m2
4865d5PO4m3M1J8o0%MP6l9o9J20l3j08J8O7q5N7J22q9l6Lpk6M6J5J5r9J14Oq1
4896b7N6K3j22P7l9R2o3Rm4M9l7M2j0l1O9l9%M2p3j1K1K1l5M3l1L7k6PK4m0j8
4927c4N6opp4P7kj9lOoL4nj0l4M6J4k1%k0K1k6L1k7k7L2k1j7j5N7L4o3J10p7j5
4961a1k6L1j5kL6nl5K2l7M9j8J3K7jl2k5P8n3J3o5P7J0o1N4n1P0l3mpL7J3j15
4993f6j9M4L6J7j1K8k6J4Ql3J9No5k0Q3j5J1j6K8n4K6k6m4R3n3J9O3l7K8j7k8
$$ plain form
5024 -8 -21 -15 28 55 24 6 7 -16 -26 33 2 -45 29 -14 -22 -38 -1 5 6 1 58 28 -9 25 -15 -14 -46 10 -17 -33 -15 -23 -59 6 -4
5059 -4 -12 -75 35 -40 -53 33 52 12 -56 48 14 -52 13 43 -38 24 -17 -31 -16 -24 -29 -10 -24 25 21 -42 -9 -12 -18 4 -10 -60 -41
5092 -41 21 49 -16 1 -11 4 -7 52 60 -40 -58 19 -1 -34 -46 92 39 -37 33 54 -46 56 12 18 22 36 -12 9 -39 20
5122 20 -49 -35 0 -13 -16 11 64 -31 -11 -21 5 0 40 21 1 -44 30 68 -10 59 -12 22 -23 22 32 -37 -66 21 6 -40 34
5153 34 89 -12 60 47 7 -3 42 39 -49 35 41 -8 -63 -5 -27 -60 -63 10 -49 -39 -7 6 -3 -5 13 -25 -70 52 -21 -83 -6 44
5185 44 -23 9 0 1 -43 9 56 -27 -12 29 15 27 39 8 -18 -53 17 13 -43 26 71 -24 -28 71 41 -25 75 -9 -66 -34 -26 -43
5217 -43 -96 -23 20 -32 -25 48 55 -6 37 13 -56 -9 3 -36 -33 -30 81 -28 -26 -14 -15 -8 34 -48 -11 63 40 -16 -81 56 25 -39
5249 -39 68 50 -57 -15 11 -52 20 -16 -5 -5 -78 -8 -41 -78 22 3 -41 -2 -11 -11 -32 25 75 -1 -48 -15 71 -11 -1 57
$$ packed form
5024hj3OM3K7l1j8Jk3j0N9l1m7P4m3qj6L7OJnN7l0l7L4m0Jl2N6k7j6J8ql6O5j0
5059dqo3J10p5j3Q6J9m0o8J04l4o6O5L0q1O2m1j4J5qnJ9j4M9mo3L3loK2j4n0J9
5092d1O2K8o5J7j2J5j1N9Qj00j8P7k0l3j2J38n3p6P0K1j00J02m4OMJ4m8K1m8N9
5122B0o9J4L5j3lK7N3r5K0j0K6nM0j9k0m5P4L8p8O9p1L4m5M5J0o9k9Q7j5m6P4
5153C4N5j01P2j3m0j0M5lq8Q4Om9n5N8k2l3lP3n9J0L2J3rkJ8l8m5J22p3o2P7N0
5185D4o7L2rJm4N2M7q3J5M1j4J2J2l1k6l5P0mn6O9M5r5mR9l0o6J00q4n7L2Qj7
5217d3n3P3M3n2PP3Po1M3k4o9M7J2l9LLJ11j09KJ2jPM2q2L7P4k3n6o5J37l1o4
5249c9J07j8j07M2K6o3P2l6J1%p3P0l3l7J00j9m4L9r%k1N7N0p6m7L3Q6q2J0N8
$$ plain form
5279 57 -5 -5 29 19 -4 -52 36 -18 -57 -6 -40 -77 -64 23 -15 53 -18 18 -8 -36 45 16 -49 43 -46 -29 12 -4 3 -4 50 17
5311 17 23 26 12 -9 -30 22 67 7 -29 -8 -30 -28 0 29 -11 -59 -22 -15 -103 -55 -13 -42 -79 20 30 20 -21 39 -7 -74 6 8 -55
5344 -55 0 -11 -70 -42 -3 -32 7 12 -3 26 -79 82 18 -25 -40 25 -9 31 -14 -9 -6 -17 20 -36 -17 0 48 -58 9 19
5374 19 -8 -11 -13 66 -13 14 4 -10 -37 -15 -59 -28 -37 8 -29 13 23 2 -58 -3 -3 -38 5 53 -40 -18 69 36 25 58 -13 56
5406 56 21 -20 -3 23 22 49 -12 37 2 -20 12 -6 -55 -8 -20 -43 -52 13 -17 12 -44 -11 62 26 -47 15 -26 -23 -73 -68 10 1 -1
5439 -1 31 6 -78 6 8 7 -8 -27 51 41 -36 38 77 -30 18 31 -3 14 43 21 19 -10 -70 -1 -64 10 -46 -18 -67 -14 58 -12
5471 -12 -24 75 6 -20 4 -25 -45 35 -3 15 10 -18 8 -74 30 -8 -51 -19 117 -4 -37 52 -61 -9 7 33 23 16 38
5500 38 -9 -39 -19 14 -52 -35 -12 -29 -13 -9 -23 -67 -16 23 -33 -13 -27 27 -4 -16 27 39 -19 -24 9 -10 -28 29 -33 -26 46 1
$$ packed form
5279E7o2%L4j0k3m8Q8n4l9N1l4l7J3Q7l8O8p1L6k6k8Q1k9o5R2q9J7M1j6PpN4l3
5311A7OLj4k1k1N2M5o0l6K1k2KK8K9m0m8L7Pq8M8M2k9l7R9J0j0m1O0m6o7Q0Ko3
5344e5N5j1n9K8L9k9L9Nj5K9j05J61o4m3j5O5l4M0m5NLj1L7n6J9J7M8j06O7J0
5374A9k7lkP9p9K7j0j4k7K2m4L1rM5l7M2J0k1o0N5%l5M3M8r3K2Q7l3j1L3p1O9
5406E6l5m1J7K6jK7o1M9l5k2L2j8m9M7j2k3rO5l0K9n6L3P3l6p3O2m1Ln0NP8rk
5439aL2k5q4Q4Kjj5j9P8j0p7P4L9j07M8J3l4J7K9k2kk9o0O9o3P4n6K8m9N3P2p0
5471a2j2R9o9k6K4k9k0Q0l8J8nk8K6q2J04l8m3L2J36j21l3Q9j13N2J6K6j0pK2
5500C8m7l0K0L3o6J7K3j7J6Mj4m4N1L9n6K0j4N4l1j2M3J2n8nL3j9j8N7o2PP2m5
$$ plain form
5532 1 -59 -2 65 0 16 9 -29 -36 -8 -55 20 13 68 0 -37 1 -18 -19 -1 16 -6 -32 -47 10 -37 -24 27 23 7 2 53 -24 -37 27
5566 27 -12 -29 38 -14 2 23 -25 -14 -57 -1 23 -18 -6 -11 -27 23 24 -7 -21 6 52 -5 -68 29 -6 -56 14 -1 5 -55 -52 -37
5598 -37 49 -46 -37 6 -22 37 77 -40 0 29 8 -13 8 39 -11 12 12 -57 -25 -2 50 14 -41 -19 -13 17 -12 -8 -15 -4 -23 22
$$ packed form
5532Ao0N7O7o5J6pl8pK8m7P5pN5o8l7L8j9jJ8J7k2k6j5N7m7J3N1mj6nN1p7j3O4
5566B7l9j7O7n2J6K1m8J1m3N6K4m1J2nj6N0Jl1j4K7M6n7o3R7l5n0P0j5Oo0LJ5
5598c7Q6r5RM3k8N9M0j17M0K9k1k1K1L1n0K3%o9L2K3N2l6n5K2OL0k9MpJ1j9M5
$$ [...]
8191d3
##END NTUPLES=NMR FID
##END=
