##TITLE=1H_DE-80H_X3
 200.13MHz, d2o
 8 sc
 
 19ns.26.2.2025
##JCAMPDX= 6.0         $$ Bruker NMR JCAMP-DX V2.0
##DATA TYPE= NMR FID
##DATA CLASS= NTUPLES
##ORIGIN= UXNMR, Bruker Analytische Messtechnik GmbH
##OWNER= pz
$$ XWIN-NMR		Version 3.5
$$ Tue Sep 16 11:39:20 2025 Russian Standard Time (UT+4h)  Yarkov@DPX200
##.OBSERVE FREQUENCY= 200.1313
##.OBSERVE NUCLEUS= ^1H
##.DELAY= (6, 6)
##.ACQUISITION MODE= SIMULTANEOUS
##.ACQUISITION SCHEME= undefined
##.AVERAGES= 8
##.DIGITISER RES= 18
##SPECTROMETER/DATA SYSTEM= spect
##.PULSE SEQUENCE= zg30
##.SOLVENT NAME= CDCl3
##.SHIFT REFERENCE= (INTERNAL, CDCl3, 0, 14.3821)
##AUDIT TRAIL= $$ (NUMBER, WHEN, WHO, WHERE, WHAT)
$$ ##TITLE= Audit trail, XWIN-NMR		Version 3.5
$$ ##JCAMPDX= 5.01
$$ ##ORIGIN= Bruker BioSpin GmbH
$$ ##OWNER= Yarkov
$$ C:/Bruker/XWIN-NMR/data/yarkov2/nmr/H-C/1/audita.txt
$$ ##AUDIT TRAIL=  $$ (NUMBER, WHEN, WHO, WHERE, WHAT)
(   1,<2025-09-16 11:38:36.37 +0400>,<Yarkov>,<DPX200>,
      <created by zg, POWCHK disabled, PULCHK disabled
       configuration hash MD5:
       00 E9 B6 7A A2 85 ED C7 34 08 36 98 17 FE 4E 26
       data hash MD5: 16K
       CF 40 22 34 43 FA 02 61 BC 14 AB B5 01 4B DA 84>)
$$ ##END=
$$ 
$$ hash MD5
$$ BE 68 9D 32 C4 71 EF 78 D5 80 C8 ED DA 70 C4 A1
##$RELAX= 
##$RELAX= 
##$RELAX= 
##$RELAX= 
##$RELAX= 
##$RELAX= 
$$ Bruker specific parameters
$$ --------------------------
##$DU= <C:/Bruker/XWIN-NMR>
##$EXPNO= 1
##$NAME= <H-C>
##$PROCNO= 1
##$TYPE= <nmr>
##$USER= <yarkov2>
##$AMP= (0..31)
100 100 100 100 100 100 100 100 100 100 100 100 100 100 100 100 100 100 
100 100 100 100 100 100 100 100 100 100 100 100 100 100 
##$AQSEQ= 0
##$AQ_mod= 1
##$AUNM= <au_zg>
##$AUTOPOS= <>
##$BF1= 200.13
##$BF2= 200.13
##$BF3= 200.13
##$BF4= 200.13
##$BF5= 200.13
##$BF6= 200.13
##$BF7= 200.13
##$BF8= 200.13
##$BYTORDA= 1
##$CFDGTYP= 0
##$CFRGTYP= 5
##$CHEMSTR= <none>
##$CNST= (0..31)
1 1 145 1 1 1 1 1 1 1 1 1 1 1 1 1 1 1 1 1 1 1 1 1 1 1 1 1 1 1 1 1 
##$CPDPRG= <>
##$CPDPRG1= <>
##$CPDPRG2= <>
##$CPDPRG3= <>
##$CPDPRG4= <mlev>
##$CPDPRG5= <mlev>
##$CPDPRG6= <mlev>
##$CPDPRG7= <mlev>
##$CPDPRG8= <mlev>
##$CPDPRGB= <>
##$CPDPRGT= <>
##$D= (0..31)
0 0.7 0 0 0 0 0 0 0 0 0 0.03 0 0 0 0 0 0 0 0 0 0 0 0 0 0 0 0 0 0 0 0 
##$DATE= 1758008315
##$DBL= (0..7)
120 120 120 120 120 120 120 120 
##$DBP= (0..7)
150 150 150 150 150 150 150 150 
##$DBP07= 0
##$DBPNAM0= <>
##$DBPNAM1= <>
##$DBPNAM2= <>
##$DBPNAM3= <>
##$DBPNAM4= <>
##$DBPNAM5= <>
##$DBPNAM6= <>
##$DBPNAM7= <>
##$DBPOAL= (0..7)
0.5 0.5 0.5 0.5 0.5 0.5 0.5 0.5 
##$DBPOFFS= (0..7)
0 0 0 0 0 0 0 0 
##$DE= 6
##$DECBNUC= <off>
##$DECIM= 32
##$DECNUC= <off>
##$DECSTAT= 4
##$DIGMOD= 1
##$DIGTYP= 9
##$DL= (0..7)
0 120 120 120 120 120 120 120 
##$DP= (0..7)
150 150 150 150 150 150 150 150 
##$DP07= 0
##$DPNAME0= <>
##$DPNAME1= <>
##$DPNAME2= <>
##$DPNAME3= <>
##$DPNAME4= <>
##$DPNAME5= <>
##$DPNAME6= <>
##$DPNAME7= <>
##$DPOAL= (0..7)
0.5 0.5 0.5 0.5 0.5 0.5 0.5 0.5 
##$DPOFFS= (0..7)
0 0 0 0 0 0 0 0 
##$DQDMODE= 0
##$DR= 18
##$DS= 0
$$ [...]
##$SUBNAM2= <"">
##$SUBNAM3= <"">
##$SUBNAM4= <"">
##$SUBNAM5= <"">
##$SUBNAM6= <"">
##$SUBNAM7= <"">
##$SUBNAM8= <"">
##$SUBNAM9= <"">
##$SW= 18.0517328524113
##$SWIBOX= (0..15)
0 0 2 0 0 0 0 0 0 0 0 0 0 0 0 0 
##$SW_h= 3612.71676300578
##$TD= 16384
##$TD0= 1
##$TE= 0
##$TE2= 300
##$TE3= 300
##$TEG= 300
##$TL= (0..7)
0 120 120 120 120 120 120 120 
##$TP= (0..7)
150 150 150 150 150 150 150 150 
##$TP07= 0
##$TPNAME0= <>
##$TPNAME1= <>
##$TPNAME2= <>
##$TPNAME3= <>
##$TPNAME4= <>
##$TPNAME5= <>
##$TPNAME6= <>
##$TPNAME7= <>
##$TPOAL= (0..7)
0.5 0.5 0.5 0.5 0.5 0.5 0.5 0.5 
##$TPOFFS= (0..7)
0 0 0 0 0 0 0 0 
##$TUNHIN= 0
##$TUNHOUT= 0
##$TUNXOUT= 0
##$USERA1= <user>
##$USERA2= <user>
##$USERA3= <user>
##$USERA4= <user>
##$USERA5= <user>
##$V9= 5
##$VALIST= <valist>
##$VCLIST= <CCCCCCCCCCCCCCC>
##$VD= 0
##$VDLIST= <DDDDDDDDDDDDDDD>
##$VPLIST= <PPPPPPPPPPPPPPP>
##$VTLIST= <TTTTTTTTTTTTTTT>
##$WBST= 1024
##$WBSW= 4
##$XGAIN= (0..3)
0 0 0 0 
##$XL= 0
##$YL= 0
##$YMAX_a= 256173
##$YMIN_a= -125929
##$ZGOPTNS= <>
##$ZL1= 120
##$ZL2= 120
##$ZL3= 120
##$ZL4= 120
##$ABSF1= 10
##$ABSF2= 0
##$ABSG= 5
##$ABSL= 3
##$ALPHA= 0
##$AQORDER= 0
##$ASSFAC= 0
##$ASSFACI= 0
##$ASSFACX= 0
##$ASSWID= 0
##$AUNMP= <proc_1d>
##$AZFE= 0.1
##$AZFW= 0.1
##$BCFW= 1
##$BC_mod= 2
##$BYTORDP= 1
##$COROFFS= 0
##$CY= 83.5205535888672
##$DATMOD= 1
##$DC= 2
##$DFILT= <>
##$DTYPP= 0
##$F1P= 10.8118882576601
##$F2P= -7.23987719738617
##$FCOR= 0.5
##$FTSIZE= 0
##$FT_mod= 4
##$GAMMA= 1
##$GB= 0.15
##$INTBC= 1
##$INTSCL= 1
##$ISEN= 128
##$LB= 0.25
##$LEV0= 0
##$LPBIN= 0
##$MAXI= 10000
##$MC2= 0
##$MEAN= 0
##$ME_mod= 0
##$MI= 1.114404
##$NCOEF= 0
##$NC_proc= 0
##$NLEV= 6
##$NOISF1= 3.799351
##$NOISF2= 2.8
##$NSP= 1
##$NTH_PI= 0
##$NZP= 0
##$OFFSET= 14.38212
##$PC= 1
##$PHC0= -1352.778
##$PHC1= -0.009078503
##$PH_mod= 1
##$PKNL= yes
##$PPARMOD= 0
##$PSCAL= 0
##$PSIGN= 0
##$REVERSE= no
##$SF= 200.129724274929
##$SI= 16384
##$SIGF1= 3
##$SIGF2= 2
##$SINO= 400
##$SIOLD= 16384
##$SREGLST= <1H.CDCl3>
##$SSB= 0
##$STSI= 0
##$STSR= 0
##$SW_p= 3205.1282051282
##$SYMM= 0
##$S_DEV= 0
##$TDeff= 0
##$TDoff= 0
##$TI= <>
##$TILT= no
##$TM1= 0
##$TM2= 0
##$TOPLEV= 0
##$USERP1= <user>
##$USERP2= <user>
##$USERP3= <user>
##$USERP4= <user>
##$USERP5= <user>
##$WDW= 1
##$XDIM= 8192
##$YMAX_p= 0
##$YMIN_p= 0
$$ End of Bruker specific parameters
$$ ---------------------------------
##NTUPLES= NMR FID
##VAR_NAME=  TIME,          FID/REAL,        FID/IMAG
##SYMBOL=    X,             R,               I
##VAR_TYPE=  INDEPENDENT,   DEPENDENT,       DEPENDENT
##VAR_FORM=  AFFN,          ASDF,            ASDF
##VAR_DIM=   8192,          8192,            8192
##UNITS=     SECONDS,       ARBITRARY UNITS, ARBITRARY UNITS
##FACTOR=    0.0002768,     1,               1
##FIRST=     0,             0,               0
##LAST=      2.2672688,     0,               0
##MIN=       0,             -125929,         0
##MAX=       2.2672688,     256173,          0
$$ Real data points
##PAGE= N=1
##DATA TABLE= (X++(R..R)), XYDATA
$$ [...]
1025C350J850l786j483L929J650l253k714K282K051l441k440K987J095l809j947
1040c679K852K599k800l029K804K510k514j709K430J963k347k985K687L267k924
1055h75k990K189K557j172k143K162L362k064k692L011K987j761l021R18K919
1070C387j288l341J644K695k298k918J212L056j211m102N52L405j378k754J323
1085b016K816n13k878J163M225n20l413P69K895k72k805j55L083n25l841N66L351
1102A930n09l410n38K964M94l466q0L357k03k905J96L294J001l164r01L500O17
1119B177k931m55K411O69k874j186L536J285l366p98L016J213k273j254K734J266
1135C170l274j186K914P61k712j827J963J659k690j976K376J135k603j415K201
$$ plain form
1025 3350 5200 1414 -69 3860 5510 2257 -457 1825 3876 435 -2005 982 2077 -1732 -3679
1040 -3679 -827 1772 -1028 -4057 -1253 1257 -1257 -2966 -536 1427 -920 -3905 -1218 2049 -875
1055 -875 -3865 -1676 881 -291 -2434 -272 3090 1026 -1666 1345 4332 2571 -450 468 3387
1070 3387 2099 -1242 402 3097 799 -2119 -907 2149 938 -3164 -2612 793 -585 -3339 -2016
1085 -2016 800 287 -2591 -1428 2797 2277 -1136 -367 2528 2256 -549 -704 2379 1854 -1987 -1421 1930
1102 1930 1421 -1989 -2527 437 931 -2535 -2615 742 539 -2366 -2170 1124 2125 -1039 -1940 1560 2177
1119 2177 -754 -1209 1202 1871 -1003 -2189 1347 2632 -734 -1532 1484 2697 424 -830 1904 3170
1135 3170 -104 -1290 1624 2385 -327 -2154 -191 1468 -1222 -3198 -822 313 -2290 -3705 -1504
1150a504K154k038k208K764K467k024j239K309K073j645k115K310K398k473k169
1165i40J838J656j561k391J306K353j964k439J851K137j393k432J059K838j146
1180G72k811J691K425j625k162J006K369j016k999Q61K547j317k397R74K199l59
1196A58k428O82L169m67k630Q67K549l10k462M1K866l70l074N55K626n46k459
1213a233j45K488L37k865J65K880r1k173L3K445P06k644o77K723J46k791l84K053
1231I73M58k621j164K467M56l036n40K130N86j935q75K539J511k292m46K682R68
1248A861j823r90K011J531k167j320K530J110k117j038J651J370k074j889J894
1263E40J232k188j177J709J533j324j811J664J797k102j863J348J243j586k015
$$ plain form
1150 -1504 650 -1388 -3596 -832 1635 -389 -1628 681 2754 1109 -1006 1304 3702 1229 -940
1165 -940 898 2554 993 -1398 -92 2261 297 -2142 -291 1846 453 -1979 -920 1918 772
1180 772 -2039 -348 2077 452 -1710 -704 1665 649 -2350 -1489 1058 -259 -2656 -1682 517 158
1196 158 -2270 -1588 1581 1114 -1516 -649 1900 1590 -872 -831 2035 1665 -1409 -854 1772 1226 -1233
1213 -1233 -1378 1110 1447 -1418 -1253 1627 1536 -637 -604 1841 2547 -97 -774 1949 2095 -696 -1080 973
1231 973 1431 -1190 -2354 113 569 -2467 -3007 -877 -291 -2226 -3101 -562 949 -1343 -1789 893 1861
1248 1861 38 -952 1059 2590 423 -897 1633 2743 626 -412 1239 2609 535 -1354 540
1263 540 1772 -416 -1593 116 1649 325 -1486 178 1975 -127 -1990 -642 601 -985 -3000
1278c000J380K212j548j774J822J747j163j564J113K023q84j911J691K176p89
1293A531j490R17J970q35k547N95J897j441k228P67J888n39k172O14K399q21k184
1310a679P67J742m67j817L29K512j03k264O14K018m38k095l76J870j56k508J82
1327a869K431j30j806J39K066N15k288l01K296J8j974N7J954O96j852p09K166
1344A409K42k335n87J568L67j651p45K217J164j954l99K130N07j760r06J407Q47
1361A521j895j066J954P36j635r48J256J022j748j701J582R52j599q42J681J478
1377G48r28j230J740J533j688j208J360J154j037j270J339J824j193j498J293
1392I39J078j275j686N83J415j075j622J283J671q93j165P26J516q65j963N49
$$ plain form
1278 -3000 -1620 592 -956 -2730 -908 839 -324 -1888 -775 1248 364 -1547 144 2320 1531
1293 1531 41 958 2928 2093 -454 141 2038 597 -1631 -864 1024 485 -1687 -1073 1326 505 -1679
1310 -1679 -912 830 363 -1454 -1125 1387 1284 -980 -366 1652 1214 -881 -1257 613 457 -2051 -1869
1327 -1869 562 432 -1374 -1235 831 1346 -942 -1243 1053 1071 -903 -846 1108 1804 -48 -757 1409
1344 1409 1651 -684 -1271 297 664 -987 -1732 485 1649 -305 -704 1426 1933 173 -733 674 1521
1361 1521 -374 -1440 514 1250 -385 -1333 -77 945 -803 -2504 -922 30 -1569 -2411 -730 748
1377 748 -180 -1410 330 1863 175 -1033 327 1481 444 -826 513 2337 1144 -354 939
1392 939 2017 742 -944 -361 1054 -21 -1643 -360 1311 418 -747 -21 1495 630 -1333 -784
1408g84J454j092j444O58J507l43j728M22J831p43j845N69J589p4j345O34K446
1425A712P1j530P04J644m08j716k96J237k22k047N8J766j87j444m6J420K33j874
1443i25m16J699l4j624K7J587N31j510m55J702J38j894m01J281K48j322m93J759
1461a02R67j457k19J655O06j301p29J248R28j525p59J669N95j241n98J090R05
1478A732j389j124J224O04j463q59R72Q92j017j209J247J081j222r04J197R02
1494F64o61j070R74J434j061j246J014R73r78j195M14J290q25j303R70J396p48
1511D2r14O68J405k96j407P82J431o59j074M76J068m98j620J17J265p31j501M15
1529a031J129j33r85K11J629j55j385L63J291k26j224j14J254r6j497L0J366l23
$$ plain form
1408 -784 670 -422 -1866 -1208 299 -44 -1772 -1350 481 -262 -2107 -1538 51 -23 -1368 -734 1712
1425 1712 1783 253 957 2601 2193 477 181 1418 1196 -851 -793 973 786 -658 -704 716 949 -925
1443 -925 -1341 358 324 -1300 -1273 314 845 -665 -1120 582 720 -1174 -1575 -294 -46 -1368 -1861 -102
1461 -102 865 -592 -811 844 1450 149 -580 668 1596 71 -688 981 1576 335 -263 827 1732
1478 1732 343 -781 443 1047 -416 -1275 -303 589 -428 -1637 -390 691 -531 -1435 -238 664
1494 664 3 -1067 -93 1341 280 -966 48 1021 43 -1152 -738 552 -273 -1576 -606 790 42
1511 42 -872 -204 1201 905 -502 280 1711 1052 -22 454 1522 1024 -596 -479 786 55 -1446 -1031
1529 -1031 98 -35 -1020 -809 820 665 -720 -357 934 708 -516 -630 624 528 -969 -939 427 104
1547A04j180p0J301K62j254m2J429J20j132J07J120L89j272k80J415K93j396k17
1565c03J019J98j112o01J246M57j424l66J237K95r61n77R24O54j215n03J207L59
1583E34r87n09J005Q62q23p74J092N84j133o58O83N37j053j012R28R71p97n16
1601a066R98Q16m60p49Q55J005r14r09Q93Q39m48q72L34J005q71j134N80P02p59
1620a55r44N05J327k78j065O38R51o85q54K23O78l89j310K38J199m47r69K74P96
1639b67r7r79K07J345j87r59O27J328K22o03K7J052M0j237Q0P78m11j037n9R64
1659H34M36j090k64R24k42j219m33N16Nj203k68J391N15p79J07P93K61q66n10
1678a092P71J59j053j32J243P46k94k22P77O40q55n46P13J60r29m02R83R04n35
$$ plain form
1547 104 -1076 -1146 155 417 -837 -879 550 670 -462 -355 765 1154 -118 -398 1017 1310 -86 -303
1565 -303 716 914 -198 -799 447 904 -520 -886 351 646 -315 -892 32 686 -529 -1032 175 534
1583 534 -453 -962 43 905 82 -692 400 984 -149 -807 -124 413 -640 -1652 -724 247 -550 -1066
1601 -1066 -68 748 288 -461 394 1399 485 -424 469 1308 860 -12 322 1327 456 -678 -98 604 -155
1620 -155 -1099 -594 733 455 -610 28 979 294 -560 -337 341 -48 -1358 -1120 79 -368 -1337 -1063 -267
1639 -267 -364 -1343 -1136 209 22 -937 -310 1018 1240 637 664 1716 1756 519 599 1377 966 -71 -130 834
1659 834 1270 180 -84 840 598 -621 -1054 -538 -533 -1736 -2004 -613 -98 -877 -770 23 284 -582 -1092
1678 -1092 -321 -162 -1215 -1347 -104 642 348 126 903 1543 688 142 855 1015 86 -316 667 1571 1036
1697A036n80Q19K65q83q09J58J12j075j033P62Q47n35m40O69P68k79o88N17O65
1716B96q92o49Q37Q93j08n46M60R27l86q31L44L93p26q17M30R37l4q51L93Q23
1736H93k51o78J54M96l47r77L19J033j31q12Q9N72r1q69j59P57l81p53L86R47
1756A97K38o40j68Q97R9r62P6N76j09o88j7J006L58q93j64P13r6p26k52L96J19
1777d0p79o7J194M32n91q7N45L19o13n68O20Lq47j85Q79M71n08n69N25M17p86
1798b35n24M53J22n02k42Q08Q46m09m46O12L65n72n36J64L55n55n26P54P03m61
1818A74n52K98L92k79o97K31N16m65l30O35P44o2o20K29O48m12p63K73K96k83
1838b7n04L41Q51j65p38K73M59l30n76j47M39j9o01M21R70J1m88q6M46r0q69l32
$$ plain form
1697 1036 456 1275 1540 657 -152 6 118 -957 -1990 -1228 -381 -916 -1356 -687 81 -198 -886 -369 296
1716 296 -596 -1245 -408 485 377 -169 291 1218 832 1 345 738 12 -805 -375 562 528 -323 70 893
1736 893 642 -36 118 614 267 -710 -391 642 511 -301 -212 360 269 -600 -759 -2 -383 -1136 -750 197
1756 197 435 -205 -373 524 623 -339 -263 313 204 -484 -501 505 863 -30 -194 519 423 -303 -555 -159 -40
1777 -40 -819 -886 308 740 149 62 607 926 313 -255 365 368 -479 -664 215 686 178 -391 134 551 -235
1798 -235 -759 -306 -184 -686 -928 -120 726 317 -129 483 848 276 -260 -96 259 -296 -822 -68 635 174
1818 174 -378 -80 312 33 -664 -433 83 -382 -712 -77 667 605 -15 214 862 450 -313 -40 256 -27
1838 -27 -531 -190 661 496 -242 31 490 160 -416 -563 -124 -143 -744 -323 647 658 170 84 530 440 -429 -761
1860g61M53k78n09K66Q13K80m56LP81M6p09j79M70p5l79j1Q39L79n48j36O17m0
1882H66o70m12J01M1p04k09P92K32l74j1N72L60n18m53L05J50o47j98N19L46k89
1903b01k37N59N59n44k61L05J35m61l83K85O15m57l47N53N00j08l80J76M36m20
1923C24n99L62L29m34m92K27M53q4n43J77N48l80m36K37L15j54m80K54O56j13
1943A67l04L40M56o9n15q9L93k41o56K6M01k5l76N1N25K38m93K00N16j05n37r3
1965a90M08O0n37J6N82l0m18K4K84J2m67k56M22R9m61P9M92L34l12j40M78J65
1987F44o12j86L36J3l81j72L22L03m08k84N08J19l99k95K83K48l60k00M72K86
2007B37l15m2K65L75k65l50K39L13m32k01K67K55j73l04J61M53k82m22K02J52
$$ plain form
1860 -761 -308 -586 -1095 -829 -16 264 -192 -189 592 638 -71 -250 220 145 -234 -245 594 973 425 289 906 866
1882 866 196 -216 -115 -74 -778 -987 -195 37 -337 -348 224 584 66 -387 -82 68 -579 -777 -258 88 -201
1903 -201 -438 121 680 136 -125 180 315 -146 -529 -244 371 -86 -433 120 620 512 132 308 744 324
1923 324 -275 87 416 -18 -510 -283 170 86 -457 -280 268 -112 -548 -311 4 -150 -630 -376 280 167
1943 167 -137 203 659 590 75 -14 379 138 -518 -492 -91 -116 -492 -441 84 322 -171 29 545 440 -97 -190
1965 -190 218 278 -259 -243 339 309 -109 -85 199 211 -256 -512 -90 9 -452 -373 119 453 141 1 479 644
1987 644 32 -154 182 195 -186 -358 -36 267 -141 -425 83 202 -197 -492 -209 39 -321 -521 -49 237
2007 237 -78 -120 145 520 255 -95 144 457 25 -176 91 346 173 -131 30 483 201 -221 -19 133
2027A33k08k84J43M85k12k76K70M02k46k76J3K02k01m51J32L24k55l42J67L38
2047a42J29k80J88M95j27k56K21K74m5m50o4L84Q6l94J66K79r5l15j16K68j49
2068E7o17q1L75P7j03P8L78K41l68o6M70k50n74k27K37J26k18j34N50K23j78J44
2090A40K55O7m53m22K36J61k46k3M14L06L5Q3K66J31n87m58J34j83k15k42J13
2111d88M03P4n2M53J28l09m17o0N8k38l15K49L66m0J76L62K17j64m14r1K26l39
2133b15l90Q5K26J41k1L82M93j29k96J96J56k42l69j64J70Jk41K64L11j48l37
2154a27N3J56o8m42j21J90o8m8J99L46Q4l32nM23o8k70o5J62J18j49M5L49j8l90
2178d6jL28Jj94j57J19K11j93m4K66n3l36j33K29K11k42k02J95J00j85j12J61
$$ plain form
2027 133 -75 -359 -216 269 57 -219 51 453 207 -69 -56 146 -55 -506 -374 -50 -305 -647 -480 -142
2047 -142 -13 -293 -105 390 263 7 228 502 457 7 -57 327 413 19 185 464 369 54 -62 206 57
2068 57 -560 -641 -266 -189 -292 -214 164 405 37 -29 441 191 -383 -610 -373 -247 -465 -599 -49 174 -4 140
2090 140 395 462 9 -413 -177 -16 -262 -285 129 435 470 553 819 950 363 -95 39 -144 -359 -601 -488
2111 -488 -85 -11 -63 390 518 209 -208 -268 -210 -448 -763 -514 -148 -188 -12 350 567 403 -11 -102 124 -215
2133 -215 -605 -520 -294 -153 -174 208 701 572 276 472 628 386 17 -147 23 24 -217 47 358 210 -127
2154 -127 -74 82 14 -428 -549 -359 -427 -475 -276 70 154 -178 -183 240 172 -98 -163 -1 117 -32 13 362 344 -46
2178 -46 -47 281 282 88 -69 50 261 68 24 290 237 -99 -232 -3 208 -34 -236 -41 59 -126 -238 -77
2200g7M8l64j64K77K50j35j52L03J88on5K09K15l84k08K01J12r8l19J15J76l9
2222I3j86L08k6k75k78J67K12n5k46J92K51n5L1J61l1q9l42J0K61j26j71oK03
2245CP2o6j1J03j51l63J64K47j3j08J1L24R6j86J6J49j30l13l1K08J8k08o4L28
2269I5O6m9pP0m0l03kJ80M9k15K7J46K01l6n7J29q4l57j26P2J0j99j01K53K82
2294Dk8J28K35J8k11j33Q7R3k30k02L21J36J5J0J12k4j41l30J76l5k22j71N0K09
2318a33%l3J14K27j65p3J19J16j36k79RK19k1j19J31Q0KqL5K22j25k74L7R0p3
2343c8p5J18J29%j03J49J04j47j78j6O4m9j50J3O2m8j72J49J63K4j44j4K87jn4
2368G3p8R2l6q4N6J58J5j03p3J12O3j27j16n0Q9k02j20K62P1q1K7J03J25p2j33
$$ plain form
2200 -77 -29 -393 -557 -280 -30 -165 -317 -14 174 168 113 322 537 153 -55 146 258 160 -159 -44 132 93
2222 93 -93 215 189 -86 -364 -197 15 -40 -286 -94 157 102 133 294 263 174 -168 -158 103 -23 -194 -200 3
2245 3 75 9 -2 101 -50 -413 -249 -2 -15 -123 -112 212 308 122 138 287 157 -156 -187 21 39 -169 -233 95
2269 95 161 112 105 175 135 -168 -170 10 59 -156 -129 17 218 182 125 254 170 -187 -313 -241 -231 -430 -531 -278 4
2294 4 -24 104 339 357 146 13 100 193 -37 -239 82 218 233 243 355 331 190 -140 36 1 -221 -392 -342 -133
2318 -133 -133 -166 -52 175 10 -63 56 172 36 -243 -234 -15 -36 -155 -24 56 58 50 85 307 182 -92 -55 35 -38
2343 -38 -113 5 134 134 31 180 284 137 -41 -57 7 -42 -192 -179 -117 -165 -337 -188 -25 -1 -145 -159 128 127 73
2368 73 -5 87 51 -33 23 181 196 93 20 132 195 68 -48 -98 -9 -211 -331 -69 2 -79 -52 51 176 104 -29
2393b9J70M3j96m3Q1J3r6k23J27J50o6L9Q9M0o5m1J14M2j51j34M8R0M6j17J16
2418D7J60j30l0JJ47j65j23n0N3n3o4Q7J49n8L6J72M9j5j15l8P8j52j60Q4J0k4
2444a04j2j3L11p2j82kM9j04j68L9R3M3q2J68K14kM4n5M7l9j25r5J18j05j55J03
2470h6J60L0k4k6J06P6k35l5M4p5n6q0P1J72j85R8J07j1j5j37N6J9j83j05J28
2495a86n6MO4J91J78l8m5J69N6r2p1j7Pj64j55J84N2q2k6P0J28k7k15R1J8k57
2521b19l5L3JM1LM9J11P1k8M9Nj39q5n6Q1j34m3K13J36M8j1J19Q4p7j02J1M9j36
2549C9m3R3M5N1mN1l0j6k54l1qj41j08l4J23R8m9J39J60j2J1j22N9K7j46QO3J5
2577a6m2N7P6R0j29p0J58l3q8%P6M0m2K7J40K8j08j8j6n6o1j15L9jm4m0J16r3
$$ plain form
2393 -29 141 184 -12 -55 26 39 -57 -280 -153 -3 -69 -30 59 99 34 -7 107 149 -2 -136 -88 2 48 -69 47
2418 47 207 77 47 48 195 30 -93 -143 -90 -143 -207 -120 29 -29 7 179 228 213 98 60 138 -14 -174 -90 -80 -104
2444 -104 -116 -129 182 110 -72 -74 -25 -129 -297 -258 -165 -122 -204 -36 178 176 220 165 212 173 48 -47 71 -34 -189 -86
2470 -86 74 104 80 54 160 236 1 -34 10 -65 -121 -201 -130 42 -143 -45 62 51 36 -101 -45 -26 -209 -314 -186
2495 -186 -242 -238 -174 17 195 157 112 281 337 245 174 157 164 0 -155 29 81 -1 -27 43 171 144 -71 20 38 -219
2521 -219 -254 -221 -220 -179 -176 -127 -16 55 27 76 81 -58 -143 -199 -118 -252 -295 -82 54 102 91 210 294 217 115 126 175 39
2549 39 -4 89 134 185 181 232 202 186 -68 -99 -107 -248 -356 -390 -267 -169 -218 -79 81 69 80 -42 17 44 -102 -94 -31 -16
2577 -16 -58 -1 75 165 36 -34 124 91 3 3 79 119 77 104 244 272 164 146 130 74 13 -102 -63 -64 -108 -148 -32 -125
2605a25j0p4rP6q0m9K07M6JO0L5K8K6j15N5Mj00J2P2L0l9j6Q7P0j25p4J29p3p8
2634b9o3k3J10j7k0J43Q2n8q6l2L1j39p5n6Qj9Q2K7k1R8O8O5Q2k9p0K5k6m6k5
2663a3K9R6K1n1J00l9O3o8j15pp1j32j4N2m9L1L9J16M7J8%Q9o7j18k9rl9m7LJ19
2693d5M8L8J55j9R7r4j30N8k7j28K0nQ0P9J3L3L6p6j03M4j72r9j00n9L1%M1J79
2721a05J16K4N5P4k1o1j19L2j3n1O6N8J51L5L8L0j8j72l8o5o3j12r9J6J56J6K8
2748d2J27L0no9o5j7j30j11J8P3l9R3R9M7R0k2N9L5j25N6r6k3M5jL5J44M4m2M5
2777B53K4r4n5j74M4j27j73J30m6J08K7n3J65n2nP7k9n1m9kj4P3m9O1J08Jm8Q
2805E8j7O3j06m0J9J3m8rO7N6n4k6J15K9k0q4j4n6j4M9r1J33r6J0J02k9qQ4p9
$$ plain form
2605 -125 -135 -209 -218 -142 -222 -271 -64 -18 -17 43 78 106 132 17 72 76 -24 -12 60 90 51 35 122 192 67 -7 122 49 -29
2634 -29 -92 -115 -5 -22 -42 101 183 125 39 7 38 -101 -176 -232 -224 -243 -161 -134 -155 -57 11 76 158 129 59 84 58 12 -13
2663 -13 16 112 133 82 182 143 206 138 23 16 -55 -187 -201 -149 -198 -167 -128 -12 35 53 53 142 75 -43 -72 -81 -120 -167 -164 -45
2693 -45 3 41 196 177 274 180 50 108 81 -47 -27 -32 48 127 140 173 209 133 30 74 -98 -197 -297 -356 -325 -325 -284 -105
2721 -105 11 35 90 164 143 82 -37 -5 -18 -69 -3 55 206 241 279 309 291 119 81 16 -47 -159 -258 -242 -86 -70 -42
2748 -42 85 115 110 41 -24 -41 -171 -282 -264 -191 -230 -137 -38 9 99 77 136 171 46 102 6 -17 28 27 62 206 250 208 253
2777 253 277 183 128 -46 -2 -129 -302 -172 -218 -110 -83 -136 29 -23 -28 49 20 -31 -80 -82 -96 -23 -72 -11 97 98 50 58
2805 58 41 104 -2 -42 -23 -10 -58 -67 0 56 2 -24 91 120 100 16 2 -54 -68 -19 -110 23 -73 -63 39 10 2 86 7
2834GN1o1q4O0Q8o3K4O6j4p6%N6K3j50MqL4j17P1r6J16J6J3K1N2OJ3J07j4J7j15
2865D7nJ7n1J4j4K0L2p7N7Q4j29kNk0K7l1j33J14j1J1Q2Kqj8o0P2l4p5ppm4j4
2897a56L6O3K5j4R6j9P6M8j37L6J7L3k2k9%K0rK7lQn4m0m2QK7j4j06N0l0J8R4
2928Go0R7L4nm7n9l3Jk2j1J6m1K1M3R6L5J3m4M3M4p4j9o9J14K6j2L8K0OqJ1n9
2960A02l5n1o3q1m0k7L0L2P1L9n4O9K8p6nm5k2K8kMO8M3L7M5m3N1r8N5L9p2q5
2991e8J09l9L0Q2O6Npl7J7Pj73rm7n0Kp1J01J4n2M1L6l6Om0l3N0K0p8N9J4O6P6
3023G1NO0L5j2l0p5l7P3j21k7Q8n5O0N0L0j3qPO0o8m3r4N9l6m6k5qK0jO2k8k4
3055g1M0m7q5O6q9Q4M6j3J16O6l1R3l3qK3j31O%j5Mj8J5L2L3m9J7K6o7M2n9M7
$$ plain form
2834 7 58 -3 -87 -27 61 -2 22 88 74 -2 -2 54 77 -73 -69 -77 -43 -160 -89 -185 -69 -53 -40 -19 33 39 52 159 145 162 47
2865 47 42 59 8 22 8 28 60 -17 40 124 -5 -7 -2 -22 5 -26 -159 -45 -56 -45 37 39 31 13 -47 25 -9 -84 -91 -98 -142 -156
2897 -156 -120 -57 -32 -46 50 31 107 155 18 54 71 104 82 53 53 73 64 91 88 96 42 2 -40 -32 -5 -19 -125 -75 -105 -87 7
2928 7 -53 44 78 73 26 -33 -66 -65 -87 -98 -82 -123 -102 -59 37 72 85 41 84 128 54 35 -34 80 106 94 132 152 158 150 161 102
2960 102 67 16 -47 -128 -168 -195 -165 -133 -62 -23 -77 -8 20 -56 -61 -106 -128 -100 -102 -98 -30 13 50 95 52 103 5 60 99 27 -58
2991 -58 51 12 42 124 190 195 188 151 168 175 2 -7 -54 -104 -102 -173 -72 -58 -110 -69 -33 -69 -63 -103 -136 -86 -66 -144 -85 -71 -5 71
3023 71 76 136 171 159 129 54 17 90 -31 -58 30 -25 35 85 115 102 94 101 161 93 50 -44 15 -21 -67 -92 -100 -80 -81 -19 -47 -71
3055 -71 -31 -78 -163 -97 -186 -102 -56 -69 47 113 82 175 142 134 157 26 32 32 17 21 3 18 50 83 34 51 77 10 52 -7 40
3086D0j5j00O5J1o1M4j4K2K7q6Rl3l9K7j3J8J0K3OO5N0n1Q1J3j0Nq1P0m8j4N7
3117G8o8K0j8QM4m5Oq5K1K3l2J4m8P2j3P0jrl1k5J7J8k3r2qkK1L5rn2J28K2l0
3150FN8RL6m0nM7l6o9L5k7m7P4J0p6Q4r9M9m2k2k0K3mL4k7L6N5k3RL9o5K3K4j10
3183f1L5p6J8Q2o8K8Q0n9L9J1l4N7l3j14J04jn7P7J8rN7m9J8J0q0k0n8rj1O2k0
3214f3K9M2k6J04r0JJ10o3m2O9j7q0l0L0MO6k5Qn9ll6R1r2L1OK1o8M4O6J4J0N0
3246A02k2j2j8p5M4m5k9k0k1OP9k6M1R4k1m3l4m8Q9l8m8P3L8m6K7m8N0j5j0nl3
3277a4j6j5l8qQJ4M7O1J8M0p3L0rk1qj5M8o7K8nj4L6l2Rk9k7k7P7n6LPN4K1j3
3311A4L7MJ9l0K1k8J6l0o0J6j7k7O4l5nR4pj6J8J3o4M6j16M5N0PN0m2m6M7jr3
$$ plain form
3086 40 25 -75 -10 1 -60 -16 -30 -8 19 -67 -58 -91 -130 -103 -116 -98 -88 -65 -59 6 56 5 86 99 89 94 13 83 35 21 78
3117 78 10 30 12 20 64 19 25 -60 -39 -16 -48 -34 -82 -10 -23 47 46 37 6 -19 -2 16 -7 -99 -107 -109 -88 -53 -62 -114 14 36 6
3150 6 64 73 109 69 64 111 75 6 41 14 -33 41 51 -25 59 -40 9 -33 -55 -75 -52 -56 -22 -49 -13 42 19 28 67 2 25 49 -61
3183 -61 -26 -102 -84 -2 -70 -42 38 -21 18 29 -5 52 19 -95 9 8 -49 28 46 37 94 45 63 73 -7 -27 -85 -94 -105 -43 -63
3214 -63 -34 8 -18 86 -4 -3 107 44 2 71 54 -26 -56 -26 -22 44 19 27 -32 -35 -71 20 -72 -41 -35 -14 -82 -38 28 42 52 102
3246 102 80 68 50 -25 19 -26 -55 -75 -96 -90 -11 -37 4 98 77 34 0 -48 41 3 -45 28 66 20 47 -1 49 34 24 19 -14
3277 -14 -30 -45 -83 -91 -83 -69 -22 39 57 97 24 54 45 24 16 1 49 -18 10 5 -9 27 -5 4 -25 -52 -79 -2 -58 -55 -48 6 27 14
3311 14 51 55 74 44 65 37 53 23 -37 -21 -38 -65 -1 -36 -41 53 46 30 48 61 -3 43 -73 -28 22 29 79 37 -9 38 37 -56
3343e6M0k6J1J9n0Q0n2l7N1rM9K1J3N5J5p9k4K4m1ml5jN8m4k6K9R2n5l6l0k9N0
3375b7j4J4k4O5%mM6lNm3lk7j8j3N0oql7J19m2k0L8j6N7p7rJ4%L9l8M8j15R9p7
3409b7L0K9j52R8M3o0o0L0Q1m2j4L1N6l1qk1R1q2l3K2J8J4qJ9j9j4J5Rk9P2k0
3440C8p2R8l2j5K5m6O2j0Lmqj5J9m5O5p3m5O0n3K4r2L3M5p3K2N8j0K3L1k9K3K4
3472C1J7q6J01m1o2J12m3K7M0l9N3o2p6P4k0J7o3k7J18po7M3l8K6NOn0o2k0P1
3502b2n4M3k6j1O2LkM6K0k1m1O4l4O5p9M6K9O0p9lN4j16N5q6%K1p6J05l8O1j03
3533e7Q5PO2p1l9nL2o7R5n9Ok1l9Q4MK5r1J6J6l6K8LN7k1l4Q1j0O1o2K5Lk2l5
3566B1%m6L7j08Q1K0k5QoR4r9O4n2K9nq2J02lmJl8L3L5l0j1K0rn8kj1JRl1L9P4
$$ plain form
3343 -56 -16 -42 -31 -12 -62 18 -34 -71 -20 -29 20 41 54 109 124 45 21 45 4 0 -35 -36 22 -22 -48 -19 73 18 -18 -48 -77 -27
3375 -27 -41 -27 -51 14 14 10 56 53 58 15 12 -15 -33 -46 4 -2 -10 -47 72 30 10 48 32 89 12 3 17 17 56 18 66 -49 50 -27
3409 -27 3 32 -120 -22 21 -39 -99 -69 12 -30 -44 -13 43 12 4 -17 74 -8 -41 -19 -1 13 5 24 5 -9 6 15 -14 58 38
3440 38 -34 64 32 17 42 -4 58 48 51 47 39 24 43 -2 63 -10 -55 5 -48 -24 -116 -83 -38 -111 -89 -31 -41 -18 13 -16 7 31
3472 31 48 -38 63 22 -40 72 29 56 96 57 110 48 -28 46 26 43 -20 -47 71 64 -3 40 2 28 33 39 -11 -73 -93 -22
3502 -22 -76 -33 -59 -70 -8 -5 -7 39 59 38 -3 61 27 92 13 59 88 148 69 66 120 4 59 -27 -27 -6 -82 23 -15 46 -57
3533 -57 28 35 97 26 -13 -18 14 -53 42 -17 -11 -32 -71 13 17 42 -49 -33 -17 -53 -25 -22 35 14 -20 61 51 112 50 75 78 56 21
3566 21 21 -25 12 -96 -15 5 -20 -12 -18 76 -23 41 -11 18 13 -69 33 30 26 27 -11 22 57 27 16 36 27 -31 -33 -44 -43 -34 -65 -26 48
3601D8m0J0L9L5q2J8m3NM6QKk7pj2J0J0j7o6K2K0q9L4N1k1O0M4M6p6M3o4M6ol7
3634A0k3l7N1m4L7L1l9K2p2J12k2Jj23N5N1ol1K5P4J2n9L6m7J4q6J1O8o0q7J32
3664Fkl3N8p7Q6J3p6L2N5l3o2L7j8J4J1m4Q0K3j39M8N2k1m3K8L6p2K0J7P0k4j3
3695B9rK5J5n2OroJ5p2P0rk6k1J06j6l0K6k7N5r0M4N0O5j20j6K4J8mj6l6M3J9
3727E1j43R4p5J4lN4M4m5K8k7Q7o4k7L6K7l9J0k8L7qJ0l5J7Mp2M4N2r5KM0J2j
3759A%MJ3N4j15J1Q3n9K9q7J02k8o3N1J9J0l7J5krO4k2M2k0q6P4O3p4J0k2l7L1
3791A5o0l1K1K5M1q8Q6l1l5L3J7L9m4qP2kk4M5m0O7j8m1K3K3j47O9MM9j32PR5
3822C0n0L7k6K7J4k8k5K2J2K0o1l0R4nn9K7L6J1o6PN4p0o0Q7K8n5j7KQ7O8m7m3
$$ plain form
3601 48 8 18 57 92 10 28 -15 -10 36 44 46 19 12 0 10 20 3 -63 -41 -21 -110 -76 -25 -46 14 58 104 28 71 7 53 47 10
3634 10 -13 -50 1 -43 -6 25 -14 8 -64 48 26 27 -96 -41 10 4 -27 -2 72 84 25 61 14 28 -58 -47 21 -39 -126 6
3664 6 4 -29 29 -48 38 51 -25 7 62 29 -33 4 -14 0 11 -33 47 70 -69 -21 31 10 -33 -5 31 -41 -21 -4 66 42 29
3695 29 20 45 60 8 14 5 -1 14 -58 12 3 -23 -44 62 46 16 42 15 70 -20 24 74 139 19 3 27 45 41 25 -11 32 51
3727 51 -92 2 -73 -59 -62 -8 36 -9 19 -8 79 15 -12 24 51 12 22 -6 31 23 33 -2 15 19 -53 -9 43 -52 -50 -10 2 1
3759 1 1 5 18 72 -43 -32 51 -8 21 -66 36 8 -55 -4 15 25 -12 3 1 -8 56 34 76 56 -30 44 107 33 43 21 -16 15
3791 15 -45 -76 -55 -30 11 -77 9 -22 -57 -24 -7 32 -12 -20 52 50 26 71 31 98 80 39 62 85 -62 7 11 60 -72 -65 30
3822 30 -20 17 -9 18 32 4 -21 1 13 33 -28 -58 36 31 -28 -1 35 46 -20 -13 41 -29 -89 -2 26 -29 -46 -44 43 111 64 21
3854B1R9o1n9m6J03r4qj6R8n4j9QO5j2q3l1J13m3m3R6k1N5r7J3Q0l8o7N8m7M1
3884A1o1l5M2M4j20R6P5n5j8K8P0k5j3n0N2N8j24M4L2M8r4j8Q9m2o3j9J4K3l2
3913d3lL3J7n3N7K4kj05L1L4M8n9m5L7J7n3O1L0P0n7n3M9j8K7j3Q0m4L0l2j5J25
3944A75q9p2L4K0n7n0q0J00o8l1N2Mm4rM8O6j8p3J9R3n3oJ5Q9Qn6J0Q6J1m6j7
3975F1J1J4j39M1O0n3k7rJ21J9r0mR4k8o1o0L1km6j5N9L7j37M2R4k0p5l8J89j2
4005E7r2K2J6Q1k6N7p1R2j09j10O6N7n3p5M7JM1n7L4N5o6oK9M0mr5N7J0Mk3K2
4036AR5n8n8L3M3r5jL8L6o0k7N0j2Q2j43P6K5J3o8LO4l0J6j7R0p4l3n2O5op0%
4068g4Q7l0l8L0L9J3q7J09O3K3j52L4K5L5p9O7k0l7q0M1L7Q1j90K7N5J3k0k1J10
$$ plain form
3854 21 120 59 0 -46 57 -37 -45 -61 37 -17 -36 -28 37 25 -58 -89 24 -19 -62 34 13 68 -29 -16 64 26 -41 17 -30 11
3884 11 -50 -85 -43 1 -119 -23 52 -3 -21 7 77 52 39 -11 41 99 -25 19 51 99 5 -13 76 34 -29 -48 -34 -11 -43
3913 -43 -46 -13 4 -49 8 32 30 -75 -44 -10 38 -21 -66 -29 -12 -65 -4 26 96 39 -14 35 17 44 31 111 67 97 65 50 175
3944 175 86 14 48 68 11 -39 -119 -19 -87 -118 -66 -62 -106 -115 -67 -1 -19 -92 -73 20 -33 -39 -24 65 73 17 27 113 124 78 61
3975 61 72 86 -53 -12 48 -5 -32 -41 80 99 9 5 99 71 10 -50 -19 -21 -67 -82 -23 14 -123 -81 13 -7 -82 -120 69 57
4005 57 -35 -13 3 84 58 115 44 136 27 -83 -17 40 -13 -88 -41 -40 1 -56 -22 33 -33 -39 -10 30 26 -69 -12 -2 2 -21 1
4036 1 96 38 -20 13 56 -39 -40 -2 34 -26 -53 -3 -15 67 -76 0 25 38 -30 -27 37 7 23 6 96 22 -11 -63 2 -4 -74 -74
4068 -74 13 -17 -55 -25 14 27 -60 49 112 135 -17 17 42 77 -2 65 45 8 -72 -31 6 87 -103 -76 -21 -8 -28 -49 61
4097F1Jl3l3Q3K2q2o1j3J00r4m4P8J4n8P2OL2lr6O3J5q8K9O3L7q3pQ1L0o7nJ7
4129C7L6j13n5P2K1m1OM6O7j04l2M2R2j04k0K2M4K1j52J32QN3j13K8R7n0m1lj6
4158b0k0j24J00J10m0j7N0K5P5r3j0K2n2j27L3J34l3q9L8J11q6k9K8J1j1r4K5
4185h3PN6n1R2P2k2n3J2P5jj11o5Q9m7l0k5J46k6No0R2j0o7K4N7n1l2K3K3Jj11
4216g1L0J03j4L4r2nO0j19o3J39o8%j7J04J12j47L8M5K5l5j20J07K5j34k1J22
4242C8K5r3NP2mp9p5J39K2r8nM4P8k7k5K2M9k3r0O0mmj22N2K4O6j21K0L2j9k1
4273f2k0Q0k6k0J5J44p2r0M5N0no0K9R0j33m8J7J49m3n9PMJ08j62L5O2M0j44Q7
4302A8P9J2j08PJ05o7j06qN0J6j48M3K3J00j47jJ74mj8n6K9P2o8L0M7K4j05m6
$$ plain form
4097 61 62 29 -4 79 101 19 -42 -55 45 -49 -93 -15 -1 -59 13 19 51 48 -48 15 30 -58 -29 34 71 -12 -19 62 92 25 20 37
4129 37 73 -40 -95 -23 -2 -43 -37 9 76 -28 -60 -18 74 -30 -50 -28 16 37 -115 17 25 78 -35 -7 90 40 -1 -4 -20
4158 -20 -40 -164 -64 46 6 -11 39 64 139 46 36 58 6 -121 -88 46 13 -76 -38 73 -13 -42 -14 -3 -14 -108 -83
4185 -83 -76 -20 -71 21 93 71 18 30 105 104 -7 -72 17 -30 -60 -85 61 35 40 -20 72 62 -5 19 76 25 -7 16 39 40 -71
4216 -71 -41 62 48 82 -10 -15 45 -74 -137 2 -66 -66 -83 21 133 -14 24 69 94 59 -61 46 71 -63 -84 38
4242 38 63 -30 -25 47 43 -36 -111 28 50 -48 -53 -9 69 42 17 39 88 65 -25 35 31 27 -95 -43 -19 47 -74 -54 -22 -41 -62
4273 -62 -82 -2 -28 -48 -33 111 39 -51 -6 44 39 -21 8 98 -35 -83 -66 83 40 -19 -12 -8 100 -62 -27 35 75 -69 18
4302 18 97 109 1 8 113 46 -60 -68 -18 -2 -150 -107 -84 16 -131 -132 42 38 20 -36 -7 65 -3 27 74 98 -7 -53
4330e3J17Q0r7K5K0j2m1r7Q6K1n4p2J22R7j17lN4N5j44l8K3qr3o4J19O1o9m0J16
4359fN3k8p0M3J7m7p9J01J01J4j32J21P8k3l1jK5m2j23K7J8n0j20J56P1k4l3M2
4387E8QJ4j63j7O0n1nJ4J67k8o2M5Q5p1n7o5L9K2j49M4O7Q9q9O2J58j9p3mJ28
4416B07q2r8n4Q0rj87L0J33j5j2J5kJ5p1o7J52K3o6k5Q8M6o1l9Q5j6j04r9P7M6
4445a0j48k9J15P4m1k1R9J00j24N6o3Q8q0p0O6K0o4pM6P4J5j68R7Q2j05j7L7O2
4473H4j24K5j29J71r1l5J36j9J1j42O6R9o1r6J38K9rj17O4N4r1p7M5J23n7j41
4499a44J45P8N3j14L0N8n9p9L7M8Lm4p6J02j4j22P1L1p1o3oJ54Nj2J9J53j00J6
4527I9l7J0J6j10j03R1l6j09P3P3L7l6k6J28J2j15L0J6J7o7n1J14O6j45kR4Q5
$$ plain form
4330 -53 64 144 47 72 92 80 39 -58 28 49 -5 -77 45 142 25 22 76 131 -13 -51 -28 -36 -129 -193 -74 -13 -82 -122 -6
4359 -6 47 19 -51 -8 9 -38 -117 -16 85 99 -33 88 166 143 112 111 136 94 -29 -2 16 -34 -154 2 73 49 16 58
4387 58 66 80 -83 -100 -40 -91 -96 -82 85 57 -5 40 125 54 -3 -68 -29 -7 -156 -112 -45 44 -45 17 175 156 83 79 207
4416 207 125 27 -27 53 44 -143 -113 20 5 -7 8 6 21 -50 -117 35 58 -8 -33 55 101 40 1 86 70 -34 -133 -56 -10
4445 -10 -158 -187 -72 2 -39 -60 39 139 15 71 8 96 16 -54 12 32 -32 -39 7 81 96 -72 25 107 2 -15 22 84
4473 84 -40 -15 -144 27 -64 -99 37 18 29 -113 -47 52 -9 -105 33 62 53 -64 0 54 -37 -114 -69 54 -3 -144
4499 -144 1 79 132 18 48 106 47 -32 5 53 56 12 -64 38 24 -98 -27 4 -67 -130 -136 18 23 11 30 183 83 99
4527 99 62 72 88 -22 -125 -34 -70 -179 -106 -33 4 -32 -58 70 82 -33 -3 13 30 -37 -88 26 92 -53 -55 39 124
4554A24m1j55J06L3j04q1J32K7j00k1R9J46p3j28J70p5r4J1r4P2j02nJ35J01p7
4579Fl7RJ30m7j49N9kk8j16J12J44k8m5Q1J59q4j43J12j5q5r5M3L3o0l6M7N8L
4607B6r4mJ34j5j46o1K23p3r4P2J20J0k0p0O8Ok19oJ10j22K5k2J63M6j11J26J03
4634A75p2m9J2J6K8j91J3P0j7k1n5J08O1p9j26J34L9j85K2M7J01q0m2K08Rj60
4660c4K0Q6L2j27o6P5N4j02n4J55O3j64k0J24M9o3j18J55K0j51k5J14J09r2j08
4685f8Q7J13r3r9R7M3j61n3J4J48j26m9Q5J14j3j03J22R7o3j69Q9O7p2o7K4J31
4711I5n0r4K3P7j9j71J10N6k6j10OJ61M8j63P8J01l6j52K5J39k2j96Q2Q4q1o3
4737i8K2O4O1j88l0J73J8q6N5J41k5q5NJ11k9j84K2J06k3j05l7J19K8j66j9J75
$$ plain form
4554 124 83 -72 34 67 -37 -118 14 41 -59 -80 19 165 92 -36 134 59 -35 -24 -118 -46 -148 -153 -18 83 6
4579 6 -31 -22 108 61 -88 -29 -31 -59 -175 -63 81 53 8 89 248 164 21 133 118 33 -62 -19 14 -46 -82 -35 23 26
4607 26 -68 -72 62 47 -99 -160 63 -10 -104 -32 88 98 78 8 76 82 -137 -143 -33 -155 -130 -152 11 57 -54 72 175
4634 175 103 54 66 82 110 -81 -68 2 -15 -36 -91 17 78 -1 -127 7 46 -139 -117 -70 31 -49 -91 117 126 -34
4660 -34 -14 72 104 -23 -89 -14 40 -62 -116 39 102 -62 -82 42 91 28 -90 65 85 -66 -91 23 132 40 -68
4685 -68 19 132 39 -60 37 80 -81 -134 -120 28 -98 -147 -62 52 39 -64 58 155 92 -77 12 79 7 -60 -36 95
4711 95 45 -49 -26 51 32 -139 -29 27 1 -109 -103 58 106 -57 21 122 86 -66 -41 98 76 -120 -38 46 -35 -98
4737 -98 -76 -12 49 -139 -169 4 22 -64 -9 132 107 22 27 138 109 -75 -53 53 30 -75 -112 7 35 -131 -150 25
4763B5R7j57n8P8Q7j68M7J70L0j00lO5P4k01m1P5p0n5j3L8Q0r5pJ32M9n9l3K8
4791A5Q8j49q6O2J67j62o6J34J49q0j32J9J84j60j30Q5Q8p7j01Q2K08l9j31J89
4815A57Qn5j63Q3L2o0j65J45R4q2o0P9P0o7j06NJ41j42q6P5J35l0j05L2K54m4
4841A45j60O7J00r1j41q2J71J4k58R2J48K5n3k8J33M1j50%J37j9j06l9J50L8j57
4866b3m6K07n8j51n7O1L9j64n0J68J00j10JJ48O7o3j3K0O7j83p6J01N8p6j28J02
4892e9J04k0j41J99O4j52j5j1R3n9j52P4J78j05l9J26N8o7j50P8J65j81o9K8M8
4917eK6j17Q6M8J5j65J23J13oj57M5J06o3j74J11J16o7q2L4N3l5j08m7R1k2j19
4943b00P7J42k3j20J13J70j9j27L7J53m3j62lJ36q3j10m2P9O7j56M2Q9N6j66J4
$$ plain form
4763 25 122 -35 -93 -15 72 -96 -49 121 151 51 48 113 187 -14 -55 20 -50 -105 -118 -80 0 -95 -102 30 79 20 -13 15
4791 15 103 -46 -132 -70 97 -65 -131 3 152 72 -60 -41 143 -17 -147 -62 26 -51 -152 -70 138 99 -32 157
4815 157 165 110 -53 30 62 2 -163 -18 76 -6 -66 13 83 16 -90 -85 56 -86 -172 -97 38 8 -97 -65 189 145
4841 145 -15 52 152 61 -80 -162 9 23 -235 -143 5 30 -23 -51 82 123 -27 -27 110 91 -15 -54 96 134 -23
4866 -23 -69 138 80 -71 -128 -67 -28 -192 -242 -74 26 -84 -83 65 132 69 56 76 143 -40 -116 -15 43 -33 -161 -59
4892 -59 45 25 -116 83 147 -5 -20 -31 62 3 -149 -75 103 -2 -41 85 143 76 -74 4 169 -12 -81 -53 -5
4917 -5 21 -96 -10 38 53 -112 11 124 118 -39 6 112 49 -125 -14 102 35 -47 -13 40 5 -103 -150 -59 -81 -200
4943 -200 -123 19 -4 -124 -11 159 140 13 50 203 160 -2 -5 131 48 -62 -104 -25 42 -114 -72 17 73 -93 -79
4968g9J65j8j80jJ77lj16o2J80J2k01P5M9Om4j26K19kj55RK10M7j21j9J61J3k13
4995a7J9J31l0j44r9J76L8r7o9J35N0k03k0R3O3q6j51J93J20j83p6J60Q9m5j21
5020g4J21Q0l6q0RQ5j27jKP0M1k20J08J51r3p2RJ53n4j49P2J29j03j02R6O9K3
5047A07j91J9J45j12j07%Q1n1l9l3K78K8j39Q2J12k8j41K9Q1o5j91mJ12Qj15J4
5073a20J00M2p2kJ37m7j27L9J36K2r5o6J94K7k05P2O3K8k18m1J56J8j07m9J30
5098A5om3l0M5J33j95k7J89L0j70q2O9R8p2j08J89R0j77L0J10L0j56j57K10L3
5123D8o8r2J66P9l3j17J10R1j48j11P1O7j08j37R9J02j15q9J63J25j12p3O1Q1
5147F0n3j69J33J06p1j06J16Q7K5j33L5P5n4j52O5J5K1r3jJ98n7j04R0J05m8q9
$$ plain form
4968 -79 86 68 -112 -113 64 61 -55 -117 63 75 -126 -51 -2 4 -40 -166 53 51 -104 -95 115 162 41 22 183 196 -17
4995 -17 2 133 103 -41 -140 36 74 -23 -92 43 93 -110 -130 -37 26 -60 -211 -18 102 -81 -157 3 92 47 -74
5020 -74 47 127 91 11 20 105 -22 -23 -21 49 90 -130 -22 129 36 -36 -27 126 72 -77 -5 124 21 -81 15 84 107
5047 107 -84 -65 80 -32 -139 -139 -58 -109 -148 -181 97 125 -14 68 180 152 11 40 121 56 -135 -139 -27 -19 -134 -120
5073 -120 -20 22 -50 -52 85 38 -89 -50 86 108 13 -53 141 168 -37 35 98 126 -92 -133 23 41 -66 -115 15
5098 15 9 -34 -64 -19 114 -81 -108 81 111 -59 -141 -72 26 -46 -154 35 125 -52 -22 88 118 -38 -195 15 48
5123 48 -20 -112 54 133 100 -17 93 184 36 -75 -4 63 -45 -182 -83 19 -96 -185 -22 103 -9 -82 -21 60
5147 60 7 -162 -29 77 6 -100 16 103 128 -5 30 105 51 -101 -36 -21 0 -93 -94 104 47 -57 33 138 90 1
5173AJ5R2l6j59k5J48m9j16K3J60L1j86J1J38m7q1j2J23Q0j32k6J91R5j97k1O5
5199H6j3j03k0R8j9j17k2P9K9o3NK2J56j52M3K7qn9p0J65J04j62r9J99M5j34j31
5226a14R5O1j21n6L0J25j14lJ29O6p2j15J29J28j38j06J00L9l3p7j4J56j24q2
5250a11Q9J18j08m3L0Q2o8j02M8J79j58kP2O4M4j05l9J55r2q2J9N6n7j56N4J80
5276F7m7j41J23M3K1j67R2J18J6k28P4R8O6j67m0J80l5j06m7J61j04l7l5Q4N0
5301C9j00k9J96j9j18k0J19J18j60j41K55m1j05j27J78K4j08j02J25Q4j36l1J30
5324C1lp1O0MO7j21JJ00N5j33m6O9N4n5p7O7J10j61p2R8O9k2j38J36Q2q1m2L6
5352A7J12j11m7K9J11j49j01J11O3k4j28J8J29m3j22J14J7p2L1n2J21N5r2J7J28
$$ plain form
5173 1 16 108 72 -87 -112 36 -13 -129 -106 54 85 -101 -90 48 1 -80 -92 31 111 -21 -47 144 239 42 21 86
5199 86 73 -30 -50 48 29 -88 -110 -31 -2 -65 -60 -38 118 -34 9 36 28 -31 -101 64 168 6 -93 106 151 17 -114
5226 -114 -19 42 -79 -135 -105 20 -94 -97 32 98 26 -89 40 168 30 -76 24 63 30 -47 -61 95 -29 -111
5250 -111 -22 96 -12 -55 -25 57 -11 -113 -65 114 -44 -46 26 90 134 29 -10 145 53 -29 -10 46 -11 -167 -113 67
5276 67 20 -121 2 45 66 -101 -9 109 125 -103 -29 69 135 -32 -72 108 73 -33 -80 81 -23 -60 -95 -11 39
5301 39 -61 -90 106 87 -31 -51 68 186 26 -115 140 99 -6 -133 45 69 -39 -141 -16 68 -68 -99 31
5324 31 28 -43 17 21 88 -33 -32 68 123 -10 -56 13 67 12 -65 2 112 -49 -121 -23 46 24 -114 22 104 23 -19 17
5352 17 129 18 -29 0 111 -38 -139 -28 35 11 -117 -99 30 -13 -135 -21 -4 -76 -45 -97 24 79 -13 4 132
5377A32n1j18N9L1L0j10m1J23l4j42O2J30j5p8j1J46J8k03oJ28J9j16l0J14O2
5402I9j45MR1m2o8k4M3O4j81M1N1Q2m9O0P4M1p9k8J25M2j94m2P2J9j00p8J09N9
5430D6m6q8J44n0q6k4P1Q6j34J6O8N1o8m4J14R6r6j27O7Q2j56l5L0R8l9q7P5J56
5458A20p5o6O7O7q3n7K4J59j30q7M0J18q5o5P7m%j25M1R9j17k7N0J23k8o1Q2M3
5486A00Oj05K1P9o0j22J4J16j13K7l7J09jj03K2J24r3r6O7N9K6j23O9Q0O5j08
5512B3L2R0k2j40j1P0Q1k08L6L0N8q2J2J27rj24j8Q8J9r7k2N4Q5j84l6J42qj5
5540b9l1R3l1n6m3P4M2j03mJ57Kn0jO5Q1j02o7P2l1n5q3R7L6j20RN7J01r5n3J6
5570e2R8o9l8M4M8n4q7J13R1o2r4N7J6J3j53Q9Q8j1j16O3L5pqK1P0o5o7K2R5o1
$$ plain form
5377 132 81 -37 22 53 83 -27 -68 55 21 -121 -59 71 56 -22 -33 113 131 -72 -78 50 69 -47 -77 37 99
5402 99 -46 -42 49 7 -61 -85 -42 22 -159 -118 -67 15 -34 26 100 141 62 34 159 201 7 -35 37 56 -44 -122 -13 46
5430 46 0 -88 56 6 -80 -104 -33 53 -81 -65 3 54 -14 -58 56 152 56 -71 -4 78 -78 -113 -83 15 -24 -111 -36 120
5458 120 45 -21 46 113 30 -27 -3 156 26 -61 -21 97 12 -53 24 20 20 -105 -64 35 -82 -109 -59 64 36 -25 57 100
5486 100 106 1 22 101 41 -81 -67 49 -64 -37 -74 35 34 -69 -47 77 -16 -112 -45 14 40 -83 -14 66 131 23
5512 23 55 145 123 -17 -28 42 123 -85 -49 -19 39 -43 -31 96 87 -37 -55 33 52 -45 -67 -13 72 -112 -148 -6 -14 -29
5540 -29 -60 33 2 -54 -97 -23 19 -84 -88 69 71 21 20 85 166 64 -3 69 38 -17 -100 -3 33 -87 -78 -21 80 -15 -68 -52
5570 -52 46 -23 -61 -17 31 -23 -110 3 94 32 -62 -5 11 24 -129 -40 48 37 -79 -16 19 12 4 25 95 30 -37 -15 80 19
5600A9n7L4R9q6m7L0O6m0l7k4Q2lr6qJ34r2j01P9J02Jr4O4O1mj37JJ00K6j53K4
5630e7J47j02l0J7N9J9j17K8J07j3p2nL8R1q2l6Q9Q6j77j8R9k2o7r1P9N7j29M5
5658e7M4J19n7o1M1Q2j00r5Q9K6m0n0P0O7p8q0J28k9%p1N2N5m3m6J3N3Ro7O7J4
5688E5j7l9k7J48j03n7O8j0n2n0M5O4k4j23R1P0p2m4Q9L4J1j05M0J44j31j4l8
5715d7R0j3m5L8J9k3o5J7Q8m8n8o0R6K5p1K2J43j03j8L6M6Q3j87JM0J4p2m7O2
5744c7M8J6j02R8O8o4l1N8P0j43n3P7O3o1l2J02M7q4m5K5N2j13p3R1Jpk7N6J8
5773A8k1KN2Kp7n2O2J15m7j29P5M0n3l5rJ44j42K3M0j1m3j6mQ4J07j46lJ22o7
5802C1m1L7NL1j51nJ51o5p2O0R5n9jj9R4k8q3l3Q2j1n9k6J75q6n3N5P2o2j2l0
$$ plain form
5600 19 -38 -4 95 9 -38 -8 58 18 -19 -43 39 36 -60 -68 66 -26 -127 -48 54 55 -39 25 86 82 -55 -54 46 72 -81 -57
5630 -57 90 -12 -42 -25 34 53 -64 -36 71 58 -14 -19 19 110 28 -8 81 167 -10 -28 71 49 -18 -109 -30 27 -102 -57
5658 -57 -13 106 49 -12 29 111 11 -84 5 31 -9 -59 11 78 0 -80 48 19 19 -52 0 55 12 -34 -21 32 41 -26 41 55
5688 55 38 -1 -28 120 17 -40 28 18 -34 -84 -39 25 1 -122 -31 39 -33 -77 12 46 57 -48 -8 136 5 -9 -47
5715 -47 43 30 -15 23 42 19 -46 -29 59 11 -47 -107 -11 14 -57 -35 108 5 -13 23 69 152 -35 -34 6 20 -52 -99 -37
5744 -37 11 27 -75 23 91 27 -4 54 124 -19 -72 5 68 7 -25 77 124 40 -5 20 72 -41 -114 -23 -22 -29 -56 0 18
5773 18 -3 -1 51 53 -24 -76 -14 101 54 -75 0 40 -13 -48 -57 87 -55 -32 8 -3 -46 -62 -66 18 125 -21 -24 98 31
5802 31 -10 27 32 63 -88 -93 58 -7 -79 -19 76 17 16 -3 91 63 -20 -53 29 18 -41 -67 108 22 -31 24 96 34 22 -8
5832hkK8o3l6Q9Ln9MO2K3k8PP1K7j39ML4j3p5K6J16n2n7PJ00k9j21mK7K9p9M0
5864f8O4K4n2L5J00Op9o4J23k4j06p5N4K8ro0P1J44j04qQ7Jn9o4O6K4o7j2L8L6
5894E0k7k1k1J11n4j13N3Pk6p2Q5P9nqJO3Kj17J6O2l5r1M3P3l1l5m4N5Q2j12N0
5925B0k2J5m3MO1n0o7J09k8L9k8J0J10q7o4M9J8l0k9k2K9L6q0j1L3L7l1o0J28
5954D6o5n6M3O0K3j12N8N9O9j68K4L9k7j1k3PJ9Pn7J19J9p9n5Q2P0J2m8m0P0r6
5984a1k5M0J9m8j1K6K3n6JR4k5n1k4P3P1j20J3K4L0l9j7K5L6l5r3O8K3K1p5J01
6014E8r8J08n3l5J08p7q0P0j6P9o5j9Q5j9m7J4O4r4lj3K2O4l7m4J05k9r7K2L4
6043GL3k2m0P1l0j5NQ6n2k7k5L1L1j1q4J0K6m2p4J47M3j16N1L5L2n4j6M2j6J1
$$ plain form
5832 -8 -10 18 -45 -81 8 11 -48 -44 18 41 13 20 91 118 -21 -17 17 4 -71 -45 71 19 -38 -31 69 40 -81 -85 -58 -29 -108 -68
5864 -68 -4 20 -32 3 103 109 30 -34 89 65 -41 -116 -62 -34 -43 -103 -32 112 8 0 87 88 29 -35 31 55 -12 -24 14 50
5894 50 23 2 -19 92 38 -75 -22 -15 -41 -113 -28 51 46 38 39 102 104 -13 3 65 30 -61 -18 55 24 -11 -55 0 82 -30 20
5925 20 -2 13 -30 -26 35 -15 -82 27 -1 38 10 20 130 43 -21 28 46 16 -13 -35 -6 30 -50 -61 -28 9 -22 -82 46
5954 46 -19 -75 -32 28 51 -61 -3 56 125 -43 -19 20 -7 -18 -41 -34 -15 -8 -65 54 73 -6 -61 21 91 103 55 15 85 -11
5984 -11 -36 4 23 -25 -36 -10 13 -43 -42 52 27 -24 -48 25 96 -24 -11 13 43 4 -13 12 48 13 -80 -12 11 32 -43 58
6014 58 -40 68 15 -20 88 11 -69 1 -15 64 -1 -20 65 46 -1 13 77 -17 -20 -33 -11 53 16 -28 77 48 -49 -27 7
6043 7 40 18 -22 49 19 4 9 95 43 16 -9 22 53 42 -42 -32 -6 -48 -122 25 68 -48 3 38 70 16 0 42 26 37
6073C7j16N6Q5j04k9N8L7po2N0K3n7mO1j8jl2O7j0mm5M6n1Qp1M3N0Ml8J9J1rm1
6106d4P4j1K6o7K7N6q4ljP0J4l6n3P1l3o5O7K1km0n2Q4J7n1n5N8LPJ2L6j7l8K4
6139A5J2Om0j6O8J3o2K6K0q7m3J2N2L5o5j2J08Oj13O9J9N6o6k2L5m0k7OO1lJk3
6171ANP8j05pM7K8j00J1R4m6m5L4K2N2o3j2Mkq1L1L5N6r9N4QP3j8j3L7l1n5J2
6203EL0Oj8p1N1M9r0N9L8n7N5n9K2L6j2j47Q8L2j4k9M9O5k5o8KP0o8j1J1N6m6
6234Il5k2J20o2j8l4O6k5Kk2L1j7k8K5L0Lj1L2j7K7q9M2L4l4pk3K3M7l7J3J6M2
6266H1r9J2L0mkn9P4m5qM0k7L4k7nRj4Qm0M9k2p2K0R7j1Po3K3P5r8NO1l4k1J3
6300a3R0n7k9%lK0J2o1NN2k7m1Q2J5j3p7R7Rn2l6n0J16k6J8l1M4j9o3j8Q2n0L9
$$ plain form
6073 37 -79 -23 62 -42 -71 -13 24 17 -45 5 28 -29 -33 28 10 9 -23 44 34 30 -15 31 -20 -12 -83 -40 10 14 -24 -5 6 -3 -44
6106 -44 30 19 45 -22 5 61 -23 -26 -27 43 57 21 -32 39 6 -59 8 29 27 -13 -65 19 36 -15 -70 -12 -9 -2 10 46 29 -9 15
6139 15 27 33 -7 -23 45 58 -4 22 42 -45 -88 -76 -24 11 -54 -66 42 48 -65 4 23 79 13 -9 26 -14 -41 -35 26 23 24 1
6171 1 6 84 -21 -28 19 47 -53 -42 52 6 -39 -5 17 69 6 -6 -2 -4 -85 -54 -19 37 -62 -8 0 73 55 42 79 48 -7 5
6203 5 35 41 23 -48 3 52 -38 21 59 2 57 -2 20 56 44 -103 -15 17 3 -26 23 88 63 -5 -3 67 -1 -12 -1 55 9
6234 9 -26 -48 72 10 -8 -42 24 -1 1 -21 10 -7 -35 -10 20 23 12 44 27 54 -35 7 41 7 0 -23 0 47 10 23 39 81
6266 81 -18 -6 24 20 18 -41 33 -12 -20 20 -7 27 0 -5 4 -10 -2 -42 7 -15 -87 -67 30 19 26 -37 -14 61 -37 -32 29 -5 -26 -13
6300 -13 77 20 -9 -9 -12 8 20 -41 -36 16 -11 -52 30 45 32 -45 52 61 9 -27 -77 39 13 31 0 44 25 -38 -56 26 -24 15
6332A5J0j1m9LJ09l4o6j9M5L7n0k6O3lM0j03P0M2m6k6o5Q3m2j4kK5O6q5M2k2M7
6363C4ql1QJ9o2j1L6L0l9m1P8J6q4L4M9j7m0K7lM2J3o6O5Kmo6lj4OJ6k4N4k8q8
6397a00R8m5O5jk2Nkm3K1R0q8J2M2j1q4N6QL5m8J1k1j0pm5Q2O2o2Nj4K6M6r7l
6430c9N1Rl9P9k6k5km5R8j7j05J8L9N5j7k7j5L8o7L4L3Om9k7R8k7k3Mj9nL0l3
6462a5M5m2Om9N9R3j01J4LK7m5J4K4L7j01L9N1l5K0n3N5m9Lj6J9J3n9l8P6M3n8
6493b0j0O4k3M8o6K4J3o0oM4k4oqLN6j2k3l0M7j5k1K3R9po4M1k8o5K9l7R2k1n1
6526a4PJ5%KqKl3j2M0K2q1O8l5P2m9k9L5O0l5n9Q3l8J7p8R6m1Mjk2Lk5J2QJ6K1
6561B3%J0J1K3r0P6k6j4k9qN1k3m6L4j0N9n9RJ0J2J3m9M2M0p4j7L6Q1l4pp2%k
$$ plain form
6332 15 25 14 -35 -32 77 43 -23 -42 3 40 -10 -36 27 24 64 -39 31 73 27 1 -64 19 -23 -37 -39 -14 52 -33 9 -13 34
6363 34 26 -5 3 22 -40 -51 -15 15 -24 -65 13 29 -55 -21 28 11 -29 -2 -5 37 50 -16 49 51 47 -19 -22 -36 -30 -14 -38 16 -12 -100
6397 -100 -2 -47 18 17 -5 0 -2 -45 -24 66 -22 -10 32 21 -63 -7 1 36 -12 -1 -22 -32 -39 -84 -2 60 -2 3 -11 15 61 -36 -39
6430 -39 12 21 -18 61 35 10 8 -37 61 44 -61 -43 -4 51 34 7 -8 30 -37 -3 30 36 -13 -40 58 31 8 12 -7 -12 18 -15
6462 -15 30 -12 -6 -55 4 97 -4 10 13 40 -5 9 33 70 -31 8 59 24 44 -9 46 -3 0 -16 3 16 -43 -81 -5 38 -20
6493 -20 -30 34 11 59 -7 17 30 -30 -36 8 -16 -22 -30 -27 29 17 -6 -36 11 -4 -25 -2 97 90 26 67 39 -26 3 -34 58 37 -14
6526 -14 -7 8 8 10 2 4 -29 -41 -1 21 -60 8 -27 45 -4 -33 2 62 27 -32 51 13 30 -48 48 7 11 10 -12 -9 -34 -22 -14 2 23
6561 23 23 33 44 67 -23 53 27 13 -16 -24 27 4 -42 -8 -18 41 -18 -9 1 13 26 -23 19 59 -15 -32 4 85 51 44 -28 -28 -30
6594c0J4N4N0o3k6m2Q0n5m5M7L9k9Qo5Q8kp9M3L0L4n3o5L3rj2K5qM6k3j7N7L2
6626E7j16K9R1n1l5R5n4K0J7Nk8m4K6j9pK9n6l3P1L3k0r1M2R7j89J19j6K8p1L7
6656c4M7nj2J7J0n6R5j06L5M1j3k7J1K7m8M6j4K2M1o3n0O9Nlm2K5m9L1j3OJ7m7
6688c7L5mN9r9oO3M1o2j3N2n6l2Q9M4n7l3j4N1J2r2L8O0kp5K4J3K9lnPJ5q4P9
6721C7k3jnoJ3j1J5jN7n0j2j3L4l6K3n4M0K9r6M7K8K6n8J0j0M1o2M9L1m2l1K4
6753gm4K9P2q9N2L9q3J6NPK4p0N8R1r1Pl4N1j4m1O8l3m5o2R1Jj0l1k0Q8J7n1m
6786a3O5k3k4NJ5Mq3%N9o6P8J2l4M3Lm7L4j0l1PK6o0l5K8R3k0n7L6Q3oj7q4J5
6819dol1J8M3k9k4M5jL4r5O4J3j9J4l1LlJm2R8mj11R6K3l8m2N2l1M7j07R0K3p3
$$ plain form
6594 -30 -16 38 88 25 -1 -43 37 -18 -63 -16 23 -6 2 -63 25 23 -56 -13 17 51 -2 -67 -34 -43 -55 -30 -38 8 -15 -32 25 57
6626 57 -59 -30 61 10 -25 70 16 36 53 58 30 -14 12 -7 -14 15 -41 -74 -3 30 10 -81 -39 58 -131 -12 -28 0 -71 -34
6656 -34 13 8 -4 13 23 -33 62 -44 -9 32 19 -8 3 30 -18 28 14 36 77 14 -36 33 38 35 -7 18 -31 0 -13 -7 10 -37
6688 -37 -2 -6 53 -46 -52 11 52 -10 -23 29 -27 -59 30 74 17 -16 -30 21 33 -59 -21 39 37 -38 -14 -1 28 25 20 27 42 -42 37
6721 37 14 13 8 2 15 4 19 18 75 25 13 0 34 -2 21 -33 7 36 -60 -13 15 41 -17 -7 -17 24 -38 11 42 0 -31 -7
6753 -7 -51 -22 50 -39 13 52 -31 -15 -10 -3 21 -49 9 100 9 16 -18 33 19 -22 46 13 -32 -94 -3 -2 -12 -43 -63 25 42 -9 -13
6786 -13 52 29 5 10 25 29 -54 -54 5 -61 17 29 -5 38 41 -6 28 18 -13 -6 20 -40 -75 -47 46 26 -31 5 88 82 65 -19 -4
6819 -4 -10 -41 -23 20 -9 -33 12 11 45 -50 14 27 8 22 -9 -6 -9 -8 -50 48 44 -67 29 52 14 -28 24 -7 40 -67 23 46 -27
6852b7M0k0K0N2m5m5J24m5p3OM2l6j1L9l4KJ2p8N5J3RK1m2J4m1ON5m0N3j4j1J1
6884A2j8ML9j7o3L6j6k4M6l3K3K4j1QN9j06kM1j6nK5m8N0j6K6m4O5m3m2k3O5M
6916@j3NKL8m2Km4O1K9j1j6jl1KJ8N1l8jj4k3N8q6j9P4J0n6kK0L3j2N5n2N9p5
6950a9LN1rOo0K8nk8%K4K6m4j8K1L2j0j2M1K4%j6M7j2j10O8k3RK6l9RK9L3j01
6983b9O1J0l6l5N2M1Jr9N9Ok5j7L2k2J9Rm5K2%n0L2L2%o4N7K2n1K0jk6L7l5R4
7016G1Rj1m2pL8nr6O2j9M5j06Q2m9N0j08P0K9Nk0M0M2l5n7mL2j6L9q0J01l8m9
7047b7K0oL2p7J04m5M2q0N9L1l2mKl2N1o2k7Q2J6o8M6J9m7m7N1pM4r2O2J0k2j5
7079a9K3J6N8p9kL3OrPJ4j6m6M7o8Q0p3J6N4l2lrNM1K6k2Ll4n1k2P1k0j6k1L7
$$ plain form
6852 -27 13 -7 13 65 20 -25 99 54 -19 -13 29 -7 -18 21 -13 -11 1 -77 -22 -9 0 21 -21 -7 -48 -42 13 -27 26 12 1 12
6884 12 -6 -2 37 20 -43 -7 -23 -47 -1 -34 -11 13 2 10 69 -37 -39 2 -14 -19 6 -42 8 -8 18 -26 39 -4 -46 -69 -4 0
6916 0 -13 -8 -6 32 -10 -8 -52 9 38 27 11 10 -21 -19 -1 50 12 11 -3 -26 32 -54 -73 1 11 -45 -47 -27 6 -6 49 -3 56 -19
6950 -19 -16 35 26 32 -28 0 -5 -33 -33 -9 17 -27 -45 -24 8 -2 -14 27 51 51 35 82 70 -40 28 5 14 40 1 10 39 72 -29
6983 -29 32 42 6 -29 23 64 65 -34 25 31 6 -11 21 -1 18 27 -18 4 4 -46 -14 18 18 -46 11 33 -18 2 1 -25 12 -23 71
7016 71 80 69 27 20 58 53 -43 19 0 45 -61 21 -28 22 -86 -16 13 18 -2 38 80 45 -12 -16 16 0 39 -41 60 22 -27
7047 -27 -7 -13 19 -58 46 1 43 -37 22 53 21 17 19 -13 38 -24 -51 31 47 -21 25 44 -3 -50 1 -6 38 -54 8 18 -4 -19
7079 -19 4 20 78 -1 -3 30 36 27 34 48 32 -14 33 -35 45 -28 -12 42 10 7 -2 3 44 70 48 51 17 -34 -56 15 -5 -21 -42 -5
7113eL7m0j3K7n7J01q4j3J12o7qj2M4Mn1KN9j6lo7M3J5Pn0K3j6%lL5M9l5K8k5
7146B1j7J2KK4l4n3L8J8J2kl0K8m9j6rK3M3l1m2P5rj3L7j0Qnpm8M8Mp1Q8p8k1
7180f4N0K4k0qN1k8j3K0K3n0K8m%J%L0k6k7N7Mn5J9nl4m3N9L6jlrk0J0R3m9L1
7215G7p3NO8k0k8k9j8O5l5k3nJ07m8q0J8qO1K0n2ML4o9L2M1NMk9QJ6k8kK3J4n3
7249Bm1O1J5p1L4M3L9q1K2Pjr1O2j1Rm1O1J9%p9O4o9P7l4l3K5L4p0O8l3M9rm4
7282a7O2oj1p5J45j03k4JN6n0M7n3L4J2Om8jnpJ4L5m3O9j3j2O2q5KpoK2j4K9L9
7316E5p6oJ2K7%j9J9k7K0PQNql6K2o0K6LJO4k9l2M2Ml7J9M7m6m%J8OL9l5j1m1
7352b3L0J4j2N1m9l4N5j5j8l8L7M2l1k4l9J22n4l2O0n0K3m3lM0J0j2k1J5K9k6
$$ plain form
7113 -5 32 -8 -21 6 -51 50 -34 -47 65 -2 -10 -22 22 26 -25 -23 36 20 17 -50 -7 8 15 -35 -12 -28 -28 -31 4 53 18 46 21
7146 21 4 16 18 42 8 -45 -7 11 23 21 -9 19 -30 -46 -55 -32 11 -20 -62 13 4 -9 28 18 26 21 14 -34 14 18 -53 35 -43 -64
7180 -64 -14 10 -10 -18 33 5 -8 12 35 -15 13 9 9 10 10 40 14 -13 44 48 -7 12 7 -27 -70 -11 25 24 21 12 -8 2 95 46 77
7215 77 4 9 77 57 29 0 -18 47 12 -11 -16 91 43 -37 -19 -27 34 54 2 6 40 -29 3 44 49 53 24 32 48 20 18 41 55 2
7249 2 -39 22 37 -34 0 43 82 1 23 30 29 -62 0 -11 -2 -43 18 37 37 -42 22 -47 30 -4 -37 -12 22 -48 20 -13 36 27 -17
7282 -17 45 39 28 -47 98 -5 -29 -28 28 -22 25 -28 6 18 24 -24 -25 -30 -37 -23 12 -31 38 25 13 75 -10 -8 -15 -21 1 -13 16 55
7316 55 -21 -27 -15 12 12 -7 12 -15 5 12 20 25 17 -19 3 -57 -31 -28 -27 37 8 -24 18 22 -15 4 51 5 1 1 19 25 64 29 18 -23
7352 -23 7 21 9 60 11 -23 32 17 -1 -39 -2 40 9 -15 -54 68 14 -18 42 -8 15 -28 -31 9 19 7 -14 1 30 4
7382D%j1k0j8M7Kp3J21l0l4Rj4mP0n1lj4L5k3j2L0J9%j3n4M0J7l0J2k5j7K0K9
7415Ik2J35r1j5l4MKj1K7L1o2J9j1K5l1J1J1N2k7K2j2J1N2o9pm5K3Qm3J07kj04
7447c7L0L3o3mK4m4N4o1O9J9M7k7p9O4J3nj6NK6L6m5o3K5lK9j0J2m5Lj2M5k0l4
7480c4L0j4N6k4Pl8L2J3mk8k6O9m1L0n6oL9nL3p3K5M2l0k1M6Lk5l6M9J2n7%N9
7513B7l9oJ0M2J7m9j8PL5n9nK5L9j9k2M6l0M3r7j1R0k1jj7J3n8J5L9K1n6kK1K9
7546In0L9ql0J7l6O1O0n9j7J6K7j4Ml8K6k5N3m1L5jo4N8ON3j15K1O9l3k7L4k6
7578DJ2k7K9k6Ok6L9N3p7Lm0j7N7o7K1Q0rL2m9l3L8Ok6M5J3o8M8K1m9L8l6N7l0
7611B2l9nJ9J4Lm9R0k8m5k2M5n0M1m0L5L7m1M0m3jrL2m7M0j7j5K5J7k8K6ON8o6
$$ plain form
7382 4 4 -7 -27 -45 2 4 -69 52 22 -12 -3 -17 -21 49 -2 -5 -19 16 -7 -19 11 30 30 17 -37 3 20 -10 2 -23 -40 -20 9
7415 9 -13 122 31 16 -18 -14 -12 -23 4 35 -27 -8 -19 6 -25 -14 -3 49 22 44 32 43 95 26 19 -26 -3 5 -38 69 67 -37
7447 -37 -7 26 -37 -41 -17 -61 -7 -68 1 20 67 40 -39 25 38 33 17 22 48 84 39 -24 1 -2 27 17 29 -16 -13 -25 20 0 -34
7480 -34 -4 -18 38 14 21 -17 15 28 24 -4 -30 39 -2 28 -28 -34 5 0 33 -40 -15 27 -3 -24 22 25 0 -36 13 25 -32 -32 27
7513 27 -12 -18 -8 34 51 2 -16 -9 26 -33 -38 -13 26 7 -15 31 1 44 -53 -64 26 5 4 -13 0 -58 -43 -4 17 -39 -41 -20 9
7546 9 -41 -2 -10 -40 -23 -59 2 62 3 -14 2 29 15 19 -19 7 -18 35 -6 29 28 -36 22 28 81 -34 -13 56 23 -4 30 4
7578 4 16 -11 18 -8 -2 -28 11 64 -13 -10 -50 -67 -10 -77 -56 24 15 47 -2 -35 3 9 -17 28 41 -27 21 42 -7 31 -5 52 22
7611 22 -17 -22 -3 11 14 -35 55 27 -18 -40 5 -45 -4 -44 -9 28 -13 27 -16 -17 -26 6 -41 -1 -18 -33 -8 9 -19 7 13 71 5
7644EM4n6L0M0q7K3L2k1n2L7M2m2o9N9qm0K6J1j4L2kl1P1n8k6K2L7o5OL2L9Ml7
7677a6M0nl6l4M1qM2j7J2l1L6n1LNk2M4Ok5oj5k2Q5K6r0K3K8l4N0Oj2j8J0m1Q7
7711F1q3O3o0J8j3J2m2qN6J9j2K4r7Q5p9Q6Qj1nl8J8K4l7lN2pPK7j32M8L3o3L2
7744a7%K8J6k2l6Q2m6M2Lp2k9P9j8k3m4O9j8nL1l7KJ6N0p3M2l8L6kjok4K0kk4
7778b1L7l0QJ6o5M5Mk2mj7L1J3lj9n9J44o0L8j2o4K7OM2l2J1j2j2QpJ9l3L2l%
7812Fj%j0k1K4o5R3Qp1L5L4k0Lk6l0L8JML1j4lm2On9R0k6pjO3jj12R2p1N3O1m7
7848A5qM7n5K4r6P6o8P6L5m7K8m0JN4q2N8j2M1m4n1M6k0L1k2pJmJ2l5N5j2mPL1
7882C1n0KJ1K3jL7j1k1n6L7J2l4K0m1P3Nn0j0L1M8k7j2j9M0p2J9M3Nj1lJjJ2q
$$ plain form
7644 5 49 -7 23 63 -24 -1 31 10 -42 -5 37 -5 -74 -15 -23 -63 -37 -26 -40 -8 -10 -41 30 -28 -54 -32 5 -60 -54 -22 17 21 -16
7677 -16 24 19 -17 -51 -10 -18 24 7 19 -12 24 -27 -24 -19 -41 3 9 -16 -22 -37 -59 26 52 -38 -15 13 -21 29 35 23 5 15 -26 61
7711 61 -22 41 -19 -1 -14 -2 -44 -52 4 23 11 35 -62 23 -56 30 38 27 22 -16 2 26 -11 -14 38 31 38 65 -67 -19 14 -49 -17
7744 -17 -17 11 27 5 -31 51 5 47 50 -22 -51 28 10 -13 -57 12 -6 -11 20 -17 -15 1 51 -22 20 -18 18 16 15 9 -15 5 3 -21
7778 -21 16 -14 -6 10 -55 -10 -6 -28 -32 -49 -18 -5 -8 -27 -86 58 -2 36 24 -40 -13 -7 35 3 14 2 -10 -2 -9 10 -23 9 6 6
7812 6 5 5 -5 -26 -2 -67 26 34 -37 -2 32 12 15 -11 -41 -3 -2 2 33 19 16 -26 -20 -79 11 -15 -22 -23 40 39 -73 19 -52 1 62 15
7848 15 7 54 -1 23 -73 3 -65 11 46 -1 27 -13 -12 42 -40 18 6 47 3 -48 -2 -22 9 -13 -20 -19 -23 -11 -46 9 -3 -7 0 31
7882 31 -19 -17 -6 17 16 53 42 21 -35 2 14 -20 0 -41 32 37 -13 -23 8 56 29 17 -2 38 -34 -15 28 33 22 19 20 19 31 23
7916B3j9j6l6R0rk0m7O8j0J0l9L4o4J8J6K3Qk4j1j4O2k4j8k1K4rJ5k4J03j06N4
7947C7l7oL1mOqj1Kl5M0K7q9R7m3J4rL9o0k9M4j7j2L1n1MK2LPKmK8K4l5l3P5j06
7983e6Q4o4R8rj4o0J8jo2Q1k4K0l3L2l1KL6l2K0NPJ1m1M0k7pM5n2pk2N6J2j7m3
8017c5N2LOk0l3KL8j31J31K6k0k4M6r2lM1n4K2K4k6L6l9L9L9K8k5n0j0M0k4J3
8048@K1l0M4k7m2J7L6mj7J1k2nK8n9R9p6O2J5l1j4RJK8q5J2K1j8L2K1on4M6j3
8081@n1P2j2j3Nok1OJ5qk4PR4o2n1k2O0L4k2n6N7PNj2J2K1K1p8K4j5rrP7k2l5
8116a1L5n0N6m3L5qj3K7p5N7lk9K5J7k1L2J6j2n0KK8k2K6l0J8L1Qj9Jl7j9JJ6
8149a1j5k7O2k9k1J5LO0k9j2k1N2K6j7o6L3lj9kn4O4KM1n4lKRM8k4j0QL0n4M9
$$ plain form
7916 23 4 -12 -48 42 33 13 -34 34 24 34 -5 29 -35 -17 -1 22 30 6 -5 -19 43 19 1 -20 4 -5 10 -14 89 -17 37
7947 37 0 -6 25 21 27 19 8 10 -25 15 42 -47 50 7 21 12 51 -9 -38 6 -11 -23 8 -43 -39 -17 -14 -7 -5 -9 19 43 8 -25 50 -56
7983 -56 28 -36 62 53 39 -21 -3 -4 -66 15 -9 11 -22 10 -21 -19 17 -15 5 10 17 28 -13 27 0 -7 38 -14 -21 -43 13 25 8 -35
8017 -35 17 20 26 6 -27 -25 13 -118 13 39 19 -5 41 -51 -54 -13 -67 -45 -21 -47 -11 -50 -11 28 56 31 -19 -29 11 -13 0
8048 0 21 -9 35 8 -34 -17 19 15 -2 9 -13 -18 10 -49 50 -26 36 51 20 6 15 16 44 -41 -29 -8 -26 6 27 21 -33 13 0
8081 0 -51 21 9 -4 1 -5 -26 -20 -5 -13 -37 -30 64 2 -49 -71 -11 23 1 -55 2 9 14 2 14 35 56 -22 2 -13 -22 -31 46 24 -11
8116 -11 24 -26 30 -13 22 14 1 28 -47 10 7 -22 3 20 -1 31 47 35 -15 -13 15 -7 19 -11 7 38 46 27 28 -9 -28 -27 -11
8149 -11 -26 -53 9 -20 -41 -26 -23 37 8 -4 -25 27 53 36 -30 3 0 -19 -21 -75 -11 -9 32 -22 -25 -23 -14 34 10 0 8 38 -16 33
8183C3n6N8n8K4M3r6Q9o6
$$ plain form
8183 33 -23 35 -23 1 44 -52 37 -29
8191b9
$$ Imaginary data points
##PAGE= N=2
##DATA TABLE= (X++(I..I)), XYDATA
0@%%%%%%%%%%%Qj6J6j6J6k4L2l7M5n6O5p3Q8j05J22j41J65j94K25k57K91l28L70
34A96m19M74n35O01o72P50q34R27j031J143j264J397j541J699j874K064k273K507
52A315k762L047l365L722m130M594n130N757o508P423q563J0033j2012J4835j9222
67a0966K7047m5281J68929J16444j86947k2440k8762j8984m5770o169l4567k9679
79a17145K2830J21718P9832k8011r8851m0648K7141J7068l6650j6689j8563l7961
91a25929O307R7120R2181j3780q9406k1607N0244K2370j6713q782j8402l0387
103e6784Q619Q8889R6386j004o8098k5784L1890K7402k6134n3560l9027m5026
115f2231l3687N1084Q4859q29o9443k3131N4420M8193r107k2863k3835m5892k7518
$$ plain form
0 0 0 0 0 0 0 0 0 0 0 0 0 8 -8 8 -8 8 -16 16 -21 24 -32 33 -40 48 -57 65 -76 89 -105 120 -137 154 -174 196
34 196 -223 251 -284 317 -355 395 -439 488 -543 600 -664 733 -808 891 -983 1081 -1192 1315
52 1315 -1447 1600 -1765 1957 -2173 2421 -2709 3048 -3460 3963 -4600 5433 -6579 8256 -10966
67 -10966 16081 -29200 139729 256173 69226 46786 18024 -960 -46730 -52899 -87466 -117145
79 -117145 -94315 27403 107235 79224 -19627 -60275 -33134 -16066 -52716 -69405 -87968 -125929
91 -125929 -119622 -22502 69679 55899 -33507 -55114 -4870 17500 787 -7995 -26397 -56784
103 -56784 -48165 40724 137110 136106 68008 42224 74114 101516 75382 21822 -17205 -62231
115 -62231 -95918 -44834 40025 39196 -30247 -53378 1042 49235 40128 17265 -6570 -52462 -79980
128g9980L2527N4362l104p3523m2338N0483O4198J5492l621J365p066j3329K4931
141B0397O1025j35q3954n4689L1376N0042O503j5462k76r645k3271K2174N4260
154E8345p31o6788n3918K1498N8491J4943j6277J491k165j9274Q166M3422P224
167E4427p3950p2623J4212M4876M526j0451M992Q105K980K4744O0098K8867n1478
180C9325o0558K454L4170L391l0647j5399M303q414R767N3879L2412l6660n3586
193b5563L475M5905R698k6985o939J024j3452M328L4591K2937l2203n7375m453
206d5012M1445J4800j8602j1280N412m58n018K6323L4485k5306n3783j163M0534
219B377J9555j6745j3619P481m028r514K2951K7241j7552m3182j0463L7864K8703
$$ plain form
128 -79980 -47453 6909 3805 -69718 -112056 -61573 2625 18117 14496 15861 8795 -4534 20397
141 20397 81422 81287 -2667 -57356 -25980 24062 30565 15103 14827 5182 -18089 4085 58345
154 58345 57614 -9174 -63092 -41594 16897 31840 15563 17054 14889 -4385 3781 47203 54427
167 54427 -19523 -92146 -77934 -33058 -28532 -38983 -33991 -25886 -22906 1838 61936 90803 39325
180 39325 -21233 -18779 15391 18782 -11865 -27264 -22961 -31375 -21608 32271 64683 28023 -25563
193 -25563 -22088 23817 33515 6530 -409 615 -12837 -8509 26082 49019 16816 -40559 -45012
206 -45012 -3567 11233 -7369 -18649 -13237 -13695 -18713 7610 42095 16789 -36994 -38157 2377
219 2377 21932 5187 -8432 -951 -4979 -14493 8458 35699 18147 -25035 -35498 2366 31069
232C1069j6672j4626R795l83j0257J0439K3143j1215n1965k1421L4139K1165j5919
245a2708q089J4563J1832l55J3769L0475m463m5806k4487J6571J4532j7622k3196
258c4984Q911J6365m704J0187L4502P373l2753k2750J9428K0753k0105k2966R132
271a1611Q261p310N708K5536J2271k4469k3293J6632J8879j7556k5458j656Q856
284a5210n899m507K6573K4862j4799j4624K1306K2735j2628k8777o357M263j6922
297a9984j2812J8651J8514o856r935J6539K8326l299k5959m610N516j4622j8720
310b9251O287K0222k383j5308J7355L2895K41j7567l61Q033j1824k5275k829J4153
324e612p719j6656J0428K6471R588j0540L86J8248l051k5740n772J1833n412j9996
$$ plain form
232 31069 14397 -229 9566 9183 -1074 9365 32508 21293 -30672 -52093 -17954 3211 -12708
245 -12708 -20797 -6234 5598 5243 19012 49487 45024 -782 -25269 -8698 5834 -11788 -34984
258 -34984 -26073 -9708 -14412 -4225 30277 37650 4897 -17853 1575 22328 2223 -20743 -11611
271 -11611 -3350 -10660 -4952 20584 32855 8386 -14907 1725 20604 3048 -22410 -24066 -15210
284 -15210 -21109 -25616 957 25819 11020 -3604 17702 40437 27809 -968 -7325 -3062 -19984
297 -19984 -32796 -14145 4369 -2487 -12422 4117 32443 29144 3185 -1425 4091 -10531 -29251
310 -29251 -22964 -2742 -5125 -20433 -3078 29817 30058 12491 12130 20163 8339 -16936 -19765 -5612
324 -5612 -13331 -29987 -19559 6912 16500 5960 6346 24594 21543 -4197 -9969 1864 -3548 -23544
338b3544m60K4052Q842j4135M405K1930p29j9577o104J1152N71j9861n684J7849
352a293M564j2745R96J8939Q542j6144r420J7794P449j8617p707J1505J642j6619
366a1114o634J8226Q736j8059o464J8156J0602r164q980O345L445j7635j0373
379b2913J5573R126j3349q016J7861K2768j971q663J0474L876j9718j3099P759
392b92M053j8365j7377J3775K2694J358k128J0906P719q677j1615O189P834j9658
406c584k3572O815J9383K956p023N145J0488r043j3536Q749P945j8084k1604M218
420c0747K2364J0127l407Q674J4515k468o884P254Q846j3761k8772n780J8347
433a692M524r569K309J0613L92n949R225J6889r334k6270m062J4843M215j0748
$$ plain form
338 -23544 -24004 48 8890 -5245 -840 21090 20361 784 -5320 5832 6403 -13458 -19142 -1293
352 -1293 3271 -9474 -8478 10461 19003 2859 -6561 11233 18682 65 -7642 3863 5505 -11114
366 -11114 -17748 478 9214 -8845 -15309 2847 13449 4285 -4695 1650 5095 -12540 -22913
379 -22913 -7340 1786 -11563 -19579 -1718 21050 19079 10416 20890 24766 5048 -8051 -292
392 -292 3761 -14604 -31981 -18206 4488 5846 3718 14624 22343 13666 2051 8240 16074 -3584
406 -3584 -27156 -20341 -958 1998 -5025 120 10608 1565 -11971 -3222 4723 -13361 -34965 -30747
420 -30747 -8383 1744 -1663 7011 21526 19058 12174 19428 28274 14513 -14259 -20039 -1692
433 -1692 2832 -6737 -4428 6185 6577 628 9853 26742 17408 -8862 -12924 1919 6134 -4614
447d614p450L623k232r837O987J6705l668j9295l507K0944J5781p800o345O860
461F152k885j0174M918J4373k096k0474o307K1164J5900n260n908J714j478q263
475A376p39J2728L62k1613r335J7630J6498m381j2025j561j734j3754m181J2167
489h562o58j8210o799J9694K5386M955n272M080J585r194m809M376k716k0947
503a7091j8077J2932K4299M079m747N136P093j977k065R271L014k0838j7984R712
517g243J8523L301q782l114L950l981n706O333K089j7389j8265N383K2022Q246
531E367r121k08Q160j035k546P064M216j4764k1223J931J9093M889q733k066N885
546c091L923J227Q419J0695q013j7994J507J7555O359j1644r974K801O17n457
$$ plain form
447 -4614 -12064 -8441 -10673 -20510 -13523 3182 -486 -19781 -23288 -2344 13437 5637 -708 6152
461 6152 3267 -6907 -1989 12384 10288 -10186 -16493 4671 20571 15311 9403 11117 9639 1376
475 1376 637 13365 13727 -7886 -17221 409 16907 12526 501 -1060 -2794 -16548 -20729 -8562
489 -8562 -9220 -27430 -34229 -14535 10851 15806 10534 14614 16199 7005 2196 6572 3856 -17091
503 -17091 -35168 -22236 2063 6142 1395 6531 13624 11647 9582 18853 21867 1029 -16955 -7243
517 -7243 11280 14581 5799 2685 6635 2654 -3052 3281 5370 -12019 -30284 -24901 -2879 5367
531 5367 -3754 -3962 4198 3163 617 7681 11897 -2867 -24090 -22159 -3066 1823 -6910 -8976 -3091
546 -3091 832 2059 10478 21173 13160 -4834 -3327 14228 20587 8943 -1031 1770 2387 -3070
560c070N756R173q283j6234M39J8133J0331j0082r768J650j188n083J559M926
574a741n927j6866l117J9488J3513o317o835L936N021r98K202R553j696j5606
588e390k379J6928J2315n897j1319r00K528n029j349O088k694j3492m929J4530
602i89J6572l348j0888J687L796l961k214L253k909j5647j0669J1093J3980l681
616c925q686J341P264L084Q52P066L775j1700q857R967J3319j859j1817l037O603
631C390P7k741N885K345j0583q852P103J4323k02j2322k871N408N5j924L278K875
647E244o955j0681M901J4919K05j1809m130M784K265k488L060O551n185r498N556
662c261J3184J637j0888p535L507J914m385J741N654l208p353L537J4518O277
$$ plain form
560 -3070 2686 11859 3576 -12658 -12219 5914 16245 6163 -3605 -1955 -3143 -8226 -6667 -1741
574 -1741 -7668 -24534 -27651 -8163 5350 -967 -7802 -3866 1155 157 2359 11912 10216 -5390
588 -5390 -7769 9159 21474 15577 4258 3358 5886 857 -492 5596 2902 -10590 -15519 -989
602 -989 15583 12235 1347 3034 6830 2869 655 3908 999 -14648 -25317 -14224 -244 -3925
616 -3925 -12611 -11270 -4006 -922 -70 6996 10771 -929 -9786 181 13500 11641 -176 -3213 3390
631 3390 3467 726 6611 8956 -1627 -10479 -3376 10947 10745 -1577 -4448 960 1015 -909 2369 5244
647 5244 -1711 -12392 -7491 7428 7633 -4176 -8306 -3522 -1257 -3745 -685 5866 681 -8817 -3261
662 -3261 9923 11560 672 -6863 -3356 -1442 -5827 -4086 1568 -1640 -8993 -5456 9062 15339
676A5339r835o857M707J651m871j133K770l492j0078J13J3835O137p470m602M793
691A007M901j773j840L659j654j0303j670J0658O238o714p926L572N598m046l172
706c465L493j882r038k834R594Q565m664o064N583P030n63j657K549M45q228o670
722g806O550O841o251p756K910P678J374k390M180L581p386o080N556N468n077
737A392r071O24P587R43k432M070L355m718n952K570O693l803j0593R8P291J054
753h92k120K981N208k205o389L183P587l416q884j151N467K150l367J183O080
768E415j377o014K331O624j199q837l870N541J869n121Q35O010k64m474J467P674
784F610J324q330l338N330J082m474j234L564R22n487j064P427J890p107k951
$$ plain form
676 15339 5504 -1353 3354 5005 134 -999 1771 -1721 -11799 -11686 2149 8286 816 -3786 1007
691 1007 5908 4135 2295 5954 4300 -6003 -7673 2985 9223 2509 -5417 -1845 3753 -293 -3465
706 -3465 28 -1854 -10892 -13726 -4132 4433 -231 -6295 -712 6318 5755 4098 6647 7092 -1136 -7806
722 -7806 -1256 5585 -666 -8422 -5512 2166 3540 1150 5330 8911 1525 -4555 1001 6469 1392
737 1392 -7679 -7055 532 1475 -957 3113 6468 1750 -4202 -1632 5061 1258 -9335 -9237 -1946 -892
753 -892 -3012 -31 5177 2972 -3417 -234 7353 3937 -4947 -6098 -631 1519 -1848 -665 5415
768 5415 4038 -1976 355 6979 5780 -3057 -6927 -1386 483 -4638 -3803 2207 1943 -2531 -1064 6610
784 6610 7934 -396 -3734 1596 2678 -1796 -3030 534 1456 -4031 -5095 2332 4222 -2885 -5836
799e836N081L571l509k390N185J734o024r54O276K302n233l927M616M423m106
814A209l063L819Q49n273l454M029M059m894m498N506N348k429k383L531L253
829E609m390m723M175L699m966m263L452M822j547l761K799M041m029m735K713
844a104L685k965n169K418O511j093l943L514M171k958n116Q42L755l256o434
859g142J690N205j047l234K144N036m29n124J080N184j674m992J061N303P41m328
875e26Q70N852j011n729L12L916r62n251n60N215N47m958M64M631j19m787j627
892c723M148R11n485q63N441Q02m039o64M620J530n248k087M687Q88m468n92M350
909B08K330l234j551N286K396m654j919L585K060l116k384M365L200m232k099
$$ plain form
799 -5836 -755 2816 -693 -3083 2102 3836 -2188 -3142 3134 5436 203 -3724 892 5315 1209
814 1209 -1854 1965 2814 -2459 -5913 -1884 2175 -2719 -7217 -1711 3637 1208 -1175 2356 5609
829 5609 1219 -3504 671 4370 -596 -4859 -1407 3415 1868 -1893 906 4947 918 -3817 -1104
844 -1104 2581 -384 -5553 -3135 3376 2283 -1660 1854 6025 3067 -2049 -1207 2548 -708 -7142
859 -7142 -5452 -247 -1294 -4528 -2384 2652 2223 -2901 -1821 3363 1689 -3303 -2242 3061 3802 -526
875 -526 344 6196 5185 -544 -232 3684 2722 -2529 -3089 2126 2673 -2285 -1821 2810 2691 -2096 -3723
892 -3723 425 1336 -4149 -5012 429 1231 -2808 -3472 1148 2678 -2570 -4657 30 918 -3550 -4142 208
909 208 2538 -696 -2247 3039 5435 781 -1138 2447 4507 1391 -993 3372 6572 2340 241
924B41M194J530m715m295J717J953m483l307L915K560k794j589L586L975k697
939b09m235K810L132l105k676K784L465k013l352L587M530l102l866K274L162
954C186j740l037K195M215j950l166L123L837j919m330J03L302j751n036J077
969a891L127k484l738J244M288q69m975Q25M446j081l178J257L459m44l530J000
985b544N039k08m298N22L903N51k955k31M172k6m485M32M175l43m372j251L732
1002A813J067l875j29L857r6l543m94L527R33m665k209L460J009l494r31K843
1018i27J176l407j580M361J636m229j562L540K197k004j110L710K286l040j088
1033d1L762J520l383l052J931K470l126k612L014J807k800j637K903K885k852
$$ plain form
924 241 4435 5965 1250 -3045 -1328 625 -3858 -7165 -3250 -690 -3484 -5073 -1487 2488 -209
939 -209 -4444 -1634 1498 -1607 -4283 -1499 1966 -47 -3399 188 4718 1616 -2250 24 3186
954 3186 1446 -1591 604 4819 2869 -297 2826 6663 4744 414 517 3819 2068 -2968 -1891
969 -1891 1236 -1248 -4986 -3742 546 -323 -5298 -4473 -27 -1108 -4286 -3029 430 -14 -3544 -2544
985 -2544 2495 2287 -2011 -1489 2414 2965 10 -221 3951 3925 -560 -128 4047 3704 -668 -1919 1813
1002 1813 2880 -995 -1124 2733 2637 -906 -1400 2127 3060 -1605 -3814 -354 655 -2839 -3770 -927
1018 -927 249 -3158 -4738 -377 1259 -2970 -4532 -992 1205 -799 -1909 1801 4087 1047 -41
1033 -41 3721 5241 1858 -1194 737 3207 81 -2531 483 2290 -510 -2147 756 3641 789
1048G89l482K690K488k651k157J758K161k167k877K628L130k957l244J786K525
1063D20j232k927J546L367j860k610L026L348j409k844J199L672r00l354J410
1078H52K636j710k756J047L065q96m050N62L505j044l081M62K502o07l376O40
1094b249L898p88l598P32L057J96k878l57L100k59l615M83L140j58k926n93L424
1111F09J323l112j02L475K91k644j91L138J011l517j183L484M38l059r07K103
1127A157N82l036j472K936Q34l427j118K625J532k091j531K812K048k785j033
1142a967L192J398k449j796K313K147k682j913K496J236k295j500J925K057k248
1157h6k358K328K146j982j911J677K127j600k459K126K458k353k316J679K131
$$ plain form
1048 789 -2693 -3 2485 -166 -2323 -565 1596 -571 -3448 -820 2310 -647 -3891 -2105 420
1063 420 -812 -3739 -2193 1174 -686 -3296 -270 3078 1669 -1175 24 3696 2796 -558 852
1078 852 3488 1778 -978 69 3134 2238 -1812 -1250 2255 1211 -1870 -1408 1094 487 -2889 -2249
1094 -2249 1649 861 -2737 -2005 1052 1248 -1630 -1987 1113 854 -2761 -2278 862 704 -2222 -2815 609
1111 609 1932 -1180 -1282 2193 2484 -160 -351 2787 3798 281 -902 2582 3020 -39 -946 1157
1127 1157 1739 -1297 -2769 167 1001 -2426 -3544 -919 613 -1478 -3009 -197 1851 -934 -1967
1142 -1967 1225 2623 174 -1622 691 2838 156 -1757 739 1975 -320 -1820 105 2162 -86
1157 -86 -2444 -116 2030 48 -1863 -186 1941 341 -2118 8 2466 113 -2203 -524 1607
1172A607j415k506J358K609j797k172J967K226j001k214J110K989q84k744J333
1187D66K404j378k467N62K316j042l433O56K565j219k568O89K331k71k548O48
1203b289L125m46k391R32K674K99k143O0L042Pk843L28K427l76k666n42K475K47
1221A920l044j05K669j77k412l46K133N61k884q39K698K25k384m36K202R22k336
1238a633j053K689P90k620n54K300J073j705p76K616J586k132o26K438Q94j873
1254A414j390J755J360k296j634J967Q75k156j681J227J431k265k047J889J549
1269bj903j057J776J883j163j671J860J991j661j556J526J727j014j820J377K309
1285B602j519k001J345J621j236k058Q09K275r98k069J453K004j151j844M46J823
$$ plain form
1172 1607 192 -2314 -956 1653 -144 -2316 -349 1877 876 -1338 -228 2761 1877 -867 466
1187 466 2870 1492 -975 -413 1903 861 -2572 -1916 649 -570 -3138 -2449 -118 -389 -2937 -2289
1203 -2289 836 390 -2001 -1069 1605 1904 -239 -179 2863 2870 27 355 2782 2406 -260 -802 1673 1920
1221 1920 -1124 -1229 1440 1263 -1149 -1495 638 1199 -1685 -2524 174 399 -1985 -2421 -219 703 -1633
1238 -1633 -2686 3 793 -1827 -2381 -81 992 -713 -1489 1127 2713 581 -45 2393 3287 1414
1254 1414 24 1779 3139 843 -791 1176 2051 -105 -1786 -559 872 -1393 -3440 -1551 -2
1269 -2 -1905 -2962 -1186 697 -466 -2137 -277 1714 53 -1503 23 1750 736 -1084 293 2602
1285 2602 1083 -918 427 2048 812 -1246 -437 1838 840 -1229 224 2228 1077 -767 -321 1502
1301A502r06k641N80J979j037j775O85K002k02k274L82K526p06k065O83K229J44
1318A106j720M89K762j04k223L50J721m66k199n95J824Q9k366L2K187j75j918
1335a206l47J800L69k350m50K348L00j827J44J971P43j962q01J957L05k233m81
1352a720J619P34j340o84K165J253j885o57J868O19j568j142J593J365j830r57
1368e67J965P39j732j249R59R01j847j641J461J100j461q06J364J513j108j505
1384a914J319J468j591j250J403J470p12j169J326J912j237j518J121J074j146
1399E56j605O15J760p37j542J322J636p10j472M80J555p95k160N45J726q84j514
1416a224N09J425n50j941Q1J474p29j807N39J601K21j140M76K316Q2j567M19J570
$$ plain form
1301 1502 596 -2045 -1465 514 -523 -2298 -1613 389 187 -2087 -1705 821 115 -1950 -1267 962 1106
1318 1106 -614 -125 2637 2533 310 660 2381 1915 -284 -879 945 1034 -1332 -1300 887 712 -1206
1335 -1206 -1553 247 616 -1734 -2184 164 464 -1363 -1219 752 1495 -467 -1268 689 994 -1239 -1720
1352 -1720 -101 633 -707 -1391 774 2027 142 -515 1353 1972 404 -738 855 2220 390 -567
1368 -567 1398 2137 405 -844 115 1016 -831 -2472 -1011 89 -1372 -2178 -814 699 -409 -1914
1384 -1914 -595 873 -718 -1968 -565 905 193 -976 350 2262 1025 -493 628 1702 556
1399 556 -1049 -434 1326 589 -953 369 2005 1295 -177 303 1858 1063 -1097 -552 1174 290 -1224
1416 -1224 -715 710 160 -1781 -1700 -226 -955 -2762 -2223 -622 -401 -1541 -1065 1251 1333 -234 185 1755
1434A755j35j671k22J773O0j914J63J677j39j556l76J458K77j905k30J770J97
1451I82j390j75J386M71j759p40J519R5j784n02J351O13j284o22J771Q03j602
1468h67l94J357N97j069q17J370J189j188n41J659O28j125q66R15R78j393j281
1485h48J342Q00j246q19Q66Q96j160j425R99R01j202r45J097J134m77j038J085
1502d0J409j001j217Q54R21q12j384N10J409p64j221R74J290n04j030O28J422
1519A444l40j468N76J360n83j258L39J034l34j657Q8J261o11j546K47J171k1j187
1537a485J38J869n2j208N27J330kj172j01J271P9j537L5J263k12j173k13J188
1555E45L48j447k37J362O1j297j55R89L21j274m17J443L27j217k30R59M46r92
$$ plain form
1434 1755 1620 -51 -273 1500 1560 -354 -191 1486 1347 -209 -585 873 1150 -755 -985 785 982
1451 982 -408 -583 803 1274 -485 -1225 294 389 -1395 -1897 -546 67 -1217 -1839 -68 735 -867
1468 -867 -1261 96 693 -376 -1193 177 1366 178 -363 1296 1924 799 -67 848 1826 433 -848
1485 -848 494 1294 48 -771 95 991 -169 -1594 -595 306 -896 -1841 -744 390 -87 -1125 -40
1502 -40 1369 368 -849 5 926 114 -1270 -760 649 -115 -1336 -362 928 424 -606 22 1444
1519 1444 1104 -364 212 1572 989 -269 70 1104 770 -887 -799 462 -149 -1695 -1448 -277 -298 -1485
1537 -1485 -1347 522 470 -738 -211 1119 1117 -55 -156 1115 1194 -343 -308 955 743 -430 -643 545
1555 545 893 -554 -791 571 632 -665 -820 169 490 -784 -1201 242 569 -648 -878 81 527 -465
1573d65o68J234N58j231l38J296O38q69p30J052O53j127o20J163M97p84n06Q79
1591F32R73r63r58Q19M20j156p80N22O23q42j034R56R90q69o23O55Q72m31r04
1610a098R47J126p22p14R91R52m59j036K37R00q30j187M25O55m98p50N57J373
1628H69k4j071M23R60n57j029J24P43k30j196L58J386l64r21R8O91r1j089j42
1647a062J107k14q71N09J175K77q57k45J002j0j258o1R33k09q46j34J205L10j059
1666c08k19J021J7r66j56P20L03r55k01J373K84q47j74O86L51p95n85Q37K19j052
1686d47k65R18M09q37p76N85M83r20m80Q27M38m47k35R99J020o98p81O60M19p56
1706A16o26N06O15o24n45R59P54p25p79J74N60n59q00M70Q87m88l40Q22P80k96
$$ plain form
1573 -465 -1133 101 659 -572 -910 386 1024 155 -575 477 1130 3 -617 546 1043 259 -247 632
1591 632 1605 642 -316 503 923 -233 -1013 -491 132 -710 -1744 -788 202 -667 -1290 -635 237 -194 -1098
1610 -1098 -151 975 253 -461 530 1482 1023 -13 224 1124 294 -893 -468 187 -311 -1061 -504 869
1628 869 845 -226 197 1157 600 -429 -305 438 208 -988 -630 756 392 -529 -431 260 169 -920 -1062
1647 -1062 45 -169 -1040 -531 644 921 64 -181 821 811 -447 -508 425 216 -630 -764 441 751 -308
1666 -308 -527 494 511 -455 -611 109 412 -543 -744 629 913 66 -108 578 929 134 -451 386 605 -447
1686 -447 -712 206 615 -222 -998 -413 70 -850 -1330 -503 -65 -512 -747 252 1272 574 -207 453 872 116
1706 116 -510 -4 611 -13 -558 401 1155 430 -349 -175 385 -174 -974 -504 383 -105 -445 377 1157 861
1726H61j038l5O14o28j019M04N43k60m55O35J253k48r19K48O66l42p56N7P06l4
1746B53n84N35J120j72q34k07M34k01j088k86P52k47o18M48J077K25p17k64P51
1765C77P0r89n2N90J39m15J34J067L33j008m06O68j41p79l72M33L38n60l6J198
1785E89K08p70l46M21L11o08o51O22L57n31p5Q36M15n55o66L81M82q08m93M72
1805d09M04l24j02Q39Q20n50o14M82L14n57o55J20M97m13n08P77O84n38o73J93
1825b13L95m25r09K66N73l15k41O83Q53l8o41J93O58l30p21J17K93j56m75K09
1845b24Q73j61p86K05O06j58o34n4M39l2n94K26Q07q3n88P9N13K09p46k49N18
1866A66k39o04L7M93P6n65j89Q38K43m60L3N66K10m61r6N75J17q42k59N21J64
$$ plain form
1726 861 -177 -212 402 -226 -1245 -841 -298 -558 -1013 -378 875 627 -292 -44 622 280 -476 -419 287 253
1746 253 -331 204 1324 1152 318 111 545 344 -744 -1030 -278 -525 -1143 -695 382 607 -110 -374 377
1765 377 447 -542 -594 -4 135 -280 -146 921 1254 246 -160 508 367 -412 -784 -351 -13 -573 -609 589
1785 589 797 27 -319 102 413 -195 -846 -224 133 -398 -473 363 778 223 -443 -62 420 -388 -881 -409
1805 -409 -5 -329 -431 408 1228 678 64 546 860 303 -352 -232 265 -148 -656 121 805 267 -406 -213
1825 -213 182 -243 -1152 -886 -313 -628 -869 -186 667 629 -12 181 839 509 -212 -95 198 42 -433 -224
1845 -224 649 488 -298 -93 513 355 -279 -333 106 74 -520 -294 513 430 -158 -79 434 643 -103 -352 166
1866 166 -73 -677 -640 -147 -71 -636 -825 13 256 -204 -171 395 605 144 48 623 740 -102 -361 160 324
1887C24m18k71M73M12n03k65N70P6o60l40L98L72l48k94O30L75k53j85L45J88
1907F26n22o70J89L64m72l03M94M01l6l03M00N09m95n79K41K17k61l61L11O40
1927C90o9k16M43M45n04m68r1K78k34p28J09N75j51j66L20N31o7n15Q7M08k15
1948A62n85J67L37M4l39J10O22l4n94K1L48j77n21k18M68O1m63K01O61J09k45
1969A35K0M30K8o03k36M00j16m53j1L23K60k82k42O15O7n28r4L04J48m34r2M53
1991I2L15l64L2M17J71l81k82J65J87o19l46L69J99k26j64L50L75k74l42L79J18
2012A71m55k80K36L62r2k63M61M72k75k64K58O8l06n76J85L81k36j30L61L23L3
2033D34k11J12K84l15o05J18L17j17l28J57N32o5m53J74K68m41n04j88K53pk41
$$ plain form
1887 324 -94 -365 108 520 17 -248 322 398 -262 -602 -204 168 -180 -474 156 531 278 93 438 626
1907 626 104 -566 -377 -13 -485 -788 -294 107 71 -232 168 677 182 -397 -156 61 -200 -561 -250 390
1927 390 321 105 548 993 489 21 -70 208 -26 -754 -645 -70 -221 -387 -67 464 397 -118 -31 377 162
1948 162 -423 -256 81 125 -214 -104 518 484 -110 -89 259 82 -439 -657 -189 -128 -591 -390 271 380 135
1969 135 155 585 613 10 -226 174 58 -395 -406 -83 177 -105 -347 268 335 -193 -287 17 165 -269 -361 92
1991 92 407 43 75 492 663 282 0 165 352 -267 -613 -244 -45 -271 -435 -85 290 16 -326 53 171
2012 171 -284 -564 -328 34 -58 -321 140 612 337 73 331 399 93 -483 -298 83 -153 -283 78 401 434
2033 434 223 335 619 304 -301 -183 134 17 -311 -154 378 313 -140 34 302 -139 -643 -831 -578 -585 -826
2054h26R6P19M4n2L26L24k0n21j22L27j17m21K5M00J32p3oM95p4n38j27J59l7
2077A13k85j46L53K36l13J43L25q0m10k70Q5J39m73l41L84J64j78J53K93J97k08
2098a19k14M00K44k80j82J72J80l0j01L47K87l24j18L49J92k42m34j0N4k63k28
2119c20K20Q2k65j22J72L85j10l21J89J47j53j93P5L4j95k70K67L50l7r6J41K61
2141B41j4k65RJ75k29l29L40M53J43j05O5L45Mm53o8k7m09l81m7L80J58k91J51
2164a54L20rj78lm6k1m99k9M69J12k29J13L64N4q3r8J23j80m60j17K79J47j09
2187b34nL38L98r5M0R0j34l25k86K17K01k23j26L04K46j19o4m5m9m53l42L29J88
2210a49k53r4L25K72K0q8J61J4l75j86K50J29j09j33J17M16j13q2J19n0k48j72
$$ plain form
2054 -826 -730 -11 33 -19 307 631 611 90 -32 295 178 -243 -218 182 314 241 235 730 656 118 -9 150 113
2077 113 -172 -318 35 271 -42 101 426 346 -64 -334 -249 -110 -583 -924 -540 -376 -554 -401 -108 89 -119
2098 -119 -333 67 311 31 -151 21 201 171 70 417 704 380 262 611 803 561 127 117 171 -92 -320
2119 -320 -100 -18 -283 -405 -233 152 42 -279 -90 57 -96 -289 -214 -180 -375 -645 -378 -28 -65 -161 -20 241
2141 241 227 -38 -29 146 -83 -412 -72 381 524 419 484 829 833 380 312 285 -124 -505 -552 -172 -14 -305 -154
2164 -154 166 157 -21 -24 -70 -91 -590 -619 -150 -38 -267 -154 210 264 181 83 206 26 -434 -551 -272 -125 -234
2187 -234 -239 99 497 402 442 532 398 73 -213 4 205 -18 -144 160 406 287 223 178 129 -324 -666 -337 -149
2210 -149 -402 -496 -171 101 121 33 194 208 -167 -353 -103 26 -83 -216 -99 317 204 122 241 191 -57 -229
2232b29N1K52r4k11J98K72P9r9K0J13j90l55Q4J47j67k71J03K37J40j18Q2K09
2254B53k50k49J11J42l9j86P9L65J70j79O9R4j81j58j18J69l1m11k2K37L9n7m4
2277a97J31P9k35J1L26J3k62j9J27J26J2j59K13O5j38O4J41M3k16k77K47lj48
2300e6l7M6J09l4n4J16K39k36j88J23J1j13j86l3O6j54n8K36J69r9m2J45J59j7
2324A12k45J00J34j29J1J39K34L8j43J28J95j74j95j21j45j28j34K3K21Mj90J87
2346g8J75lo5j94Q9n8k38J50K27o9j13J07J62R9j70j4K09j33k28M2J29k9r8mK93
2371A88M0j33L9J61r7j50m7M0pk83rJ98K2o5m2N3J04j11J1J20mj40oJ03J14n6
2397D3j10J76R6j63R0Q2K3j27j75O7j2j32j70J07O0J3m1J45J48j24m3R9O0j17
$$ plain form
2232 -229 -178 74 -20 -231 -33 239 318 219 239 352 162 -193 -109 38 -129 -400 -297 -60 80 -38 44 253
2254 253 3 -246 -135 7 -32 -218 -139 226 396 217 286 380 199 41 -77 92 61 -350 -372 -135 -96 -153 -197
2277 -197 -66 13 -222 -211 115 128 -134 -153 -26 100 112 -47 166 231 93 157 298 341 125 -152 95 92 -56
2300 -56 -93 -47 62 28 -26 90 329 93 -95 28 39 -74 -260 -293 -227 -381 -439 -203 -34 -133 -175 -30 129 112
2324 112 -133 -33 101 -28 -17 122 356 394 251 379 574 400 205 84 -61 -189 -323 -300 -79 -75 -265 -78
2346 -78 97 94 29 -165 -76 -134 -372 -222 5 -64 -177 -70 92 191 21 7 216 83 -145 -103 26 -3 -101 -105 188
2371 188 228 95 134 295 198 48 1 41 34 -249 -258 -60 -38 -103 -145 -92 12 -99 -88 32 28 -112 -118 -15 99 43
2397 43 -67 109 205 42 132 214 237 110 -65 2 -10 -142 -312 -205 -145 -132 -173 -28 120 -4 -47 52 112 -5
2421em5K1K8o4l2J86Oo0r9J40J08o4j94O2J24j44l7P7N0L3j03J06J80o7j20JK7
2448A15j22j34j04J15k4j32J24J00N6j10P7J50m0j63QJ27o3m9jJ52O5p2N4J66
2472B95o8l8r9o6m7j49j08J64Ol1J62J77P0j08M0L0p5k81j28M3j9l1P5J27Q8l5
2498fjO8j05p4j44pJ08p9K0J96J77M6O3R2L4j08k25j6K1j18j05J22N1k0j1J33
2524A12J91j37q8k9%j10j37l6J58r6M5J05N3K1j21J6L3n7j50L2M4OlO6J39J8r
2551F6M3O6k2n8J04K1m5k5j33J75j13o4L7k1N6j01n1R1m9j72P4Mj1n0KJ32L3r5
2579a06L7J11l7m8l1M9j7p5n5J28j4n2J53Q0K5L2r6L6O7n6q5R3Kl8p8M2P0j12
2607B5K4J6o8q7j15J12jn6n6J12j2J3k7N6Q1k1j10Q3R3l5j0JJ7n7r8R1N4q8m7
$$ plain form
2421 -5 -50 -29 -1 -65 -97 89 95 35 -64 76 184 120 -74 -12 112 -32 -69 8 58 91 -12 94 274 207 87 88 115
2448 115 -7 -141 -245 -130 -154 -286 -162 -62 -6 -116 -39 111 71 -92 -84 43 -20 -69 -70 82 147 75 129 295
2472 295 227 189 90 24 -23 -172 -280 -116 -110 -141 21 198 268 160 200 230 155 -126 -254 -211 -230 -261 -186 -59 29 -6
2498 -6 -7 61 -44 -118 -262 -269 -161 -240 -220 -24 153 199 262 354 388 280 55 39 60 -58 -163 -41 10 -10 -21 112
2524 112 303 166 78 49 49 -61 -198 -234 -76 -172 -127 -22 31 52 -69 -53 -20 -77 -227 -195 -151 -145 -148 -82 57 75 66
2551 66 109 175 153 95 199 220 175 150 17 192 79 15 52 31 87 -14 -65 26 -23 -195 -121 -117 -128 -178 -176 -44 -11 -106
2579 -106 -69 42 5 -43 -74 -25 -42 -117 -172 -44 -58 -110 43 123 148 180 84 120 187 131 46 139 141 103 25 67 137 25
2607 25 49 65 -3 -90 -205 -93 -94 -150 -206 -94 -106 -93 -120 -64 17 -4 -114 -31 62 27 17 18 35 -22 -120 -29 25 -63 -110
2636a10J44k1J07m1Q5J10j15p6K4l0r6l8j6N9K9n8P5P9j10o7l9rj16m3K5J64l3
2663a17N8J01J45nr8l3N0p2j42j30M7R1JL0J58J11p0oQ0j05j18r2M4J7kK9J77
2690A49QKP9n4K9j73j52J0r9l1o1K1J10P6KJ08M5j01J6k0j9j25k5J32K9j9R6J51
2718A84M3J7q2K9p4n4j07LK5K7j6L9J77m2nN9l1q7j42j5o1j63m7J5Q8k8R2J16
2746d0M4L1r3MK0q3k6J7M3M7J55RJ45J2p1Q9k7p6j49j06j6p3l9Q3R1o2J10K2J14
2775A75p6o9q9n1%p8L7M9O9l7N1Q3J7o9J9kp8j9l1J3P6K5k7J66L7PJl2n5p9k1
2806A2om9n3m6J4J21%j0N2j3k6J1p7J4k0JR3N6j4j5N6J0N6l4j24K7j03q1O9j5
2836i4M7n7J6R0KJ0P1l8jk3k8N2p7N5j7j5p1Q3L3L3n4l9LR6j03p5N5M1mO6p1K9
$$ plain form
2636 -110 34 13 120 79 164 274 159 83 107 77 -19 -57 -73 -14 15 -43 32 111 1 -66 -105 -114 -230 -273 -248 -84 -117
2663 -117 -59 42 187 182 84 51 101 29 -113 -243 -196 -105 -104 -74 84 195 125 119 199 94 -24 -116 -72 -55 -57 -28 149
2690 149 157 159 238 184 213 40 -112 -102 -201 -232 -293 -272 -162 -86 -84 24 69 -32 -16 -36 -55 -180 -205 -73 -44 -63 33 184
2718 184 227 244 162 191 117 63 -44 -41 -16 11 -5 34 211 169 164 223 192 105 -37 -52 -113 -276 -323 -308 -220 -248 -156 -40
2746 -40 4 35 -58 -54 -34 -117 -143 -126 -83 -36 119 128 273 285 214 303 276 200 51 -55 -71 -144 -183 -100 -9 -71 39 61 175
2775 175 99 30 -59 -110 -110 -188 -151 -102 -33 -70 -19 64 81 12 31 29 -49 -68 -99 -86 -10 15 -12 154 191 198 199 167 112 33 12
2806 12 6 -43 -96 -142 -128 -7 -7 -17 35 22 -4 7 -70 -56 -76 -75 18 74 60 45 101 111 167 133 9 36 -67 -148 -79 -94
2836 -94 -47 -104 -88 2 4 14 85 47 46 23 -5 47 -30 25 8 -7 -78 5 38 71 17 -22 -19 77 -26 -101 -46 -5 -9 57 -14 15
2868A5M4o7Q7k4k0pl7m0K4r2L8P8j3o4Q7m1J22l0M9N2j31J2j1k6k0j1K1K7KoJ6
2899C4l6L7n2j05K8L4p6rN6J2J04k5k1J08Q8m7L3p2p6M1q0lj8K1O5O3n9K0OJ5
2929H6o7p3kN2l7nnP1K3lL2lq2K0n6p6qM2r8N1N3rJ26j9J18l5M3l8lp8jM4q0%
2963a7L4J5L7l5L1lrm8q0k7k8M2ON1p8O3O8L1k4M4j3o2K1q5j9J1j0l9N7J5R0j7
2995B2N5Q2m5l0J3k9n2k2L2O5kM9J4L7m0o0m1o8k8r9JJ3qP1K4K1RL7K6n8l1O0
3027A8q2n1PM7n8J23M9l8P4j9l0K6m3M2j02J9qJ1Q2O5J2NJ6m2l0Rj06l7k0k2l7
3058a20l0L6J00Ln3P4o5nj1J5%l5J5P8m7O7P8l1l5M7q9P3n8l4l6M5k6N2j7J4J19
3089A24l9N7J9j36K0Pn2l2K9o0k9K8l1L6k9O7r0P0l0M0k9OL5p2J16rJ8O6m2M8
$$ plain form
2868 15 59 -8 79 55 35 28 -9 -49 -25 -117 -79 -1 -14 -78 9 -32 90 60 109 161 30 42 31 5 -15 -26 -5 22 24 18 34
2899 34 -2 35 -17 -122 -94 -60 -136 -145 -89 -77 27 2 -19 89 177 130 163 91 15 56 -24 -27 -45 -24 41 104 45 65 71 86
2929 86 19 -54 -56 -4 -41 -46 -51 20 43 40 72 69 -13 7 -49 -125 -133 -91 -189 -138 -85 -94 32 13 131 96 139 101 98 20 19 63 -17 -17
2963 -17 17 32 69 34 65 62 53 5 -75 -102 -130 -88 -82 -31 -109 -46 22 53 29 73 60 -2 19 -66 -85 -74 -84 -123 -66 -51 39 22
2995 22 77 159 114 84 97 68 16 -6 26 91 89 138 152 189 149 89 48 -20 -48 -147 -146 -133 -141 -70 -46 -25 -16 21 47 -11 -42 18
3027 18 -64 -115 -108 -61 -119 4 53 15 89 70 40 66 23 65 -37 -18 -26 -15 67 132 144 149 165 123 93 102 -4 -41 -61 -83 -120
3058 -120 -150 -114 -14 -11 -64 10 -55 -60 -71 -56 -56 -91 -76 2 -45 22 100 69 34 81 -8 65 7 -27 -63 -18 -44 8 -9 5 124
3089 124 85 142 161 25 45 52 0 -32 -3 -63 -92 -64 -95 -59 -88 -21 -111 -41 -71 -31 -60 -54 -19 -91 25 16 34 100 58 106
3119A06l5k0J4K0o3j7k7j5K4l5N8j1l9RJ08m4m3O3m5j9j0Ol6jK3L2k4lNOp9K3
3151f9k3N6m3O9O5q2O7L7LK7j9j3K0j8l8l0l8k8O0m8l5R1p4N2L4o2k6P3n6Q4o4
3182b8K8n7R8k2pM5J3j5j10J04r0j9N5l7n2Q1m0O6M3j8J1K1j0lm2l1K6l9K6p0
3212g3K0O9M4n5L1jor9M0o2N8k0O4J3J6o5Q9K9n0k8j5k6l1k8M8M8j15L4M6K0j5
3243b0L0N9l2o0N2K5j7k5k9J03k7J6m7oJ5l8k4l5nn0J3M2l9M1M1L7J1N9n1Lrq4
3275e1N4m4N5rn9J6N8qM0k9J0j7o8K4K8jl9O0L7o7O0m0R2n8J1p3k7m5j1lL2J6
3307e6J0pN4Mj3L3O0k9r4NP5L4j6n8qJ02o7M5m4J5k6o5K7l5L4n3O7l3L6M6K9%
3339G2rk6Nj5m0k7M4l7lkjJlm9N3o0K9l9Q0l0P2o7M2N2j5J3j9K6Rl8K1l1k0K2
$$ plain form
3119 106 71 51 65 85 22 5 -22 -37 -13 -48 10 -1 -40 -31 77 33 -10 53 8 -11 -21 -15 -51 -52 -29 3 -21 -24 -19 -13 -92 -69
3151 -69 -92 -36 -79 -10 55 -27 40 77 80 107 88 75 95 77 39 9 -29 -57 3 -45 -80 11 -63 -11 23 -39 -65 8 -48 36 -28
3182 -28 0 -57 41 19 12 57 70 55 -55 49 -41 -60 -5 -42 -94 -13 -53 13 56 38 49 70 60 57 15 -16 10 -29 -3 -73
3212 -73 -53 16 60 5 36 35 29 -70 -30 -92 -34 -54 10 23 39 -26 63 92 42 14 -1 -27 -58 -86 -38 10 -105 -71 -25 -5 -20
3243 -20 10 69 37 -23 29 54 37 12 -17 86 59 75 28 22 37 -1 -25 -60 -65 -115 -102 -60 -99 -58 -17 20 31 90 39 42 33 -51
3275 -51 3 -41 14 5 -54 -38 20 12 52 23 33 16 -52 -28 0 -1 -40 20 57 -10 50 10 102 44 55 -18 -45 -90 -101 -104 -72 -56
3307 -56 -46 -53 1 5 -8 25 85 56 -38 -33 42 76 60 2 -6 96 29 74 30 45 19 -46 -19 -54 -20 -73 -6 -39 -3 43 72 72
3339 72 63 37 42 27 -13 -40 4 -33 -36 -38 -39 -38 -41 -90 -37 -97 -68 -107 -27 -57 15 -52 -10 42 27 40 21 47 56 18 39 8 -12 10
3373A0N9j08Q1k4mM8Ll1QM4q8jk1j1N4r3J4NL4n3LK0J7m0OP2p0L3M4q1R5L3j5
3406D3M9ok1M2j6J5n3O0j10Q1m7rj4j15P9k7M0M8r6J1L7n3J8K4qN1n3K8m0j0J7
3437c5JM6p0Q1j09P1J4j3N4m7N8N9q9Q0M3j19oL5k4K2l3lO3q9l6P2k0J2o6nM8
3468el9m5M8j3J1k7P7L6l3m0qL7L4l3k4Ll1J7n8N5K2K1J3kJJ9nL6o7M6k1k2L5
3501C8QLk4N1j32K9m7O8j09P3o4J8K1j2L9K8K3jMM4J5p8K6n5%LP0k3no0J76l9
3533H8o8j2KK1M1q7N0k8M3j3L1M1q3j6j5p6nMO9m2j9J6M4K0L9n8J5j3j5m1N9j1
3565a9pP4l3K2P8n3J4m5J6j05P9J4l2Kp1O7N2o2k9M5QLK7n1N2l7p0M8n3J5N3L
3597EJ7k5K8j3J0j4l4RJ1j5k4O1l0R9n5O9n7jJ4o0J6p7l1O8L9p9K6J14j8m8M9
$$ plain form
3373 10 69 -39 42 18 14 62 65 34 42 86 -2 -3 -24 -35 19 -74 -60 -55 -21 -74 -71 -51 -34 -74 -68 4 -66 -33 11 -70 25 58 43
3406 43 92 86 65 107 91 106 53 113 3 84 37 28 14 -101 -22 -49 -9 39 -57 -46 -9 -62 -44 -20 -28 23 -30 -2 -42 -52 -35
3437 -35 -34 12 -58 23 -86 -15 -1 -14 40 -7 51 110 21 101 144 25 19 54 30 52 19 16 79 -10 -46 26 6 18 -48 -53 -5
3468 -5 -44 -89 -41 -54 -43 -70 7 43 10 -30 -38 -1 33 0 -24 -21 -52 -35 -93 -38 -16 5 18 16 17 36 31 67 0 46 25 3 38
3501 38 46 49 25 76 -56 -27 -74 -6 -115 -42 -106 -88 -67 -79 -40 -12 11 10 14 58 73 -5 21 -34 -34 -31 39 16 11 -49 127 88
3533 88 20 8 10 31 72 -15 35 7 50 37 68 109 26 10 -5 -81 -86 -82 -13 -55 -74 -58 -14 6 45 -13 2 -11 -26 -67 -8 -19
3565 -19 -26 48 15 37 115 62 76 31 47 -58 21 35 3 5 -66 1 53 -9 -38 7 15 18 45 -6 46 9 -61 -13 -66 -51 2 5
3597 5 22 -3 25 12 22 8 -26 -17 -6 -21 -45 16 -14 85 30 99 42 41 55 -5 11 -66 -97 -29 10 -69 -43 71 53 5 54
3628E4r7Q2J5j12N3M0J8r9P9Jk9%J9n0j4o8M7mJ3l5M8O3p5LP2N9m4k8L0L9q5k3
3660b8KM0Mj5J3k6%r8J21Jj0o4N0P8o6lN2qmk0K8M1l2q1kQ1p5m5M9K8j01K4K7
3693c9J6qN8o9R8o4lM1M5Lo5M1KL1l4r8O7L2j54O7M3rm5LM1N7l3o7R0k0j0p1Q9
3726C5l3k6j3O0l7mJ7k7L1p6K2K7M6k8k3P8l4J2l2N1L4j8m7j1K2j6l7J4K0j2o5
3757g0P3J3m8o1O4K3l2MN5L8m3NO5m2L6r5PJ1Jj5J3n4l5Q1j21J30J8j18N6M4L
3788FK2k1K2N8o7n1Q7k9n9J7qNP1j01PO6n3L5lj8N1m4N9j4l3l8P7kn7m9Q0J2n1
3821b3L8mJ6j08O8k2O4k5q6J13L8o1j7Q0J9m6l9j2J4l2n2K0M9l4j8JO2k7n0R1
3851A7j0N2j22P3j8P0p5Q9Kk1K4n9P2o5qo1k3O3l1kO4m3n6K2M0Ln5N4RJ9n6kO8
$$ plain form
3628 54 -43 39 54 -58 -5 35 53 -46 33 34 5 5 24 -26 -40 -108 -61 -65 -52 -87 -39 24 -51 -48 24 83 39 11 41 80 -5 -28
3660 -28 -26 14 18 3 16 -10 -10 -108 13 14 4 -60 -10 68 2 -1 51 43 39 19 47 88 56 -25 -27 54 -21 -66 -17 11 -90 -66 -39
3693 -39 -23 -31 27 -42 56 -8 -11 30 75 78 13 54 56 87 53 -45 22 54 -100 -33 10 1 -44 -41 0 57 24 -43 47 27 17 -54 35
3726 35 2 -24 -37 23 -14 -18 -1 -28 3 -73 -51 -24 22 -6 -29 49 15 27 -5 46 80 62 15 4 26 10 -27 -13 7 -5 -70
3757 -70 3 16 -32 -93 -29 -6 -38 -34 21 59 16 21 86 44 80 -15 -8 3 4 -11 2 -52 -87 -6 -127 3 21 -97 -41 3 6
3788 6 28 7 29 87 20 -31 56 27 -32 -15 -23 -18 53 -48 -41 25 -28 7 4 -14 37 -7 52 38 5 -33 44 42 -15 -64 16 28 -23
3821 -23 15 11 27 -81 -13 -35 29 4 -82 31 69 8 -9 71 90 44 5 -7 7 -25 -77 -57 -8 -42 -60 -59 3 -24 -74 17
3851 17 7 59 -63 10 -8 62 -13 76 78 57 81 22 94 29 21 -40 -63 0 -31 -33 31 -12 -68 -46 -6 -3 -58 -4 5 24 -32 -34 34
3884C4n7k8j2L1M0k0lL3O2j05NJ0M1Ok6J32J3m8l6J1k1Nn5k8J24j53m0K0J3l6
3914h8mON0k5m5N8M9q5L0O4J3k3M3N3J0m4k6N7J2j4p9J5L5m1m5N1Q6j05l6J02
3944G4nm2j15P4k1J4l9k3J19m6n4J5P8j03L9j9O8m8l6J3J12Ro2J0R9mlj10Q0o
3974F8o3K7N9p9p5J04m3j2p4K8K7O3j22NM4mL5o5J75q6Kj0J00o2p3K8pop9L4p
4005f8Q7k0m2P5M5m6k0J0M6l5qJ3j2qj2L2Pn9k3L2N0j03pM1M1o2j3Q3N0m4n2L1
4037IP0o9lnR9o6r5P8R0j24j4K2L9o4m4J9Q8q0n5Q6J85j38q3Q2J5Jo5J4O2m7q5
4068g8N5R1l7j20j3J13rm0jQ7p5L2l8Q9N0r4K3K8j2l1o9P0j9p9nQ1Qj11J2M9R9
4099E6j70Q1L5L8l7K1MJ2l7J1M2j8q4j0K8M9p0n2O6R2o5j3L9O1k7n9JR8p5m2p
$$ plain form
3884 34 -23 -51 -63 -32 8 -12 -15 18 80 -25 -20 -10 31 37 11 143 156 108 72 83 62 67 12 -16 108 -45 -85 -65 -52 -88
3914 -88 -92 -86 -36 -61 -106 -48 1 -84 -54 10 23 0 43 96 106 62 36 93 105 91 12 27 62 21 -24 27 113 8 -28 74
3944 74 69 27 -88 -14 -35 -21 -60 -83 36 -10 -64 -49 29 -74 -35 -54 14 -34 -70 -57 55 64 2 12 111 107 104 -6 74 68
3974 68 5 32 91 12 -63 41 -2 -14 -88 -60 -33 30 -92 -87 -43 -47 -12 -77 98 12 14 4 104 42 -31 -3 -10 -16 -95 -61 -68
4005 -68 19 -1 -43 32 77 31 11 21 67 32 24 37 25 17 5 37 44 -15 -38 -6 44 -59 -66 -25 16 -46 -59 24 74 30 -22 9
4037 9 79 10 7 2 101 35 -60 18 108 -16 -30 -8 31 -33 -77 -58 30 -50 -105 -19 166 28 -55 27 42 43 -22 -8 54 7 -78
4068 -78 -23 68 31 -89 -102 11 2 -38 -39 48 -27 5 -33 56 106 12 35 63 51 20 -49 21 2 -77 -82 -1 7 -104 -92 -43 56
4099 56 -114 -33 2 40 3 24 28 40 3 14 56 38 -46 -56 -28 21 -49 -101 -35 57 -8 -21 18 79 52 -7 -6 92 17 -25 -32
4130c2J12o5l9J02p0pl0KJ7Pr4R5K9j23J6J04P3r6m0Q3J11l7j14NK7m2q7R4L2
4159C3Mn9P6K4m5j16P1N5q5n3QJ16N7o6K4O1k4n2m6L2L4j70j1J20j4o2K8R2O4
4188I6j17K4L7O4j41M9O8l7m8k6O5L2q6rQ5m6n7m4L7M1j22pJ74N3j20N8L8K5m3
4217D3l9P6J8j05k7L1Kk3n8Q9Q9r1n2J32o3j5n7L6N0p9j2J09L5m2o9K7J54j08
4245E1j02L6P0j27p0J33J9j6r7Q5N6p4jJ06rn9n1P8M0j6q2P0N9r7p7M4L3k0m2
4274f0J1R7j19m4R0O2J8j54K2J83m5j03L9P2Jq8j2J08m8o7k0O8l4p7l3J83jj19
4302g0N6O2M4o5jK2J5j56pJ93p2l8qP4M3n4j26Q4o2ln5P7O4k8l2J86J4r5j9M6
4332H9J4j05l2J5Rl4j03O3J12j05l7R8J49j55q2J26Np1kL8J06o7n4Q9J2j8r4N3
$$ plain form
4130 -32 80 15 -24 78 8 1 -29 -27 -10 -3 -97 -2 27 -96 -80 24 97 1 -39 44 155 118 4 9 36 -6 -93 1 33
4159 33 37 -22 54 78 33 -83 -12 43 -42 -95 -87 29 86 20 44 105 81 29 -17 15 49 -121 -132 -12 -26 -88 -60 32 96
4188 96 -21 3 40 104 -37 12 80 43 -5 -31 34 66 -20 -29 56 10 -47 -91 -54 -13 -135 -142 32 85 -35 23 61 86 43
4217 43 4 80 98 -7 -34 -3 -1 -24 -82 7 96 5 -47 85 22 7 -50 -14 36 -43 -55 54 89 47 -22 5 159 51
4245 51 -51 -15 55 -72 -142 -9 10 -6 -103 -18 38 -36 -37 69 60 1 -50 28 68 52 -30 40 99 2 -75 -31 2 -18 -60
4274 -60 -49 48 -71 -115 -25 37 55 -99 -77 106 61 -42 -3 69 70 -18 -30 78 30 -37 -57 11 -23 -100 -133 50 49 -70
4302 -70 -14 48 92 27 26 48 63 -93 -100 93 21 -17 -25 49 92 38 -88 -4 -66 -69 -124 -47 17 -11 -43 143 157 62 43 89
4332 89 103 -2 -34 -19 -10 -44 -147 -84 28 -77 -114 -16 133 -22 -104 22 27 -44 -46 -8 98 31 -23 66 78 60 -34 19
4360A9qj0j21Q0M9Lm1P5RJ6m6m0J03q0j14P8N1o6j03K4J32P5j61J21Q7q5j49O9
4388c3K6j5j17P6J46n9J9j9J57k3j44K9J01m8j35p4J14k0rp9J99p1q6k4Q4J5j18
4415a08N9J14j6n7oJ22O3j42J0P0J5j08j17N3n7n0J7Q2J50j55K6J33L0j14pKO9
4442G8j88K3MJ50j46L0N3L6p2k8J3R3r4QP4K9j3p7R6J03j6k55J52O9j27l8K0N7
4470C4o7n9NJ61m9j28P6P2n8q9J06J06j12j33Q1Q2j7q2Q3R8j2j49Q5R6n0j00p1
4497i1J63j4j95l7J90k7k3l1J13l8J8k1J57l0r9J1j4L1j63O1%l6l6O1P9n7mm8
4525h0J07l0o7M1Q8jl9r6P8J55j46j8L0L7k11K3J07n1k5qR2R6m2J8L8Q8j47rJ4
4554D2L0j76o9J47L9m9m9J03P2l1j24J51o0j00l0m9J58m3j11J66J16j14l3J24
$$ plain form
4360 19 11 1 -120 -40 9 12 -29 46 55 71 25 -15 88 8 -106 -28 23 -43 -146 -122 10 85 -76 45 132 47 -102 -33
4388 -33 -7 -22 -139 -63 83 24 43 24 181 158 14 43 144 96 -39 -113 1 -19 -28 -107 92 21 -65 -89 -5 10 -108
4415 -108 -49 65 49 -8 -14 108 171 29 39 109 124 16 -101 -48 -105 -155 -138 -56 94 -61 -35 98 128 14 7 9 78
4442 78 -110 -87 -83 67 -79 -49 4 40 -32 -60 -47 46 -48 -40 34 63 50 -27 69 172 156 -99 53 122 -5 -43 -23 34
4470 34 -33 -92 -87 74 25 -103 -27 45 -13 -102 4 110 -2 -135 -54 28 11 -71 12 110 98 -51 34 130 80 -20 -91
4497 -91 72 58 -137 -174 16 -11 -34 -65 48 10 28 7 164 134 35 46 32 63 -100 -39 -39 -75 -111 -50 29 -28 -32 -80
4525 -80 27 -3 -70 -29 59 58 19 -77 1 156 10 -8 22 59 -152 -129 -22 -73 -98 -106 -14 82 40 58 96 184 37 28 42
4554 42 72 -104 -173 -26 13 -36 -85 18 90 59 -65 86 26 -74 -104 -153 5 -38 -149 17 133 19 -14 110
4578A10L9q0j41N1M3o2n6M8J55r0q2N6J34q9j11O2mn5n2L8J40qn5R4O5j8j20k1
4606iK6l4j58mP1O%rJ94L4r1QJ47o1j13l1P3qj17k1J83L0k09O0R8k0j02q3J35
4635eO0k14R4O3J1JQP4P4j15n2J22Lk03j7M2j6j5r4K81l0l0q6J48l2p6j11J15
4663@Q6j34m9J55pj0q0Q3J32j86n4L8M9j06j05J34J28j12n7J39J17j66j8N7M7
4688H1m8j06L0J16r0k0Q4M7q0j58J44K7o2p4J19N1q4o0M0J61n5j36J26L8n5m0
4714do5J43l3j29J4J32k2q5j7J45p0j49O5J35j9j18L1J68M7q7j16J08j9j17RR2
4740C9pp1o0J59mj47J6J54k9j37k1J32L8r9N9Q3Q2j30r6Q8J4q6j40J38jp3k7J20
4768fO7q3p8K24K5k12%Q2L9j29k1O6J52r9r1J16O6j39p1R3j8n2p4Q9Q2l8n6J62
$$ plain form
4578 110 149 69 -72 -21 22 -40 -96 -48 107 17 -65 -9 125 36 -75 -13 -17 -72 -124 -86 54 46 -9 85 150 132 12 -9
4606 -9 17 -17 -175 -179 -108 -102 -102 -111 83 117 26 34 181 120 7 -24 49 41 -76 -97 86 116 -93 -33 65 45 -57 -140 -5
4635 -5 55 -159 -65 -2 9 10 18 92 166 51 -1 121 124 -79 -96 -54 -70 -85 -179 102 72 42 -44 104 72 -4 -115 0
4663 0 86 -48 -97 58 51 41 -39 44 176 -10 -64 -26 23 -83 -188 -54 74 -38 -95 44 161 -5 -23 34 81
4688 81 33 -73 -43 73 -17 -37 47 94 14 -144 0 27 -35 -109 10 61 -23 -83 -43 118 63 -73 53 91 36 -4
4714 -4 -69 74 41 -88 -74 58 36 -49 -66 79 9 -140 -75 60 41 -77 -46 122 169 82 -34 74 55 -62 -53 39
4740 39 32 -39 -99 60 56 -91 -75 79 50 -87 -108 24 62 -37 22 105 187 57 -39 49 63 -23 -163 -25 -26 -99 -126 -6
4768 -6 61 -22 -100 124 149 -63 -63 19 58 -71 -92 -26 126 27 -64 52 118 -21 -92 1 -17 -69 -143 -54 28 -10 -66 96
4796I6L8Jq2O5N3j14j28O2qk8p9O1J38m9j04Q8Q5j05j29R5R0q6j03Q2J72o2n4
4823eR2J21m1j65L0N0j09j10K2Q5j7q5O5J40M5j55K6N5P5j37q1J36N7j42O1J29
4849A42j1j53L1R0m0j78j00J88l5j35J4J38J29n2o2K26k3j21n8O4K4j56j01J82
4873Cl4j14PJ59J10j56NQ3O9j59j4P8M0p3J3Q3N8j34l2R9M1j06j75Q3J16j36j30
4900b16J70R7q7n1Q8J17o1j53J21R1j26n2J11LJ6j57J17J73j51r6L4O1jj73N1
4925g4R0o5j27J29J67j21r2J46J30j28j26Q4J45j05r6mJ53n7j33q3K60n4j63P7
4949d7J09o5q0N7J53n9j28P0Q2J9j59K9P1o7j43o8J91k2j10J1J15J25j27K2J95
4974A74o0m7nJ13L8j24j00N6Q6j87LJ37n7q8n2J41O4j52j19K15Mq2q8J04L4r3
$$ plain form
4796 96 134 135 53 118 171 57 -71 -9 -17 -45 -124 -63 75 26 -78 10 95 -10 -139 -44 46 -40 -143 -61 111 49 -5
4823 -5 87 208 167 2 32 82 -27 -137 -115 -30 -47 -132 -67 73 118 -37 -11 44 119 -18 -99 37 94 -48 13 142
4849 142 131 -22 9 99 59 -119 -219 -31 -66 -201 -187 -49 80 28 -34 192 169 48 -10 54 78 -78 -179 3
4873 3 -31 -145 -138 21 131 -25 -20 63 132 -27 -41 37 77 4 17 100 158 24 -8 91 132 26 -149 -66 50 -86 -216
4900 -216 -46 51 -36 -87 1 118 57 -96 25 116 -10 -62 49 52 68 -89 28 201 50 -46 -12 49 48 -125 -74
4925 -74 16 -49 -176 -47 120 -1 -93 53 183 55 -71 13 158 53 -43 -47 106 49 -84 -167 93 39 -124 -47
4949 -47 62 -3 -83 -26 127 68 -60 10 92 111 -48 -19 52 -15 -158 -226 -35 -57 -167 -156 -41 84 -43 -21 174
4974 174 114 67 62 175 213 89 -11 45 131 -56 -53 84 27 -61 -113 28 92 -60 -179 36 40 -42 -130 -26 8 -85
5000h5j0R0P6q8r6R6J42j67k9O8J36j00j03R1J17m4j72J71K0k5j57Q6K5rq3J13
5026F3Q6j27j20Q8O2p0j15K1J22j21q7P2J37j02q6J06J80L6j81J32R7r5l8l2J49
5051A77j04j27n0J78n5j28R1P4rj05l0J26k0j34J08P9n3k5%Q1K7j68O8N4l6j88
5077a69j0J51J0j35PK37J5j48L4J32L6r4j35J45jj27J7Q7k6p2p2J11J13j58o5
5102a17J14J1j44L2J45Qj10K3J46O9p6j42J18N5r8j21R0L9n8j02J03J45j45j42
5126a57J56J14j63j27J91M7p1j20J02J48n5j23J24P0j24q2N3R6p7j78J20P9nj04
5150h6M1J75k6j73M8J56j20n6kJ45m4j34O8P6m3j12K4P4M0j54L9J06jj23M4J01
5176F3k3j08Q0R3O4j56j2J54q5j61l4J13J7j68N2J46k8p4l3J57K5q1p9J76rj99
$$ plain form
5000 -85 -95 -5 71 -17 -113 -17 125 -42 -71 -3 133 33 -70 21 138 94 -78 93 113 88 -69 17 42 33 -50 63
5026 63 149 22 -98 -10 52 -18 -133 -112 10 -111 -198 -126 11 -91 -177 -71 109 145 -36 96 193 98 60 28 177
5051 177 73 -54 -104 74 19 -109 -18 56 47 -58 -88 38 18 -116 -8 71 18 -7 -7 74 101 -67 1 55 19 -169
5077 -169 -179 -28 -18 -153 -146 91 106 -42 -8 124 160 66 -69 76 75 -52 -35 52 26 -46 -118 -7 106 -52 -117
5102 -117 -3 8 -136 -104 41 49 -61 -38 108 177 101 -41 77 132 34 -87 3 42 -16 -118 -15 130 -15 -157
5126 -157 -1 113 -50 -177 14 61 -10 -130 -28 120 65 -58 66 136 12 -70 -17 79 2 -176 -56 23 18 -86
5150 -86 -45 130 104 -69 -21 135 15 -41 -43 102 58 -76 -8 68 25 -87 -63 11 51 -103 -64 42 41 -82 -38 63
5176 63 40 -68 12 105 169 13 1 155 70 -91 -125 -12 5 -163 -111 35 7 -67 -100 57 82 1 -78 98 89 -110
5202a10K8J37R9j86r3K04Jj72KN4O9q3j13J13J40j56p0K01M4qj30Q5R9j38r0J47
5228G4Mo6n2J2J04o1j42J23J47k05j21J73M7j13l5J58N2j04j7N9L9o5q4R2R5q1
5254C3j09L7N3m6j49J38R5m1q6Q4O9q7q1N2J85o3j47L1J68j06j01Q0M9l3j79P6
5280g8J21o5j22L7J51l8m8l6J70O1j58o6J33K0q4kN8Jr0o5J50nr1m4J46P0j25
5307Ap1J45o0l1m8J77%r8q2J89j2j17j0O2J1j09r2J46M5j82K3N2J30p8q9J50J26
5334A78j79lP2K1j02mM5R8j07j28J26L4k7q4K5N4n3j20J06O6q2l6R5J09k4j36
5360e6N5P7o7o0K2P0o8j10P2P5M2j61R1J25p1l3lJ59m5j44PJ67j54j4J3J36o3
5387F2j35rJ72r6q1p5R9L5j03J3J22O9k01J09Q5M8n9r1J36j9j36j3J01m9j7L7
$$ plain form
5202 -110 -82 55 154 -32 -125 79 80 -92 -90 -36 33 -50 -163 -50 90 -66 -136 65 109 101 -29 56 155 17 -73 74
5228 74 78 12 -40 -28 76 15 -127 -4 143 -62 -183 -10 37 -76 -111 47 99 -5 -22 37 76 11 -73 19 114 33
5254 33 -76 -39 14 -32 -181 -43 52 11 -75 9 78 -9 -90 -38 147 84 -63 -32 136 30 -71 9 58 25 -154 -78
5280 -78 43 -22 -144 -107 44 6 -42 -78 92 153 -5 -71 62 82 -2 -4 54 55 -35 -100 50 45 -46 -90 56 126 1
5307 1 -70 75 15 -16 -64 113 113 15 -67 122 110 -7 -17 45 56 -53 -145 1 46 -136 -113 -61 69 -9 -98 52 178
5334 178 -1 -4 68 89 -13 -17 28 126 19 -109 17 51 24 -60 -35 19 -34 -154 -48 18 -64 -100 -5 104 80 -56
5360 -56 -1 76 9 -51 -29 41 -27 -137 -65 10 52 -109 -18 107 36 3 0 159 114 -30 -23 144 -10 -24 -11 125 62
5387 62 -73 -82 90 -6 -87 -162 -63 -28 -131 -118 4 73 -128 -19 66 114 55 -36 100 81 -55 -68 33 -16 -33 4
5413DN5O9r8o1O0M3j01n4J16k6l7j3J01Q1j66l4O1N4j02j01P2R4r4n9L1J18o4
5440e1m0J09N6q7k1J06Qj17m5J50K8j27l2J38M8j06mk2N1k2j78J14J07j28m6N6
5466e5J31n8k5M6N9l9k06J18J02n5q1l1J13n7p5J31N3k1j44O3J03q7q2J15qkJ7
5493B5N2P2r7j26J27M9l5j26K8O6j3o1o0J68nj35P3J12m8m4J0J4j4k4p1J09K3
5520F9p8LM0j0n4p0O0oq5k0J20J11j18K4J10K6q1k8J04j5r7j7O8kp6j6J37n2j9
5549B8o5J19K1j98j2J30O9j74PN9J26o9p5L1N9o4r3L7J07j00q7J13M5l0r7J27
5575A4JL9q2L9J03q7q0P6L3lp2m4J60p3m7JL3K1j11mO4m0o0P3J03p4l0J2J31m3
5605E3j04K4J41o3j25J6J02k9q2o7J76K9j40mP5K5m6n8J70lj00k9J29J1j11j9
$$ plain form
5413 4 59 128 30 -31 29 72 -29 -83 33 7 -30 -43 58 139 -27 -61 0 54 -48 -149 -77 17 -77 -136 -105 13 -51
5440 -51 -91 18 74 -13 -34 72 80 -37 -82 68 96 -31 -63 75 123 17 13 -9 42 20 -158 -44 63 -65 -111 -55
5466 -55 76 18 -7 39 98 59 -147 -29 73 18 -63 -94 19 -38 -113 18 71 50 -94 -31 72 -15 -97 18 10 8 25
5493 25 77 149 52 -74 53 102 67 -59 -31 35 22 -39 -99 69 64 -71 2 114 66 22 32 46 32 8 -63 46 69
5520 69 -9 -6 34 24 -30 -100 -40 -46 -131 -151 -31 80 -38 -14 96 122 41 13 117 102 5 -12 56 54 -22 -38 99 47 28
5549 28 -37 82 103 -95 -107 23 92 -82 -75 -16 110 41 -34 -3 56 -8 -101 -64 43 -57 -144 -31 14 -16 -113 14
5575 14 15 54 -28 11 114 27 -53 23 56 53 -19 -63 97 24 -23 -22 11 32 -79 -83 -19 -59 -119 -46 57 -17 -47 -35 96 53
5605 53 -51 -27 114 51 -74 -58 44 15 -67 -134 42 71 -69 -73 2 27 -19 -77 93 90 -10 -39 90 101 -10 -29
5631b9J02K3r2j08Q5R7j02m2N4O0j18m8J64P4j66L5J5O0p1j8L0P2q0k5L3J2k1
5658do8R5k7k8j07K06n1lr5P9J11j52j1M1J02j07k9N6J30j11n4K2Knj18R3M9o8
5686e2n8N6J29q1q1P8J19q3o2J1N0L8j57R8J10j40J3k7M6l0p8M1Q4Pp5k6J13k6
5714A7r0M9J10k1o6RO7J6j58K1J23n7o6m0J61o1j4r5J20K9j03PJ04l5m3j6M6j5
5742al3LJ09k5l3j04M9J18j54l1P2O4o1J1K6J5j5k6P2M5q4n3L5Q1p2o8J7R6p9
5771b6J6M2kn4o3K7N5K3j17M2Q4J2m4J17j2j4j14O7K4j15k4L3P7p1o6J07J06j03
5799Gj5nP4kq9J9N9q3p4J59RLj14Q9M9o4j05J39k3l9j02M8Q0j9m1P0Q0o9j5k7
5829aK1l6n5J8Q8Pj33Q2Q5k8l5q1J62q2l2k3O6qo6J0J06N2p6n1P8J0p8l7Q0n8
$$ plain form
5631 -29 73 96 4 -104 -19 78 -24 -66 -12 48 -70 -118 46 120 -46 -11 4 64 -7 -25 5 77 -3 -28 5 17 -4
5658 -4 -72 23 -4 -32 -139 67 16 13 -82 -3 108 -44 -55 -14 88 -19 -48 8 138 27 -27 -5 -3 -8 -126 -33 16 -52
5686 -52 -110 -54 75 -6 -87 -9 110 27 -35 -24 26 64 -93 5 115 -25 -12 -39 7 -23 -101 -60 24 31 -44 -70 43 17
5714 17 -73 -24 86 65 -1 8 75 91 -67 -46 77 20 -46 -86 75 14 0 -95 25 54 -49 -42 62 27 -16 -32 14 -1
5742 -1 -34 -31 78 53 20 -84 -35 83 -71 -102 -30 34 -27 -16 10 25 10 -16 56 101 17 -36 -1 80 8 -60 -43 53 -26
5771 -26 -10 32 30 -24 -87 -60 -5 18 -99 -57 27 39 -5 112 100 86 -28 39 63 -52 -76 -43 34 -37 -103 4 110 7
5799 7 -8 -13 61 59 -30 -11 48 -35 -109 50 59 62 -52 37 86 22 -83 56 33 -6 -108 -60 20 1 -40 30 110 41 26 -1
5829 -1 20 -16 -71 -53 35 42 -91 -9 76 48 13 -68 94 12 -20 -43 23 15 -51 -41 65 117 41 -10 68 78 0 -37 43 -15
5859a5l5l1J38n3o7QN7Q4j51JQ6Rm7j4N0K2No8L1j6j3k2jP6q3j8J3m2J5L2R5m2
5891DNj0N6M4k2q8N8K3n8j09N7N0M2j10M9J01p6p8N6M0J0j21N9L4j4Lk6P1l2p8
5921f0N1O5p4j6k4M8rk7j1K3JJ1J1R7p2m7M6j6M9o8j1L7Ll4N5mJ5k0m1L4j0n6
5953e4n7O2rj1l4J02O6j30L9O6J8n5k7K7l7O1q0J16k5o1m9N1K3m6rNN4Mm4R9k8
5984C7J3o6R2K3j32L3mj0j1m5M0Q3r3l8L5J13n3l7K2M1n3j3J4J36j17KJ5OK3j46
6014i0R0K2J8p9J7N2J7l1k3O2n8n3Q6NQ8j90O9M5N8j49O7k4K5j6m3N2N7j17J9
6043b4K6rm7L9k9J6MKP4Lj01R5k3Qk3o3N5o4M9q0KP0M8o2J6K8r8N5J20m5n3JP8
6076F8n8k4L3k9Nk6k8K1J1k4L6N9J0j02O0l1N1Pm7L7lJ1l7L5j0Kk8NL7n8k8O9
$$ plain form
5859 -15 -50 -81 57 4 -63 -55 2 86 -65 -64 22 31 -16 -30 20 42 47 -21 10 -6 -19 -41 -42 34 -49 -67 -54 -96 -81 -49 46 4
5891 4 9 -1 55 99 77 -11 47 70 12 -97 -40 10 52 -58 -9 92 16 -62 -6 34 44 -77 -18 16 2 5 -21 50 18 -60
5921 -60 -9 56 -18 -34 -58 -10 -19 -46 -57 -34 -33 -22 -11 86 14 -33 13 -3 46 -22 -33 4 7 -27 28 24 39 19 -22 12 2 -54
5953 -54 -111 -49 -58 -69 -103 -1 65 -65 -26 40 58 3 -24 3 -34 27 -53 63 38 -23 -72 -21 2 -44 -53 -48 6 10 -34 65 37
5984 37 50 -16 76 99 -33 0 -4 -14 -25 -70 -30 53 -40 -78 -43 70 17 -20 2 43 -10 -23 -9 127 10 12 27 33 56 -90
6014 -90 0 22 40 -39 -22 30 47 16 -7 55 -3 -56 30 35 123 -67 2 47 105 -44 23 -1 24 8 -35 17 74 -43 -24
6043 -24 2 -7 -54 -15 -44 -28 -24 -22 52 55 -46 49 26 34 11 -52 3 -61 -12 -92 -90 -20 28 -34 -18 10 -88 -33 87 42 -11 -10 68
6076 68 10 -14 19 -10 -5 -31 -59 -38 -27 -51 -15 44 54 -48 12 -19 32 39 -8 29 26 37 0 35 25 27 -1 4 41 -17 -45 24
6108B4o4N9o7M0K9Jm4K6L5J1m7j7J1N2n9j3M6p7L2M3M9L6j03o6N9J5rj9N0n4k5
6139d6L7J01k2o3pJ07p7q4K0QM7r7K5O7K1o4oL3M9o7m0P3j5k1k1Q8J8r1L1k0M1
6170B5k2L1p5O2p9l1J13m2k5j6N7M6r8M8K2K5j4nj7J1j8k2P2j5l7J8j0Q4j42m5
6200i9R3o0K9J9NjK4pKL8oo9PM2j4n0L5J0j4k5K2PJ7o3M6K5kq6P6O9m3l9R0mo
6235F8rn6L2jk8k4jL1m7M6m7O2j14N3M3J0m9JN4k3%o4J06Ln8J5L3l3lM6j8K9r5
6268c8K0L8L1o0j6P6m5L9n1N1J3r3RO3k1m6M5k6Qn5L3M1L7j00qN2O5n1r3J15j7
6299A6k8L2N0Lp8J9OKm4n3L7Q4K5r8L5M8o4J8P2o2K0l4k8M2k5kM4K1L6j05O3K0
6331G2m0o8L1PN9q7nR7m3L8j3j6k9j8MM8Oo6L8L1o2K7p7J45q0l9j6O4K5n3kK9
$$ plain form
6108 24 -40 19 -48 -8 21 22 -22 4 39 50 3 -14 -3 49 -10 -23 23 -54 -22 21 70 106 3 -63 -4 11 2 -17 33 -21 -46
6139 -46 -9 92 70 7 0 107 30 -54 -34 -26 21 -76 -51 16 37 -27 -33 0 49 -18 -58 15 0 -21 -42 46 64 -27 4 -16 25
6170 25 3 34 -41 21 -58 -89 24 -18 -43 -59 -2 44 -54 -6 16 41 27 22 5 16 -2 -24 48 33 -4 14 4 88 -54 -99
6200 -99 -6 -66 -37 -18 -13 -14 10 3 5 43 37 -32 -25 17 3 -47 -12 -2 -16 -41 -19 -12 5 -58 -12 13 11 -75 1 70 27 -12 78 74 68
6235 68 59 3 35 34 6 -18 -19 12 -35 11 -36 26 -88 -35 8 18 -31 -30 24 1 1 -63 43 46 -12 3 36 3 0 46 28 57 -38
6268 -38 -18 20 51 -9 -25 51 6 45 -6 45 58 -35 -26 37 16 -30 15 -11 -3 -58 -25 16 53 -47 -55 -3 62 11 -82 33 16
6299 16 -12 20 70 73 -5 14 20 22 -22 -75 -38 46 71 -27 8 56 -8 10 82 20 40 6 -22 20 -5 -7 37 58 94 -11 52 72
6331 72 32 -36 -5 2 61 -26 -31 66 23 61 48 32 3 -15 -11 37 43 -23 15 46 -16 11 -66 79 -1 -40 -56 8 33 -20 -22 7
$$ [...]
8190@M0
8191D0
##END NTUPLES=NMR FID
##END=
