##TITLE=1H_DE-80H_X3
 200.13MHz, d2o
 8 sc
 
 19ns.26.2.2025
##JCAMPDX= 6.0         $$ Bruker NMR JCAMP-DX V2.0
##DATA TYPE= NMR FID
##DATA CLASS= NTUPLES
##ORIGIN= UXNMR, Bruker Analytische Messtechnik GmbH
##OWNER= pz
$$ XWIN-NMR		Version 3.5
$$ Tue Sep 16 10:59:51 2025 Russian Standard Time (UT+4h)  Yarkov@DPX200
##.OBSERVE FREQUENCY= 200.1313
##.OBSERVE NUCLEUS= ^1H
##.DELAY= (6, 6)
##.ACQUISITION MODE= SIMULTANEOUS
##.ACQUISITION SCHEME= undefined
##.AVERAGES= 8
##.DIGITISER RES= 18
##SPECTROMETER/DATA SYSTEM= spect
##.PULSE SEQUENCE= zg30
##.SOLVENT NAME= CDCl3
##.SHIFT REFERENCE= (INTERNAL, CDCl3, 0, 14.3821)
##AUDIT TRAIL= $$ (NUMBER, WHEN, WHO, WHERE, WHAT)
$$ ##TITLE= Audit trail, XWIN-NMR		Version 3.5
$$ ##JCAMPDX= 5.01
$$ ##ORIGIN= Bruker BioSpin GmbH
$$ ##OWNER= Yarkov
$$ C:/Bruker/XWIN-NMR/data/yarkov2/nmr/H-C/1/audita.txt
$$ ##AUDIT TRAIL=  $$ (NUMBER, WHEN, WHO, WHERE, WHAT)
(   1,<2025-09-16 10:59:03.78 +0400>,<Yarkov>,<DPX200>,
      <created by zg, POWCHK disabled, PULCHK disabled
       configuration hash MD5:
       00 E9 B6 7A A2 85 ED C7 34 08 36 98 17 FE 4E 26
       data hash MD5: 16K
       BA BF F1 E4 4E 9E 17 CD B6 53 6F 10 0B 85 41 8A>)
$$ ##END=
$$ 
$$ hash MD5
$$ 6F 0A 38 E6 0E 42 12 9C A7 6B 9B 61 89 10 98 C0
##$RELAX= 
##$RELAX= 
##$RELAX= 
##$RELAX= 
##$RELAX= 
##$RELAX= 
$$ Bruker specific parameters
$$ --------------------------
##$DU= <C:/Bruker/XWIN-NMR>
##$EXPNO= 1
##$NAME= <H-C>
##$PROCNO= 1
##$TYPE= <nmr>
##$USER= <yarkov2>
##$AMP= (0..31)
100 100 100 100 100 100 100 100 100 100 100 100 100 100 100 100 100 100 
100 100 100 100 100 100 100 100 100 100 100 100 100 100 
##$AQSEQ= 0
##$AQ_mod= 1
##$AUNM= <au_zg>
##$AUTOPOS= <>
##$BF1= 200.13
##$BF2= 200.13
##$BF3= 200.13
##$BF4= 200.13
##$BF5= 200.13
##$BF6= 200.13
##$BF7= 200.13
##$BF8= 200.13
##$BYTORDA= 1
##$CFDGTYP= 0
##$CFRGTYP= 5
##$CHEMSTR= <none>
##$CNST= (0..31)
1 1 145 1 1 1 1 1 1 1 1 1 1 1 1 1 1 1 1 1 1 1 1 1 1 1 1 1 1 1 1 1 
##$CPDPRG= <>
##$CPDPRG1= <>
##$CPDPRG2= <>
##$CPDPRG3= <>
##$CPDPRG4= <mlev>
##$CPDPRG5= <mlev>
##$CPDPRG6= <mlev>
##$CPDPRG7= <mlev>
##$CPDPRG8= <mlev>
##$CPDPRGB= <>
##$CPDPRGT= <>
##$D= (0..31)
0 0.7 0 0 0 0 0 0 0 0 0 0.03 0 0 0 0 0 0 0 0 0 0 0 0 0 0 0 0 0 0 0 0 
##$DATE= 1758005943
##$DBL= (0..7)
120 120 120 120 120 120 120 120 
##$DBP= (0..7)
150 150 150 150 150 150 150 150 
##$DBP07= 0
##$DBPNAM0= <>
##$DBPNAM1= <>
##$DBPNAM2= <>
##$DBPNAM3= <>
##$DBPNAM4= <>
##$DBPNAM5= <>
##$DBPNAM6= <>
##$DBPNAM7= <>
##$DBPOAL= (0..7)
0.5 0.5 0.5 0.5 0.5 0.5 0.5 0.5 
##$DBPOFFS= (0..7)
0 0 0 0 0 0 0 0 
##$DE= 6
##$DECBNUC= <off>
##$DECIM= 32
##$DECNUC= <off>
##$DECSTAT= 4
##$DIGMOD= 1
##$DIGTYP= 9
##$DL= (0..7)
0 120 120 120 120 120 120 120 
##$DP= (0..7)
150 150 150 150 150 150 150 150 
##$DP07= 0
##$DPNAME0= <>
##$DPNAME1= <>
##$DPNAME2= <>
##$DPNAME3= <>
##$DPNAME4= <>
##$DPNAME5= <>
##$DPNAME6= <>
##$DPNAME7= <>
##$DPOAL= (0..7)
0.5 0.5 0.5 0.5 0.5 0.5 0.5 0.5 
##$DPOFFS= (0..7)
0 0 0 0 0 0 0 0 
##$DQDMODE= 0
##$DR= 18
##$DS= 0
$$ [...]
##$SUBNAM2= <"">
##$SUBNAM3= <"">
##$SUBNAM4= <"">
##$SUBNAM5= <"">
##$SUBNAM6= <"">
##$SUBNAM7= <"">
##$SUBNAM8= <"">
##$SUBNAM9= <"">
##$SW= 18.0517328524113
##$SWIBOX= (0..15)
0 0 2 0 0 0 0 0 0 0 0 0 0 0 0 0 
##$SW_h= 3612.71676300578
##$TD= 16384
##$TD0= 1
##$TE= 0
##$TE2= 300
##$TE3= 300
##$TEG= 300
##$TL= (0..7)
0 120 120 120 120 120 120 120 
##$TP= (0..7)
150 150 150 150 150 150 150 150 
##$TP07= 0
##$TPNAME0= <>
##$TPNAME1= <>
##$TPNAME2= <>
##$TPNAME3= <>
##$TPNAME4= <>
##$TPNAME5= <>
##$TPNAME6= <>
##$TPNAME7= <>
##$TPOAL= (0..7)
0.5 0.5 0.5 0.5 0.5 0.5 0.5 0.5 
##$TPOFFS= (0..7)
0 0 0 0 0 0 0 0 
##$TUNHIN= 0
##$TUNHOUT= 0
##$TUNXOUT= 0
##$USERA1= <user>
##$USERA2= <user>
##$USERA3= <user>
##$USERA4= <user>
##$USERA5= <user>
##$V9= 5
##$VALIST= <valist>
##$VCLIST= <CCCCCCCCCCCCCCC>
##$VD= 0
##$VDLIST= <DDDDDDDDDDDDDDD>
##$VPLIST= <PPPPPPPPPPPPPPP>
##$VTLIST= <TTTTTTTTTTTTTTT>
##$WBST= 1024
##$WBSW= 4
##$XGAIN= (0..3)
0 0 0 0 
##$XL= 0
##$YL= 0
##$YMAX_a= 29079
##$YMIN_a= -22571
##$ZGOPTNS= <>
##$ZL1= 120
##$ZL2= 120
##$ZL3= 120
##$ZL4= 120
##$ABSF1= 10
##$ABSF2= 0
##$ABSG= 5
##$ABSL= 3
##$ALPHA= 0
##$AQORDER= 0
##$ASSFAC= 0
##$ASSFACI= 0
##$ASSFACX= 0
##$ASSWID= 0
##$AUNMP= <proc_1d>
##$AZFE= 0.1
##$AZFW= 0.1
##$BCFW= 1
##$BC_mod= 2
##$BYTORDP= 1
##$COROFFS= 0
##$CY= 83.5205535888672
##$DATMOD= 1
##$DC= 2
##$DFILT= <>
##$DTYPP= 0
##$F1P= 10.8118882576601
##$F2P= -7.23987719738617
##$FCOR= 0.5
##$FTSIZE= 0
##$FT_mod= 4
##$GAMMA= 1
##$GB= 0.15
##$INTBC= 1
##$INTSCL= 1
##$ISEN= 128
##$LB= 0.25
##$LEV0= 0
##$LPBIN= 0
##$MAXI= 10000
##$MC2= 0
##$MEAN= 0
##$ME_mod= 0
##$MI= 1.114404
##$NCOEF= 0
##$NC_proc= 0
##$NLEV= 6
##$NOISF1= 3.799351
##$NOISF2= 2.8
##$NSP= 1
##$NTH_PI= 0
##$NZP= 0
##$OFFSET= 14.38212
##$PC= 1
##$PHC0= -1351.727
##$PHC1= 4.790921
##$PH_mod= 1
##$PKNL= yes
##$PPARMOD= 0
##$PSCAL= 0
##$PSIGN= 0
##$REVERSE= no
##$SF= 200.129724274929
##$SI= 16384
##$SIGF1= 3
##$SIGF2= 2
##$SINO= 400
##$SIOLD= 16384
##$SREGLST= <1H.CDCl3>
##$SSB= 0
##$STSI= 0
##$STSR= 0
##$SW_p= 3205.1282051282
##$SYMM= 0
##$S_DEV= 0
##$TDeff= 0
##$TDoff= 0
##$TI= <>
##$TILT= no
##$TM1= 0
##$TM2= 0
##$TOPLEV= 0
##$USERP1= <user>
##$USERP2= <user>
##$USERP3= <user>
##$USERP4= <user>
##$USERP5= <user>
##$WDW= 1
##$XDIM= 8192
##$YMAX_p= 0
##$YMIN_p= 0
$$ End of Bruker specific parameters
$$ ---------------------------------
##NTUPLES= NMR FID
##VAR_NAME=  TIME,          FID/REAL,        FID/IMAG
##SYMBOL=    X,             R,               I
##VAR_TYPE=  INDEPENDENT,   DEPENDENT,       DEPENDENT
##VAR_FORM=  AFFN,          ASDF,            ASDF
##VAR_DIM=   8192,          8192,            8192
##UNITS=     SECONDS,       ARBITRARY UNITS, ARBITRARY UNITS
##FACTOR=    0.0002768,     1,               1
##FIRST=     0,             0,               0
##LAST=      2.2672688,     0,               0
##MIN=       0,             -22571,          0
##MAX=       2.2672688,     29079,           0
$$ Real data points
##PAGE= N=1
##DATA TABLE= (X++(R..R)), XYDATA
$$ [...]
$$ plain form
550 -2348 -1021 3085 -53 -3038 354 754 -1863 -1157 -139 -978 -1415 -261 -619 -2705 -321 2512
566 2512 -1676 -3341 1058 1135 -951 291 405 -784 596 2752 1406 -1052 1579 3468 -327 -322 3190
583 3190 983 -1051 924 461 -964 585 1336 -1206 -2500 799 1855 -2003 -1375 1288 -1101 -1307
599 -1307 1477 -41 -1545 352 782 -1062 -952 1535 785 -2539 -631 1751 -860 -646 1166 -984
615 -984 -1145 1523 1028 -938 -469 1340 607 -1425 722 1798 -1292 -586 1204 -874 -489 1407 -511
632 -511 -2188 -652 908 -85 -1839 -252 451 -1243 444 1657 -887 -15 2043 294 -273 1172
648 1172 1281 -33 -767 688 1017 -436 568 738 -1407 23 1652 -392 -913 86 -36 -317 -377 231
666 231 72 -980 242 664 -755 244 697 -1126 -939 57 -296 -582 -854 -640 -426 -604 473 573 -601
$$ packed form
550b348J327M106l138k985L392M00k617P06J018q39m37J154l58k086K384K833
566B512m188j665M399P7k086J242J14j189J380K156j346k458K631J889l795NL512
583C190k207k034J975m63j425J549P51k542j294L299J056l858O28K663k389k06
599a307K784j518j504J897M30j844J10K487p50l324J908K382k611K14J812k150
615i84j61K668m95j966M69J809p33k032K147J076l090P06J790k078L85J896j918
632e11j677J536J560r93j754J587P03j694J687J213k544Q72K058j749n67J445
648A172J09j314p34J455L29j453J004J70k145J430J629k044n21R99j22k81o0O08
666B31j59j052J222M22j419R99M53j823J87R96l53k86k72K14K14j78J077J00j174
$$ plain form
685 -601 387 845 -18 680 914 -11 80 145 393 707 103 206 227 -399 412 460 -672 -288 -272 -726 -126 -288
707 -288 -347 -21 -360 27 542 179 498 247 -463 267 269 -135 25 -554 -579 198 -85 -48 225 -222 150 404
729 404 65 412 81 -180 359 -139 85 657 -136 -149 241 -206 176 151 -489 -351 -692 -555 62 -600 -545
750 -545 108 -362 191 752 0 277 539 150 562 263 101 467 -300 -103 541 -243 35 411 -429 -128
770 -128 241 -180 -7 -388 -498 93 -303 -65 419 -494 -159 570 -203 25 177 -407 -127 -290 -419 47
790 47 -485 -386 337 -389 -37 727 65 233 495 206 551 438 182 458 -94 159 677 -216 -198 375 -372
811 -372 -211 51 -483 -375 -421 -417 -55 -497 -325 284 -412 -74 496 -90 144 421 -94 85 65 65 215 -340
833 -340 -95 332 -312 112 434 -335 -73 400 -56 124 171 64 218 -67 162 280 -377 26 328 -621 -281
$$ packed form
685f01R88M58q63O98K34r25R1O5K48L14o04J03K1o26Q11M8j132L84J6m54O00j62
707b88n9L26l39L87N15l63L19k51p10P30Km04J60n79k5P77k83L7K73m47L72K54
729D04l39L47l31k61N39m98K24N72p93j3L90m47L82k5o40J38l41J37O17o62N5
750e45O53m70N53N61p52K77K62l89M12k99j62L66p67J97O44p84K78L76q40L01
770a28L69m21J73l81j10N91l96K38M84r13L35P29p73K28J52n84K80j63j29M66
790D7n32R9P23p26L52P64o62J68K62k89L45j13k56K76n52K53N18q93J8N73p47
811c72J61K62n34J08m6ML62m42J72O09o96L38N70n86K34K77n15J79k0%J50n55
833c40K45M27o44M24L22p69K62M73m56J80M7j07J54k85K29J18o57M03L02r49L40
$$ plain form
854 -281 96 -498 -401 -343 -439 -154 -301 -31 -45 -450 326 587 -227 363 660 48 463 551 160 313 360 367 177
877 177 -157 435 174 -552 189 226 -545 122 203 -478 10 175 -27 -107 -178 257 -109 -583 241 -108 -820 85
899 85 -188 -869 -97 38 -522 -307 -105 246 -207 -346 552 118 -314 769 287 -453 758 655 -318 10
919 10 407 200 -249 -287 280 -297 -466 545 -353 -857 675 298 -669 97 534 81 -4 202 393 -143 107
940 107 829 -382 -611 1006 170 -895 201 294 -409 -181 154 -74 -363 178 602 -740 -387 1119 -49
959 -49 -839 487 232 -602 -47 144 -498 -537 173 98 -1066 -296 842 -524 -773 702 103 -439 551 453
979 453 -258 173 847 305 -605 472 1091 -429 -357 799 -240 -575 493 -149 -836 159 509 -355 -695
998 -695 496 619 -694 -38 793 -354 -161 852 -275 -639 505 444 -540 -493 534 229 -716 82 505
$$ packed form
854b81L77n94R7N8r6K85j47K70j4m05P76K61q14N90K97o12M15Q8l91J53M7Pj90
877A77l34N92k61p26P41L7p71O67Q1o81M88J65k02q0p1M35l66m74Q24l49p12R05
899H5k73o81P72J35n60K15K02L51m53j39Q98m34m32J083m82p40J211j03r73L28
919A0L97k07m49l8N67n77j69J011q98n04J532l77r67P66M37m53q5K06J91n36K50
940A07P22j211k29J617q36j065J096R3p03K28L35k28k89N41M24j342L53J506j168
959d9p90J326k55q34N55J91o42l9P10p5j164P70J138j366k49J475n99n42R90r8
979D53p11M31O74n42r10J077O19j520P2J156j039l35J068o42o87R95L50q64l40
998f95J191J23j313O56Q31j147J93J013j127l64J144o1r84M7J027l05r45P98M23
$$ plain form
1017 505 -718 68 778 -535 -377 891 293 -499 -8 591 82 -440 294 175 -865 107 458 -1087
1035 -1087 -514 535 -432 -830 -14 220 -309 -383 382 87 -491 706 587 -703 376 1058 -156 -127 617
1054 617 313 -41 84 363 -145 -251 667 171 -886 423 785 -561 -45 486 -99 -49 271 -7 -411
1073 -411 -164 440 -349 -971 309 229 -1023 -184 167 -681 -195 227 -310 -477 174 499 -170 -419 763
1092 763 363 -424 542 473 -397 277 584 -292 -240 268 248 -385 -267 580 -123 -594 492 152 -567 381 394
1113 394 -337 -45 417 47 -310 5 447 -214 -488 501 -91 -649 263 69 -581 17 278 -101 -278 68
1133 68 382 -134 -67 590 -18 -257 657 96 -418 256 264 -234 -231 3 38 -410 -247 230 -321 -305 436 -104 -412
1156 -412 288 182 -119 114 194 167 -124 98 309 -259 -133 410 -211 -378 260 -119 -279 21 -31 -32 -88 36
$$ packed form
1017E05j223P86P10j313J58J268n98p92M91N99n09n22P34j19j040R72L51j545
1035a087N73J049r67l98Q16K34n29p4P65k95n78J197j19j290J079O82j214K9P44
1054F17l04l54J25K79n08j06R18m96j057J309L62j346N16N31n85N0L20k78m04
1073d11K47O04p89o22J280q0j252Q39L51q48M86M22n37j67O51L25o69k49J182
1092G63m00p87R66o9q70O74L07q76N2N08k0o33J18Q47p03m71J086l40p19R48J3
1113C94p31K92M62l70l57L15M42o61k74R89n92n58R12j94o50N98K61l79j77L46
1133F8L14n16O7O57o08k39R14n61n14O74Qm98LK34L5m48J63M77n51J6P41n40l08
1156d12P00j06l01K33Q0k7k91K22K11n68J26N43o21j67O38l79j60L00n2jn6J24
$$ plain form
1178 36 341 -155 -64 440 -76 -99 401 -3 -108 172 -37 -52 -138 -143 92 -181 -171 147 -242 -208 266 -83 -53
1201 -53 236 66 143 93 18 255 -30 -100 259 -145 -154 195 -210 -214 -20 -168 32 -52 -148 135 -48 -108 270 -38
1225 -38 21 308 45 62 129 -83 132 30 -140 123 -138 -189 195 -167 -316 88 -95 -35 133 -112 77 110
1247 110 -64 300 31 -80 252 59 -111 123 -76 -59 -3 -167 -16 -93 -155 110 -148 -180 184 5 -58 235
1269 235 41 40 198 63 159 -17 -27 177 -61 -136 113 -132 -228 79 -118 -135 -67 -46 44 -65 -127 222 48 -109
1293 -109 264 -22 -77 224 22 -38 3 -113 86 -112 -188 93 -155 -230 136 -60 -204 127 -6 26 16 116
1315 116 192 10 21 313 -74 -99 281 -15 -245 92 -62 -182 -107 -86 30 -133 -98 197 -194 -137 365 16
1337 16 -163 264 49 -44 143 14 64 -81 -5 259 -274 -240 289 -129 -205 206 -31 -120 104 107 39 -58 171 322
$$ packed form
1178C6L05m96R1N04n16k3N00m04j05K80k09j5q6nK35k73J0L18l89L4M74l49L0
1201e3K89j70P7n0p5K37k85p0L59m04rL49m05mJ94j48K00q4r6K83j83o0L78l08
1225c8N9K87k63J7O7k12K15j02j70K63k61n1L84l62j49M04j83O0J68k45J89L3
1247A10j74L64k69j11L32j93j70K34j99J7N6j64J51p7o2K65k58l2L64j79o3K93
1269B35j94jJ58j35R6j76j0K04k38p5K49k45r6L07j97j7O8K1R0j09o2L49j74j57
1293a09L73k86n5L01k02o0M1j16J99j98p6K81k48p5L66j96j44L31j33L2j0J00
1315A16P6j82J1K92l87k5L80k96k30L37j54j20P5K1J16j63L5K95l91N7N02l49
1337A6j79M27k15r3J87j29N0j45P6K64n33L4N29m18p6M11k37q9K24Lo8r7K29J51
$$ plain form
1361 322 -191 -9 372 -117 -183 263 -124 -251 71 -47 -263 -231 -33 -38 -332 -128 225 -320 -167 331 -146
1382 -146 -209 278 48 -169 77 186 19 -202 108 232 -278 -18 340 -255 -84 329 -60 -160 219 215 -9
1403 -9 -68 243 233 -137 127 272 -285 -35 285 -210 -261 115 -67 -317 -190 35 -91 -303 128 87 -387 136
1425 136 362 -228 -128 381 34 -88 113 162 -64 -148 222 11 -377 152 191 -416 -95 262 -232 -133 161
1446 161 19 -107 89 302 -69 -183 336 197 -357 119 194 -305 -39 150 -140 -118 96 83 -195 -151 338
1467 338 -23 -335 282 239 -276 122 239 -222 -10 243 1 -259 -98 232 -206 -394 147 -89 -426 124
1487 124 90 -338 28 282 -116 -169 159 289 -108 -89 357 -39 -189 335 123 -326 194 236 -193 -189 177 57
1509 57 -238 -65 175 -199 -169 359 1 -333 299 210 -262 38 199 11 -174 27 138 -249 -93 263 -191
$$ packed form
1361C22n13J82L81m89o6M46l87j27L22j18k16L2J98nk94K04L53n45J53M98m77
1382a46o3M87k30k17K46J09j67k21L10J24n10K60L58n95J71M13l89j00L79mk24
1403in9L11j0l70K64J45n57K50L20m95n1L76j82k50J27K25j26k12M31m1m74N23
1425A36K26n90J00N09l47j22K01M9k26q4L70k11l88N29L9o07L21L57m94R9K94
1446A61j42j26J96K13l71j14N19j39n54M76P5m99K66J89k90K2K14j3k78M4M89
1467C38l61l12O17m3n15L98J17m61K12K53k42k60J61L30m38j88N41k36l37N50
1487A24l4m28L66K54l98n3L28J30l97J9M46l96j50N24k12m49N20M2m29ML66j20
1509E7k95J73K40l74L0N28l58l34O32q9m72L00J61j88j85K01J11l87J56L56m54
$$ plain form
1530 -191 -262 382 101 -203 149 161 -31 17 197 203 -103 105 304 -182 -96 321 -100 -288 115 -25 -246 -61
1552 -61 -3 -126 -211 43 48 -280 -43 330 -162 -185 296 16 -133 115 183 -113 -34 158 67 -274 38 255 -180
1575 -180 -59 236 -115 -95 204 10 -108 122 242 60 -74 165 184 -168 -19 166 -220 -65 109 -111 -155
1596 -155 29 27 -88 -112 24 74 -216 68 166 -174 84 258 -71 15 189 26 -8 11 75 -81 -131 33 13 -296
1620 -296 72 88 -244 41 148 -46 -35 95 80 61 -62 65 24 -187 99 36 -197 44 91 -160 32 63 -23
1643 -23 -6 -31 130 7 -110 148 102 -123 194 154 8 72 129 27 35 16 -80 -13 -123 37 35 -168 73 4 -137
1668 -137 132 83 -125 26 47 -1 -1 -29 111 -24 -130 88 5 -122 51 -18 -99 -31 -28 -58 -22 -29 -51 -44 -70 119 38
1695 38 -89 76 87 11 74 40 -6 -14 -69 20 -10 -65 15 -25 -92 60 8 -92 -20 -43 13 45 -38 50 63 -33 54 16 -17
$$ packed form
1530a91p1O44k81l04L52J2j92M8J80Ol06K08J99m86Q6M17m21j88M03j40k21J85
1552f1N8j23q5K54Nl28K37L73m92k3M81k80j49K48O8k96P9J92r1l41L12K17m35
1575a80J21K95l51K0K99j94j18K30J20j82j34K39J9l52J49J85l86J55J74k20m4
1596a55J84kj15k4J36N0k90K84R8l40K58J74l29Q6J74j63l4J9O4j56n0J64k0l09
1620b96L68J6l32K85J07j94J1J30j5j9j23J27m1k11K86o3k33K41M7k51J92L1q6
1643b3J7k5J61j23j17K58m6k25L17m0j46O4N7j02Qj9r6O7j10J60kk03K41o9j41
1668a37K69m9k08J51K1m8%k8J40j35j06K18q3j27J73o9q1O8Ll0L6pk2Pk6J89q1
1695C8j27J65J1p6O3l4m6qn5Q9l0n5Q0m0o7J52n2j00P2k3N6L2q3Q8J3r6Q7l8l3
$$ plain form
1724 -17 122 -53 -37 79 -76 -73 -84 -105 -12 -49 -40 66 10 -8 97 30 35 56 -21 25 42 9 42 28 -78 63 -27 -109
1752 -109 84 -95 -129 5 -26 49 92 -4 -1 36 -22 155 61 -23 157 -38 -12 104 -62 -54 -42 -97 -84 -21 -86 19
1778 19 -134 -102 46 3 -62 128 -97 74 52 10 13 -18 -47 21 51 -49 59 -88 8 14 -12 19 15 -55 5 55 -10 91
1806 91 34 -32 103 44 41 98 -5 -8 60 -91 64 40 -91 -37 -41 -131 -21 -24 -35 -2 -30 41 64 -57 97 59 -77 85
1834 85 115 -110 -12 7 -54 -1 33 51 -11 -109 103 -23 -113 117 -29 -166 90 65 -32 32 65 73 41 -35 183 -1
1860 -1 -115 74 -62 -184 46 28 -155 -94 60 -14 -70 32 141 -43 -14 148 29 -134 145 67 -113 25 123
1883 123 -14 -111 51 82 -125 -67 105 -178 -104 168 -25 -142 80 72 -24 -19 115 95 -96 32 106 -149 -48 175
1907 175 -164 -169 134 -41 -113 25 66 -30 -75 110 77 -149 -4 178 -103 -121 250 14 -78 64 83 -85 15
$$ packed form
1724a7J39j75J6J16j55Lj1k1R3l7RJ06n6j8J05o7NK1p7M6J7l3L3j4j06J41r0q2
1752a09J93j79l4J34l1P5M3r6LL7n8J77r4q4J80j95K6J16j66QJ2n5J3O3o5J05
1778A9j53L2J48m3o5J90k25J71k2m2Ll1k9O8L0j00J08j47R6Ok6L1mp0O0N0o5J01
1806I1n7o6J35n9lN7j03lO8j51J55k4j31N4mr0J10lj1L3k8P1K3j21J54l8j36J62
1834H5L0k25R8J9o1N3L4J8o2r8K12j26r0K30j46j37K56k5r7O4L3Ql2p6K18j84
1860aj14J89j36j22K30j8j83O1J54p4n6J02J09j84K9J62j19j63K79p8j80J38R8
1883A23j37r7J62L1k07N8J72k83P4K72j93j17K22qr6NJ34k0j91J28P4k55J01K23
1907A75l39nL03j75p2J38M1r6m5J85l3k26J45J82k81j8L71k36r2J42J9j68J00
$$ plain form
1930 15 -9 -26 -149 3 129 -154 -80 164 -61 -103 156 104 -61 66 103 -17 -85 53 61 -187 24 120 -144 12
1954 12 104 -114 -133 84 72 -114 -95 92 18 -127 109 108 -75 12 180 -29 -36 93 -25 -88 -13 84 -23 -124 59
1979 59 31 -174 96 119 -126 51 173 -31 -98 89 72 -45 -71 51 20 -125 46 -31 -200 -2 33 -125 -72
2002 -72 65 -11 -78 -12 89 -38 -7 115 5 -163 96 30 -126 85 57 -49 -44 20 53 -74 -14 121 -42 -105
2026 -105 88 70 -130 98 114 -27 19 74 21 9 30 95 -47 -117 99 -83 -149 87 -29 -91 6 45 -5 22 58
2051 58 34 -104 13 130 -55 -104 161 72 -20 135 10 -14 -13 11 -81 -137 -80 68 -132 -86 128 -12 -133 105
2075 105 29 -68 47 72 -41 -37 -6 -8 -160 -2 103 -33 -32 127 34 -57 76 12 -70 -37 -4 -53 -34 34 124 -8 -10
2102 -10 92 11 -20 96 13 -60 -68 -92 -15 -68 -16 26 -89 -11 48 -44 12 39 0 26 84 -17 -12 -49 -67 -2 -29 -10 97
$$ packed form
1930A5k4j7j23J52J26k83P4K44k25m2K59n2j65J27L7j20o8J38Qk48K11R6k64J56
1954A2R2k18j9K17j2j86J9J87p4j45K36jj83Q7J68k09pJ29j18o3P5R7j07j01J83
1979E9k8k05K70K3k45J77J22k04o7J87j7j17k6J22l1j45J71p7j69J98L5j58N3
2002g2J37p6o7O6J01j27L1J22j10j68K59o6j56K11k8j06NO4L3j27O0J35j63o3
2026a05J93j8k00K28J6j41M6N5n3j2K1O5j42p0K16j82o6K36j16o2R7L9n0K7L6
2051E8k4j38J17J17j85m9K65q9r2J55j25k4JK4r2n6N7J48k00M6K14j40j21K38
2075A05p6r7J15K5j13ML1kj52J58J05j36JJ59r3r1J33o4q2L3L3m9J9O8R0j32k
2102a0J02q1l1J16q3p3qk4P7n3N2M2j15P8N9r2N6K7l9K6N8j01Nl7j8O5k7J9J07
$$ plain form
2131 97 -2 -37 97 -45 -35 -32 -32 30 -45 12 62 0 17 47 87 25 77 -44 13 33 -42 5 36 -59 -64 -82 34 19 -61 7
2161 7 82 33 -32 -20 -29 41 57 30 54 -20 40 33 -33 29 29 -36 19 39 -154 -20 -31 -75 40 -32 -14 32 -23 37 22 16 38
2192 38 64 -38 76 -18 -56 36 6 -37 -8 -66 4 11 -44 49 -34 -38 36 82 -17 45 13 4 54 -10 -5 42 8 6 43 -65 34
2223 34 53 -32 76 6 -11 1 -30 -8 16 -30 60 -14 38 70 85 -40 36 -35 -25 -23 -24 -42 -31 -39 -69 -14 -63 63 19 -27
2253 -27 -5 -83 -83 25 23 17 49 41 61 41 -53 93 27 46 69 6 -27 -23 -49 -5 19 -12 24 39 22 108 60 45 39 -2 25 35
2285 35 -11 -43 -35 -28 -9 -65 -68 21 -70 -38 24 -58 -36 12 -44 -15 -57 -18 40 48 55 7 0 14 63 -72 -12 -5 -51 -41 55 -56 53
2318 53 49 -17 85 49 78 17 -92 -4 69 -29 53 16 -64 -16 -17 -59 58 -5 -38 12 -49 14 21 -134 -18 79 -69 57
2346 57 85 39 86 91 46 28 6 77 45 -100 52 -26 -72 13 31 3 19 105 25 -32 -40 57 -22 -43 30 -8 -40 52 -8 -57
$$ packed form
2131I7r9l5J34j42J0L%O2p5N7N0o2J7L0M0o2N2j21N7K0p5M7L1r5nj8J16j5q0O8
2161GP5m9o5J2rP0J6k7K4p4O0po6O2%o5N5K0j93J34j1m4J15p2J8M6n5O0j5oK2
2192C8K6j02J14r4l8R2l0m3K9n8P0Pn5R3q3mP4M6r9O2l2rN0o4NM7l4kL7j08R9
2223C4J9q5J08p0j7J2l1K2K4m6R0p4N2L2J5j25P6p1J0Kjj8J1ql0N5m9J26m4m6
2253b7K2p8%J08koL2qK0k0r4J46o6J9K3o3l3Mk6M4K4l1L6J5j7Q6m8j5om1K7J0
2285C5m6l2QPJ9n6lQ9r1L2O2q2K2M8n6K9m2L9N8QPm8pJ4M9j35O0Pm6J0R6j11J09
2318E3mo6J02l6K9o1j09Q8P3r8Q2l7q0M8jm2J17o3l3N0o1O3Pj55J16R7j48J26
2346E7K8m6M7Nm5j8k2P1l2j45J52p8m6Q5J8k8J6Q6q0n7qR7p9k1P3l8l2R2o0m9
$$ plain form
2376 -57 8 46 -62 -36 11 34 -79 -45 -46 -20 -18 83 -6 -58 113 47 -24 26 76 9 -14 -4 23 -91 6 26 38 -101
2404 -101 61 17 -144 37 3 -31 -25 26 19 -31 19 103 -8 -34 65 -39 -55 75 -6 -88 -29 4 -42 -56 40 59 -59
2431 -59 -22 60 -35 -92 88 31 -16 31 81 -59 64 60 -40 -31 -33 83 -67 -30 12 -50 -65 39 13 -61 8 12 6 -48 57
2460 57 91 -90 5 120 -77 -67 66 -32 -11 4 46 32 -40 23 46 -26 -1 39 -38 -30 81 0 -30 86 115 -45 -5
2487 -5 22 24 -90 3 44 -120 -25 48 -94 -55 67 -61 -66 37 87 29 -48 58 -7 -41 3 69 -47 -9 85 4 -53 18
2515 18 11 -11 -73 -9 38 -84 43 23 -43 47 89 -26 -27 40 -57 30 -47 -59 -34 -50 63 6 -76 10 -8 -49 -60 36 -45
2544 -45 -1 5 -16 24 -27 19 42 12 114 -7 -44 33 29 -51 57 -29 -31 -20 -49 4 -47 -49 -16 63 -32 70 19 -29 27 28 4
2575 4 -38 -24 20 -20 18 38 -21 -101 -15 -24 -31 -12 27 -13 14 4 32 -12 -10 59 19 3 -9 5 -55 63 -30 -63 -29 20 -23 17
$$ packed form
2376e7O5L8j08K6M7K3j13L4jK6KJ01q9n2J71o6p1N0N0o7k3J0K7j14R7K0J2j39
2404a01J62m4j61J81l4l4ON1pn0N0Q4j11k6R9j04j6J30q1q2N9L3m6j4R6J9j18
2431e9L7Q2r5n7J80n7m7M7N0j40J23mj00RkJ16j50L7M2o2j5J04k6p4O9Mon4J05
2460E7L4j81R5J15j97J0J33r8K1J5M2j4p2O3K3p2K5M0p7QJ11q1l0J16K9j60M0
2487eK7Kj14R3M1j64R5P3j42L9J22j28nJ03N0n8p7J06o5l4M4O6j16L8R4q1n7P1
2515A8pk2o2O4M7j22J27k0o6R0M2j15jO7r7Q7p7j2K5j6J13n7q2Q6j8m1j1R6q1
2544d5M4Ok1M0n1M6K3l0J02j21l7P7mq0J08q6kJ1k9N3n1kL3P9r5J02n1m8N6Jk4
2575Dm2J4M4m0L8K0n9q0Q6rpJ9L9m0K7j0K8m4KO9m0j6j2J4o0J18r3l3L4M9m3M0
$$ plain form
2607 17 -14 -32 -10 22 58 -34 -32 49 7 -17 -21 -21 -10 35 25 18 -3 -25 -5 -58 11 32 -64 38 27 -12 -9 56 10 44 7 25
2639 25 29 -8 32 8 31 2 84 -106 -17 24 16 16 -74 -38 31 -9 4 19 -3 10 31 33 37 7 34 3 19 16 41 -46 -28 -37 -12
2672 -12 -14 45 -58 20 27 -1 -30 -44 -7 -11 45 -18 58 29 -16 9 58 27 29 -43 -13 -6 -57 -30 -35 -59 26 -51 32 56 -8 -31 38
2705 38 -81 -48 72 10 -6 -47 -28 -33 -37 -37 10 -24 -41 -84 -56 -32 -44 -45 44 0 19 9 54 14 -5 12 55 -12 -21 27 -29 -23
2737 -23 -43 -65 -64 -1 4 -25 27 -19 27 -27 28 48 10 1 -14 45 -12 -14 26 14 -15 7 31 -3 -56 34 -29 -45 -32 43 5 10 14
2770 14 -3 52 9 25 5 -34 42 -36 -67 -6 15 -48 2 -28 -11 -21 -21 39 -45 -3 10 -7 -43 -52 -8 -25 75 -16 10 -10 -36
2801 -36 -6 -54 -40 -28 -68 7 52 -56 -40 69 44 34 53 28 54 32 -6 44 -13 1 81 -31 -12 53 -53 -17 21 -24
2829 -24 -67 38 3 -36 -6 -18 62 -59 -45 73 -50 11 86 -8 -20 31 11 -56 30 53 -27 -10 -55 -9 20 49 60 -33
$$ packed form
2607A7l1j8K2L2L6r2KQ1m2k4m%J1M5j0pk1k2K0n3O9K1r6J02j1l9LO5m6L4l7J8
2639B5Ml7M0k4K3k9Q2j90Q9M1q%r0L6O9m0J3J5k2J3K1KMl0K7l1J6lK5q7J8rK5
2672a2kN9j03P8Pk8k9j4L7mN6o3P6k9m5K5M9l1Kp2L0Pn1K7nk4Q5p7Q3K4o4k3O9
2705C8j19L3J20o2j6m1J9nm%M7l4j7m3K8K4j2jQ9m4J9j0M5m0j9J7M3o7rM8n6O
2737b3k0k2JO3Nk9N2m6M6n4N5K0l8rj5N9n7kM0j2k9K2K4l4n3R0o3j6J3P5l8NM
2770A4j7N5m3J6k0l9P6p8l1O1K1o3N0l0J7j0%O0q4M2J3j7l6rM4j7J00r1K6k0k6
2801c6L0m8J4J2m0P5M5j08J6J09k5j0J9k5K6k2l8N0n7J4Q0j12J9O5j06L6L8m5
2829b4m3J05l5l9L0j2Q0j21J4J18j23O1P5r4j2N1k0o7Q6K3q0J7m5M6K9K9J1r3
$$ plain form
2857 -33 13 89 22 29 28 45 20 -10 -11 9 -16 16 29 -39 -46 -4 -48 -7 28 -13 -27 -29 69 -9 -41 29 -26 -108 40 73 -26 -21 77
2890 77 48 -41 -19 65 -34 -60 45 -14 -53 32 47 -63 18 -4 24 42 52 31 -35 22 56 -15 -37 41 7 -92 64 15 -8
2919 -8 -18 -35 -14 -34 -5 33 10 -2 70 48 -42 10 29 -85 58 48 -34 -49 74 23 -63 -13 24 -44 -29 94 -1 -101
2947 -101 39 6 -44 -24 24 36 23 51 42 -24 -14 27 -66 -16 65 -1 -77 58 16 -48 32 15 34 -49 5 104 52 -81 45
2976 45 -17 -88 47 3 -26 -17 21 20 1 13 7 -69 8 26 -52 -17 82 -37 -48 -29 2 -58 -58 9 -10 -37 -39 -5 11 -66 23 -58
3008 -58 -37 36 -9 -36 16 31 -15 -36 -46 3 3 32 84 -51 -10 3 42 59 29 -43 23 16 26 -18 5 -37 7 -74 -1 49 -97
3039 -97 -4 58 -15 25 -16 4 25 -76 -18 -7 -46 -37 19 -76 -30 47 -4 4 -26 -19 14 -29 31 33 16 3 53 -16 17 -5 -18 28
3071 28 24 -5 -1 -3 46 -5 25 37 -2 -19 -30 7 3 59 60 -11 47 11 -15 -14 -25 35 9 -26 -15 -19 -11 9 -30 -18 27 -12 21 25 13
$$ packed form
2857c3M6P6o7PjJ7k5l0jK0k5L2J3o8pM2m4M1L5m1j4kR8p8l2P0n5q2J48L3r9NR8
2890G7k9q9K2Q4r9k6J05n9l9Q5J5j10Q1k2K8J8J0k1o6N7L4p1k2P8l4r9J56m9k3
2919hj0j7K1k0K9L8k3j2P2k2r0N2J9j14J43j0q2j5J23n1q6N0L7o8J5J23r5j00
2947a01J40l3n0K0M8J2j3K8ro6J0M1r3N0Q1o6p6J35m2o4Q0j7J9q3N4R9n2j33J26
2976D5o2p1J35m4k9RL8jj9J2op6P7J8p8L5R9j19j1J9L1o0%O7j9k7kL4J6p7Q9q1
3008e8K1P3m5k7N2J5m6k1j0M9%K9N2j35M1J3L9J7l0p2O6pJ0m4K3m2M4q1P3N0j46
3039i7R3O2p3M0m1K0K1j01N8J1l9RN6r5M6P7n1Ql0PL3m3O0Kj7j3N0o9L3k2j3M6
3071B8mk9MkM9n1L0J2l9j7j1L7mN6Jp1N8l6k6Jj1O0k6l5J1mQK0l9J2M5l9L3Mj2
$$ plain form
3106 13 47 -30 83 40 -9 -44 -12 44 -26 3 -33 -33 -12 -36 38 69 -65 -17 23 33 54 18 -16 28 31 12 -16 28 13 43
3136 43 -24 18 -6 -12 22 33 -48 36 -11 -15 10 0 -14 58 -9 22 -47 -12 -13 -15 34 34 4 -33 36 -91 22 36 -84 16 -4
3167 -4 -13 -35 2 -69 29 -41 -33 20 -41 -59 14 -67 -29 -11 76 -17 -20 8 18 -42 -7 34 -21 18 -8 14 6 3 44 22 -27 10 43
3200 43 39 -43 -24 2 -12 28 28 -51 -68 -53 -59 -73 -19 47 30 -34 45 -9 10 20 8 -51 31 -18 -1 5 -16 63 -51 -14 -17 -56
3232 -56 -5 9 -8 -12 9 -33 -34 -37 -7 -23 1 5 24 30 -40 32 22 37 41 -21 -45 26 30 27 -2 -26 25 -63 -58 27 36 17 16 5 32 -5
3268 -5 -7 26 3 -12 -14 -3 -25 26 -43 -4 47 -42 3 48 24 21 15 42 -62 -63 53 -20 1 13 -6 8 33 38 -58 -26 -29 -39 -41 -57
3302 -57 15 -40 -39 37 29 -53 10 33 -2 43 -28 24 47 -4 39 -43 23 27 -23 -33 47 25 -24 15 70 -24 52 17 -1 -24 -61 3
3334 3 17 7 14 -9 -24 -6 -27 -37 -33 21 -2 13 34 -35 -52 21 -24 10 -29 45 19 -36 29 -19 22 12 -20 17 -28 -53 33 -15
$$ packed form
3106A3L4p7J13m3m9l5L2N6p0K9l6%K1k4P4L1j34M8M0J0K1l6l4M4Lj9k8M4j5L0
3136D3o7M2k4oL4J1q1Q4m7mK5j0j4P2o7L1o9L5jkM9%l0l7O9j27J13J4j20J00k0
3167drk2L7p1R8p0QN3o1j8P3q1L8J8Q7r3lK8J0o0L5M1n5L9k6K2qlM1k2m9L7L3
3200D3mq2J9K6j4M0%p9j7J5oj4N4O6j7o4P9n4J9J0j2n9Q2m9J7Ok1P9j14L7ll9
3232e6N1J4j7mK1m2jlL0j6K4MJ9Op0P2j0J5Mo2k4P1Mlk9k4N1q8NQ5Rj9jj1K7l7
3268ekL3k3j5kJ1k2N1o9L9N1q9M5M5k4loK7j04jJ16p3K1J2j9J4K5Nr6L2lj0kj6
3302e7P2n5JP6qq2O3K3l5M5p1N2K3n1M3q2O6Mn0j0Q0k2m9L9N5r4P6l5j8k3l7O4
3334CJ4j0Pk3j5J8k1j0MN4k3J5K1o9j7P3m5L4l9P4k6n5O5m8M1j0l2L7m5k5Q6m8
$$ plain form
3366 -15 -18 39 -1 -38 -4 47 -56 -34 26 9 -4 28 77 -47 40 -32 -12 57 6 28 -33 50 -10 -3 -12 -28 -5 -16 -28 12 34
3397 34 40 -10 11 -17 26 51 13 9 17 61 40 6 17 -41 -15 18 -4 33 -17 -43 -2 -33 22 -13 -9 -11 39 -79 -20 33 14 -6
3429 -6 -57 -47 -82 51 -13 3 7 -39 13 -12 -20 32 -47 45 -2 13 46 62 38 -8 23 10 -20 -30 -12 35 -38 31 2 -61 7
3460 7 -19 -31 29 18 37 -50 -30 16 -14 -16 -51 13 -19 65 1 -36 -7 -12 -68 -47 28 41 -5 -29 46 32 -20 -17 22 -52 12 -30
3492 -30 -20 1 -24 -34 -13 -83 -18 -37 -32 42 -29 -14 -7 -20 -3 57 -35 24 -4 3 15 24 -7 -19 8 31 13 -8 -30 -26 35 16 -19
3525 -19 -17 -19 -9 31 -4 -12 -3 74 57 4 33 -18 21 36 2 31 -14 8 41 -34 -15 27 -20 -46 -76 28 -20 -6 17 22 28 30 29 -24
3559 -24 17 5 9 -25 14 23 24 53 -37 -57 -17 -27 -1 3 -7 -6 14 0 37 -1 -5 -11 -25 -2 -2 -8 -2 -50 -26 2 -25 -29 41 -34 -40 -7
3595 -7 -14 -36 -19 6 0 36 6 -18 12 -16 3 28 17 39 -47 -11 3 -6 -25 0 40 38 -36 -21 8 29 -14 -21 3 41 14 -11 4
$$ packed form
3366a5lN7m0l7L4N1j03K2O0j7j3L2M9j24Q7p2K0O9n1K2o1Q3o0Prj6K3j1j2M0K2
3397C4On0K1k8M3K5l8mQM4k1l4J1n8K6L3k2L7n0k6M1l1N5l5MkN0j18N9N3j9k0
3429fn1J0l5J33o4J6Mm6N2k5qN2p9R2m7J5L3J6k4m6L1j3l0j0J8M7p3O9k9o3O8
3460Gk6j2O0j1J9q7K0M6l0kl5O4l2Q4o4l7K9nn6K1P5J3m6k4P5j4n2LL9p4O4m2
3492c0J0K1k5j0K1p0O5j9NP4p1J5Pj3J7O0r2N9k8PJ2Rl1j2K7K3j8k1k2MO1j9l5
3525a9KkJ0M0l5qRP7j7n3K9n1L9J5l4K9m5K2L3p5J9M2m7k6l0J04m8J4K3NOKjn3
3559b4M1j2Ml4L9RJK9r0k0M0j0K6Mj0JK0j4L7l8moj4K3%oOm8K4K8k7mP0p5oL3
3595gpk2J7K5oL6l0k4L0k8J9K5j1K2q6L6J4rj9K5M0kp4J5K9K1m3pK4L8k7k5J5
$$ plain form
3628 4 -32 5 41 -21 -44 26 -9 16 48 14 -16 -48 69 47 9 -3 8 42 -22 13 -34 1 2 -22 37 31 32 -37 -14 -23 35 -26
3660 -26 -29 -39 66 2 22 -48 -21 16 17 18 62 32 -27 21 -16 -45 15 -64 -18 -60 11 -11 -5 65 12 -21 4 11 5 5 -17 31 -22
3693 -22 11 29 -30 28 -22 45 -17 19 76 -5 -49 -45 -31 0 -13 16 16 -27 -9 -38 -84 3 -26 17 -14 2 -19 -7 5 7 18 -92
3725 -92 49 -51 -58 -23 3 -1 -25 -3 47 -5 -18 52 -59 36 32 2 -4 -4 60 18 42 14 -24 10 -30 48 -46 69 -38 -5
3755 -5 -10 0 -46 2 25 26 -6 -28 -4 4 32 -37 13 -21 -22 -25 3 -41 -1 -64 1 15 -14 39 -67 8 42 0 -33 29 -16 -28 4
3788 4 3 -9 -42 -19 4 -8 33 -11 -53 30 -25 -36 7 -70 -10 66 -25 -10 -3 -30 60 22 -23 43 4 -10 8 -4 9 24 -25 45
3820 45 7 -9 57 -9 -41 32 -2 -8 37 8 19 21 -29 -30 -6 -6 -39 0 39 48 39 -37 -18 -45 9 -2 -17 -10 62 -16 63 8 -39 -24
3854 -24 -35 36 31 5 38 35 -14 -6 -11 29 2 50 -63 61 -29 -8 12 -31 -20 -65 -82 -11 40 25 -24 3 -18 -5 25 -15 86
$$ packed form
3628Dl6L7L6o2k3P0l5K5L2l4l0l2J17k2l8j2J1L4o4L5m7L5Jk4N9oJo9K3rN8o1
3660b6lj0J05o4K0p0K7L7JJM4l0n9M8l7k9O0p9M6m2P1k2OP0n3l3K5Po%k2M8n3
3693b2L3J8n9N8n0O7o2L6N7q1m4MJ4L1j3K9%m3J8k9m6Q7k9M3l1J6k1J2J2KJ1j10
3725i2J41j00pL5K6mk4K2N0n2j3P0j11R5ml0o%O4m2K4k8l8L4m0P8r4J15j07L3
3755enJ0m6M8K3Jl2k2K4QK8o9N0l4jlK8m4M0o3O5J4k9N3j06P5L4m2l3O2m5j2L2
3788Djj2l3K3K3j2M1m4m2Q3n5j1M3p7O0P6r1J5Pk7R0l8m5O6l9j4J8j2J3J5m9P0
3820D5l8j6O6o6l2P3l4oM5k9J1Kn0jK4%l3L9L9Rrp6J9k7N4j1j5PP2p8P9n5m7J5
3854b4j1P1nk6L3lm9QnM0k7M8j13J24r0K1K0m3J1m5j7P1N1j5m9K7k1J3L0m0J01
$$ plain form
3885 86 -36 -48 -39 -26 -61 -14 -28 -4 -16 29 18 36 18 -18 -21 -58 8 -25 70 -25 21 8 12 -57 62 30 -37 -33 23 -7 -67
3916 -67 20 -9 -59 -15 -36 15 -19 57 -46 16 9 13 -28 4 18 27 -14 7 22 -1 -4 46 68 24 36 -32 22 17 18 6 5 23 -9
3949 -9 -24 28 -31 -19 -12 17 -47 -26 -1 17 0 -31 25 8 -27 36 -30 52 -7 -1 70 -64 -34 30 -26 36 -72 16 -9 -12 -20 -19
3981 -19 26 56 57 -58 -44 16 20 -36 14 13 -10 50 -36 25 -4 -14 -60 -65 -3 -14 20 -13 -36 -11 -5 -15 -17 -23 -33 13 -9 2 30
4014 30 -24 -45 10 21 -12 -20 11 -38 24 -4 -38 -37 2 11 7 14 78 -3 -83 -1 -2 19 25 26 -25 -17 -62 13 -66 35 14 -24 -49 1
4048 1 40 28 -55 116 -27 -28 3 -11 8 48 14 -6 27 -33 17 -25 2 -22 -7 -7 -36 21 -38 -47 52 -20 -11 12 16 35 -24 29
4080 29 26 31 -26 19 41 -46 47 -10 -31 16 -77 15 -72 -23 -46 -20 -32 11 -9 -7 20 -39 -20 69 11 -35 -24 -33 -4 -67 57 17
4112 17 -10 36 -24 28 -14 -58 5 -1 -63 -33 -46 24 24 -16 61 -19 23 -11 4 -27 -1 -7 -29 50 11 -20 -14 -7 -3 -42 27 -31 -16
$$ packed form
3885H6j22j2RJ3l5M7j4K4j2M5j1J8j8l6ll7O6l3R5r5M6j3Mo9J19l2o7MN6l0o0
3916f7Q7k9n0M4k1N1l4P6j03O2pMm1L2J4Rm1K1J5k3lN0K2m4J2o8N4nJj2jJ8l2
3949ij5N2n9J2PK9o4K1K5J8j7l1N6j7l5O3o6Q2n9OP1j34L0O4n6O2j08Q8k5lqJ
3981a9M5L0Jj15J4O0Mn6N0jk3O0q6O1k9j0m6nO2j1L4l3k3K5Oj0koj0M6k2J1K8
4014C0n4k1N5J1l3qL1m9O2k8l4JL9RmPO4q1q0Q2jK1OJn1Qm5P5p9J01k1l8k5N0
4048AL9j2q3J71j43jL1j4J9M0l4k0L3o0N0m2K7k4J5%k9N7n9rR9p2RK3MJ9n9N3
4080B9lNn7M5K2q7R3n7k1M7r3R2q7M9k3K6j2M3k0KK7n9J9Q9n8m6J1rK9o3J24m0
4112A7k7M6o0N2m2m4O3oo2L0j3P0%m0P7q0M2l4J5l1K6ok2P9l9l1OPMl9O9n8J5
$$ plain form
4145 -16 14 41 -35 -14 -18 -14 -3 -44 -34 21 1 22 9 2 -27 18 41 -33 9 -8 -5 6 -4 55 26 -31 -23 44 45 -24 -9 -55 -37
4178 -37 7 -116 -64 -3 9 40 1 7 23 13 22 41 60 -8 6 -48 -7 37 30 -17 6 1 1 -18 10 1 39 8 -41 -42 -8 -33 -21
4211 -21 -30 25 1 79 33 -41 46 18 17 11 -9 14 70 -76 -53 17 -7 52 1 -52 42 3 17 29 -40 -7 -5 -20 3 41 -12 -11
4243 -11 29 -25 -7 2 -3 24 27 20 33 -45 28 -22 -9 -1 -19 -42 -26 -13 -20 -19 50 1 -21 4 19 50 -14 25 -51 -7 17 1 -11 -20
4277 -20 7 -10 53 -21 -13 -19 6 -6 29 31 -15 24 -60 -15 2 -32 -52 -22 -13 30 -52 -19 -33 -22 43 -3 -59 30 -36 -15 -68 -39
4309 -39 51 -10 -12 20 9 35 -3 -43 35 21 77 -15 47 -24 35 64 35 2 34 -19 20 16 44 -35 -5 56 5 -17 -62 -51 -33
4340 -33 -38 -59 -74 3 -7 -39 57 -21 -2 18 57 -32 -7 1 -19 -35 12 10 -2 12 24 0 28 57 -55 -33 -26 30 -27 -3 -33 22
4372 22 -57 7 -7 -21 -10 10 -45 22 -15 -60 -44 -38 8 8 29 -13 41 -50 46 14 -26 -9 20 22 88 18 -7 -1 91 51 -3 -3 6
$$ packed form
4145a6L0K7p6K1mMJ1m1J0N5k0K1j3pk9M5K3p4M2j7LJ1j0N9k9n7QO7Jo9J5m6J8
4178c7M4j23N2O1J2L1l9OJ6j0RJ9J9o8J4n4M1M4pm7K3n%j9K8rL8l1m9jL4k5J2
4211b1rN5k4P8m6p4Q7k8jok0K3N6j46K3P0k4N9n1n3R4l9J4J2o9L3Kj5K3L8n3J
4243a1M0n4J8RnK7LpJ3p8P3n0J3Qj8k3J6J3pJO9m9k2K5J5L1o4L9p6M4K4j6j2r
4277b0K7j7O3p4QoK5j2L5Km6L9q4M5J7l4k0L0RM3q2L3j4J1O5m6n6Q9o6K1n3K9
4309c9R0o1kL2j1K6l8m0P8j4N6r2O2p1N9K9k9l3L2n3L9mK8p9L0O1n1k2m5J1J8
4340c3nk1j5P7j0l2R6p8J9K0L9q9K5Qk0j6M7kj2J4J2k4K8K9j12K2PN6n7K4l0N5
4372B2p9O4j4j4J1K0n5O7l7m5J6OM6%K1m2N4r1R6l2m0J7K9KO6p0k5OR2m0n4%R
$$ plain form
4405 6 23 -57 1 28 11 24 -52 -15 50 26 -30 2 13 -19 11 -7 -36 15 12 26 2 24 -12 -52 -25 -7 -114 21 -36 -45 24
4436 24 -44 -59 45 -24 -36 31 -23 -10 31 -11 -55 8 -20 33 -41 -26 62 12 19 8 24 43 17 34 23 6 -15 25 -7 -26
4466 -26 -3 26 -85 -12 -34 27 42 -44 -33 -9 34 19 32 -15 31 1 3 11 2 26 60 52 23 -1 22 -12 52 -25 -4 8 21 -28
4498 -28 -33 18 -32 11 -36 -26 -25 10 -12 15 28 -12 18 10 -7 -46 -47 -64 -9 -4 -8 17 -38 5 -38 -26 28 -29 22 8 30 -25 1
4531 1 -69 19 12 -16 19 27 -16 -66 11 -6 19 32 17 52 -22 -47 -5 40 -31 18 27 5 18 24 -16 -15 -52 -41 -3 -18 4 -1 -31 39
4565 39 33 7 23 -25 23 13 -51 5 28 -6 -6 33 -28 48 -9 14 -2 11 10 31 -48 10 12 1 55 40 -14 43 -59 -3 -11 28
4597 28 -12 -48 -43 22 26 13 18 -27 -33 36 15 -22 -10 -22 8 -25 -21 -19 -2 -39 18 -16 36 12 -44 -2 -31 11 39 20 -49 -18 14
4630 14 -11 66 27 -43 -24 -21 9 41 -41 -14 -49 10 29 8 -31 -60 -16 -16 -1 33 -8 -41 -7 -23 20 -23 1 -1 -45 75 -1
$$ packed form
4405FJ7q0N8K7j7J3p6L7O5k4n6L2J1l2L0j8k9N1lJ4k4K2l6m0K7J8j07J35n7rO9
4436B4o8j5J04o9j2O7n4J3M1m2m4O3k8N3p4J5Q8n0Pj1J6J9k6J7j1j7k1M0l2j9
4466b6K3K9j11P3k2O1J5q6J1K4M3j5J3m7M6l0KQrK4L4qk9k4K3l4O4p7K1J2J3m9
4498b8nN1n0M3m7J0JL5k2K7J3m0L0qj7l9jj7N5NmK5n5M3m3J2N4n7N1j4K2n5K6
4531Ap0Q8pk8L5Qm3n0P7j7K5J3j5L5p4k5M2M5p1M9Rk2J3Om0Jl7J1L8j5K2nl0P0
4565C9ok6J6m8M8j0o4N6K3l4%L9o1P6n7K3j6J3jK1p9N8Kj1N4j5n4N7j02N6qL9
4597B8m0l6NO5Mj3Nm5oO9k1l7J2j2L0l3MKJ7l7N7l4N2k4n6M2k9M2K8j9o9L1L2
4630A4k5P7l9p0J9LL0L2q2K7l5N9J9k1l9k9M4%J5L4m1l3L4j6M3m3K4km4J20p6
$$ plain form
4661 -1 -25 -16 3 20 10 47 27 -22 20 -23 2 -22 43 -15 -7 51 8 -16 10 -21 3 2 -8 6 13 -53 28 -13 0 27 -45 0 -4
4694 -4 0 -14 23 44 -77 -48 13 -10 65 15 27 7 31 22 -35 14 -22 -22 -8 -32 12 -38 -43 2 -28 -9 -20 84 22 -6 34 -8
4726 -8 -10 1 -27 15 -41 -28 16 2 -31 27 -37 -34 12 -32 2 0 -36 -34 -17 -53 36 12 30 35 7 21 45 -4 77 -23 -57 -5 -34
4759 -34 24 17 -1 33 -50 21 -59 35 -11 -31 54 38 13 30 48 11 -17 26 33 -29 36 70 2 21 25 45 -1 7 -38 1 -25 11
4791 11 37 22 4 34 23 26 49 -26 24 -5 28 -13 -34 -26 -15 -15 -11 8 -33 -62 -28 -51 -24 6 -4 52 4 -15 -26 18 17 6 -35
4824 -35 30 19 -34 -39 -24 -11 -13 6 -18 -5 0 -4 24 21 14 48 24 6 36 44 11 28 -46 65 10 10 11 -52 43 39 16 -5 -50 23 35
4859 35 29 40 64 -26 9 -24 -8 36 36 -3 14 18 12 13 -10 -22 42 -8 25 11 65 42 -35 -15 20 31 -16 58 -41 -47 -10 0 12
4892 12 8 8 -69 21 29 -5 -28 -37 26 -4 85 46 14 -4 68 2 16 -21 -18 -43 23 54 27 -2 -26 21 -58 -2 29 -20 6 46 21
$$ packed form
4661ak4RJ9J7j0L7k0m9M2m3K5k4O5n8QN8m3k4K6l1K4jj0J4Po6Q1m1J3K7p2M5m
4694dMj4L7K1j21K9O1k3P5n0J2k0K4rn7M9l6%J4k4M4n0nM5l0J9j1J04o2k8M0m2
4726hkJ1k8M2n6J3M4j4l3N8o4LM6m4L4kl6KJ7l6Q9k4J8Nk8J4K4m9Q1j00l4N2k9
4759c4N8pj8L4q3P1q0R4m6k0Q5j6k5J7J8l7k8M3Po2O5L4o8J9MK0m6Qm5L9k6L6
4791A1K6j5j8L0j1LK3p5N0k9L3m1k1QJ1%MJ9m1k9L4k3K7L0j0N6m8j9j1M4jj1m1
4824c5O5j1n3nJ5J3kJ9k4J3NmK8lpL4k4j8L0Ql3J7p4J11n5%Jo3R5mk3k1m5P3J2
4859C5oJ1K4r0L5l3J6M4%l9J7MoJk3j2O4n0L3j4N4k3p7K0L5J1m7P4r9oL7J0J2
4892A2m%p7R0Ql4k3rO3l0Q9l9l2j8P2o6J4l7Lk5O6L1k7k9k4M7p9N6L1m9K6M0k5
$$ plain form
4925 21 36 -1 -116 58 -5 -65 63 -48 -35 17 22 26 4 -37 -53 -13 -24 -7 2 -4 80 -12 -34 36 45 34 -44 -3 -10 8 13 10
4957 10 28 12 25 -11 -26 30 -11 29 -11 -6 22 13 -28 46 8 -22 -30 -6 16 33 7 -11 2 -34 -30 -6 -4 -38 -31 -8 75 -4 60
4990 60 4 -5 15 -11 11 28 -2 9 3 21 -50 13 -30 -11 -14 -10 52 55 -41 13 -5 -69 32 1 46 50 25 26 24 18 48 27 45 23
5024 23 5 -72 -41 -2 -4 -16 4 2 0 -21 9 50 1 26 -27 -64 58 43 49 26 -24 -26 5 -37 3 64 9 -37 34 -21 29 -22
5056 -22 -10 -32 -45 33 11 21 38 50 -3 23 30 -13 5 -46 41 -74 -14 -2 25 -15 10 -48 -52 50 48 30 -21 4 -6 7 -10
5087 -10 8 -13 49 35 -1 -43 22 -39 1 11 10 -35 17 0 -23 -48 -27 -31 -35 -9 -14 -21 20 -25 -57 34 -26 19 5 73 29 26 -22
5120 -22 -11 -8 33 -34 -32 4 -27 8 -76 27 17 6 -12 113 3 22 -34 -56 61 -29 -13 40 -34 -43 -21 0 36 17 -34 34
5150 34 -10 -11 48 23 42 27 -39 18 -9 -22 -24 -7 -7 12 40 12 12 -20 24 -10 16 -41 -9 29 45 28 39 41 -23 6 58 -29 15
$$ packed form
4925B1J5l7j15J74o3o0J28j11J3N2NMk2m1j6M0j1J7RoQ4r2k2P0Rj1p8M1pJ8Nl
4957A0J8j6J3l6j5N6m1M0m0NK8rm1P4l8l0qK4K2J7k6j8J3l6MK4Kl4PK3Q3p9O4
4990F0n6rK0k6K2J7l0J1oJ8p1O3m3J9lMO2Lr6N4j8o4J01l1M5Mk5JkoL0k1J8k2
5024B3j8p7L1L9kj2K0kkk1L0M1m9K5n3l7J22j5Ok3n0kL1m2M0O1n5m6P1n5N0n1
5056b2J2k2j3P8k2J0J7J2n3K6Pm3J8n1Q7j15O0J2K7m0K5n8mJ02kj8n1K5j0J3j7
5087a0J8k1O2j4l6m2O5o1M0J0jm5N2j7k3k5K1mmK6npM1m5l2R1o0M5j4O8m4lm8
5120b2J1LM1o7KL6l1L5q4J03j0j1j8J25j10J9n6k2J17r0J6N3p4rK2K1L6j9n1O8
5150C4m4jN9k5J9j5o6N7k7j3kJ7%J9K8k8%l2M4l4K6n7L2L8J6j7J1Ko4K9N2q7M4
$$ plain form
5183 15 -16 -6 28 29 8 -39 14 46 31 9 -26 38 41 33 -8 -51 15 55 -23 83 13 -46 -11 -57 13 71 15 -24 21 -39 22
5214 22 44 19 21 -47 -28 6 23 21 21 15 -60 12 16 40 -8 15 -37 -57 -46 5 -44 -6 3 6 -6 23 67 -11 -6 -68 38 -20 -35 -8
5248 -8 1 -7 6 -21 -108 -11 17 -60 51 -51 59 -39 -2 28 6 -53 -7 52 -22 24 -1 -5 11 33 5 13 -48 0 -51 28 7
5279 7 11 -1 42 -76 -4 41 -42 53 42 31 21 -44 10 22 -30 -14 -7 -7 -56 8 -16 8 -30 -43 -24 -12 -12 38 -28 -15 76 -14
5311 -14 -19 57 24 33 5 -31 -36 19 -87 59 14 -18 39 25 -42 26 -10 -6 -10 28 -88 11 48 26 24 15 -25 -32 33 77 -8 -6 72
5344 72 8 9 -22 15 38 21 17 -52 -65 41 0 -17 28 -18 9 -14 19 -19 6 14 -20 12 15 7 12 33 53 -5 -38 15 33 27 73
5377 73 -19 23 59 -25 34 -5 13 -25 21 -27 2 3 -38 23 -65 -14 9 -24 19 11 -5 27 11 5 26 25 1 41 -22 -17 11 -10 -31
5410 -31 -32 -14 29 8 15 8 5 38 34 -9 -12 -14 12 3 0 21 -17 50 7 -11 -24 -53 0 -61 4 1 45 -41 -8 29 -17 -59 -53 50 -31
$$ packed form
5183A5l1J0L4Jk1m7N3L2j5k2l5O4Lqm1m3O6M0p8J06p0n9L5m6P0N8n6l9M5o0O1
5214B2K2k5Ko8J9L4J7k%op5P2MK4m8K3n2k0J1N1m9L8RLj2K9M4p8No2J06n8j5K7
5248hRqJ3k7q7R7K8p7J11j02J10r8L7L0k2n9M6N9p4M6k5mJ6K2k8Qo1M8n1P9k1
5279GMj2M3j18P2M5q3R5j1j1j0o5N4J2n2J6P%m9O4k4K4l8j3J9J2%N0o6J3R1r0
5311a4nP6l3Rk8l6nN5j06J46m5l2N7j4o7O8l6MmL8j16R9L7k2krm0pO5M4q5KP8
5344G2o4Jl1L7K3j7mo9j3J06m1j7M5m6K7k3L3l8K5Ql4L2LqNK1K0n8l3N3J8oM6
5377G3r2M2L6q4N9l9J8l8M6m8K9Jm1O1q8N1K3l3M3qj6L2j6oK1jk4M0o3NK8k1k1
5410c1jJ8M3k1PplL3mm3lkK6rlK1l8O7m3j8j3k9N3o1O5lM4q6L3L7m6m2OJ03q1
$$ plain form
5445 -31 -6 31 12 38 25 -74 -11 -44 -39 -37 9 -43 -11 -14 16 41 51 29 17 -32 -35 9 7 -13 13 7 -14 12 -10 12 33 32 55 30
5479 30 -15 -57 3 16 -10 -24 30 -78 12 28 7 49 -11 -78 -16 18 -20 4 -15 -31 31 -19 17 44 39 30 14 -23 33 -11 14
5510 14 40 -15 -30 11 15 -8 -31 -1 -7 0 -80 22 4 -37 -20 -44 29 -21 26 3 70 36 4 -20 -11 -13 -12 -21 56 8 39 2 -33
5543 -33 -40 46 -36 -38 -11 2 -9 10 -33 -12 0 -27 -49 -24 57 4 10 22 -17 -31 -8 -14 -75 -42 -16 8 53 2 -42 19 -20 -10
5575 -10 -43 -41 -19 -25 -20 -16 25 -29 38 -12 -53 -61 9 0 -36 29 15 16 -58 52 -4 -27 54 24 11 -49 -49 -17 -1 -25 -49 22 -30 20
5609 20 -38 16 4 -23 -32 -12 21 2 1 -45 1 27 -32 33 -19 -41 -13 -17 -8 34 26 50 -23 4 -5 0 -36 -18 53 -9 37 -28 22 -17
5643 -17 46 -2 -19 16 15 14 -49 30 -52 -29 57 -22 -15 26 -26 -33 10 26 -33 -54 -53 -14 23 -42 -3 -32 9 -22 -17 -28 -29 -40 -10 -38
5677 -38 -2 10 19 -32 6 -25 -13 -9 -49 7 37 -37 23 -27 -30 8 -13 11 -16 -12 -45 42 -62 40 30 -75 15 -67 -38 -29 89
$$ packed form
5445c1K5L7j9K6j3r9O3l3NKM6n2L2lL0K5J0k2j2m9lM4kk0K6ok1K6k2K2K1jK3k5
5479C0m5m2O0J3k6j4N4j08R0J6k1M2o0o7O2L4l8K4j9j6O2n0L6K7nrj6l7N6m4K5
5510A4K6n5j5M1Mk3k3L0oPq0J02j8m1J7k4P3n0M7k3O7l4l2k4RkJrP7m8L1l7l5
5543c3pQ6q2kK7J3j1J9m3K1J2k7k2K5Q1n3OJ2l9j4K3oo1L3K6K4M5n1m4O1l9J0
5575a0l3KK2oNMM1n4O7n0m1qP0rl6O5j4Jp4J10n6k3Q1l0j3o0%L2J6k4k4P1n2N0
5609B0n8N4j2k7rK0L3j9jm6M6K6n9O5n2k2K8mRM2qK4p3K7rNl6J8P1o2M6o5N0l9
5643a7O3m8j7L5jjo3P9q2K3Q6p9PM1n2pM3J6n9k1JL9L7o5L9k9M1l1Nj1jj1L0k8
5677c8L6J2Rn1L8l1J2Mm0N6L0p4O0n0lL8k1K4k7Ml3Q7j04J02j0j05R0q2K9RJ18
$$ plain form
5708 89 59 9 -24 43 15 -56 6 20 -47 31 -38 0 -14 -41 -18 -22 -49 -20 27 -16 8 -21 -18 -21 -42 -51 -10 -48 44 -15 -12 24 -31
5741 -31 10 29 -4 -58 41 -17 18 26 -23 17 69 8 -16 -5 44 -12 28 26 10 0 -54 -24 4 -42 39 -18 -10 3 -21 -36 -15 -1
5773 -1 40 -28 -44 -5 9 -7 40 -25 -18 -8 33 66 -16 -24 -24 35 -11 -13 22 -16 14 -46 -56 46 68 23 -70 5 -8 48 54 33 14
5806 14 -3 -46 18 -65 53 -25 36 -13 21 -2 -2 -19 12 23 16 -4 -34 -14 28 -29 32 -5 19 30 68 -18 -46 22 -63 2 -25
5837 -25 -27 14 -15 32 31 -36 1 -69 -35 -81 -67 10 -23 -61 35 12 -13 -8 0 -26 5 8 10 -41 21 -12 -17 43 -15 47 -29 -6 37 -30
5871 -30 -45 55 30 4 -18 35 10 46 4 72 50 9 -34 -4 22 30 21 10 16 77 48 -20 -43 -38 -24 45 -39 -39 -5 -63 -64 -6 -4
5904 -4 -18 26 1 -15 12 -20 -51 -17 0 13 -5 -52 59 -17 19 35 -58 24 23 -9 12 15 -27 3 8 -5 10 7 1 15 8 10 -32 11
5938 11 -23 3 -54 -1 -16 -15 -57 -20 13 -76 -28 -32 71 -6 -39 0 -18 -22 21 29 0 -35 -46 30 43 -34 -24 17 -33 -12 -33 -4
$$ packed form
5708H9l0n0l3O7k8p1O2J4o7P8o9L8j4k7K3mk7K9M7m3K4k9Llk1rM1l8R2n9LL6n5
5741c1M1J9l3n4R9n8L5Qm9M0N2o1k4J1M9n6M0kj6j0n4L0K8m6Q1n7QJ3k4j5K1J4
5773aM1o8j6L9J4j6M7o5PJ0M1L3q2q%N9m6kL5l8L0o0j0J02K2m5r3P5j3N6Ok1j9
5806A4j7m3O4q3J18p8O1m9L4k3%j7L1J1pk0l0K0M2n7O1l7K4J1L8q6k8O8q5O5k7
5837b5kM1k9M7jo7L7p0L4m6J4P7l3l8R6k3k5NQk6L1LKn1O2l3nO0n8O2p6K3M3o7
5871c0j5J00k5k6k2N3k5L6m2O8k2m1m3L0K6Qrj1OO1k9o8k3NJ4O9q4%L4n8jN8K
5904dj4M4k5j6K7l2l1L4J7J3j8m7J11p6L6J6r3Q2jl2K1Lm2L0Nj3J5loJ4pKm2M3
5938A1l4K6n7N3j5Jm2L7L3q9M8mJ03p7l3L9j8mM3Qk9l5j1P6J3p7J0M1n0K1k1K9
$$ plain form
5970 -4 -44 -72 -21 -17 23 -16 -26 12 7 -32 2 -1 22 24 56 20 -24 11 10 27 -14 6 12 13 53 -12 37 73 -3 50 -19 0 -3 -40 25
6005 25 47 4 6 -3 22 -64 -28 -1 -52 -19 -22 29 0 -52 -9 -40 12 -1 19 -31 6 -30 -24 36 -4 -26 -42 41 -5 3 48 50 -58
6038 -58 -7 -42 3 -43 53 43 -27 -23 83 9 15 -7 40 35 -16 -17 -60 -61 -57 10 -84 30 -21 -8 -26 19 -14 4 11 59 31 -18 29
6071 29 23 -35 76 -53 19 11 1 -4 -18 16 68 -2 -31 -22 -30 30 0 56 -49 21 -64 -7 34 -24 38 -16 -4 -15 -20 5 0 27
6103 27 -12 -13 -4 12 -37 -32 -47 4 -27 66 -7 14 13 13 -32 -2 35 -21 20 -49 -9 -4 6 -31 -40 25 51 32 -14 7 53 20 0 13
6137 13 -25 13 -24 -12 -2 -40 17 -64 -34 28 12 -18 -16 -10 22 -60 -40 12 -29 -13 -63 30 0 32 -18 12 -14 -53 0 -3 22 13
6169 13 -27 -10 -12 -28 12 42 10 24 -2 22 20 -2 -18 -19 -20 -111 -5 29 2 -4 -30 -4 -33 -12 -42 -42 -41 -10 -48 -39 -5 38 15 27
6203 27 20 42 -3 -37 18 -7 7 -12 -9 -29 -2 -23 23 -47 -14 53 34 -1 -14 -6 -1 -87 -3 -15 -14 35 1 41 11 -13 -60 -25 -33
$$ packed form
5970dm0k8N1MM0l9j0L8nl9L4lK3KL2l6m4L5jJ7m1K0OJM0o5M9L6p6N3o9J9ll7O5
6005B5K2m3KrK5q6L6K7n1L3lN1k9n2M3l1N2j3K0n0L7l6OO0m0k2j6Q3m6QM5Kj08
6038e8N1l5M5m6R6j0p0MJ06p4Ok2M7nn1jm3jMO7r4J14n1J3j8M5l3J8PM8k8m9M7
6071B9on8J11j29P2qj0nj4L4N2p0k9RqO0l0N6j05P0q5N7M1n8O2n4J2j1nK5nK7
6103B7l9jRJ6m9Nj5N1l1R3p3K1j%m5L0L7n6M1o9M0NJ0l7rO5K6j9m6K1M6l3k0J3
6137A3l8L8l7J2J0l8N7q1L0O2j6l0KOL2q2K0N2m1J6n0R3l0L2n0L0k6l9N3lK5r
6169A3m0J7kj6M0L0l2J4k6K4kk2j6jjr1J06L4k7ok6K6k9K1l0%JL1l8RL4M3k3J2
6203B7pK2m5l4N5k5J4j9Lk0K7k1M6p0L3O7j9l5j3QNq6Q4j2JM9l4M0l0k4m7L5q
$$ plain form
6236 -33 -57 -40 -23 -60 12 -18 -31 -28 -69 -10 48 -22 -6 7 32 -3 -13 -5 -15 18 41 0 -8 0 -49 23 -17 24 -7 -36 25 -32
6268 -32 9 -31 35 20 -32 -4 37 0 55 -44 -75 -20 33 -27 -3 15 -7 -15 -59 43 27 54 31 -30 31 28 56 24 42 22 -41
6299 -41 6 -53 -27 -25 -15 17 -56 -32 -17 -3 -2 14 11 37 -54 6 -9 -27 37 15 23 4 -42 -24 26 0 12 -21 -21 38 -42 10 15
6332 15 -11 14 -25 -57 26 4 40 -1 -11 -6 1 3 -74 -5 5 -10 24 20 -26 43 33 -4 23 -15 -6 -41 5 32 -26 -12 -5 40 -18
6365 -18 -33 -22 -48 -46 -19 -23 28 -5 0 -14 -5 -20 40 49 20 21 31 -15 -1 -9 -22 -35 7 -76 10 -5 -40 -41 3 74 -6 -11 -28 8 8
6400 8 -20 12 -36 -50 36 -71 -33 -18 -12 -21 18 28 -23 54 -28 -30 2 -7 41 31 10 19 -4 37 52 9 22 16 -10 34 68 6 10 -21
6434 -21 27 17 27 -4 19 -15 -62 -3 5 -36 36 -5 -6 12 -74 -35 -48 -3 23 0 -12 -16 -26 -20 -37 -2 5 -11 -52 24 11 3 -32
6467 -32 15 38 -25 29 -61 -2 32 14 -34 -10 -51 -35 -35 -32 -2 31 -39 -14 17 -50 -22 -10 2 22 17 -33 -13 0 -45 25 -4 -6
$$ packed form
6236c3k4J7J7l7P2l0j3Lm1N9N8p0J6J3K5l5j0Qj0L3K3m1qQm9P2m0M1l1k9O1n7
6268c2M1m0O6j5n2K8M1l7N5r9l1N5N3o0K4J8k2qm4J02j6K7k3o1O1lK8l2J8k0o3
6299d1M7n9K6KJ0L2p3K4J5J4JJ6lK6r1O0j5j8O4k2Qj9m6J8N0k6J2l3%N9q0N2N
6332A5k6K5l9l2Q3k2L6m1j0NPKp7O9J0j5L4mm6O9j0l7K7l8Rl5M6K7n8J4PM5n8
6365a8j5J1k6KK7mN1l3Nj4Rj5O0Rk9JJ0m6J4qj3j3M2q3Q6j5l5jM4P1q0nj7L6%
6400Hk8L2m8j4Q6j07L8J5OrL9J0n1P7q2kL2rM8j0k1Rk3M1J5m3J3ok6M4L4o2Ml1
6434b1M8j0J0l1K3l4m7N9Qm1P2m1jJ8q6L9j3M5K6k3j2mj0Oj7L5Pj6m1P6j3ql5
6467c2M7K3o3N4r0N9L4j8m8K4m1J6%LL0L3p0K5L1o7K8J2J2K0nn0K0J3m5P0k9k
$$ plain form
6499 -6 2 -11 16 1 22 49 -13 -26 17 -5 -34 39 -4 12 30 14 -39 24 10 0 -15 -23 -3 -38 -48 14 26 -47 -55 -11 -67 6
6531 6 8 30 -75 -67 -4 0 0 -21 41 -2 -39 -12 13 4 -22 -29 1 -13 54 -63 44 6 1 26 14 -21 78 -6 6 -38 -11 20 7
6564 7 18 11 -27 2 33 46 -18 -19 32 -50 -1 4 4 -39 -64 7 29 -11 3 13 0 13 -25 -15 1 -24 -17 -27 -54 30 18 -29 -31 26
6598 26 -22 -39 -13 -35 -16 -22 7 1 -32 -3 -65 -19 18 -21 -25 -25 27 -32 -74 -34 27 8 -36 36 30 -20 32 31 35 55 -17 23 4 -39
6632 -39 -8 -17 47 -3 16 -21 -37 -40 6 13 -12 -20 -5 27 54 -46 9 19 22 41 -50 8 -13 -19 21 -30 12 24 16 -36 26 -28 -61
6665 -61 13 -14 -8 1 12 -77 -27 -31 -2 24 39 0 101 -49 -21 -10 8 -28 -32 15 -5 -11 -27 -8 9 -7 -7 -21 -38 -11 1 -46
6697 -46 -13 -8 1 29 0 34 -29 -21 -11 46 -56 6 -16 -33 -13 57 -15 10 12 -26 38 -24 15 -5 6 18 -44 -6 -3 10 0 18
6729 18 -29 0 -27 -50 -43 45 -19 -22 28 -14 10 37 4 15 3 -17 5 -39 1 -54 32 36 -47 -40 22 -11 11 -23 52 -24 32 0
$$ packed form
6499fQj3K7j5K1K7o2j3M3k2k9P3m3J6J8j6n3O3j4j0j5qK0l5j0O2J2p3qM4n6P3
6531FKK2j05QO3M%k1O2m3l7K7K5rk6pL0j4O7j17J07l8nK5j2l5R9q4J2m4K7L1j3
6564GJ1pl8K9L1J3o4jN1q2M9N%m3k5P1K2m0J4J0j3J3l8J0J6k5Pj0k7Q4j2m7kN7
6598B6m8j7K6k2J9oK9ol3K9o2M6L7l9m%N2n9m2M0O1j9m4P2on0N2jMK0p2M0j9m3
6632c9L1rO4n0J9l7j6lM6Pk5qJ5L2K7j00N5J0LJ9r1N8k1oM0n1M2J2qn2O2n4l3
6665f1P4k7ORJ1q9N0mK9K6J5l9J01j50K8J1J8l6mM7k0oj6J9J7j6%j4j7K7J2m7
6697d6L3NRK8k9L4o3QJ0N7j02O2k2j7K0P0p2K5Kl8O4o2L9k0J1J2o2L8LJ3j0J8
6729A8m7K9k7k3PQ8o4lN0m2K4K7l3J1j2k0K2m4M0n5Q6Mq3PO2l3K2l4P5p6N6l2
$$ plain form
6761 0 26 -33 3 32 -4 0 -50 -19 -36 20 -22 23 -56 39 -16 31 24 43 -8 8 -29 -25 19 -26 -7 -21 43 18 29 -25 33 17
6793 17 44 6 30 -41 46 24 -54 11 29 -10 -16 -16 -2 0 -52 69 46 -21 -10 42 -14 -5 -18 25 -3 -4 -10 -26 -59 -13 -14 -4 -62
6826 -62 6 24 20 -27 -6 -51 -6 -44 27 -9 3 22 -25 -13 -5 12 28 24 17 -55 11 -22 -2 25 -12 40 -62 -11 5 29 13 -31
6858 -31 -10 -41 -33 -71 -9 -80 -38 18 10 11 -20 39 -23 13 -74 -4 -16 -17 7 -6 33 16 -34 5 -36 5 26 67 -71 -11 28 62
6890 62 -13 -10 3 -11 3 -41 -32 -71 44 -4 21 23 33 41 4 -33 -10 38 47 18 -42 -70 19 12 42 -44 -25 38 27 -24 31 54 0
6923 0 33 47 13 2 -5 36 27 46 -8 38 17 19 -18 -64 43 37 28 -11 -19 36 -24 -21 -21 3 22 -10 6 -30 -40 -14 -38 15 -2 12
6957 12 -36 13 39 -9 1 -8 7 -22 26 47 38 -14 13 9 33 0 -19 -6 -29 15 10 3 25 16 101 -14 -12 -14 -30 -4 -14 -19 -21 43 -2
6992 -2 3 2 -10 28 19 -16 10 21 -36 29 14 31 9 -79 8 20 7 17 12 -7 -2 -4 -44 -1 -14 -28 31 3 -16 29 -11 4 -37 -49
$$ packed form
6761@K6n9L6K9l6Mn0L1j7N6m2M5p9R5n5M7pJ9n1J6l7MM4m5J9j4O4k5J1n4N8j6
6793A7K7l8K4p1Q7k2p8O5J8l9o%J4Kn2J21k3o7J1N2n6Rj3M3k8joj6l3M6jJ0n8
6826f2O8J8mm7K1m5M5l8P1l6J2J9m7J2QJ7J6mpp2O6l3K0K7l7N2j02N1J6K4j6m4
6858c1K1l1Ql8O2p1M2N6qJl1N9o2L6q7P0j2jK4j3L9j7n0L9m1M1K1M1j38O0L9L4
6890F2p5LJ3j4J4m4Rl9J15m8K5KJ0Ql7l7K3M8Rk9o0k8Q9pL0q6J9O3j1n1N5K3n4
6923@L3J4l4j1pM1rJ9n4M6k1Kl7m6J07orl9qN5o0L%K4J9l2J6l6j0K6k4N3j7J4
6957A2m8M9K6m8J0rJ5k9M8K1rn2K7mK4l3j9J3k3M4npK2rQ5j15Kkj6K6j0nkO4m5
6992bNjj2L8rl5K6J1n7O5j5J7k2q8Q7J2j3J0nj9Nkm0M3j3j4N9k8j9M5m0J5m1j2
$$ plain form
7026 -49 -87 43 -36 8 -18 -16 -24 19 -27 2 -35 45 -36 -65 2 2 46 0 17 -56 28 7 13 7 -8 14 12 32 -39 22 -30 -35 33
7059 33 20 18 -29 -15 32 -17 51 -17 -10 5 7 34 6 47 -69 -18 22 32 -13 64 6 -18 -3 26 60 -54 58 34 31 41 24
7090 24 14 12 23 23 -7 3 -48 -5 13 12 -27 4 -23 32 -9 -23 -6 1 25 -12 -31 20 -26 21 -31 -13 15 52 -45 -6 24 -17
7122 -17 6 5 -84 35 -24 36 28 -30 39 0 -10 -17 15 -33 28 -55 -9 12 -12 -85 -67 -51 17 5 -16 16 6 -35 -47 0 24
7153 24 -37 -13 -16 7 14 -17 2 5 -15 -30 -31 15 9 80 -11 -26 12 -6 51 46 -7 -4 -54 -56 -8 65 51 -30 -4 16 -28 6 -35 -57
7187 -57 -4 -17 -21 -30 -33 11 -20 28 -11 -38 23 -95 -42 -14 -10 46 -3 9 -32 -52 5 20 0 37 47 39 31 -21 -33 36 -2 -43 21
7220 21 39 -16 -10 2 -8 -21 0 -87 -21 17 -53 9 -27 -44 12 3 -38 -12 -14 15 7 -23 -29 -1 -63 29 -46 15 9 -42 -32 -26 51 7
7254 7 15 -81 15 -35 -26 -76 -19 -41 -7 -25 8 -1 -18 -39 -70 19 -17 26 -22 -38 -13 14 28 9 6 -11 -72 20 -3 -39 -32 3 -15
$$ packed form
7026d9l8J30p9M4k6KqM3m6K9l7Q0q1k9O7%M4m6J7p3Q4k1Ooj5K2kK0p1O1n2nO8
7059C3j3km7J4M7m9O8o8PJ5KK7k8M1j16N1M0J0m5P7n8k4J5K9L4j14J12k4lJ0j7
7090B4j0kJ1%l0J0n1M3J8jl9L1k7N5m1j4J7PK4l7j9N1m6M7n2J8K8L7r7L9L0m1
7122a7K3jq9J19n9O0qn8O9l9j0pL2m8O1q3M6K1k4p3J8J6O8j2k1L2j0m1j2M7K4
7153B4o1K4lK3Pl1J9Lk0j5jM6oP1r1j5L8j8N7nn3Ln0kM8P3j4q1K6K0m4L4m1k2
7187e7N3j3mrlM4l1M8l9k7O1j18N3K8MN6m9J2m1k0N7J5k0L7J0qqn2j2O9l8m1O4
7220B1J8n5OJ2j0j3K1q7O6L8p0O2l6j7N6rm1K6kK9ql0oK8o2R2p5O1on1J0OP7m4
7254GQr6R6n0Rn0N7k2L4j8L3rj7k1l1Q9l6M3m8j6K5K7J4j9lj7o1R2k3l6PL5j8
$$ plain form
7287 -15 -14 -19 5 -33 16 13 28 6 -2 11 12 30 3 -2 -30 -15 -28 13 61 -7 13 -41 -9 33 -8 -59 -11 9 8 0 9 -2 -53 -35 -50
7322 -50 -32 -12 -7 -23 3 27 18 1 27 2 -16 20 -30 18 -47 -16 -21 25 1 -22 -10 2 49 -31 -9 -24 25 60 -9 -19 -5 3
7354 3 -3 45 42 -66 29 33 -23 -102 -12 2 -3 -21 3 -6 -26 -23 -21 -37 4 -26 5 53 -4 33 -31 44 -46 4 -10 -35 -4 5 0 12 48
7389 48 -22 9 29 4 15 -22 12 -25 34 -11 39 22 -30 33 10 11 -23 -8 -31 23 67 19 39 -8 -22 12 -3 -2 22 -54 21
7420 21 -29 6 18 -8 -20 -5 -6 -53 41 -8 55 15 -11 39 -13 38 48 16 -22 -27 24 -19 48 -30 17 6 21 14 -25 -9 7 -22
7452 -22 -11 21 16 -6 -7 -3 33 -3 -9 11 32 -63 -5 -27 -22 -41 -18 -6 53 3 13 -41 2 38 -4 -12 -77 22 4 22 -43 48 -15
7485 -15 -29 -52 9 28 17 -47 -7 8 -50 -4 60 5 -6 -51 -36 -14 -13 33 -45 -16 33 8 -75 -23 19 23 31 -15 -31 6 8 -30
7517 -30 24 23 25 2 -58 -47 26 -50 -18 -15 20 65 20 14 52 21 1 -17 7 -6 1 -21 14 -18 -1 2 -55 -34 38 21 23 74 3 -69
$$ packed form
7287a5JnK4l8M9lJ5k2qJ3JJ8k7nk8J5j3M1M8o8K0n4L2M2m1n1M8K0jqRj1n1J8j5
7322e0J8K0Nj6K6K4rj7K6k5j8L6n0M8o5L1nM6k4k3J2J2M7q0K2j5M9L5o9j0J4Q
7354CoM8lj08R5Mn6p9R0J4nj8K4rk0LKj6M1l0L1M8n7L7o4P5r0N0j4k5L1RnJ2L6
7389D8p0L1K0k5J1l7L4l7N9m5N0j7n2O3k3Jl4J5k3N4M4m8K0m7j4L4j5JK4p6P5
7420B1n0L5J2k6j2J5jm7R4m9O3m0k6N0n2N1J0l2l8nN1m3O7p8M7j1J5pl9J6J6k9
7452b2J1L2nk2jML6l6oK0K1r5N8k2Nj9K3J2N9n0J0n4M3L6m2qo5R9j8J8o5R1o3
7485a5j4k3O1J9j1o4M0J5n8M6O4n5j1m5J5K2JM6p8K9M9k5q3N2M2MQm6j6L7Kl8
7517c0N4jKk3o0J1P3p6L2LL5M5m5oL8l1k0j8K4j3Pk2L5l2J7Ln7K1P2j7KN1p1p2
$$ plain form
7551 -69 -26 -19 12 30 -2 27 7 -51 3 -6 26 -28 10 39 4 5 -11 -40 -43 -55 10 -14 7 -46 28 55 -94 -12 -22 -54 3 11
7583 11 2 -36 -13 16 72 15 8 16 -26 -10 -18 4 39 38 -44 9 38 1 15 -55 -21 5 -2 4 45 -38 67 -46 11 24 -74 3 -8
7616 -8 13 -11 -36 29 -6 30 17 -47 52 10 39 3 -3 -13 -32 -13 -10 2 22 -22 36 -8 15 -51 62 -29 14 -4 5 -55 19 -15
7648 -15 -81 -13 18 25 15 -2 -4 -4 -7 -32 -43 23 -23 -14 7 48 34 30 22 -53 16 -10 12 23 -2 -41 9 14 -29 16 3 13 3 -21
7682 -21 -26 -36 38 -11 5 -10 56 8 6 9 -12 61 39 -33 -1 4 -22 41 -14 -22 -47 -7 2 -51 87 -39 26 60 -44 -4 55 41
7714 41 22 13 59 -7 -41 -11 -55 15 -22 14 30 18 7 24 13 -17 -40 -45 35 8 1 4 7 -32 63 3 14 3 -10 16 -67 -20 -49
7747 -49 -9 -10 19 -3 -1 6 -31 -37 25 -9 -21 6 -28 58 6 -3 -31 23 46 73 58 -39 18 67 9 -9 28 40 34 17 21 -5 31 4
7781 4 -18 -4 -53 -48 -34 -1 -13 21 -13 -15 -10 -18 -22 -11 5 -32 0 20 -13 47 4 49 10 12 25 -22 -16 19 15 -21 31 15 -27 37 22
$$ packed form
7551f9M3PL1J8l2K9k0n8N4rL2n4L8K9l5Jj6k9lj2O5k4K1n3P4K7j49Q2j0l2N7Q
7583A1rl8K3K9N6n7pQm2J6qK2L5jq2N3K9l7J4p0L4K6pOM1q3J05j13N7J3r8P7j1
7616hK1k4k5O5l5L6j3o4R9m2K9l6oj0j9J9LJ2K0m4N8m4K3o6J13r1M3j8Ro0P4l4
7648a5o6O8L1Pj0j7k%lk5j1O6m6RK1M1j4mqp5O9k6K2J1k5l9N0Nm3M5j3J0j0k4
7682b1nj0P4m9J6j5O6m8kLk1P3k2p2L2Nk6O3n5qk5M0Rn3J38j26O5L4j04M0N9j4
7714D1j9rM6o6l4L0m4P0l7L6J6j2j1J7j1l0k3nQ0k7pLLl9R5o0J1j1j3K6q3M7k9
7747d9M0jK9k2KPl7oO2l4j2K7l4Q6n2rk8N4K3K7j5r7N7M9n8j8L7J2oj7Mk6L6k7
7781Dk2J4m9NJ4L3j2L4l4kNqmJ1J6l7L2K0l3O0m3M5l9KJ3m7OL5ml6N2j6m2O4j5
$$ plain form
7816 22 44 -51 -4 2 33 -17 30 -31 -52 -4 27 6 22 37 35 51 1 12 2 7 -34 10 8 7 36 -8 44 0 9 21 57 30 19
7849 19 -40 -51 -20 42 -19 22 7 -18 13 -25 -12 -1 -62 -40 -13 -10 -26 13 -21 7 -14 24 -30 -38 -11 24 -20 1 -59 43 -28
7880 -28 -6 -21 -6 0 44 -74 -6 38 -28 18 -6 -31 59 -4 37 26 -54 -18 -9 1 14 -28 -51 -29 8 27 -1 27 27 -17 -9 -24
7912 -24 -17 30 16 -14 -13 41 -1 3 -33 -41 -9 30 32 -18 -3 -18 -15 -20 -37 -8 52 63 -1 -2 22 31 3 -13 -33 -75 -15 -44 -25 -2 14
7947 14 -18 -12 26 -14 13 -64 -4 -10 -15 54 -30 12 3 24 0 -16 -24 74 -5 -27 34 50 -31 4 -44 -12 -8 -19 17 31 -33 -28 11 15
7981 15 15 -61 -29 -40 38 -35 61 -29 -55 -10 0 6 -56 -23 -20 -21 6 15 40 77 39 39 -32 -32 3 6 14 -23 -7 16 -4 35 50 -4 -49
8016 -49 -23 -32 7 -10 16 -12 30 -4 29 6 24 -14 -22 -43 17 17 -25 -32 18 -14 -23 -25 -11 37 -38 -73 -4 4 8 -64 2 17 73 26
8050 26 22 22 15 44 -15 23 -3 -6 7 -20 18 13 45 32 -37 -23 0 -37 -5 -15 -26 30 26 -14 30 9 2 -23 34 -17 9 9 16 -50 -28
$$ packed form
7816B2K2r5M7OL1n0M7o1k1M8L1k1J6J5kJ6n0J1j0Nm1M4kjK9m4N2m4RJ2L6k7j1
7849A9n9j1L1O2o1M1j5k5L1l8J3J1o1K2K7Lj6L9l4K8k1L8n4qK7L5m4K1o0J02p1
7880b8K2j5J5OM4j18O8M4o6M6k4k5R0o3M1j1q0L6RJ0J3m2k3K2L7J9k8K8%m4Qj5
7912b4PM7j4l0JN4m2Ml6qL2L9Kn0J5j5Lnj7K9O0J1o4jK4Rk8j6k0m2O0k9J9K3J6
7947A4l2OL8m0K7p7O0onO9q4M2rK1k4j6qR8p9k2O1J6q1L5m8L2Mj1L6J4o4NL9M
7981A5%p6L2j1P8p3R6r0k6M5J0Oo2L3LjK7RK5L7l8%p1%L5LQl7J6K3k0L9J5n4m5
8016d9K6rL9j7K6k8M2l4L3k3J8l8qk1O0%m2pN0l2rkJ4M8p5l5O9QMp2O6J5N6m7
8050B6m%pK9n9L8k6lJ3k7L8nL2j3o9J4K3l7L2j0j1N6mm0M4k1pk5N7n1K6%Po6K2
$$ plain form
8085 -28 -22 -13 -41 -42 29 -46 50 -31 -29 -39 65 -1 -18 -3 -7 45 22 -5 -16 -17 36 38 -12 45 8 21 -41 -10 -8 -66 -58 63 -37
8118 -37 -16 -22 3 -56 24 -14 -38 -49 16 45 65 3 8 12 -34 -40 -2 26 -16 38 -26 5 7 -2 15 7 -12 23 17 -1 -17 35 -25 -18 26
8153 26 -47 -76 -30 -62 -32 14 -13 6 -23 13 -28 35 33 -7 -8 13 -27 -11 45 10 -38 21 9 64 -6 -17 7 -20 9 19 -63
8184 -63 -8 13 -67 13 -13 -7 50
$$ packed form
8085b8ORk8jP1p5R6q1Kj0J04o6j7J5mN2k3k7j1jN3Kn0N7l7J3o2L1Kn8QJ21j00
8118c7K1oK5n9Q0l8k4j1O5K9K0o2NMm6oL8K8m2N4o4L1KrJ7qj9L5oj8j6N2o0PM4
8153B6p3k9M6l2L0M6k7J9k9L6m1O3km0jK1m0J6N6l5m8N9j2N5p0j1K4k7K9J0q2
8184f3N5K1q0Q0k6ON7
8191E0
$$ Imaginary data points
##PAGE= N=2
##DATA TABLE= (X++(I..I)), XYDATA
$$ plain form
0 0 0 0 0 0 0 0 0 0 0 0 0 0 0 0 0 0 0 0 -4 8 -8 8 -8 8 -8 16 -16 16 -24 24 -24 32 -33 40 -47 49 -56 64 -72 80
40 80 -88 97 -108 121 -133 147 -163 179 -196 217 -239 263 -290 321 -355 393 -436 485 -543 611
60 611 -693 793 -919 1086 -1313 1643 -2168 3151 -5606 26701 29079 -8799 12832 10787 -1520
75 -1520 -359 4119 -8651 -4979 12325 8824 -14076 -435 13027 -13465 -22571 1284 -1574 -12920
89 -12920 -7322 -7950 -14475 -3598 8187 -4827 -21644 -4274 10926 -3643 -3180 11171 673
102 673 -5976 4251 1221 -7221 -496 5758 -2224 -2783 18180 21089 -1236 -1348 9120 -727 -2622
117 -2622 3723 -6550 -11092 1553 5466 -3971 -4132 6814 1030 -13077 -3328 5592 -4581 -4066
131 -4066 -329 -7021 -249 12218 5232 -6968 -3299 8553 7461 276 4792 5398 -1263 3905 4363
$$ packed form
0@%%%%%%%%%%%%%%%%%%mJ2j6J6j6J6j6K4l2L2m0M8m8N6o5P3q7R6j05J20j36J52
40H0j68J85k05K29k54K80l10L42l75M13m56N02n53O11o76P48q29R21j028J154
60F11j304J486j712K005k399K956l811N319q757L2307K378l7878K1631k045j2307
75a520J161M478j2770L672J7304l501k2900J3641J3462k6492r106K3855k858j1346
89a2920N598o28o525J0877J1785j3014j6817J7370J5200j4569M63J4351j0498
102F73o649J0227l030q442O725O254p982n59K0963K909k2325j12J0468r847j895
117b622O345j0273m542J2645L913r437j61J0946n784j4107R749Q920j0173N15
131d066L737o692O772J2467o986j2200L669J1852j092p185M516O06o661N168M58
$$ plain form
146 4363 -5782 -2128 3611 -3790 -6802 1320 8248 3857 -3831 -1813 -472 -1886 2854 -1792 -11682
161 -11682 -4477 3553 -567 -2366 -497 -323 -2212 -2819 493 -1100 -3863 508 -1561 -4033 5241
176 5241 6719 -1044 -1126 987 2107 3995 3090 1823 -284 -281 4069 1094 -2656 1009 -2470 -5757 505
193 505 1308 -1150 -372 -2596 -1897 1389 1810 1366 -2360 -2667 3277 2258 607 4360 1254 -808 2637
210 2637 589 -180 1770 -232 -1186 -917 992 4630 625 -2885 -140 -1466 -677 2707 -2017 -4279
226 -4279 -271 238 311 -269 -1564 -875 -2931 -2722 176 -2929 -3214 -230 -3420 -2977 1893 840 -227
243 -227 242 440 2682 3024 3374 3603 -328 495 4224 1191 455 2032 -590 176 2740 1836 1400 -303
261 -303 -915 248 -1926 -1583 -60 -3244 -2701 34 -1288 4 1390 -525 -656 -1030 -745 452 -1921
$$ packed form
146D363j0145L654N739p401l012Q122O928m391p688K018J341j414M740m646r890
161a1682P205Q030m120j799J869J74j889o07L312j593k763M371k069k472R274
176E241J478p763q2K113J120J888r05j267k107LM350k975l750L665l479l287O262
193E05Q03k458P78k224O99L286M21m44l726l07N944j019j651L753l106k062L445
210B637k048p69J950k002r54K69J909L638m005l510K745j326P89L384m724k262
226d279M008N09P3n80j295O89k056K09K898l105k85K984l190M43M870j053j067
243b27M69J98K242L42L50K29l931Q23L729l033p36J577k622P66K564r04m36j703
261c03o12J163k174L43J523l184N43K735j322J292J386j915j31l74K85J197k373
$$ plain form
278 -1921 -2615 -1433 -2902 -857 1358 -988 -450 1110 955 2727 2316 1297 1974 623 1174 2354 85
295 85 718 1735 -234 1133 1845 508 1192 -130 -1540 -725 -2049 -1893 -1382 -3588 -2209 -389 -1271
312 -1271 493 656 -865 842 651 -137 616 -1146 -1219 208 -1180 -16 824 -809 985 1430 0
329 0 1606 1200 139 1208 -60 -43 1132 -222 687 1104 -593 1311 1499 -524 558 -304 -1796 -548
347 -548 -1702 -2285 -1482 -2319 -862 -165 -1450 727 1093 -353 1637 1123 -530 1313 904 111 920 343
365 343 1160 1483 202 1955 1137 -934 1314 578 -1567 220 -222 -1486 -261 -230 -2 -88 -537 1111
383 1111 -56 -1803 730 -345 -2663 -779 -1334 -2728 -756 -382 -1130 -1479 -541 1588 295 -1007
399 -1007 1354 266 -812 2112 1152 -785 1622 2409 981 709 1735 2439 121 -693 1148 -747
$$ packed form
278a921o94J182j469K045K215k346N38J560j55J772m11j019O77j351N51J180k269
295H5O33J017j969J367P12j337O84j322j410Q15j324J56N11k206J379J820q82
312a271J764J63j521J707j91p88P53j762p3J427j388J164Q40j633J794M45j430
329@J606m06j061J069j268J7J175j354R09M17j697J904J88k023J082q62j492J248
347e48j154n83Q03q37J457O97j285K177L66j446J990n14j653J843m09p93Q09n77
365C43Q17L23j281J753q18k071K248p36k145J787m42j264J225L1K28q6m49J648
383A111j167j747K533j075k318J884n55j394J972L74p48l49R38K129j293j302
399a007K361j088j078K924r60j937K407P87j428k72J026P04k318q14J841j895
$$ plain form
415 -747 -1415 1213 -1197 -3057 501 1396 -558 -523 586 802 -404 255 1427 -1355 -1224 1605 -914
432 -914 -1830 1868 1005 -1403 -171 1284 838 -564 -247 78 -2057 -530 1883 -1615 -1877 1987 425
449 425 -1203 971 1411 -220 -1319 -718 -642 -2097 -553 -69 -3962 -2236 2321 -77 -1785 639 663
466 663 265 1047 1117 127 -377 1847 1922 -1301 1399 4385 577 -320 2304 1489 1217 1548 -533 -1871
484 -1871 -644 1495 -14 -3240 -606 1686 -1226 -463 1203 -1172 -592 760 -1567 -2085 -179 360
500 360 -1962 -3298 107 1574 -1249 -243 531 -1590 900 2542 -1048 -1227 1348 1183 -406 -58
516 -58 2309 1574 -679 1309 1568 -567 1575 1276 -3185 -1769 1531 -401 -2539 -1691 -127 -827 -1140
533 -1140 888 -281 -1753 1464 892 -2523 486 2828 -495 -1556 788 1843 966 746 1222 -505
$$ packed form
415g47o68K628k410j860L558Q95j954L5J109K16j206O59J172k782J31K829k519
432i14r16L698q63k408J232J455m46j402L17L25k135J527K413l498k62L864j562
449D25j628K174M40j631j099O01P6j455J544M84l893J726M557k398j708K424K4
466F63l98P82P0r90n04K224P5l223K700K986l808q97K624q15k72L31k081j338
484a871J227K139j509l226K634K292k912P63J666k375N80J352k327n18J906N39
500C60k322j336L405J467k823J006P74k121K490J642l590j79K575j65j589L48
516e8K367p35k253J988K59k135K142k99m461J416L300j932k138Q48J564p00l13
533a140K028j169j472L217n72l415L009K342l323j061K344J055q77k20M76j727
$$ plain form
549 -505 -40 3510 1170 -2682 607 2352 -856 -520 1236 413 -340 413 530 -1261 -256 2196 -1495
566 -1495 -4122 343 921 -2512 -1827 -925 -2042 -1011 781 -435 -2533 -469 2188 -906 -1627 2506
582 2506 1422 -1422 1019 1866 192 1278 2106 -21 -1142 1533 2747 -1125 -1606 1779 -9 -1464
598 -1464 1302 475 -1795 118 1052 -718 -911 1183 831 -2154 -858 2238 -176 -1418 961 -398
614 -398 -1493 1170 834 -1567 -1015 926 612 -1331 168 1982 -654 -856 1887 287 -430 1643 146
631 146 -1713 -4 1410 62 -1801 -630 663 -1107 -721 895 -1396 -1527 927 -321 -1453 286
647 286 698 -457 -711 721 1556 74 339 1229 -509 93 1977 -10 -1173 300 297 -205 -112 221 234
666 234 -589 162 1073 -360 -123 966 -726 -864 645 116 -397 -355 -332 -3 -231 79 274 -950 -536
$$ packed form
549e05M65L550k340l852L289J745l208L36J756q23p53P53J17j791J005K452l691
566a495k627M465N78l433O85R02j117J031J792j216k098K064K657l094p21M133
582B506j084k844K441Q47j674J086Q28k127j121K675J214l872m81L385j788j455
598a464K766q27k270J913R34j770j93K094l52k985J296L096k414j242K379j359
614c98j095K663l36k401N52J941l14j943J499J814k636k02K743j600p17K073j497
631A46j859J709J414j348j863J171J293j770L86J616k291j31K454j248j132J739
647B86M12j155k54J432Q35j482K65Q90j738O02J884j987j163J473ln02R3L33J3
666B34q23P51R11j433K37J089j692j38J509n29n13M2K3L29k28L10J95j224M14
$$ plain form
685 -536 507 -619 -404 347 -431 -291 424 585 925 514 385 836 198 557 862 -470 -341 122 -547
704 -547 -206 -160 -675 -291 -411 -419 197 -330 -353 -264 -834 -233 273 -322 -2 -71 -242 739 534 108 427 29
726 29 72 422 -104 -37 75 -338 332 323 252 869 375 87 752 416 346 524 -231 -236 -170 -338 167 -487 -880 -95
750 -95 -540 -573 108 -651 -791 -236 -511 -199 -87 -341 222 12 -33 947 419 170 828 157 47 639 81
771 81 4 -6 -323 276 114 -193 458 -149 -270 721 37 -199 259 -259 -157 62 -307 84 -242 -516 238
792 238 -323 -560 163 -459 -768 -57 -333 -169 36 -257 205 199 167 914 332 60 855 357 200 642 6
813 6 -79 108 -143 139 -185 -400 175 -315 -479 289 -277 -443 129 -311 -282 191 -23 261 -42 -146 465 -15
835 -15 -119 482 -222 -328 435 -114 -188 138 -104 74 99 91 494 4 147 680 -138 -84 642 -65 -215 128
$$ packed form
685e36J043j126K15P51p78J40P15J61L40m11j29M51o38L59L05j332J29M63o69
704e47L41M6n15L84j20qO16n27k3Q9n70O01N06n95L20o9j71R81k05m26L19l98
726B9M3L50n26O7J12m13O70rp1O17m94k88O65l36p0J78p55nO6j68N05o54l93P85
750i5m45l3O81p59j40N55k75L12J12k54N63k10m5R80n28k49O58o71j10N92n58
771H1p7j0l17N99j62l07O51o07j21R91o84k36M58n18J02K19l69L91l26k74P54
792B38n61k37P23o22l09P11k76J64K05k93M62ol2P47n82k72P95m98j57M42o36
813Fq5J87k51K82l24k15N75m90j64P68n66j66N72m40K9M73k14K84l03j04O11m80
835a5j04O01p04j06P63n49p4L26k42J78K5qM03m90J43N33q18N4P26p07j50L43
$$ plain form
857 128 -213 -140 -239 -334 -277 -701 -379 23 -809 -527 97 -460 -259 309 -215 -4 402 288 309 86 437 506
879 506 -202 237 671 -217 171 591 -212 37 413 34 -22 -23 289 253 -331 330 565 -422 212 426 -449 7
901 7 353 -445 -346 -95 -155 -440 -654 -28 -62 -803 121 122 -735 283 647 -463 -136 530 244 -57 -76 488
923 488 163 -369 482 75 -824 440 397 -966 -276 390 -219 -354 29 163 -173 -86 719 -29 -579 903
943 903 617 -792 259 770 -264 -138 283 24 -274 76 523 -384 -503 951 218 -961 491 669
961 669 -466 93 460 -150 -215 388 299 -635 -378 770 -390 -1183 281 82 -1042 -107 128 -698 -296
980 -296 459 53 -636 145 1095 -261 -496 1030 268 -498 695 353 -577 230 658 -292 -672 333 662
999 662 -744 -582 739 -244 -542 697 -20 -671 478 608 -494 -371 582 407 -650 -108 638 -500
$$ packed form
857A28l41P3r9r5N7m24L22M02q32K82O24n57K01N68n24K11M06j14K1k23L51O9
879E06p08M39M34q88L88M20q03K49L76l79n6jL12l6n84O61K35r87O34K14q75M56
901GL46p98R9K51o0k85k14O26l4p41R24Jq57J018L64j110L27O66k86l01j9N64
923D88l25n32Q51m07q99J264m3j363O90O66o09j35L83J34l36Q7Q05p48n50J482
943I03k86j409J051N11j034J26M21k59k98L50M47r07j19J454p33j179J452J78
961F69j135N59L67o10o5O03q9r34K57J148j160p93J464j99j124R35K35q26M02
980b96P55m06o89P81R50j356k35J526p62p66J193l42r30Q07M28r50l80J005L29
999F62j406J62J321r83k98J239p17o51J149J30j102J23R53j75j057N42P46j138
$$ plain form
1017 -500 -342 656 -395 -738 723 331 -660 -53 655 325 -330 351 670 -360 211 891 -495 -373 888
1036 888 -46 -852 17 270 -450 -646 -89 -103 -834 -76 268 -1001 -381 838 -435 -644 429 278 -139
1055 -139 75 288 -17 -244 493 357 -702 213 924 -472 -389 696 72 -155 445 213 -67 50 605
1074 605 189 -578 479 804 -608 -208 500 -422 -297 216 -305 -619 -115 122 -420 -717 247 312 -706
1093 -706 99 538 -488 66 715 -117 -226 468 393 -140 -216 551 96 -708 246 291 -692 -51 347 -543 -327
1114 -327 334 -71 -367 -64 452 -80 -480 418 199 -509 308 360 -528 -22 418 -202 -397 84 349 -114
1134 -114 -248 474 128 -274 488 408 -318 368 643 -82 -56 267 154 -86 -175 278 -167 -492 198 -130 -799
1155 -799 -13 17 -443 -207 16 -69 -170 -100 248 -101 -216 484 86 -318 345 172 -248 137 158 -85 -6 -51
$$ packed form
1017e00J58R98j051l43J461l92r91O07P08l30o55O81L19j030N71O80j386J22J261
1036H88r34q06Q69K53p20j96N57j4p31P58L44j269O20J219j273k09J073j51m17
1055a39K14K13l05k27P37j36j059R15P11j396Q3J085o24k27O00k32k80J17N55
1074F05m16p67J057L25j412M00P08r22J25N13n21l14N04K37n42k97R64O5j018
1093g06Q05M39j026N54O49q32j09O94p5n33p6P67m55q04R54M5r83O41L98q90K16
1114c27O61m05k96L03N16n32m00Q98k19p08Q17N2q88N06M40o20j95M81K65m63
1134a14j34P22l46m02P62q0p26O86K75p25K6L23j13k40q9M53m45l25O90l28o69
1155g99P86L0m60K36K23q5j01P0L48l49j15P00l98m04O63j73m20L85K1k43P9m5
$$ plain form
1177 -51 181 -198 -208 304 49 -244 346 149 -146 254 160 19 69 47 194 -7 -205 129 -102 -310 177 -94
1199 -94 -349 143 -14 -131 -32 -123 188 112 -81 359 128 -77 359 139 -195 203 2 -71 75 -264 -72 -92
1221 -92 -306 -10 -174 -361 64 2 -243 60 -39 57 194 -13 145 151 -105 285 144 -126 258 105 -73 51
1243 51 -19 -26 152 -81 122 137 -116 224 165 -175 161 86 -51 86 -16 -86 20 -182 44 -120 -359 24 -70
1266 -70 -354 -43 -114 -245 91 -6 7 83 -20 244 134 -72 289 211 -51 289 79 -92 146 11 9 -34 -186
1289 -186 173 76 -138 169 41 -152 121 107 -48 100 45 95 10 -178 115 -44 -309 81 -21 -343 -35 -9
1311 -9 -284 -135 -91 36 -23 -153 192 99 -135 282 223 -145 267 280 -80 87 61 44 -53 -142 109 -128 -343 133
1335 133 -10 -388 146 61 -204 39 42 54 23 -39 273 -78 -218 268 63 -308 179 13 -315 31 -12 -156
$$ packed form
1177e1K32l79j0N12k55k93N90j97k95M00r4j41N0k2J47k01j98L34k31k08M87k71
1199i4k55M92j57j17R9r1L11p6j93M40k31k05M36k20l34L98k01p3J46l39J92k0
1221i2k14K96j64j87M25o2k45L03r9R6J37k07J58Ok56L90j41k70L84j53j78J24
1243E1p0pJ78k33K03J5k53L40n9l40L36p5j37J37j02p0J06k02K26j64k39L83r4
1266g0k84L11p1j31L36r7J3P6j03K64j10k06L61p8k62L40k10j71K38j35km3j52
1289a86L59r7k14L07j28j93K73j4j55J48n5N0q5j88K93j59k65L90j02l22L08K6
1311ik75J49M4J27n9j30L45r3k34M17n9l68M12J3l60J67k6j7r7q9K51k37k15M76
1335A33j43l78N34q5k65K43LJ2l1o2L12l51j40M86k05l71M87j66l28L46m3j44
$$ plain form
1357 -156 -120 26 145 -100 -179 397 96 -144 410 183 -229 247 237 -129 -3 100 74 -210 -160 220 -207 -275
1379 -275 193 -152 -404 118 13 -287 -43 171 51 -103 62 204 -139 -203 331 -127 -289 306 10 -284
1399 -284 83 156 -115 -152 66 139 -80 38 363 -60 -45 447 21 -172 279 266 -82 4 119 65 -284 -5
1421 -5 134 -426 -148 334 -300 -291 195 93 -165 110 141 -9 0 203 139 -264 125 307 -323 -142 299 -224 -270
1444 -270 137 -39 -226 -39 144 -95 -309 171 213 -364 49 369 -177 -26 321 -2 -84 116 152 -182 -177 236
1466 236 24 -412 82 262 -304 0 295 -152 -26 333 92 -128 37 315 10 -289 175 175 -392 21 221
1487 221 -375 -101 240 -216 -292 -13 149 -119 -236 254 89 -238 280 237 -352 206 408 -148 -164 214 117
1508 117 -146 -135 173 -103 -274 248 70 -371 139 170 -297 -98 259 14 -111 34 179 -158 -124 227 -51
$$ packed form
1357a56L6J46J19k45p9N76l01k40N54k27m12M76j0l66J26J03k6k84N0L80m27o8
1379b75M68l45k52N22j05l00K44K14j20j54J65J42l43o4N34m58j62N95k96k94
1399b84L67P3k71l7K18P3k19J18L25m23J5M92m26j93M51j3l48Q6J15n4l49K79
1421eJ39n60K78M82o34RM86j02k58K75L1j50RK03o4m03L89J82o30J81M41n23m6
1444b70M07j76j87J87J83k39k14M80M2n77M13L20n46J51L47l23q2K00L6l34NM13
1466B36k12m36M94J80n66L04K95m47J26L59k41k20J65K78l05k99M64%n67M13K00
1487B21n96K74L41m56p6K79J62k68j17M90j65l27N18m3n89N58K02n56j6L78r7
1508A17k63J1L08k76j71N22j78m41N10L1m67J99L57k45j25J45J45l37L4L51k78
$$ plain form
1529 -51 -352 277 141 -388 -44 142 -194 -127 112 60 -103 19 276 -13 -110 396 171 -197 262 296 -133 -12
1551 -12 231 -63 -124 26 6 -245 -204 169 -133 -341 119 98 -253 19 131 -112 -10 132 120 -154 -42 285
1573 285 -153 -186 184 -67 -174 107 15 -190 14 145 22 -118 70 229 -51 -12 255 -45 -88 183 -22
1594 -22 -100 123 59 -72 -83 -41 46 -195 -71 100 -195 -94 183 -53 -49 249 34 -36 79 99 59 -45 21 117
1618 117 -132 -1 194 -130 -96 108 -129 -156 21 -50 -83 -93 11 100 -62 81 151 -138 6 267 -40 -80 121
1641 121 -67 -2 -75 -6 37 -172 66 87 -131 74 151 -122 56 169 12 58 40 63 15 -41 80 118 -55 71
1665 71 83 -142 -55 54 -164 -142 -48 -100 -48 7 43 63 -64 67 130 -47 127 66 -99 94 87 -59 44 30 9
1690 9 66 -53 123 46 -99 7 124 -104 -21 24 -41 18 37 92 69 -47 74 100 -97 81 -27 -164 -122 -76 -111
$$ packed form
1529e1l01O29j36n29L44J86l36O7K39n2j63J22K57k89r7N06k25l68M59L4m29J21
1551a2K43k94o1J50k0k51M1L73l02k08M60k1l51K72J12k43J02J42j2k74J12L27
1573B85m38l3L70k51j07K81r2k05K04J31j23j40J88J59k80L9K67l00m3K71k05
1594b2p8K23o4j31j1M2Q7k41J24J71k95J01K77k36MK98k15p0J15K0m0j04O6R6
1618A17k49J31J95l24L4K04k37k7J77p1l3j0J04Q9j62J43P0k89J44K61l07m0K01
1641A21j88O5p3O9M3k09K38K1k18K05P7k73J78J13j57M6j8K3m8n6J21L8j73J26
1665G1J2k25Q7J09k18K2R4n2N2N5L6K0j27J31O3j77J74o1j65J93pj46J03j4k1
1690IN7j19J76p7j45J06J17k28Q3M5o5N9J9N5k3j16J21K6j97J78j08j37M2M6l5
$$ plain form
1715 -111 -97 -63 -48 -11 -104 129 12 -65 114 53 -40 116 37 -58 -16 -54 32 38 -47 48 17 -116 58 -35 -61 52 -10
1742 -10 -16 67 40 60 70 -27 62 66 0 96 -4 -145 40 34 -45 -64 -64 1 11 -22 80 24 -52 70 76 -30 139 -15 -15
1771 -15 93 -20 29 53 -60 -45 -55 -75 27 -34 -77 61 -107 -94 62 -20 8 23 -6 59 33 34 78 58 37 99 91 -32
1799 -32 33 -140 10 56 -70 -1 25 -101 -4 23 -42 31 50 18 22 -32 16 123 -110 -63 59 -69 16 -7 18 -45 -38
1826 -38 49 0 -67 13 72 -70 59 88 -35 21 78 69 26 70 55 -1 -91 82 5 -94 -18 29 -163 -8 146 -8 -85
1853 -85 119 21 -28 14 141 -28 -163 78 104 -143 102 104 -108 -75 134 24 -103 -87 68 -58 -141 102 -9
1876 -9 -104 78 46 -113 25 100 46 -68 50 47 -72 -117 74 -101 -153 125 -11 -184 25 83 -32 -74 62 49
1900 49 -74 -56 160 -11 -49 276 42 -153 124 146 -82 19 21 -24 -62 -7 32 -138 -102 188 -8 -106 203 111
$$ packed form
1715a11J4L4J5L7r3K33j17p7J79o1r3J56p9r5M2l8Q6Oq5R5l1j33J74r3k6J13o2
1742a0oQ3k7K0J0r7Q9Mo6R6j00j41J85op9j9%O5J0l3J02n6p6J22Oj06J69j54%
1771a5J08j13M9K4j13J5j0k0J02o1m3J38j68J3J56q2K8J5k9O5k6JM4k0k1O2qj23
1799c2O5j73J50M6j26O9K6j26R7K7o5P3J9l2Mn4M8J07k33M7J22j28Q5k3K5o3P
1826c8Q7m9o7Q0N9j42J29K9j23N6N7rm3M4j5n6r0J73p7r9P6M7j92J55J54j54p7
1853h5K04r8m9M2J27j69j35K41K6k47K45Kk12L3K09j10j27J6J55j26q3K43j11
1876ir5J82l2j59J38P5n4j14J18lj19m5J91j75n2K78j36j73K09N8j15m2J36j3
1900D9j23J8K16j71l8L25k34j95K77K2k28J01Km5l8N5L9j70L6K90j96r8L09r2
$$ plain form
1924 111 -87 65 125 -68 -29 38 47 -116 -17 135 -161 -110 184 -17 -131 111 -30 -151 51 90 -26 -59 89
1947 89 166 -95 -24 273 -3 -94 160 50 -120 23 30 -142 -42 62 27 -127 32 101 -41 -60 144 -19 -70
1970 -70 145 71 -125 58 92 4 -138 38 139 -205 -33 99 -111 -122 88 -30 -107 73 92 4 -42 76 41
1993 41 -41 55 105 -149 -23 179 -110 -143 90 55 -73 36 48 -12 -119 16 19 -170 27 91 -98 -6 157 -2
2017 -2 -11 103 71 -36 -79 43 -72 -122 44 59 -154 19 66 -89 14 84 70 -15 -1 93 51 -84 109 106 -95 84
2043 84 125 -87 34 147 -54 14 -21 27 -81 -65 28 61 -81 122 92 -46 93 78 0 23 63 -65 -25 -43 64
2068 64 1 -50 133 -2 -127 53 80 -134 5 9 -69 -76 -17 42 36 6 103 76 -1 87 48 -86 69 30 -78 -14 -101
2095 -101 -39 -108 -25 67 -42 -4 85 20 -22 75 43 -41 12 14 -16 -34 -16 62 -25 36 133 27 -60 17 -63 -36 0 -50 -24
$$ packed form
1924A11j98J52O0j93L9O7Rj63R9J52k96N1K94k01j14K42j41j21K02L9j16l3J48
1947H9P7k61P1K97k76r1K54j10j70J43Pj72J00J04l5j54J59O9j42j9K04j63n1
1970g0K15p4j96J83L4q8j42J76J01l44J72J32k10j1K10j18p7J80J9q8m6J18l5
1993D1q2R6N0k54J26K02k89l3K33l5j28J09J2o0j07J35Lj89J97O4j89R2J63j59
2017brJ14l2j07m3J22j15n0J66J5k13J73M7j55J03P0j4q5J4R4m2j35J93lk01J79
2043H4M1k12J21J13k01O8l5M8j08J6R3L3j42K03l0j38J39j5p8K3M0j28M0j8J07
2068F4o3n1J83j35j25J80K7k14J39Mp8pN9N9ol0R7k7p7Q8l9j34J55l9j08O4q7
2095a01O2o9Q3R2j09L8Q9o5m2R7l2q4N3Kl0j8J8P8q7O1R7j06q7P7q0K7L6n0K6
$$ plain form
2124 -24 11 16 7 24 39 83 33 -42 96 -51 -84 40 -48 -38 -41 -28 -21 2 -4 50 -41 -48 28 -52 -18 52 -49 1 35 -21 95
2155 95 48 3 73 -22 -64 -19 -82 20 -43 -82 -17 -37 2 53 61 5 89 21 -11 45 -46 4 37 -100 9 39 -127 -29 -18
2184 -18 -55 -21 -45 11 5 -16 24 11 -11 40 -14 -41 44 80 -56 82 34 -108 36 -70 -3 17 -31 3 35 -70 2 43
2212 43 -36 -4 67 -19 28 14 31 59 -79 15 -7 -73 48 8 37 9 -31 -24 32 11 19 55 -118 34 36 -10 64 26 -43 63
2242 63 31 -31 20 39 -18 42 -45 25 0 -39 5 1 -65 -63 -4 -39 1 37 29 35 -37 83 40 -32 9 -46 -38 17 -46 -18 46 -41
2274 -41 34 12 -10 22 3 -93 35 -19 -79 39 64 27 33 22 47 26 -2 23 -27 -59 -40 -32 -93 60 -17 -63 32 18 14 83
2304 83 30 37 16 23 38 -55 -11 64 -37 -29 94 -25 -11 39 -11 -2 -21 -9 -72 -54 -10 9 -53 -24 66 -56 33 98 12 -24
2334 -24 8 -12 37 -47 -85 4 -153 23 40 -64 -6 55 -14 -25 73 13 -28 -17 23 -27 -73 -24 91 3 -5 73 -74 41
$$ packed form
2124b4L5NrJ7J5M4n0p5J38j47l3J24q8J0lJ3PK3oN4r1pP6q0L4P0j01N0L4n6J16
2155I5m7m5P0r5m2M5o3J02o3l9O5k0L9N1Qn6Q4o8l2N6r1N0L3j37J09L0j66R8J1
2184a8l7L4k4N6ok1M0j3k2N1n4k7Q5L6j36J38m8j42J44j06O7K0m8L4L2j05P2M1
2212D3p9L2P1q6M7j4J7K8j38R4k2o6J21m0K9k8m0PN6k1QL6j73J52Km6P4l8o9J06
2242F3l2o2N1J9n7O0q7P0k5l9M4mo6KN9l5M0L6qOp2J20m3p2M1n5QN5o3K8O4q7
2274d1P5k2k2L2j9r6J28n4o0J18K5l7Oj1K5k1k8K5n0l2J9Qo1J53p7m6R5j4mO9
2304H3n3Pk1PJ5r3M4P5j01QJ23j19J4N0n0Rj9J2o3J8M4J9o2K9R0j22Q9O5q6l6
2334b4L2k0M9q4l8Q9j57J76J7j04N8O1o9j1R8o0m1J1M0n0m6M9J15q8qP8j47J15
$$ plain form
2362 41 86 -18 -111 -46 -50 8 -59 71 16 -23 71 86 -21 19 43 -19 -11 26 -40 24 3 -9 11 -25 35 11 -79 61 76
2391 76 -83 -9 42 -62 43 68 81 22 -2 112 33 -23 58 54 -67 -24 31 -55 -25 10 31 22 -30 44 -10 -34 76 60
2419 60 -72 114 79 -53 -4 10 -18 -33 13 66 -59 -44 50 9 -109 23 5 -85 3 29 32 21 72 25 1 53 77 -69
2447 -69 -82 83 41 -65 54 59 -50 -42 -3 9 -34 -29 40 -86 -34 136 -21 -30 69 19 -4 84 48 -72 -31 -45 22 -87
2475 -87 -46 62 -58 -61 109 -24 -51 46 12 58 10 28 36 -12 -18 65 -52 -12 107 -34 -44 53 17 -49 26 -3 4 -11 -9
2504 -9 36 -42 27 37 49 10 98 -31 -56 63 -56 -22 -55 1 -29 -94 -7 73 -5 -13 41 -15 -20 8 18 -41 -48 57 3 -4 34
2535 34 1 -23 21 82 -36 -111 76 -69 30 31 -36 -8 -29 -16 35 2 -21 77 -9 -8 60 18 -36 -19 8 -35 -19 -50 11 -40
2565 -40 5 29 -86 0 20 -23 10 116 35 4 35 14 30 17 26 30 -57 -1 87 -79 -2 -14 -43 61 46 16 -22 14 -16
$$ packed form
2362D1M5j04r3O5mN8o7J30n5l9R4J5j07M0K4o2QL7o6O4k1j2K0l6O0k4r0J40J5
2391G6j59P4N1j04J05K5J3n9k4J14p9n6Q1mj21M3N5q6L0L5K1rn2P4n4k4J10j6
2419F0j32J86l5j32M9J4k8j5M6N3j25J5R4m1j18J32j8r0Q8K6Lj1N1m7k4N2K4j46
2447f9j3J65m2j06J19Nj09QL9J2m3NO9j26N2J70j57rR9n0k3Q8l6j20M1j4O7j09
2475h7M1J08j20lJ70j33k7R7l4M6m8J8Qm8oQ3j17M0J19j41j0R7l6o6P5k9Pj5K
2504iM5p8O9J0J2l9Q8j29k5J19j19L4l3N6l0o5Q7Q0p8qN4n6nK8J0n9pJ05n4pL8
2535C4l3k4M4O1j18p5J87j45R9Jo7K8k1J3N1l3k3R8q6JO8m2n4J7K7m3J6l1O1n1
2565d0M5K4j15Q6K0m3L3J06q1l1L1k1J6j3RMq7N6Q8j66P7j2k9J04j5l0l8L6l0
$$ plain form
2594 -16 -75 -49 27 88 -57 -14 -12 -14 5 31 -32 42 -38 -28 25 -57 40 -40 -41 27 14 -68 34 38 -25 19 -15 30 16 4 50
2625 50 16 0 41 -60 -32 66 46 -22 3 -44 -50 -13 27 -27 25 -13 18 24 63 72 -4 -50 24 -1 -49 -34 -31 -19 25 8 16 -18
2657 -18 -72 49 9 15 25 -34 -22 41 -15 4 58 -7 57 81 48 7 -14 -99 18 -5 -18 13 -48 12 -30 -4 34 -10 -31 42
2687 42 18 -15 42 -31 12 20 6 50 44 -17 37 73 -1 35 4 -60 59 -57 32 49 -5 49 91 -20 14 71 29 49 -1 8
2717 8 14 10 8 44 20 -17 19 -12 0 -29 29 33 -51 -41 34 -78 10 31 -86 -26 -21 -16 -1 54 27 23 -91 2 1 -49 16 21 -16 41
2751 41 61 63 16 54 24 38 32 -14 -14 16 -34 45 -34 -45 47 -72 26 -5 -46 -5 0 -13 9 2 22 39 -30 29 82 -12 80 57
2783 57 -80 62 13 -13 38 24 73 84 -49 37 86 -56 17 36 -46 72 51 -10 40 -2 -12 -32 -72 -3 -9 -53 26 46
2811 46 -136 64 20 -58 -31 10 5 -26 -11 49 -32 -15 52 27 27 33 -32 -6 33 66 23 -21 -25 8 27 -38 3 32 -72 54
$$ packed form
2594a6n9K6P6O1j45M3KkJ9K6o3P4q0J0N3q2R7q0jO8j3q2J02Mo3M4l4M5j4j2M6
2625E0l4j6M1j01K8R8k0o8K5m7oL7M0n4N2l8L1OL9Rp6m6P4k5m8J5LJ2M4j7Ql4
2657a8n4J21m0OJ0n9J2O3n6J9N4o5O4K4l3m1k1q5J17k3j3L1o1O0m2K6L8m4k1P3
2687D2k4l3N7p3M3Qj4M4oo1N4L6p4L6l1o4J19j16Q9J7n4N4M2j11L4N7m2K0n0R
2717HOmkL6k4l7L6l1J2k9N8Mq4J0P5j12Q8K1j17O0NNJ5N5k7mj14R3jn0O5Nl7N7
2751D1K0Km7L8l0J4om6%L0n0P9p9j1R2j19R8l1m1M1Nj3K2pK0J7o9N9N3r4R2k3
2783E7j37J42m9k6N1j4M9J1j33Q6M9j42P3J9q2J18k1o1N0m2j0k0m0O9om4P9K0
2811D6j82K00m4p8K7M1nl1J5O0q1J7O7k5%Oo5K6L9L3m3m4mL3J9o5M1K9j04J26
$$ plain form
2841 54 -11 -52 63 19 58 25 32 -39 11 -77 22 -97 -11 29 -31 -73 15 49 -23 -1 39 10 -56 16 17 -67 30 33 -52 6 67
2872 67 -4 -75 36 36 8 62 33 -10 -65 -17 36 -76 -50 78 6 -29 55 15 26 -50 30 -27 9 33 14 -104 -14 29 -44
2901 -44 -55 30 -7 -13 28 2 -10 -11 46 56 9 35 19 -35 67 67 16 2 26 -41 -39 -48 4 -27 -4 26 11 -72 28 21 -30 -38 61
2934 61 1 -51 58 39 19 -44 34 11 -48 7 60 -82 -15 6 -59 3 -6 -52 -43 37 82 17 -68 30 32 -49 36 69 -54 11
2964 11 50 1 -30 -4 15 -40 -17 9 -23 -11 24 23 -27 10 54 -4 28 59 11 0 35 8 -38 -22 41 0 -160 -26 22 -29
2994 -29 3 29 33 -3 1 69 -27 58 78 -40 -65 82 -21 -20 13 4 -39 -4 3 21 -20 -41 37 -27 -60 30 19 -19 62 -23 31
3025 31 -26 45 -55 -11 76 -18 -37 -37 24 -27 -60 19 21 -20 7 10 -41 15 47 41 -34 7 77 -41 -8 47 -44 -43 22 -33 -40 14
3057 14 -54 -66 -5 20 64 -10 -38 32 12 1 82 21 -34 -29 8 -19 7 -4 -58 -4 3 82 13 21 79 -47 -26 -18 -28 -16 -1 21
$$ packed form
2841E4o5m1J15m4L9l3Pp1N0q8R9j19Q6M0o0m2Q8L4p2K2M0k9o6P2Jq4R7Lq5N8O1
2872F7p1p1J11%k8N4k9m3n5M8N3j12K6J28p2l5Q4m0J1p6Q0n7L6K4j9j18R0M3p3
2901d4j1Q5l7oM1k6j2jN7J0m7K6j6n4J02%n1j4K4o7KrN2l1K3L0j5q3J00pn1qR9
2934F1o0n2J09j9k0o3P8k3n9N5N3j42O7K1o5O2rm6RQ0M5o5q5R8Kq1Q5L3j23O5
2964A1L9m9l1K6J9n5K3K6l2J2L5jn0L7M4n8L2L1m8j1L5k7m6J6O3m1j60J34M8n1
2994b9L2K6Ml6MO8r6Q5K0j18k5J47j03JL3rm3L5PJ8m1k1P8o4l3R0j1l8Q1q5N4
3025C1n7P1j00M4Q7r4j9%O1n1l3P9Km1K7Ln1N6L2op5M1P0j18L3N5r1JO5n5pN4
3057A4o8j2O1K5M4p4k8P0k0j1Q1o1n5NL7k7K6j1n4N4PP9o9QN8j26K1Qj0J2J5K2
$$ plain form
3089 21 -24 33 32 48 35 46 41 -78 7 68 -56 -36 23 -4 2 -59 -29 29 5 48 -7 19 -1 69 -49 -58 47 34 40 15 1
3120 1 7 -12 19 -34 8 -26 -47 -26 24 -17 -7 -37 -8 45 -26 -40 -3 8 -28 -26 9 -26 43 2 -22 -4 -16 -22 26 15 -26 21
3152 21 -37 2 -31 -9 30 5 51 24 18 54 13 -6 13 -56 0 -3 -20 6 17 31 -47 38 8 -6 76 59 17 18 -1 30 37 -22
3184 -22 5 33 -68 37 -4 -12 -23 -48 -5 -11 -17 -24 -35 -35 10 11 15 0 21 48 77 -10 0 -31 -25 45 11 -20 56 -25 7 -9 -68
3217 -68 -57 70 -23 -69 52 18 -10 14 -10 37 -17 28 -4 -55 -67 34 -30 -20 35 -28 17 38 -42 -15 -2 -51 27 35 -13
3246 -13 25 20 -51 56 59 44 37 11 3 8 28 10 -69 -18 11 -31 30 -37 -92 -49 -55 -48 26 1 -24 41 -24 1 -2 39 -19 55 26 3
3280 3 43 -4 -9 -57 3 32 -1 4 10 -14 -19 -7 -2 76 47 17 -19 -1 44 5 27 26 43 -49 28 -9 -86 -22 60 -34 -5 -26 -10 0
3314 0 9 38 3 -2 30 15 -85 65 -13 -5 -2 -4 2 2 34 36 -56 -10 77 -29 -53 1 -11 -13 31 19 -8 18 26 -8 -35 -6 0 35 -12
$$ packed form
3089B1m5N7jJ6j3J1nj19Q5O1j24K0N9k7Oo1L0N8k4M3n5K6k0P0j18rJ05j3Ok5j4
3120AOj9L1n3M2l4k1K1N0m1J0l0K9N3p1j4L7J1l6KL5l5O9m1k4J8j2oM8j1m1M7
3152B1n8L9l3K2L9k5M6k7oL6m1j9J9o9N6lj7K6J1J4p8Q5l0j4Q2j7m2Jj9L1Pn9
3184b2K7K8j01J05m1qj1k5M3oopj1%M5JMj5K1K7K9q7J0l1OP0l4l1P6q1L2j6n9
3217f8J1J27r3m6J21l4k8K4k4M7n4M5l2n1j2J01o4J0N5o3M5K1q0K7J3m9P8Qm8
3246a3L8np1J07Lj5pk6qNK0j8p9N1K9m2O1o7n5M3oPP4k5k5O5o5K5lM1n8P4k9k3
3280CM0m7nm8O0K9l3NOk4nJ2NP8k9l0l6J8M5l9K2jJ7r2P7l7p7O4Q2r4K9k1J6J0
3314@RK9l5nL2j5j00J50p8QLkO%L2Kr2M6Q7j06k4N4j2kM4j2k7K6Ql4k7K9OL5m7
$$ plain form
3349 -12 -36 -16 -89 41 -30 -55 50 -2 7 19 -18 33 0 -30 45 -17 -43 20 80 -69 65 9 -43 -18 -23 -1 -38 -51 2
3378 2 36 17 75 32 -26 13 12 -14 9 32 -21 -11 2 -9 -46 -29 -34 23 -51 45 97 -23 20 -44 10 -16 45 35 -72 12 22
3409 22 41 29 31 -26 -9 33 13 -44 -28 -56 -66 -6 27 15 10 6 -10 -30 7 32 -3 -1 -12 33 -26 -5 -18 -29 -78 -3 63 -47
3441 -47 -15 20 -54 -52 22 2 40 -14 -1 61 5 -1 45 -10 -27 26 -5 -19 30 44 -17 -21 77 17 46 10 -5 41 25 -3 23 13
3473 13 -67 -19 28 4 -64 -12 34 -14 0 -20 3 45 -6 5 -17 -5 -6 -32 3 25 28 61 0 16 39 48 -3 43 1 -22 38 -62
3505 -62 24 -16 10 35 -27 -36 -1 13 -11 17 -1 12 -14 -34 -35 -10 -5 8 62 46 -28 -12 -65 42 -70 -25 2 32 -24 -42 -11
3536 -11 -4 57 8 -5 40 68 68 -16 -19 -7 -1 -47 -9 -8 -15 32 -32 84 9 -14 32 26 16 3 -36 -5 -3 -16 -4 -11 11 -16 -13 4 -1
3571 -1 -32 -15 0 -22 19 -14 -44 10 -25 -61 37 35 54 47 18 -13 -10 -70 -20 18 26 -2 -98 -11 -43 27 -6 -64 -2 18 -52 -31 29
$$ packed form
3349a2k4K0p3J30p1k5J05n2RJ2l7N1l3l0P5o2k6O3O0j49J34n6n2K5nK2l7j3N3
3378BL4j9N8m3n8L9jk6K3K3n3J0J3j1l7J7nN7p4R6N2j20M3o4N4k6O1j0j07Q4J0
3409B2J9j2Kn7J7M2k0n7J6k8j0O0L3j2nmj6k0L7K5l5Kj1M5n9K1j3j1m9P5O6j10
3441d7L2L5p4KP4k0L8n4J3O2n6oM6n5j7N3l1j4M9J4o1mR8o0K9l6j5M6j6k8K6j0
3473A3q0M8M7k4o8N2M6m8J4k0K3M2n1J1k2J2jk6L5K2LL3o1J6K3Rn1M6m2k3O0j00
3505f2Q6m0K6K5o2rL5J4k4K8j8J3k6k0jK5NJ3N4j6p4J6n3J07j12M5K7L0n6j8L1
3536a1PO1m9j3M5K8%q4lJ2Om6L8JpM7o4J16p5k3M6oj0j3l9L1Kj3J2pK2k7LJ7n
3571al1J7J5k2M1l3l0N4l5l6R8kJ9pk9l1Lo0N0L8Qk8r6Q7l2P0l3n8O2K0p0K1O0
$$ plain form
3604 29 -25 -73 26 -53 50 5 81 28 8 0 19 -11 -28 27 -13 -11 -7 -19 24 7 49 49 12 -4 10 27 42 74 -21 -3 45 41
3636 41 -17 33 -2 -35 -4 16 -20 8 -67 -11 30 29 -2 22 -56 -15 -8 -3 82 42 -19 30 9 -13 9 -30 -51 -30 -53 24 44 -13
3668 -13 9 32 -93 29 -9 15 22 31 -38 49 28 25 43 10 39 6 19 -14 42 23 -1 -5 19 -33 -7 -36 23 -75 -16 -14 -40 -14
3700 -14 -49 44 20 -9 -63 14 38 -17 -52 -46 0 0 -16 -15 39 -68 6 50 0 -8 -32 20 15 -13 -12 -26 65 40 47 3 -7 22 5
3733 5 -45 13 19 25 39 -4 -47 -5 78 -8 42 0 1 37 53 -23 -81 16 105 -3 -4 -10 6 -17 56 65 -14 32 -3 -11 16 -3 -22 27
3767 27 -25 14 84 -33 -14 -6 -39 15 -25 0 29 31 -17 26 -8 73 -35 2 32 -10 -14 -15 11 -33 -21 86 3 -45 46 -16 3
3798 3 32 1 -36 21 -12 34 -31 22 23 3 -5 36 -43 -6 -18 -10 10 -61 -29 -5 -4 -6 33 16 -14 20 -4 -2 -31 -44 -10 -10 21 7
3832 7 -11 44 23 41 -6 17 39 60 -55 -15 -17 20 3 -1 7 24 13 -58 6 48 -14 42 11 8 -17 -21 4 -4 5 -4 -38 -2 -49 -17
$$ packed form
3604B9n4m8R9p9J03m5P6n3k0qJ9l0j7N5m0KMj2M3j7M2%l7j6J4J7J5L2r5J8M8m
3636D1n8N0l5l3L1K0l6K8p5N6M1jl1K4p8M1PNQ5m0o1M9k1k2K2l9k1K1k3P7K0n7
3668a3K2K3j25J22l8K4PRo9Q7k1lJ8l3K9l3J3l3N6j9k4mK4n2K6k9N9r8N9Kk6K6
3700a4l5R3k4k9n4P7K4n5l5OM6%j6JN4j07P4M4n0qk4N2nk8Jj4R1k5Pm4j0K9j7
3733En0N8OOJ4m3m3M2Q3q6N0m2JL6J6p6n8R7Q9j08joJ6k3P3Rp9M6l5qK7j9j9M9
3767B7n2L9P0j17J9Ql3N4m0K5K9Km8M3l4Q1j08L7L0m2mjK6m4J2J07q3m8R1o2J9
3798CK9l1l7N7l3M6o5N3Jk0qM1p9L7j2QK0p1L2K4JkL9j7l0L4k4Kk9j3L4%L1j4
3832Gj8N5k1J8m7K3K2K1j15M0kL7j7mQJ7j1p1O4M2o2N6l1lk5mK5qRrl4L6m7L2
$$ plain form
3866 -17 10 -34 33 -18 41 19 38 -8 -14 3 -5 -25 3 12 -21 13 16 0 64 0 -22 -36 -64 -16 -13 -1 45 -57 -10 41 67 -38
3898 -38 11 33 5 30 -32 31 -3 47 69 -65 -55 34 27 -19 36 -14 25 -25 4 10 -20 -13 -15 -10 39 -39 -20 -48 66 -23 46 20
3930 20 32 46 63 52 36 -2 5 7 -67 31 68 5 -25 -15 -24 -75 -62 -8 -24 3 -23 11 1 -3 -2 -29 33 3 2 -28 11 -58 30
3963 30 64 57 -14 -2 20 7 -34 -9 20 -38 12 2 1 33 -43 31 36 -13 -13 -5 -13 -47 3 -51 58 -52 17 53 67 -33 60 -80
3995 -80 32 23 -9 1 -16 -50 15 -14 -8 26 -47 70 -21 43 -22 -5 -38 5 14 -5 -5 14 11 24 23 29 3 9 -12 -2 -18 44 -48
4028 -48 -18 -12 24 -10 -5 -16 5 -9 -28 31 -2 31 3 25 79 17 17 -2 17 -5 -3 1 3 -20 -22 -35 -5 28 4 17 -19 -1 -22 -8
4062 -8 8 -30 -33 3 8 -30 -21 21 -11 27 -73 -8 9 -19 -9 -49 -79 -18 -9 -10 14 20 28 -12 29 -33 -25 10 -2 3 13 -25 36 -18 -18
4097 -18 -44 -3 37 -28 -16 52 6 37 -19 -83 -51 5 -2 -1 -3 26 -15 -80 38 -53 -64 -2 -3 -11 20 -28 37 74 50 39 -26 16
$$ packed form
3866a7K7m4O7n1N9k2J9m6oJ7qk0K8Rl3L4Lj6O4o4k2j4k8M8LJ2M6j02M7N1K6j05
3898c8M9K2k8K5o2O3l4N0K2j34J0Q9pm6N5n0L9n0K9Ol0PkNM9p8J9k8J14q9O9k6
3930B0J2J4J7j1j6l8PKp4R8L7o3l0J0rn1J3N4j6K7k6L4j0mJk7O2l0jl0L9o9Q8
3963C0L4pp1J2K2j3m1K5K9n8N0j0jL2p6P4Nm9%Qql4N0n4J09j10O9L6J4j00R3j40
3995h0J12rl2J0j7l4O5k9OL4p3J17r1O4o5J7l3M3Rj9%J9lJ3jOk6Ok1J0j6O2r2
4028d8L0OL6l4Nj1K1j4j9N9l3L3k8K2N4o2%j9J9k2KMKk3kj3L0L3k4J3l6J8k1J4
4062hJ6l8lL6Nl8RM2l2L8j00O5J7k8J0m0l0O1RjK4OQm0M1o2QL5j2NJ0l8O1n4%
4097a8k6M1M0o5J2O8m6L1n6o4L2N6pJkK9m1o5J18r1j1O2jqL1m8O5L7k4j1o5M2
$$ plain form
4129 16 54 33 -40 12 -57 -13 38 13 11 -5 -16 -29 -50 -21 -7 -18 -2 1 -1 -4 5 -26 4 -14 30 3 -17 -18 -15 4 8 27 35 -11 -9
4164 -9 21 60 12 -22 -39 50 -11 1 35 -35 4 1 32 -34 2 -31 -41 29 -59 18 1 13 -25 44 -8 -7 21 -12 8 54 47 -19
4196 -19 -11 77 22 -18 -18 -7 18 38 45 -54 -49 15 74 -28 -22 20 -25 17 -41 32 -20 -13 -37 -21 44 39 -5 -20 -69 6 -46 19 -57
4229 -57 -62 15 13 -40 50 6 -27 10 -87 5 -16 28 -10 33 29 16 6 -10 39 45 -4 -28 -6 -21 67 -18 47 50 43 40 47 43 71 18 18
4264 18 87 -19 -22 66 74 -36 1 -5 -61 -16 -53 4 7 -34 -32 32 -1 -37 35 -30 30 -15 27 32 36 61 -8 -35 24 41 5 15 -23
4297 -23 42 6 -66 16 -4 1 23 37 76 23 -11 3 -25 7 -25 14 -46 1 12 -45 28 10 17 9 -30 10 -2 -13 -12 -9 -64 0 40
4330 40 -22 41 51 -63 44 38 43 7 18 26 -3 23 73 28 -31 38 -37 47 -11 -15 8 34 8 -10 2 -77 36 -9 6 6 -26
4361 -26 47 53 -62 -13 33 -20 -64 -22 -20 -11 37 38 -9 -20 60 -10 -8 -24 53 20 53 -10 8 -14 -44 -27 -25 -64 -5 27 0 -8 -1 -45
$$ packed form
4129A6L8k1p3N2o9M4N1k5kj6j1j3k1K9J4j1J6LklRl1L0j8M4k7k0jLJ9MJ9Qm6K
4164iL0L9m8l4j7Q9o1J2L4p0L9lL1o6L6l3j0P0q8P7j7J2l8O9n2JK8l3K0M6po6
4196a9QQ8n5m0%J1K5K0Pr9NO4N9j02OM2m5M2n8P3n2Pk4J6O5nm4j5m9P5n2O5p6
4229e7nP7kn3R0m4l3L7r7R2k1M4l8M3mj3j0j6M9Om9k4K2j5Q8q5O5LplPmK8n3%
4264A8O9j06lQ8Qj10L7on6M5l7N7Lm1KO4l3l6P2o5O0m5M2NMK5o9k7N9J7l6J0l8
4297b3O5l6p2Q2k0NK2J4L9n3l4J4k8L2l2L9o0M7J1n7P3j8Pql9M0j2j1JLn5O4M0
4330D0o2O3J0j14J07oNl6J1Qk9K6N0m5n9O9p5Q4n8mK3K6k6j8J2p9J13m5J5%l2
4361b6P3Oj15M9M6n3m4M2KRM8Jm7j1Q0p0Kj6P7l3L3o3J8k2l0J7Kl9N9L2k7qPm4
$$ plain form
4395 -45 41 37 -10 3 -49 2 27 -7 1 25 -4 -16 4 -13 16 -36 -58 45 11 -2 9 3 14 18 -18 -1 57 -87 38 48 -2
4426 -2 7 -23 1 21 -30 4 -2 -31 21 46 7 20 -8 -32 -5 -9 -2 12 -25 41 37 -1 18 20 -40 -7 36 -4 29 -26 5 -2 21 -7
4460 -7 59 -7 29 -27 -42 11 48 -62 27 49 -51 45 37 -14 6 -53 -37 18 -26 31 41 -79 9 -43 -40 -15 31 -28 20 47
4490 47 17 -5 -42 -10 27 -17 20 39 -16 20 -23 46 -39 16 38 43 8 30 -14 51 43 -24 -2 31 -10 -16 5 -1 -3 13 -1 33 -19
4523 -19 -38 43 22 7 22 8 -31 54 -59 -11 18 28 77 -60 2 35 8 2 0 -21 -53 67 -5 -5 -3 8 -4 69 10 23 9
4554 9 -68 53 59 5 42 -43 23 33 -27 -2 -21 52 16 29 12 -3 -14 -76 -21 -4 14 19 45 -2 64 5 24 39 -53 -42 -15
4585 -15 17 39 -24 18 15 10 -19 25 -29 36 26 52 67 -19 15 10 11 -27 55 39 -45 -25 -43 12 40 27 18 29 42 -10 18 -6 33
4618 33 -7 16 33 35 9 -7 -12 57 31 20 29 14 37 -31 2 -17 30 -23 39 35 14 17 2 -38 45 14 0 -27 -49 21 -15 -6 9
$$ packed form
4395d5Q6mm7J3n2N1K5l4QK4k9j2K0j7K9n2k2J03l4j3J1oJ1Ml6J7N8j44J25J0n0
4426bRl0K4K0n1L4ok9N2K5l9J3k8k4K7mPJ4l7O6ml8J9Ko0L3M3m0L3n5L1pK3k8
4460gO6o6L6n6j5N3L7j10Q9K2j00R6qn1K0n9J6N5m4N7J0j20Q8n2LK5M6n9M8K7
4490D7l0k2l7L2L7m4L7J9n5L6m3O9q5N5K2Nl5K2m4O5qo7K2L3m1oK1okJ6j4L4n2
4523a9j9Q1k1j5J5j4l9Q5j13M8K9J0M9j37O2L3k7okk1l2J20p2%KJ1j2P3n9J3j4
4554Ip7J21On4L7q5O6J0o0K5j9P3l6J3j7j5j1o2N5J7J8NK6m7O6n9J9J5r2J1K7
4585a5L2K2o3M2lnk9M4n4O5j0K6J5q6L4nJl8Q2j6q4K0j8N5K8j3rJ1J3n2K8k4L9
4618C3m0K3J7Kk6j6nO9k6j1Rj5K3o8L3j9M7n3O2mk1Lj5m0Q3l1j4k7k2P0l6RJ5
$$ plain form
4651 9 22 17 19 -38 -82 -4 -8 -42 27 -37 -19 16 -48 -31 10 -17 0 36 9 31 -28 -22 -21 -13 2 -31 -76 7 -8 -68 0 -30 -2 21
4685 21 -41 4 -37 -7 22 -7 22 -3 -3 -57 -30 47 -17 19 -29 -13 38 -48 29 26 1 13 11 -39 38 42 -28 47 -58 9 -7 -16
4717 -16 25 -6 -26 -25 14 5 14 5 -47 -16 36 -24 -25 -48 -15 14 -26 -3 -49 26 43 10 29 -49 -22 -26 -6 -37 -32 -36 -5 -49 25 20 18
4752 18 -49 8 5 8 15 17 7 -21 -34 -1 -53 -4 56 19 10 3 18 57 16 23 2 3 -36 50 -45 1 34 24 -14 -8 -22 44 -14 -9 -22
4787 -22 0 -17 -56 42 31 63 -1 -4 71 89 -6 10 11 23 -4 43 -21 38 -47 -6 24 -60 -29 -11 -44 -39 -4 -85 43 -43 -65
4818 -65 -30 -14 -26 -9 -43 -11 8 9 -28 10 -58 -15 38 5 0 27 35 31 4 36 2 -16 8 1 7 33 37 -1 0 15 38 1 -24 7
4852 7 16 -33 -14 -47 -12 31 -45 8 -18 -44 -38 49 15 -39 6 2 45 -10 -26 44 33 18 -56 -42 -46 -65 31 7 -12 -42 -38 -21 43
4885 43 7 42 21 36 39 8 48 -39 57 -43 4 36 -17 -43 -16 -14 -66 -25 -36 -24 28 -17 -2 -7 -11 8 -43 39 4 -3 -23 42
$$ packed form
4651IJ3nKn7m4P8ml4O9o4J8L5o4J7M1k7J7L6k7K2n9OJQJ5l3m5Q3j5o0O8l0K8K3
4685B1o2M5m1L0K9k9K9k5%n4K7P7o4L6m8J6N1q6P7lk5J2kn0P7Mp0P5j05O7j6r
4717a6M1l1k0JL9rRrn2L1N2o0jk3L3K9m0K3m6P5J7l3J9p8K7mK0l1NmL1m4P4nk
4752A8o7N7lLPKj0k8j3L3n2M9O0l7rpJ5L9m1Pk1Jl9Q6r5M6L3j0l8Oj4O6n8Nj3
4787b2K2j7l9R8j1L2o4lP5J8r5J6JJ2k7M7o4N9q5M1L0q4L1J8l3NL5q1J28q6k2
4818f5L5J6j2J7l4L2J9Jl7L8o8M3N3l3nK7Qmk7L2l4j8K4pOK6Ml8JJ5K3l7k5L1
4852GRm9J9l3L5M3p6N3k6k6OQ7l4n4M5mM3n5j6P0j1j5p4J4mj9R6k4j9l0MJ7O4
4885D3l6L5k1J5Ll1M0q7R6j00M7L2n3k6K7Kn2M1j1J2N2m5J5nmJ9n1Q2l5pk0O5
$$ plain form
4917 42 -26 -31 -66 -1 49 36 17 5 -15 -1 72 -27 19 17 -37 32 28 -12 -22 34 38 11 -7 15 -36 -72 14 -12 -13 -29 -13 -25 -52
4950 -52 20 -38 29 5 17 52 -16 11 -3 -5 -47 5 -49 30 9 -83 27 8 -4 -9 35 23 74 63 -18 43 -5 -27 5 6 32
4981 32 -33 18 -6 49 -12 -17 -16 -46 -64 -71 -37 -10 -4 -29 -55 13 -14 -64 36 71 34 -34 -38 32 -42 57 -1 -12 -23 -30 8 33 -42
5014 -42 16 -9 74 14 -5 51 -50 -7 -35 18 -81 8 48 26 10 -61 -18 -40 8 9 36 -47 -94 -45 -28 65 -18 -10 -1 -27 11
5045 11 33 54 18 35 -25 3 52 46 11 -3 4 35 -17 -18 13 -40 -8 87 -2 -2 -27 -16 -55 21 10 16 -11 -39 9 6 -47 63 28
5078 28 4 -37 -30 33 -8 -42 -22 -2 1 50 42 9 64 24 0 -15 -37 9 -58 -20 -9 35 -12 27 -46 6 27 -49 -13 0 -52 23
5110 23 -32 -58 43 -28 -21 18 -62 -47 10 -46 45 23 -95 69 60 1 -42 -45 26 25 17 10 -18 -61 11 -19 15 0 -65 9 3 72
5142 72 -24 121 16 -40 -30 4 -3 -28 -38 6 -68 12 47 -30 -10 -35 19 5 17 -48 5 40 -49 -7 -26 -16 -53 -61 -11 -1
$$ packed form
4917D2o8nl5O5N0j3j9j2k0J4P3r9M6kn4O9mm0j0N6Mk7j8K2n1l6Q6k6jj6J6j2k7
4950e2P2n8O7k4J2L5o8K7j4km2N2n4P9k1r2J10j9j2nM4j2N1j1q1O1m8k2L2JK6
4981C2o5N1k4N5o1nJl0j8pL4K7Ok5k6O8k7n0J00L5l7o8mP0p4R9n8j1j1pL8K5p5
5014d2N8k5Q3o0j9N6j01M3k8N3r9Q9M0k2j6p1M3k2M8JK7q3m7M9J7R3q3QRk6L8
5045A1K2K1l6J7o0K8M9ol5j4PL1n2jL1n3L2R5q9%k5J1l9P6j1Ok7k8M8ln3J10l5
5078B8k4m1PO3m1l4K0K0LM9ql3N5m0k4j5k2M6o7L8J1M4m7L9p3N2K1p6L6J3n2P5
5110B3n5k6J01p1PL9q0J5N7n6R1k2j18J64rn9m3lP1jqpk8m3P2l0L4j5o5P4oO9
5142G2r6J45j05n6J0L4pk5j0M4p4Q0L5p7K0k5N4j4J2o5N3L5q9M2j9J0l7qN0J0
$$ plain form
5172 -1 35 17 19 -4 -3 18 37 15 22 -17 -78 2 -53 38 20 29 0 -2 -15 32 -32 -41 -22 -35 -19 -22 16 4 -12 48 22 -16 12 38
5206 38 -31 -57 -36 -3 -15 -6 -28 34 17 33 52 20 36 19 -30 -17 53 -9 23 -5 30 73 18 -22 39 -28 17 18 0 24 16 -18
5238 -18 4 14 -27 44 9 -35 5 36 3 -6 -26 36 28 -56 2 -56 -35 26 -24 31 -29 -1 1 -2 3 19 47 64 18 42 18 11 -56
5271 -56 -5 -7 -4 54 -1 -23 39 13 -12 55 -20 14 -70 1 -44 -6 13 23 13 -70 27 34 -1 3 17 14 1 23 -49 27 -36 3 8
5304 8 22 -9 -48 -10 -33 23 -4 15 33 -16 8 8 34 -17 -41 4 -17 -21 36 -40 -8 -3 -21 -37 -9 8 -44 -48 -26 -22 -21 43 33 -33
5338 -33 14 22 2 45 10 -4 -8 -25 64 1 35 29 -36 -52 -68 5 18 -2 -9 6 -58 -2 -1 52 -37 -11 43 -26 25 34 -37 -78 -9
5371 -9 -24 8 -29 -22 -6 8 24 -2 -9 -3 -4 -23 41 32 -17 34 49 -10 49 -4 -17 38 31 -15 -74 -68 -1 15 -37 6 33 42 -31 -56 11
5406 11 73 -9 -13 0 -23 47 -54 -30 -24 37 -37 -12 21 -17 39 27 -32 18 -24 10 -8 -50 26 61 22 27 -35 53 20 6 -4
$$ packed form
5172aL6j8Kk3JK1J9k2Pl9o1Q0n5R1j8Rk9kj3M7o4rJ9j3J6lL8j2j6O0k6l8K8K6
5206C8o9k6K1L3j2Rk2O2j7J6J9l2J6j7m9J3P0o2L2k8L5M3n5m0O1o7M5Jj8K4ql4
5238a8K2J0m1P1l5m4M0L1l3rk0O2qq4N8n8K1O1n0N5o0K8KlNJ6K8J7m6K4k4po7
5271e6N1kLN8n5k2O2k6k5O7p5L4q4P1m5L8J9J0j0q3R7Pl5MJ4lj3K2p2P6o3L9N
5304HJ4l1l9L8k3N6k7J9J8m9K4%K6n1k4M5k1mN7p6L2Nj8j6K8J7n2mK2MJO4j0o6
5338c3M7Qk0M3l5j4mj7Q9o3L4oo5j6j6P3J3k0pJ5o4N6JN3q9K6N4o9N1Rp1m1O9
5371ij5L2l7PJ6J4J6k6pOjj9O4rm9N1J5n9N9n3j3N5pm6n9OO7J6n2M3K7Rp3k5O7
5406A1O2q2mJ3k3P0j01K4OO1p4K5L3l8N6j2n9N0m2L4j8m2P6L5l9No2Q8l3j4j0
$$ plain form
5437 -4 24 -29 -28 -3 -34 -25 -16 -8 14 10 4 -21 -41 -71 -20 20 -28 -49 -45 -64 -40 12 35 -38 18 32 -9 -8 31 2 34 21 37 54 -29
5472 -29 12 20 9 22 -14 -59 18 1 -19 -25 4 -75 48 40 2 28 7 -11 19 -45 62 -13 -43 -2 -5 -54 22 -12 -49 -20 -19 -36
5504 -36 -16 25 -22 20 -56 19 -16 -14 17 26 -30 44 -10 -5 53 -31 -28 -1 -1 15 6 -34 -8 11 -22 37 -44 2 16 -27 0 12 -65
5537 -65 -41 36 26 43 39 17 27 -4 -34 2 -50 -64 36 2 -18 -35 -32 40 -12 24 24 -5 41 24 32 17 -12 -16 -4 -23 51 30
5569 30 -39 -24 11 17 -7 17 -1 71 2 -2 -16 -7 3 44 -31 -42 1 -12 -33 5 38 -25 48 46 70 22 -73 -23 -34 -14 13 37
5601 37 -26 16 21 -53 66 8 -30 -9 19 -31 -17 -8 -12 -77 -38 -40 48 -25 17 -6 -16 -15 -46 1 14 -71 62 42 30 60 13 5
5633 5 15 26 43 79 12 9 26 31 35 -51 -9 33 -3 -22 -21 -22 8 -2 7 -27 -23 -46 -61 11 0 5 7 4 -23 -60 -3 6 17 36 -41 -17
5669 -17 24 1 -23 35 42 -43 -22 21 -10 55 50 -76 -23 2 28 -4 -16 35 -14 -27 21 19 6 -6 81 -20 -15 54 -7 6 -9
$$ packed form
5437dK8n3JK5l1RRQK2mok5k0l0N1M0m8k1Mj9K4N2K3p3N6J4m1JL9k9L2j3J6J7q3
5472b9M1Qj1J3l6m5P7j7k0oK9p9J23ql8K6k1j8L0o4J07p5l0M1lm9P6l4l7K9Jj7
5504c6K0M1m7M2p6P5l5KL1Rn6P4n4NN8q4LK7%J6rm0K6J9l3N9q1M6J4m3K7J2p7
5537f5K4P7j0J7mk2J0l1l0L6n2j4J00l4k0j7LP2n2L6%k9M6j7Qj5k9mJ2j9P4k1
5569C0o9J5L5Ok4K4j8P2o9mj4RJ0M1p5j1M3j3k1L8L3o3P3kK4m8r5N0j1K0K7K4
5601C7o3M2Np4J19n8l8K1K8n0J4Rmo5L9kQ8p3M2k3j0Jl1M7J3q5J33k0j2L0m7q
5633EJ0J1J7L6o7lJ7NMq6M2M2l6j9JjL0j0Rl4Mk3j5P2j1NKlk7l7N7RJ1J9p7K4
5669a7M1k3k4N8Pq5K1M3l1O5nj26N3K5K6l2j2N1m9j3M8kj3j2Q7j01NO9o1J3j5
$$ plain form
5700 -9 48 -80 24 -61 5 -8 19 -15 32 -35 -4 45 -45 4 13 -1 19 -32 -63 4 44 31 37 -29 -22 -8 6 39 -26 -52 -17
5731 -17 15 17 3 -28 18 45 -21 -31 14 26 -5 28 -20 -17 46 -18 -33 6 -41 1 -10 -13 27 14 16 -22 13 13 -4 32 7 3 28
5764 28 62 -32 -40 23 25 9 4 -24 66 -9 42 -27 -9 9 13 3 -9 17 62 73 8 -19 45 -21 -54 1 53 -39 -35 38 3 -19 6
5797 6 34 19 17 -19 -5 12 27 64 48 -22 -14 -3 -15 -8 15 33 2 0 -13 6 -9 30 -59 6 44 -6 14 17 -3 -34 36 37 -10 -63
5831 -63 7 -38 -2 24 6 -15 35 75 -49 19 74 61 -31 32 -26 -25 22 74 -42 -24 52 28 -38 8 -44 25 45 59 40 12
5861 12 -15 17 -43 -84 -53 -42 7 18 -60 -43 -53 -5 -21 -46 -40 58 -47 -32 -10 -9 -19 35 11 -31 16 41 53 31 0 63 -1
5892 -1 -43 33 -2 3 -6 -4 -42 40 23 -4 15 -39 -12 52 -20 -5 -17 -39 17 -55 11 20 -23 38 5 42 9 -29 -12 -11 -2 -1 13 49
5926 49 -12 -20 18 -12 14 5 27 -3 7 5 23 9 25 -16 22 -16 -19 -22 -12 20 34 15 3 -18 13 -5 -1 -30 -11 -15 -44 -37 -64 -67 -27
$$ packed form
5700iN7j28J04q5O6j3K7l4M7o7L1M9r0M9Rj4K0n1l1O7M0j3Oo6PJ4J4L3o5k6L5
5731a7L2Kj4l1M6K7o6j0M5J2l1L3m8LO3o4j5L9m7M2j1lM0j3Kl8L5%j7L6k5mK5
5764B8L4r4qO3Kj6nk8R0p5N1o9J8J8Mj0j2K6M5J1o5k7O4o6l3N5N2r2MP3l5k2K5
5797FK8j5kl6J4J7J5L7j6p0QJ1j2PK3J8l1kj3J9j5L9q9O5L8n0K0Lk0l1P0Jm7n3
5831f3P0m5L6K6j8k1N0M0j24O8N5j3r2O3n8JM7N2j16J8P6k4o6M6n2O9K0J4j9k8
5861A2k7L2o0m1L1J1M9J1p8J7j0M8j6k5OR8j05J5K2Jj0N4k4m2M7K5J2k2l1O3o4
5892am2P6l5NrKl8Q2j7k7J9n4K7O4p2J5j2k2N6p2O6Rm3O1l3L7l3l8J7JRJJ4L6
5926D9o1qL8l0K6rK2l0J0kJ8j4J6m1L8l8llJ0L2J4j9j2k1L1j8Mk9J9mk9Pk7lM0
$$ plain form
5961 -27 23 -7 -48 7 -8 27 32 32 30 -26 -6 0 0 -85 25 14 8 -4 -1 -22 -27 59 58 -42 -3 -31 -3 55 -8 -35 22 -18 -33 2
5995 2 -29 5 -28 -92 22 -37 -4 11 -11 -2 -28 6 26 8 -5 0 22 3 -20 -48 39 23 -33 -49 26 -79 -20 17 -28 22 8
6026 8 13 -5 31 -1 21 -17 8 -30 -17 -15 -35 -11 26 6 30 33 -35 -65 46 -24 13 0 -32 -59 7 -3 24 -26 16 8 4 7 1 -30
6060 -30 4 42 19 3 -17 3 -62 7 -26 -76 -1 -11 79 16 -26 16 27 44 12 -39 2 -22 40 16 -5 -68 43 -19 -10 22
6090 22 -41 -18 -30 10 -9 -8 25 11 -27 102 49 13 -5 -3 -65 -16 -46 -55 -49 -29 8 47 -23 29 -47 -50 53 28 1 -7 -27 5
6122 5 -6 -8 1 41 15 -31 -49 -35 34 -9 19 26 -3 -28 4 28 -6 24 48 -14 41 26 35 0 -20 11 0 -10 36 -23 18 -19 -1
6155 -1 -50 55 43 -35 -24 17 -23 -6 2 -50 -9 -37 -47 -48 10 -13 -74 -41 22 -5 -41 -27 12 3 -32 7 1 -3 2 8 3 -1 26 2 58
6190 58 6 -37 6 -25 -52 46 -26 -12 -50 17 48 33 -1 20 -54 13 -24 32 -10 -38 13 56 0 18 -59 43 16 -57 24 -37
$$ packed form
5961b7N0l0m1N5j5L5N%kn6K0O%q5J10j1oj2Lk1nQ6jj00L9k8K8N8o3k7N7m0j5L5
5995Bl1L4l3o4J14n9L3J5k2Rk6L4K0j8j3NK2j9k3k8Q7j6n6j6P5j05N9L7m5N0j4
6026HNj8L6l2K2l8K5l8J3Kk0K4L7k0K4Lo8l0J11p0L7j3l2k7O6j0K7n0M2qmLol1
6060c0L4L8k3j6k0K0o5O9l3n0P5j0R0o3m2M2J1J7l2n1M1k4O2k4k1o3J11o2RL2
6090B2o3K3j2M0j9JL3j4l8J29n3l6j8Ko2M9l0rOK0L7L9p0N2p6lJ03k5k7qk0L2
6122Ej1kRM0k6m6j8J4O9m3K8Pk9k5L2K4l4L0K4o2N5j5Rl5k0L1j1j0M6n9M1l7J8
6155am9J05j2p8J1M1m0J7Qn2M1k8j0jN8k3o1L3O3k7l6J4L9rl5L9omNOnmK7k4N6
6190E8n2m3M3l1k7R8p2J4l8O7L1j5l4K1p4O7l7N6m2k8N1M3n6J8p7J02k7p3Q1o1
$$ plain form
6220 -37 -7 51 52 48 5 -12 -19 -19 -46 56 5 23 -13 20 26 47 1 32 7 10 49 21 7 -10 -15 34 -53 -19 28 48 -15 -4 -49
6253 -49 6 -24 -57 -38 36 29 -19 12 62 2 -17 -8 -15 -5 -33 11 8 18 -35 3 13 4 -11 -8 15 3 -31 22 -20 -6 21 -36 48
6286 48 -24 20 -6 -21 25 -26 21 -14 48 0 26 -78 65 37 27 48 53 25 -27 23 0 67 16 -25 -7 -13 20 38 -8 -17 -12
6317 -12 5 9 48 7 -19 -1 79 -30 11 8 19 16 31 0 9 12 -41 63 5 -40 9 -12 57 -5 28 -39 2 -25 -63 49 8
6348 8 -11 -20 -1 -15 17 2 -3 1 13 19 -38 -35 36 52 20 18 23 -30 -35 -7 9 -7 0 -43 0 13 7 32 1 -65 -27 -23 13 10 27 -20 19
6385 19 29 -28 54 -3 14 27 36 -1 0 -28 -8 10 13 9 17 6 10 6 20 19 4 20 11 -41 -12 38 -26 11 71 -11 12 26 -47 32 14
6420 14 -32 -29 -31 -52 -31 -29 -4 -12 29 -2 -26 75 37 -3 62 -14 46 12 -10 18 -13 -9 40 27 -14 0 9 8 -42 23 15 -49 -47 2
6454 2 -58 -16 -58 -26 -3 -12 -9 0 -20 -23 36 21 13 -15 -9 12 -2 18 -9 14 10 -20 34 -21 -25 -26 -20 1 -24 34 -52 2 -51 29 -15 -22
$$ packed form
6220c7L0N8Jmm3j7p%k7J02n1J8l6L3OK1m6L1k5LL9k8j4j7nM9q7L4M7K0o3J1m5
6253d9N5l0l3J9P4pm8L1N0o0j9RpJ0k8M4lJ0n3L8J0rj5LK3j2l4N3m2J4K7n7Q4
6286D8p2M4k6j5M6n1M7l5O2m8K6j04J43k8j0K1Nk8n2N0k3O7n1m1J8oL3J8m6rN
6317a2J7ML9m1k6J8Q0j09M1lJ1lJ5l1RLn3J04n8m5M9k1O9o2L3o7M1k7l8J12m1
6348Hj9rJ9j4L2j5nMJ2On7LP1J6l2kNn3nK8J6j6Pm3M3J3oK5l1o6L8ML6lJ7m7L9
6385A9J0n7Q2n7J7J3Rl7Jk8K0J8LmQj1MmJ4jj5J6rn2K9N0o4L7O0q2K3J4p3P9j8
6420A4m6Lkk1K1KK5qM1l1k4J01l8m0O5p6O0l4k2K8l1MM9j3m1J4Rjn0O5qo4KM9
6454Bo0M2m2L2K3rLRk0lN9j5qk8OK1j4K0k7K3ml0N4n5mjOK1k5N8q6N4n3Q0m4p
$$ plain form
6490 -22 -22 -69 42 -16 12 -4 -36 -45 -4 -21 7 -10 22 55 -36 -11 5 -2 9 -18 -22 47 51 1 19 -32 28 37 19 -8 1 44 21
6523 21 45 10 42 -5 -32 8 -45 -13 50 41 33 31 -13 -39 21 -45 -73 43 -21 -34 -20 -36 -14 26 17 -31 -30 -5 -24 -26 22 77 17
6556 17 5 5 28 -20 1 -28 17 5 8 22 8 32 52 11 -24 18 -19 11 -2 34 -26 4 14 -4 -40 -2 -41 -19 5 5 27 21
6588 21 -33 -55 14 4 -16 58 6 -5 59 -35 -11 -14 -5 28 4 -24 7 12 35 -6 18 -1 -9 37 29 7 -20 -8 -14 -3 18 -31 -3
6621 -3 -21 -15 -40 -22 -5 -59 -9 1 -35 9 6 -47 -31 -35 -25 0 -14 9 3 85 -19 -32 -16 12 41 10 25 -15 -46 -19 -13 36 33
6654 33 49 -35 -10 -13 -5 6 1 -10 37 -15 -31 12 38 12 19 0 38 -16 -59 31 28 70 25 -13 9 -14 -15 -22 -11 20 45 36 30 47 4
6689 4 61 52 73 -34 41 56 36 -23 -22 8 -42 -39 45 7 -51 15 5 -52 48 -18 -23 37 -11 14 7 -56 16 50 12 38 27 -1
6721 -1 -28 16 -8 4 -56 14 11 2 37 -11 25 -37 35 3 -13 23 3 -25 12 -58 -16 22 -22 -29 -32 77 -19 -40 31 -27 16 32
$$ packed form
6490b2%m7J11n8K8j6l2rM1j7K8j7L2L3r1K5J6pJ1k7mO9Mn0J8n1O0Rj8k7RM3k3
6523B1K4l5L2m7k7M0n3L2O3rqkm4k6O0o6k8J16o4j3J4j6K2M0rm8JK5j9kM8N5o0
6556A7j2%K3m8K1k9M5j2LJ4j4K4K0m1l5M2l7L0j3L6o0L0J0j8l6L8l9K2K4%K2o
6588B1n4k2O9j0k0P4n2j1O4r4K4lRL3k4k8L1NK3m1K4j9qM6qk2k7J2oJ1K1m9K8
6621cj8Ok5J8J7n4N0J0l6M4ln3J6mJ0K5j4K3oQ2j04j3J6K8K9l1J5m0l1K7OM9l
6654C3J6q4K5lQJ1nj1M7n2j6M3K6k6Pj9L8n4m3R0lM2m5l8K2k3jpJ1L1K5roJ7m3
6689DN7rK1j07P5J5k0n9JL0n0LQ4l8n8O6j0n7J00o6nO0m8K5po3P2L4l8K6j1k8
6721ak7M4k4J2o0P0lrL5m8L6o2P2l2j6L6k0k8L7p0M2L8m4plJ09r6k1P1n8M3J6
$$ plain form
6753 32 9 15 -5 1 -51 54 7 -27 -4 5 3 -14 12 17 -9 31 -25 -7 -38 -18 -39 -26 -19 -1 30 27 8 2 -3 2 0 14 31 30 4 48
6789 48 1 -23 6 16 -12 25 -3 -11 4 -23 -3 -3 -31 -44 18 50 59 -25 -32 -5 22 -27 1 11 60 25 4 0 -17 18 34 20 -45
6822 -45 -34 4 -3 4 -16 -9 3 -48 -5 34 62 60 49 -46 -28 -14 58 -5 -15 29 15 8 -36 19 35 -1 -4 37 24 15 -31 -5 8 32
6856 32 17 2 21 13 30 3 42 16 -22 -38 -40 -17 -41 -10 -42 41 -29 37 6 -25 -17 -18 83 -2 -26 4 19 13 25 -7 -46 -62
6888 -62 -15 38 -17 -1 56 1 20 28 18 -60 -15 17 -20 -5 -13 54 -10 39 30 17 29 44 8 -28 -32 4 -8 -47 20 -109 -6
6919 -6 21 -49 -23 15 11 -7 -3 58 -22 29 30 -16 28 -57 3 44 43 20 22 2 -9 4 1 0 -19 34 -24 -55 18 -4 29 25 -3 -33 42
6954 42 39 -34 40 -18 -55 13 -30 12 13 -15 -10 -6 43 -35 5 -24 32 56 -43 27 17 21 -41 -7 10 0 0 -10 31 -5 63 13 -8
6987 -8 15 19 -4 34 36 21 20 -8 30 -57 -34 -24 -16 -2 -24 -18 -16 -10 0 13 -25 26 41 -48 56 -31 -8 23 26 -9 60 -10 19 -2
$$ packed form
6753C2k3Ok0On2J05m7l4K3Rkj7K6Nk6M0n6J8l1K0k1J3PJ8L1lj9onNkJ4J7jk6M4
6789D8m7k4K9J0k8L7k8qJ5k7K0%k8j3O2L2Rq4pK7K7m9K8J0M9l5k1mj7L5J6j4o5
6822d5J1L8pPk0PJ2n1M3L9K8kj1r5J8J4P2o3j0M4j4pm4N5J6l6lM1j3rm6K6J3K4
6856C2j5j5J9qJ7k7L9k6l8j6kK3k4L1l2Q3p0O6l1l1QjJ01q5k4L0J5oJ2l2l9j6
6888f2M7N3n5J6N7n5J9Qj0p8M5L2l7J5qO7o4M9rj3J2J5l6l6mL6j2l9O7j29J03
6919fK7p0K6L8mj8MO1q0N1Jm6M4q5O0M1jk3Kk0j1J3ljj9N3n8l1P3k2L3mk8l0P5
6954D2lp3P4n8l7O8m3M2Jk8NMM9p8M0k9N6K4r9P0j0Mo2L4J7j0%j0M1l6O8n0k1
6987hK3Mk3L8Kj5jk8L8q7K3J0QJ4k2OKOJ0J3l8N1J5q9J04q7K3L1Ll5O9p0K9k1
$$ plain form
7021 -2 33 8 44 22 8 -4 -26 -45 1 9 -6 -52 13 -3 1 25 30 -31 -1 11 30 57 17 -55 -44 29 18 33 -19 4 11 -5 11
7054 11 13 -12 21 46 -17 -23 28 8 39 -14 -5 43 5 -36 15 14 3 -39 17 20 37 3 -9 -10 24 21 11 -35 -9 -8 38 88 -59 -71
7088 -71 -19 15 23 -45 -46 -54 18 29 7 6 -4 8 -44 -29 15 9 -7 82 57 -18 7 -11 -15 12 3 49 26 -10 7 -55 -13 -36 6 30
7122 30 20 56 13 -50 -55 20 20 15 25 24 -22 -60 -32 9 -28 7 75 -12 -4 -34 34 -52 -2 -21 13 -60 -20 -3 -23 9 42 49 22
7155 22 32 9 -18 -3 -18 -10 33 -62 11 37 -1 -22 8 -12 -13 -10 1 -13 1 -26 23 30 8 -22 36 -79 -22 -13 -75 55 2 -32
7187 -32 -62 -17 -1 -32 -11 -20 38 -31 39 36 -56 -4 4 44 32 -16 9 13 -17 10 13 -14 -40 14 -6 8 3 43 0 59 -21 18 12 -8
7221 -8 -38 -27 32 -2 -7 44 4 29 12 -61 -42 17 20 13 23 -2 10 36 -11 -52 -7 -51 70 30 20 -26 -3 -45 -29 28 -21 5
7253 5 21 47 7 -38 -19 -20 16 15 -10 -36 19 -66 -41 33 22 -28 37 39 -33 24 6 9 -1 -34 68 71 47 -31 4 -27 29 -11 -38
$$ packed form
7021bL5k5L6k2j4j2k2j9M6Qj5m6O5j6MK4No1L0J2J9K7m0p2J1P3j1J5n2K3Pj6J6
7054A1Kk5L3K5o3oN1k0L1n3RM8l8m1N1jj1m2N6LJ7l4j2jL4lj0m6K6JM6N0j47j2
7088g1N2L4Qo8jqP2J1k2jj0J2n2J5M4oj6Q9k5p5K5j8mK7rM6k3l6J7o2M2k3M2K4
7122C0j0L6m3o3nP5%nJ0jm6l8K8M1l7L5O8q7Ql0O8q6N0j9L4p3M0J7k0L2L3Pk7
7155B2J0k3k7J5j5QM3r5P3K6l8k1L0k0jLJ1j4J4k7M9Pk2l0N8j15N7Ro2J30n3l4
7187c2l0M5J6l1K1rN8o9P0lr2N2QM0j2m8K5Ml0K7Lk7k6N4k0J4nM0m3N9q0L9ok0
7221hl0J1N9l4nN1m0K5j7p3J9N9LpJ0k5J2K6m7m1M5m4J21m0j0m6K3m2J6N7m9K6
7253EJ6K6m0m5J9jL6jk5k6N5q5K5P4j1n0O5Kp2N7j8Lj0l3J02Lk4p8L5l1N6m0k7
$$ plain form
7286 -38 -18 20 -28 44 1 22 -61 18 -43 -45 -26 -20 10 6 -6 -42 1 16 -29 0 -5 45 12 -26 -15 3 3 -3 7 17 -44 64 7
7319 7 -14 -71 -10 -15 -24 54 18 -14 -21 19 -23 36 16 25 -9 27 16 -25 9 38 -5 5 -55 -7 -30 -11 32 -24 19 11 23 5 -31
7352 -31 6 -4 6 36 -2 15 -1 -20 3 -16 9 -30 4 39 31 -51 -2 -44 6 8 -1 -8 -17 18 11 -55 46 -2 -9 57 -56 -40 -31
7385 -31 19 -30 -21 5 -13 3 25 -15 -62 38 -10 22 21 22 24 12 -16 -4 20 53 19 -37 -3 -49 -29 5 -51 7 25 -19 18 -16
7417 -16 -86 -19 -37 -38 -27 43 34 -24 8 -60 6 10 -19 21 -22 -6 -22 15 -33 22 -6 30 -30 -43 16 69 -21 -48 1 54 -13 -11
7449 -11 -50 56 19 16 -43 -2 -2 -19 11 24 -20 -21 20 -9 4 -14 -4 -32 8 -21 -21 44 8 11 7 -43 21 5 -40 0 -8 -12 31 -27
7483 -27 -2 8 -25 16 -24 47 40 15 14 32 -34 28 -16 -38 -30 27 -3 -13 1 -28 -28 -33 -33 -15 -35 14 20 23 32 -14 19 -1 -57 15 -13
7518 -13 19 -4 -33 -20 3 16 9 18 26 37 13 15 25 18 14 31 17 -13 4 -21 -17 26 -15 -40 17 3 -48 -22 38 16 -20 -94 20
$$ packed form
7286c8K0L8m8P2m3K1q3P9o1kJ9OL0mj2l6M3J5m5K9nN0l3l8J1J8%oJ0J0o1J08n7
7319Gk1n7O1nrP8l6l2pM0m2N9k0Rl4L6j1m1L4K9m3J0o0M8k3J9M3n6M3qJ2j8l6
7352c1L7j0J0L0l8J7j6j9K3j9K5l9L4L5qq2M9m2N0KrprL5po6J01m8pO6j13J6R
7385c1N0m9RK6j8J6K2m0m7J00m8L2jJKj2k8J2K4L3l4n6L4m6K0L4n6N8J8m4L7l4
7417a6p0O7j8jJ1P0rn8L2o8O6Mk9M0m3J6j6L7m8N5k8L6o0j3N9N3r0k7M9N3o7K
7449a1l9J06l7ln9M1%j7L0J3m4jM1k9J3j8J0k8M0k9%O5l6Lmn0O4j6m5M0qmM3n8
7483b7K5J0l3M1m0P1pk5jJ8o6O2m4k2QN7l0j0J4k9%n%J8k0M9OLRm6L3k0n6P2k8
7518a3L2k3k9J3K3J3pRQJ1k4KJ0pmJ7j4l0J7k5MM3m1k5N7j4n1K6O0k2l6p4J14
$$ plain form
7551 20 -31 -50 -39 1 7 18 -9 10 46 43 9 0 10 27 -55 -35 37 -10 -4 53 -13 -10 -7 -21 26 -10 28 -34 15 -39 -9 27 -1
$$ packed form
7551B0n1j9J1M0OJ1k7J9L6ll4rJ0J7q2K0P2m7ON7o6LLj4M7l6L8o2M9n4L0L6k8
$$ [...]
8191C3
##END NTUPLES=NMR FID
##END=
