##TITLE=1H_DE-80H_X3
 200.13MHz, d2o
 8 sc
 
 19ns.26.2.2025
##JCAMPDX= 6.0         $$ Bruker NMR JCAMP-DX V2.0
##DATA TYPE= NMR FID
##DATA CLASS= NTUPLES
##ORIGIN= UXNMR, Bruker Analytische Messtechnik GmbH
##OWNER= pz
$$ XWIN-NMR		Version 3.5
$$ Tue Sep 16 11:18:12 2025 Russian Standard Time (UT+4h)  Yarkov@DPX200
##.OBSERVE FREQUENCY= 200.1313
##.OBSERVE NUCLEUS= ^1H
##.DELAY= (6, 6)
##.ACQUISITION MODE= SIMULTANEOUS
##.ACQUISITION SCHEME= undefined
##.AVERAGES= 8
##.DIGITISER RES= 18
##SPECTROMETER/DATA SYSTEM= spect
##.PULSE SEQUENCE= zg30
##.SOLVENT NAME= CDCl3
##.SHIFT REFERENCE= (INTERNAL, CDCl3, 0, 14.3821)
##AUDIT TRAIL= $$ (NUMBER, WHEN, WHO, WHERE, WHAT)
$$ ##TITLE= Audit trail, XWIN-NMR		Version 3.5
$$ ##JCAMPDX= 5.01
$$ ##ORIGIN= Bruker BioSpin GmbH
$$ ##OWNER= Yarkov
$$ C:/Bruker/XWIN-NMR/data/yarkov2/nmr/H-C/1/audita.txt
$$ ##AUDIT TRAIL=  $$ (NUMBER, WHEN, WHO, WHERE, WHAT)
(   1,<2025-09-16 11:17:12.39 +0400>,<Yarkov>,<DPX200>,
      <created by zg, POWCHK disabled, PULCHK disabled
       configuration hash MD5:
       00 E9 B6 7A A2 85 ED C7 34 08 36 98 17 FE 4E 26
       data hash MD5: 16K
       E2 03 16 25 7A 23 74 AE F8 CB 6D DA 6A 9A 66 83>)
$$ ##END=
$$ 
$$ hash MD5
$$ DA 29 DF C7 0A 31 EF EF 08 A5 F6 92 12 C7 96 32
##$RELAX= 
##$RELAX= 
##$RELAX= 
##$RELAX= 
##$RELAX= 
##$RELAX= 
$$ Bruker specific parameters
$$ --------------------------
##$DU= <C:/Bruker/XWIN-NMR>
##$EXPNO= 1
##$NAME= <H-C>
##$PROCNO= 1
##$TYPE= <nmr>
##$USER= <yarkov2>
##$AMP= (0..31)
100 100 100 100 100 100 100 100 100 100 100 100 100 100 100 100 100 100 
100 100 100 100 100 100 100 100 100 100 100 100 100 100 
##$AQSEQ= 0
##$AQ_mod= 1
##$AUNM= <au_zg>
##$AUTOPOS= <>
##$BF1= 200.13
##$BF2= 200.13
##$BF3= 200.13
##$BF4= 200.13
##$BF5= 200.13
##$BF6= 200.13
##$BF7= 200.13
##$BF8= 200.13
##$BYTORDA= 1
##$CFDGTYP= 0
##$CFRGTYP= 5
##$CHEMSTR= <none>
##$CNST= (0..31)
1 1 145 1 1 1 1 1 1 1 1 1 1 1 1 1 1 1 1 1 1 1 1 1 1 1 1 1 1 1 1 1 
##$CPDPRG= <>
##$CPDPRG1= <>
##$CPDPRG2= <>
##$CPDPRG3= <>
##$CPDPRG4= <mlev>
##$CPDPRG5= <mlev>
##$CPDPRG6= <mlev>
##$CPDPRG7= <mlev>
##$CPDPRG8= <mlev>
##$CPDPRGB= <>
##$CPDPRGT= <>
##$D= (0..31)
0 0.7 0 0 0 0 0 0 0 0 0 0.03 0 0 0 0 0 0 0 0 0 0 0 0 0 0 0 0 0 0 0 0 
##$DATE= 1758007031
##$DBL= (0..7)
120 120 120 120 120 120 120 120 
##$DBP= (0..7)
150 150 150 150 150 150 150 150 
##$DBP07= 0
##$DBPNAM0= <>
##$DBPNAM1= <>
##$DBPNAM2= <>
##$DBPNAM3= <>
##$DBPNAM4= <>
##$DBPNAM5= <>
##$DBPNAM6= <>
##$DBPNAM7= <>
##$DBPOAL= (0..7)
0.5 0.5 0.5 0.5 0.5 0.5 0.5 0.5 
##$DBPOFFS= (0..7)
0 0 0 0 0 0 0 0 
##$DE= 6
##$DECBNUC= <off>
##$DECIM= 32
##$DECNUC= <off>
##$DECSTAT= 4
##$DIGMOD= 1
##$DIGTYP= 9
##$DL= (0..7)
0 120 120 120 120 120 120 120 
##$DP= (0..7)
150 150 150 150 150 150 150 150 
##$DP07= 0
##$DPNAME0= <>
##$DPNAME1= <>
##$DPNAME2= <>
##$DPNAME3= <>
##$DPNAME4= <>
##$DPNAME5= <>
##$DPNAME6= <>
##$DPNAME7= <>
##$DPOAL= (0..7)
0.5 0.5 0.5 0.5 0.5 0.5 0.5 0.5 
##$DPOFFS= (0..7)
0 0 0 0 0 0 0 0 
##$DQDMODE= 0
##$DR= 18
##$DS= 0
$$ [...]
##$SUBNAM2= <"">
##$SUBNAM3= <"">
##$SUBNAM4= <"">
##$SUBNAM5= <"">
##$SUBNAM6= <"">
##$SUBNAM7= <"">
##$SUBNAM8= <"">
##$SUBNAM9= <"">
##$SW= 18.0517328524113
##$SWIBOX= (0..15)
0 0 2 0 0 0 0 0 0 0 0 0 0 0 0 0 
##$SW_h= 3612.71676300578
##$TD= 16384
##$TD0= 1
##$TE= 0
##$TE2= 300
##$TE3= 300
##$TEG= 300
##$TL= (0..7)
0 120 120 120 120 120 120 120 
##$TP= (0..7)
150 150 150 150 150 150 150 150 
##$TP07= 0
##$TPNAME0= <>
##$TPNAME1= <>
##$TPNAME2= <>
##$TPNAME3= <>
##$TPNAME4= <>
##$TPNAME5= <>
##$TPNAME6= <>
##$TPNAME7= <>
##$TPOAL= (0..7)
0.5 0.5 0.5 0.5 0.5 0.5 0.5 0.5 
##$TPOFFS= (0..7)
0 0 0 0 0 0 0 0 
##$TUNHIN= 0
##$TUNHOUT= 0
##$TUNXOUT= 0
##$USERA1= <user>
##$USERA2= <user>
##$USERA3= <user>
##$USERA4= <user>
##$USERA5= <user>
##$V9= 5
##$VALIST= <valist>
##$VCLIST= <CCCCCCCCCCCCCCC>
##$VD= 0
##$VDLIST= <DDDDDDDDDDDDDDD>
##$VPLIST= <PPPPPPPPPPPPPPP>
##$VTLIST= <TTTTTTTTTTTTTTT>
##$WBST= 1024
##$WBSW= 4
##$XGAIN= (0..3)
0 0 0 0 
##$XL= 0
##$YL= 0
##$YMAX_a= 327812
##$YMIN_a= -205310
##$ZGOPTNS= <>
##$ZL1= 120
##$ZL2= 120
##$ZL3= 120
##$ZL4= 120
##$ABSF1= 10
##$ABSF2= 0
##$ABSG= 5
##$ABSL= 3
##$ALPHA= 0
##$AQORDER= 0
##$ASSFAC= 0
##$ASSFACI= 0
##$ASSFACX= 0
##$ASSWID= 0
##$AUNMP= <proc_1d>
##$AZFE= 0.1
##$AZFW= 0.1
##$BCFW= 1
##$BC_mod= 2
##$BYTORDP= 1
##$COROFFS= 0
##$CY= 83.5205535888672
##$DATMOD= 1
##$DC= 2
##$DFILT= <>
##$DTYPP= 0
##$F1P= 10.8118882576601
##$F2P= -7.23987719738617
##$FCOR= 0.5
##$FTSIZE= 0
##$FT_mod= 4
##$GAMMA= 1
##$GB= 0.15
##$INTBC= 1
##$INTSCL= 1
##$ISEN= 128
##$LB= 0.25
##$LEV0= 0
##$LPBIN= 0
##$MAXI= 10000
##$MC2= 0
##$MEAN= 0
##$ME_mod= 0
##$MI= 1.114404
##$NCOEF= 0
##$NC_proc= 0
##$NLEV= 6
##$NOISF1= 3.799351
##$NOISF2= 2.8
##$NSP= 1
##$NTH_PI= 0
##$NZP= 0
##$OFFSET= 14.38212
##$PC= 1
##$PHC0= -1352.778
##$PHC1= -0.009078503
##$PH_mod= 1
##$PKNL= yes
##$PPARMOD= 0
##$PSCAL= 0
##$PSIGN= 0
##$REVERSE= no
##$SF= 200.129724274929
##$SI= 16384
##$SIGF1= 3
##$SIGF2= 2
##$SINO= 400
##$SIOLD= 16384
##$SREGLST= <1H.CDCl3>
##$SSB= 0
##$STSI= 0
##$STSR= 0
##$SW_p= 3205.1282051282
##$SYMM= 0
##$S_DEV= 0
##$TDeff= 0
##$TDoff= 0
##$TI= <>
##$TILT= no
##$TM1= 0
##$TM2= 0
##$TOPLEV= 0
##$USERP1= <user>
##$USERP2= <user>
##$USERP3= <user>
##$USERP4= <user>
##$USERP5= <user>
##$WDW= 1
##$XDIM= 8192
##$YMAX_p= 0
##$YMIN_p= 0
$$ End of Bruker specific parameters
$$ ---------------------------------
##NTUPLES= NMR FID
##VAR_NAME=  TIME,          FID/REAL,        FID/IMAG
##SYMBOL=    X,             R,               I
##VAR_TYPE=  INDEPENDENT,   DEPENDENT,       DEPENDENT
##VAR_FORM=  AFFN,          ASDF,            ASDF
##VAR_DIM=   8192,          8192,            8192
##UNITS=     SECONDS,       ARBITRARY UNITS, ARBITRARY UNITS
##FACTOR=    0.0002768,     1,               1
##FIRST=     0,             0,               0
##LAST=      2.2672688,     0,               0
##MIN=       0,             -205310,         0
##MAX=       2.2672688,     327812,          0
$$ Real data points
##PAGE= N=1
##DATA TABLE= (X++(R..R)), XYDATA
0@%%%%%%%%%%%%%%%%%%%%%%%%%%%%%%%%%%KnOoOpQqOmPj0J0j0J0j2J6j8J7j8K1
55A1k5K8l1L2l3L9m5N1o0P1q8J18j73L51j888k5331m8290m9995m5616l4436R261
76a96049M7358O4386O9045O0472M5145J8070n131q859k2007k9953j7026k3703
88A748l7426l2467k6239p940J9622L6585M6169L3721R257o9j3760k3407j0340
101d546L6Q890K3361K5615J6416j170j6333j6579j9106j7406q816k1439l2445
114f3522k2089j4044L444L2812M6129M8643M3531K7614P368j7794l1237l0172
126C0683k9247j7599n989j3925j8050j4969j1458N653K2230K8800K9747J8341
138B4217Q050L261p060q042k233l453l93P8r531j7259k1690j4829K224J4420K6569
$$ y = [0, 0, 0, 0, 0, 0, 0, 0, 0, 0, 0, 0, 0, 0, 0, 0, 0, 0, 0, 0, 0, 0, 0, 0, 0, 0, 0, 0, 0, 0, 0, 0, 0, 0, 0, 2, -3, 3, -3, 3, -4, 4, -4, 2, -2, 5, -5, 5, -5, 5, -7, 9, -9, 8, -10, 11, -14, 14, -17, 15, -18, 21, -24, 27, -33, 38, -50, 68, -105, 246, -1642, -26973, -75263, -125258, -170874, -205310, -196049, -148691, -84305, -15260, 45212, 90357, 108427, 103296, 94437, 72430, 42477, 25451, 1748, -35678, -68145, -94384, -102324, -82702, -46117, 52, 33773, 43030, 42961, 29201, 5794, -4546, -4510, 4380, 27741, 53356, 69772, 68602, 52269, 35690, 16584, -822, -9638, -31077, -63522, -85611, -99655, -96211, -63399, -17270, 31373, 74904, 102518, 109886, 92092, 60855, 30683, 1436, -16163, -22152, -36077, -54127, -69096, -80554, -74901, -52671, -23871, 5876, 24217, 32267, 35528, 28468, 20426, 18193, 14740, 14347, 14425, 4894, -12365, -34055, -48884, -46660, -32240, -5671]
153e671K8246J2156L900m59r204o009j558l835k714m012p470j0398j3409n259
167b5696M238Q673J6193J0448o241j2115j4888j2372R94Q772J2579J2889O457
180I931M142j96o184j658M40J74M570p02r296j1639j1761k431Q387J2658J6313
195A2748Q645l151l984p922r428p99J319K701O134K092j957n925q089q05K650
210e771M646P565k015q860n772n719N19R949R849R545N464k215m901r972j0652
225h340k690k67L828Q202J092k826k427l293K283N355L525K757m162p174l435
240g572m431L22Q283P252Q307P189j580n925q887q185j749N23L329M568k170k529
256c255j7j963K216N034J625J804q70m030l452m310k98N125M300N732K970n111
$$ y = [-5671, 22575, 34731, 38631, 38172, 28968, 22959, 21401, 17566, 14852, 10840, 3370, -7028, -20437, -25696, -21458, -12785, 3408, 13856, 7615, -4500, -19388, -31760, -30766, -21994, -9415, 3474, 9931, 14073, 13877, 7693, 6035, 6475, 6649, 11219, 10517, 1221, -10418, -22179, -24610, -16223, -3565, 12748, 21393, 18242, 14258, 6336, -3092, -3891, -2572, 129, 6263, 8355, 6398, 473, -7616, -8421, -5771, -1125, 6440, 4425, -4435, -10207, -15926, -15407, -5458, 4391, 13936, 19400, 17185, 12284, 2312, -8340, -11030, -11297, -7469, 733, 1825, -1001, -3428, -6721, -4438, 917, 4442, 7199, 3037, -4137, -7572, -12003, -11681, -3398, 3854, 12161, 19350, 17770, 11845, 2958, -5227, -6976, -6453, -3124, 1444, -726, -3255, -3272, -5235, -3019, 2015, 3640, 5444, 4574, 544, -2908, -7218, -7516, -2391, 1909, 7641, 10611, 5500]
272E500n741n279m292J862L869L952M007k00n15p52l515K55J770k86J849r1l621
289a228j982j248J554N049L813L310l73n868m462m596m419J423K617K467M202
304B59J512J19r2j465J507J844L05J701j842m575j719j840k92L084J979J734M32
321B651k540j585k068j490K797K168J746L170n80j678o57j588K82R93j51P94j826
338D38k693l52j505M3L133J167J067R86k138j578j323j002J897J173J611K943
354C867l38k49O67j897n30R6k238j554k517k950l10o1K622N271L141L588L168
371I776j251j226k183m424k574k429j810O71k35J318L209J691L547L398n00m86
387F492j939l966k136k151j436P32P5J690K271j01R14L12j616P91O83l50Q85o3
$$ y = [5500, -241, -5520, -9812, -7950, -4081, -129, 3878, 3678, 3163, 2411, -1104, -849, 921, 635, 2484, 2393, -1228, -3210, -4458, -2904, 2145, 5958, 9268, 8895, 3027, -1435, -6031, -10450, -9027, -6410, -3943, 259, 1771, 1890, 1798, 333, 1840, 3684, 3989, 5690, 3848, -727, -2446, -4286, -4578, -1494, 485, 2219, 2651, 111, -1474, -3542, -5032, -2235, -67, 1679, 4849, 4269, 2591, 1934, 346, 628, 1621, 1470, 2264, 438, -2255, -2607, -4112, -4069, -936, 231, 1298, 2284, 146, -1432, -2755, -3757, -1860, -687, 924, 3867, 3529, 3280, 3947, 2050, 1520, 1616, -622, -2176, -4693, -7643, -7953, -8014, -5392, -121, 3020, 6608, 9776, 8525, 7299, 5116, 692, -1882, -4311, -6121, -5450, -5685, -4367, -1158, 533, 4080, 7478, 6978, 6492, 4553, 587, -1549, -3700, -5136, -4404, -4329, -2639, -368, -469, 445, 757, -859, -68, 615, 265, 1150, 1087]
405A087j37R05l72J64l17k308m08n00j167J122N37Q3J910R70N81J63j933j298
423i18j323j428J107J108P54K870J922J263J185j558k721l462m027j808j165n03
439h704K457K764L606N654L407J976R23j920k545l380m513l675l558k207J139
454h576J346K095K725P63Q06J343Q7N16O2n19P08J64K01P73j211p88K19q45m8
473a79l22j571m83R6Q37K223J105P46Q25j001l75j61j616n72P0j56J289K75o80
492C50m81j500m2P64l75L13k0j124P08Q71M08J429L92K32Q16p53o80r03j894K31
512a258Q46K33J082n32j534k10n42K66Q79m25M92M77n62P68j25r00Q02O84M11
531H52J069n59q00r5j42J436J285J5L91j064j807l72j443j190Ol76N33Q53k34
$$ y = [1087, 950, 1855, 1483, 1647, 1330, -978, -1386, -1886, -3053, -1931, -1394, -1311, 599, 1569, 2150, 2313, 380, -918, -2241, -3669, -2562, -1454, -700, 2170, 4092, 5355, 6540, 4982, 2261, -1201, -5228, -7036, -8201, -8704, -6247, -3483, 123, 5777, 9184, 11160, 12083, 10163, 7618, 4238, -275, -3950, -7508, -9715, -8576, -7230, -5135, -2410, -1647, -841, 502, 589, 1105, 1167, 648, 1356, 1520, 1721, 2494, 1283, 495, 714, -131, -179, -501, -2072, -2555, -2459, -1622, 601, 1706, 2452, 3277, 2276, 1901, 1740, 124, -448, -378, -534, 755, 1030, 350, -131, -1631, -1673, -909, -1284, -971, -991, -2115, -1407, -536, -128, 1301, 1693, 1925, 2741, 1988, 1308, 405, -1489, -1258, -412, -179, 903, 371, -1163, -1373, -1915, -1649, -770, -1195, -703, -226, -788, -20, -145, -1045, -243, 441, 852, 1921, 1362, 562, 467, 325, 1761, 3046, 3061, 3452, 2388, 581, 209, -1234, -2424, -2418, -2794, -2261, -1408, -1642]
550a642L41j59Q5J809J176L65M61j458j596m17q21O1K08l18P95M15J68J031O0
569E64M24J835Q09M75k80k128j896j507q98L94J90J91J000J36O76J232l1L55M73
588B014m53k52j096j920j202r17N58K099J403J388Q79m63Ko6r55m05q36p85j03
607a110o10k34L55J15J432J841N92L41j000k248j502j100l45O01L40J048J507
624B3Q55J580J087J02O87j10r49j165k437k471j375o96R93J631J226J619Q15K16
642A631P50j42n24j85q96p67m73j266n62k05J59J748J254N55O13q15q72n0n00
661e47K28K09l14M88kk62N88j06J90J148L07r4k55j463j096n71m09P05K82J8N42
682d14r2P6Q98m9L66O48k37K3n56j229m11l72J30J172L90K17J61p17k49J64l20
$$ y = [-1642, -1301, -1460, -1375, 434, 1610, 1975, 2436, 978, -618, -1035, -1856, -1795, -1587, -1905, -1110, -695, -527, 504, 564, 988, 2823, 3632, 4107, 3827, 1699, -197, -1704, -2602, -2208, -2018, -1827, -827, -691, -15, 1217, 1186, 1541, 2014, 1561, 1309, 213, -1707, -2909, -3826, -3268, -1169, 234, 1622, 2501, 2038, 2040, 1974, 1019, 614, -222, -1007, -1110, -1720, -1954, -1599, -1484, -52, 1789, 2381, 2722, 1722, -526, -2028, -3128, -3473, -2872, -2532, -1484, 23, 878, 2458, 3545, 3647, 4334, 4224, 3275, 2110, -327, -2798, -4173, -4869, -3876, -2245, -1019, 600, 1415, 1631, 2381, 2239, 1715, 1530, 634, -133, -606, -1872, -2434, -2639, -2480, -732, 522, 1077, 1690, 875, 3, -47, -547, -319, -110, -424, 64, 62, -200, 388, 282, 472, 1620, 1927, 1833, 1578, 115, -981, -1552, -1961, -1256, -974, -956, -414, -506, -430, 468, 419, 785, 1433, 1196, 1219, 663, -566, -977, -1349, -1219, -47, 343, 560, 721, 4, -245, -81, -401]
703d01K46O4k35K38k72k51L47l0N37J046J03rk84j033l36j94q3M54j63j96J30
724c22n95J3L05j53P56P29M6L45m24o79j34l40K22M08k78l1q6m81M66K75Q8N30
746F60R4j27j91p81m11j44j96Q04O11J18M72k23m67K08j18M5J43m44j14l30n95
767i86J03L6L2P44J77o4J12m83j26L07O0P50L32j57K23m30n71ol71j92L38k43
789d15P2J4k70K77J28K24O49K0k21M4o07k18L78j49L36L05k36J55m07n13O3k84
811f55K9M25j18RP9l62J95K30J05N35n9j58J61m42j15L12j65K46L69l20m9k81
833b9n05J46k27K08M41p8J21J77k94K62K12o0M13m5k93J5m44k22K7l48J93J62
855a68l39P4n9l14L55J79J74M64r8M7lm55NQ6k41L01Q3k15L09j66K0L10j51K08
$$ y = [-401, -155, -91, -326, -88, -360, -611, -264, -294, 243, 1289, 1392, 1383, 1099, 66, -270, -464, -547, -93, -256, -452, -322, -917, -904, -599, -752, 4, 733, 779, 1124, 700, 21, -113, -453, -231, 177, -101, -132, -218, -699, -233, 42, 130, 660, 754, 627, 436, -345, -756, -900, -1096, -292, 319, 437, 909, 686, 219, 427, 309, 354, 497, 53, -61, -391, -986, -883, -847, -815, -71, 106, 42, 154, -329, -455, -148, -88, 662, 994, 837, 1060, 630, 59, 53, -318, -510, -172, -415, -343, -329, -599, -322, -194, 30, 679, 699, 478, 522, -85, -303, 75, -74, 262, 567, 331, 486, 79, -434, -371, -655, -626, -201, -319, -310, -231, -593, -398, -168, -63, 472, 413, 255, 416, -26, -141, 171, 6, 252, 621, 301, 252, -29, -534, -388, -615, -407, 34, -44, 77, 254, -40, 222, 434, 374, 787, 742, 449, 464, 20, -202, -175, -523, -330, -168, -507, -433, -492, -806, -451, -272, -98, 366, 268, 315, 312, -143, -138, -52, -293, 8, 91, -124, 185, 19, 39, 349, 198, 406]
879D06Q9m82n1k53l08K88nJ99N47R4Q3K20l17J9j48l46ok95k82l2j84j05M52N6
903c61M38L24j45J46k64l41J13k14o0J97j71J38L27k8L47K38k7K04k35l63q0o60
925d77k32L2j82K54M03J4L39K01N2L48j48l2O0m19j31q9m94O0J17j41L24j9j34
948b94K68k65p0K55k43K02J86k31K60J89k06L55j1p6K88l21j33l2n62K6m2k93
970g50K77J12j61M08O4J84M24M8J36J85k95M0k13m60ok14k79J40k05Q0K34j13
992c64K45K61j02K87p1k06K38k37j13J53j21K6K12j79J6o5k80J23j30j70J71j12
1014d18p7L45k3K24K18pK33Q1k35R8k87k32M5k09j0J16j34J28J35l2K27Jo5K06
1038C28j41j40J61k55o4J19k23J55J28k05J66OqK15j39N1J27j68k6M8k19L7j55
$$ y = [406, 495, 13, -38, -291, -599, -311, -316, -117, 430, 524, 607, 827, 510, 529, 381, 35, 29, -266, -548, -580, -764, -869, -417, -361, 77, 401, 256, 402, 138, -203, -90, -304, -364, -167, -338, -200, 127, 99, 446, 684, 657, 861, 626, 263, 183, -477, -709, -677, -859, -605, -202, -188, 151, 352, 404, 752, 604, 572, 632, 213, 82, -7, -501, -441, -324, -465, -141, -160, -294, -26, -291, -361, -106, -349, -147, 39, -192, 68, 257, 51, 406, 395, 319, 607, 286, 153, 121, -441, -415, -457, -750, -473, -361, -522, -114, -50, 134, 558, 606, 742, 927, 632, 672, 459, -1, -7, -221, -500, -360, -565, -485, -251, -364, -119, 142, 40, 327, 256, 50, 288, 51, -62, 91, -30, -4, 208, 29, 45, -20, -300, -177, -307, -477, -306, -418, -495, -150, -173, 51, 269, 262, 495, 576, 341, 439, 152, -80, -35, -244, -254, -138, -272, -144, -9, -41, 186, 187, 122, 328, 187, 47, 208, -47, -111, 8, -215, -60, 68, -137, 29, 35, 27, 242, 103, 154, 281, 113, 87, 135, -84, -47, -202]
1061b02j68J35j47K3J61j19K01K69j50K44M4j45J30q7r4J9k29K8J11j98J41o6
1083i9j92J41L0j22J95MK6K62r6K21Q4q2J29p5k81Lj48k29Nj86k2J18q7J67Q4
1108a50k8L11Q7p9K82l6q3K26k22K4J1l04M2q6k88O6j85j98K75j31O9L45j33J51
1132c4K33q9J35k4j25J58j78q0J08k06r1J56k18Q6L6j07J45l0j1K93j12P5K45
1155C65j72J06J11j67M9l8k30J13j78j56J32k45lJ71k12J30Q9p6J97L8kJ52n2
1178A22l0J90j35K0Q7k56Q7l3j53R0n8j18J54j36J1J14j10J25M5j20K09j2n3J67
1202B07j30p4K21j84j0K7j73R6P5k23K16j02l3J85j45RQ1j39N7Q2j64K41m9NK6
1227A02jNJ15j54J5m4k03P6k1k05J48k3j03K61p9O4J32r8J31N2p9O0l5j60K37
$$ y = [-202, -370, -235, -382, -359, -198, -317, -116, 153, 3, 247, 291, 146, 276, 189, 95, 114, -115, -87, 24, -174, -33, -99, -291, -150, -120, -242, -47, -43, -17, 245, 149, 370, 454, 372, 501, 426, 145, 148, 0, -229, -224, -410, -432, -314, -401, -234, -150, -178, 133, 220, 141, 423, 387, 304, 530, 308, 332, 343, 39, 81, -5, -293, -227, -412, -610, -335, -466, -397, -52, -185, -34, 199, 110, 245, 221, 96, 254, 76, -4, 104, -102, -193, -37, -255, -169, -133, -240, -95, -125, -136, 157, 45, 120, 365, 193, 299, 410, 243, 292, 254, 24, 137, -41, -197, -65, -310, -313, -142, -354, -224, -135, -211, -14, 24, 22, 174, 122, 92, 282, 147, 167, 254, -2, 85, 52, -101, -11, -69, -187, -33, -169, -158, -44, -154, -29, 16, -104, 105, 93, 40, 207, 77, 3, 224, 40, 30, 57, -116, -20, 55, -168, 48, -54, -87, 98, -47, -38, 43, -96, -39, 43, -121, 120, 71, 76, 102, 101, 106, 221, 67, 82, 38, -165, -89, -110, -315, -167, -190, -293, -32, -111, -47, 85, -13, 118, 170, 91, 151, 116, -44, 193]
1252A93j92m8J78k31O9P4j81K3Oj22J95j11j1K30r8J36J53j47J05O6k25J26j00
1275H8j37J28k09n5Q5q1J4R4j51J44J05j10J54L2j39K27j50l7J35j41k1J42j68
1298e1R6J6j60J66m8j27J28j43L8Q6j69J46Np3J22P9n0J92j09m6M7j41N6J8j76
1323i8J04n9j47J36Jn3Q1j02RQ7j46J13P5j12K14Jm0J51q5rP6j06m0L4k13P0m0
1350i8j82J77p5k4J70p5K2J87j5R4P6j38J26m4j9K2j49q2nj93m9K5j00K3Q4M6
1376a96Q6N8J25K13q2N0Q1j35K1j0j71l3q4j02L2j15KJ10q4P6J31k8J43J35j21
1401A02J75m3l3Q7j82nNj45j1j9j57J60j8j40J47k0K9K6nR4M8j21J04j8n7J61
1427A64r8q7J30j41L5R5j82mP7r5J14l2q3J51p2K6J49j33M6K8r7N2j9j18J03j4
$$ y = [193, 1, -47, 131, -100, -31, 43, -138, -115, -109, -231, -36, -147, -158, 72, -26, 110, 263, 116, 221, 287, 62, 188, 88, -49, 79, -130, -185, -100, -181, -167, -73, -224, -80, 25, -85, 69, 101, -38, 189, 39, 2, 137, -4, -25, 117, -51, 45, 61, -99, 67, 19, -108, 20, -123, -85, 1, -168, -22, -17, -90, 32, 111, 61, 253, 144, 98, 145, 4, 60, 78, -98, 6, -53, -200, -64, -63, -116, -35, -137, -128, -41, -187, -74, 1, -111, 103, 104, 64, 215, 130, 121, 197, 91, 51, 85, -128, -58, -98, -280, -103, -178, -202, -32, -107, -85, 102, 87, 181, 257, 119, 245, 201, 182, 204, 55, -27, -32, -225, -274, -249, -349, -326, -242, -196, -110, -52, 73, 286, 204, 254, 335, 200, 221, 211, 40, 7, -77, -179, -147, -262, -260, -150, -234, -158, -27, -55, 88, 223, 102, 277, 234, 201, 288, 106, 101, 106, -39, -50, -69, -226, -66, -84, -224, -77, -97, -68, -42, -47, 47, 95, -26, 78, 60, 3, 164, 66, -21, 109, -32, 3, 98, -84, -88, -11, -106, 8, -24, -107, 44, -28, -2, 147, 14, 60, 88, -9, 43, 24, -94, 9, -5]
1453eq2J88j44L5L4q8Q1j7j19Q8m3r3J72r9N4J30p6N2J15j29N6M7j53R5j27q2
1479a10Q7j30J6M0k4N5j9L1M4m0J2R8pm7Q5rj8Q4p4L4Rp1N6l1j40O4j23l9O3l2
1509a36K2jm7J29P3o1J40k4J4M7j04O7K6j51K9j19j2M9J4r1J33j22N9O1J3M8L4
1536I0p7J63q8n2J10n9m8O4j02jk0j27Q0m6j8NJ2k0J21omJ54k3k8J85j82J11r8
1564I6j4K2r7j27L2j05oN2m2J3R8m1J07O4p5J62q0j7J28j07p0J52j69N7j3j57
1590a37J52n3k8Q7n1N4L2l9NJ9r9P4L0m9N9m9l5P6n8O4Ko2Nm6n1J17p7j2L4r5
1620a31R2L9J9O1m5o5O6j4j4R8m6l7L7p9N6rq6O1jq5O4J7j54J10p9N1J03m0K7
1649A6P7j05J11L2n6M5o5o8M6o1l1Q2j30OoJ4rK5O0M1l2K8R7l3K0N1m2Joo9pl6
$$ y = [-5, -87, 101, -43, -8, 26, -62, 19, 2, -117, -29, -72, -165, 7, -92, -38, 92, 16, 68, 183, 54, 110, 157, 4, 99, -28, -110, -23, -153, -137, -97, -121, -66, -85, -54, -10, -50, -38, 60, 53, 6, 91, 82, 64, 148, 74, 108, 117, 46, 102, 71, -69, -5, -128, -167, -104, -136, -114, -115, -162, -33, 40, -21, 119, 95, 109, 156, 52, 119, 145, -6, 23, -96, -108, -59, -45, -136, -3, -125, -66, -5, 8, 56, 90, 13, 176, 88, 36, 146, 87, 39, 103, 1, 0, -20, -147, -67, -113, -131, -126, -114, -134, -13, -19, -23, 131, 108, 80, 265, 83, 194, 96, 82, 104, 7, -120, -88, -193, -199, -147, -189, -176, -78, -119, -12, 52, -23, 139, 59, 42, 170, 63, -7, 145, -24, 33, 20, -137, 15, -38, -66, 21, -30, 24, 56, 17, 22, 41, -58, 16, 46, -3, 56, 7, -28, 48, -10, 54, 56, -6, -1, -47, -98, 19, -58, -70, -36, -131, -39, 0, 19, 80, 35, -30, 36, 22, 8, 106, 60, 23, 60, -19, 37, 28, -58, 3, 2, -83, -19, -2, -156, -46, -125, -74, 29, -11, 16, 93, -12, 99, 131, 75, 120, 55, -13, 33, -28, -59, 23, -107, -101, -107, -93, -102, -77, -17, 24, -8, 20, 117, 84, 104, 155, 113, 114, 108, 39, 32, -4]
1681dq8J18j13j4R4j25M2J32o8M1kl5Q9Qm5J2j8K5J3p9JL2p6O4k6p9P5p7K0N6
1711b7l1M0K5j3L9Q9n3O6q4jM2o1m4J5j5lo1n6Q9L0o2R5q9N6K3mLnk1K6M5o7L4
1744B0K2p4J85j63N9l5j25P0n3k1JJ0K0J14n8M8P7QK5n1m1Q4l6j13Mj29O1O5n2
1773g8pO6m4J03m2K9K9m2LR1j20L4k1M1J8OqK2j0j02K7Pl6N2j33rQ3qk6M2K3Q0
1805G0ml1Q1m1J9l3o6K3n8k9joN6J0RnK5k0M1j4L4m7nm5M8j8mQJ4oN9n4K2J6p7
1840b9l8J1l9L2l8L6M4K1L6N3k3K2R8p9k5Jm8J1m4j08N3n5K3O2k1N4l3q0J35m
1870B8Rqk0o7J10q2P6j4K7o5Q6p6j0l8rK1m3j4Q1q9P6OM1K5L1m0O4j43P3Q8p0
1901E4Mm3q9N4k4j8MJ1M4K7m5K3M0q4J39m8q0K1P5m2O1r3O4J3r6K5K4o5N0mj12
$$ y = [-4, -92, 26, -87, -101, -7, -132, -90, 42, -26, 15, 13, -22, 67, 75, 30, 42, 24, 49, 62, -17, -16, 16, -60, 4, -22, -101, -26, -103, -83, -27, -58, -18, 7, -6, 33, 122, 69, 135, 51, 50, 92, 31, -13, 2, -13, -16, -77, -133, -44, -14, -76, 19, -70, -14, 9, 5, 8, 3, -18, 8, 53, -14, 20, 42, -32, 153, -10, 49, 14, -111, -41, -94, -115, -114, -104, -84, 30, -28, 20, 97, 105, 130, 79, 38, 122, 86, -27, -23, -152, -91, -26, -78, -85, -19, -63, 40, -2, 27, 56, 14, 17, 108, -12, 22, 1, 42, 60, 66, 58, 80, 70, -32, -5, 2, -34, 18, -115, -124, -41, -49, -75, -33, -10, 70, 66, 35, 116, 75, 94, 61, -5, 18, -40, -69, -70, -76, -20, -10, -1, -6, 19, -1, 40, 26, 60, 13, 8, -37, 11, -7, -11, -3, 11, 5, 64, 10, 32, 48, -29, -67, -56, -95, -63, -101, -65, -21, 0, 36, 89, 66, 88, 186, 107, 82, 83, 35, 46, 2, -106, -53, -108, -85, -23, -44, 10, -23, -103, 32, 28, 37, 29, 9, -58, 52, -30, 46, 32, 59, -6, 80, 4, -6, -44, -53, -32, -75, -89, -8, -97, -21, -15, 26, 51, 82, 42, 106, -37, 36, 124, 54, 58, 15, -74, -20, -44, -62, -58, -47, -3, 24, -21, 2, 42, -42, 97, 49, -31, -10, 65, 23, 84, -9, 55, 68, -28, -3, 21, -44, 6, 2, -110]
1932a10O2Nk6O0m6L2M4O3l0Rj9J7q3M9J7q7K0Mj7N0l0k9j0mN4L4j06J7O0j4M3
1963B9L0J1m6K6L3l8p%po1LNj5lK1j4L2KqL8Oo1N5j3l7O5j01J47k7o2M8p6k7N6
1997Dl9k5M5l3M1J0j8k9J40j37J25l0j5P5j08k0Q0p5j7L5o0R0p5J1L9p0R9l3n
2026EJ7l4J2L4l4R2kl9j7K5q0N3k7p1J6j1j3j6N5J2K1J4qj9RjR7p2n0Q9m8jMr
2060Cj4K7k4L3p1M7L2r7M1k2N4K3J6o1O0l1k6N0n3J2J2m5%Qj0O2n2j6M0o1M0J9
2092dn1N7M6l0k6O1l9K3Rj6kl9N0k9pQ6r5l4kM4Qn3M0J7j2pL4%j9R3n5K1n7M6
2126E8o5O6r9K1L6q8M6L7n0K0K9l0J2qJM5mK3L5m5L2p1j1O8j21L5M8m3J1L4n4
2157c2oM4j1j4N4o9M7m5J2p%J1M6M9q6J7M3m0k8n2Q8q4L1qoQ1m5Oj6J00j5k5L0
$$ y = [-110, -48, -43, -69, -9, -55, -23, 21, 84, 54, 63, 44, 61, -22, 27, 44, -43, -23, -19, -36, 14, -16, -45, -55, -59, -5, 29, -77, -60, 0, -14, 29, 59, 70, 24, 50, 83, 45, 38, 38, 31, -30, -27, -22, -37, -40, -19, -33, -1, 1, -7, 31, 37, -24, 31, 18, -19, 46, -55, 92, 65, 3, 51, -25, -52, 4, -35, -60, -15, -48, -7, 3, -15, -44, 96, -41, 84, 54, 39, 114, 6, -14, 66, -9, -26, 9, -51, 39, -36, -25, 14, -56, 43, 10, 5, 22, -12, 0, 34, 0, 92, 90, 51, 34, 59, -21, 32, 5, -66, -50, -61, -74, -90, -35, -23, -2, 12, 4, -15, -6, -7, 90, 18, -32, 57, 9, 8, 12, 3, -11, 16, -8, 25, -46, 1, 33, -64, -23, -45, 9, 32, 48, -13, 47, 16, -10, 40, -13, -1, 11, -34, -34, -26, -36, 26, -26, -42, -2, -63, -23, -4, -55, 2, 48, 18, -8, 53, 14, 37, 46, 30, 28, -11, 39, 10, 3, 89, -6, -40, -42, 2, 10, -43, -3, 14, 2, -5, 29, 29, 10, 103, 48, 69, 12, 58, -7, 59, -40, -19, 17, -71, -25, 12, -38, -18, 11, -19, -7, -15, -14, 31, 27, 50, 85, 40, 72, 1, -10, 58, -63, -28, 20, -23, -12, 22, -32, -38, 6, -5, -19, 35, -34, 13, -32, -20, -27, -27, -16, 30, 79, -7, 10, 53, 13, -15, -67, 21, -63, -32, -40, -46, 35, -10, -4, -20, 80, 65, 40, 70]
2190G0m9k7l3O4J9j23O9qk1P0o4%M6j17O5N2o0L8k0j9O3j8pJ08p3J0n0r8J05L9
2220C1j04R2l7k1J3L5l0P1j1RJ2No0N8l4j5J1J4j9r9k4R5l5K3l8LK5j6j8L1N8
2251B5j7L6n5P7r4O1k3M3r3L5K5o9nN2Lj4l5M3k0k0N5l5L6K0p6Q5L5n7L6m4l3
2282b3M9K2o5J1L1m2j7k0J4N7RK3q6L2N9k7KL2n5K0k5nK5q8Q6qpk2K3k4%M9n1
2315b1J7M3q6M2KM0j4jm0P9n1QN8q9Kk0JJ5m1lkj5N0L0l8K9O8j03Q7l3O8km5m3
2349hj0L9j9N5p3k7J3k6M5N0j0n4M0p1O8nn7L9N7k8J8m8MJ5Nmj4L3n9k1l2N5L
2382b7k4J2K6M2j4K3k3L2o3L8M7m6Rl7J9K5j17R5j3o3M8n0O2k5L7jl5N5pn0M8
2413B3rP1n0Ll8k8K2j1M6k9o3P9Ljk9J0L0j6L7n5Rl5K7O1Ok1n8K6k0K0k5l6N9
$$ y = [70, 21, -6, -39, 25, 44, -79, -10, -18, -39, 31, -33, -33, 13, -104, -39, 13, -47, -9, -29, -48, 15, -3, -10, 98, 25, 35, -15, -113, -8, 31, -73, 19, -18, -39, -26, 9, -21, 50, 39, 48, 60, 65, 5, 63, 29, 14, 25, 39, 20, -79, -103, -8, -43, -20, -58, -55, -30, -46, -64, -33, 25, 8, 44, -11, 66, -28, 33, 10, 53, -40, -5, 20, -49, -54, -2, 1, -13, -48, -5, -25, -45, 10, -25, 11, 31, -45, 40, 75, 18, 54, 10, -23, 26, 48, -17, -6, 25, -17, -34, -54, -40, 17, 26, 49, -37, -5, 54, 27, 29, 61, 6, 26, 1, -4, 21, -67, 19, 11, 4, -18, 5, -19, -19, 30, -21, -4, 39, -47, -5, -3, 37, 23, 22, -18, 61, 10, 18, 76, -13, -11, -31, -30, -15, -56, -59, -61, -76, -26, 4, -34, -5, 63, -40, 47, 14, 82, 80, 35, -8, -18, 21, 2, 57, -16, -43, -30, -56, -11, 39, 29, -25, 15, -56, 12, 7, -50, -11, 46, 18, 36, -12, -8, 7, 12, 8, -6, 27, -32, -53, -85, -30, -27, -51, -39, -13, 29, 15, 38, 15, 47, -16, 22, 69, 23, 32, -5, 14, 39, -78, 17, 4, -59, -11, -61, 1, -24, 13, 12, -23, 32, 25, -25, 23, 14, 85, 35, 38, 0, -28, -6, -17, 29, 0, -63, 16, 19, 18, -11, -1, 29, 13, 50, -5, 4, -31, -4, 57, 63, 42, -16, 10, -10, 10, -15, -51, 8]
2446Hm3L3nm0NL4J24j12K3k0k5P7l1l4j9K8J2l4J2k4O6q4L1N3q6O0L7m9P9j3n1
2477A2J3J1j7N2k5o7J9N5pK5r8Mj5JL5K2k5Oj4j1K7o2Q0k5PK4k3l4O4l1Rl6LM4
2511B3p0J2K5J6j1Ln8N0K0K2n7nJ32k4p4M4Rm7k2Kk1K4pn2Q9q4K6L3k1L9%j6N
2544Ek5M9l3L6l8L2l4j7M3m7kJ9J0qM4o3L9%l7L8rm4R6m1PK7q8M7N5q1KNl1M7
2578Col4L5o7K9M7m1k3O7RM3m1M3n7K2l4K5J3p4M5m8N9jo6Q2l6L9o4k5O8j0KK0
2611B4J0jj8J5M5l9K3k8o0N0oK1q8N9m3j6NN7l3M1j3KJJ3MpRj2n2J4L7l1Ql9l0
2646g8N2Ok0j3J12j10R2Kr5Q7p9L5O6o5Kl7Q4N0r3K9l5oq4P7Mo2L5L6J5k3J5J8
2678A7lj7R2p6n7J9K5l2Kj5P6p2jN5lj7M6r4R8J9q8j7J04m2j2L8mn2jK2n2M0L
$$ y = [8, -35, -2, -7, -47, -42, -8, 116, 4, 27, 7, -18, 59, 28, -6, -25, 3, 15, -19, -7, -31, 35, -49, -18, 35, -51, 9, 46, -3, 76, 63, 12, 25, 36, 19, 71, 46, -21, -2, 53, 46, 71, -27, -23, -38, -37, -2, 20, -5, 1, -13, -24, 3, -59, 21, -4, 3, 27, 4, -30, 34, 3, 12, -24, -21, 23, -47, -35, -10, 6, -5, -2, -60, -10, 10, 32, -25, -30, 102, 78, 4, 48, 57, 10, -12, -10, -31, -7, -14, -66, 23, -61, -35, -2, -23, 16, 16, 0, 5, -20, 29, -4, 32, -6, 26, -8, -25, 18, -29, -31, -12, -2, -10, 34, -29, 10, 10, -27, 11, 2, -42, 54, 13, 20, 47, -41, 6, 61, -20, -18, -13, -44, 3, -3, -37, -2, -69, -40, 7, -34, -57, 10, 19, 62, 21, 64, 7, 29, -5, 20, 33, -41, 4, -44, 15, 14, -52, 30, -6, 33, -31, -56, 12, 2, 4, 24, 34, 33, 15, 30, 75, 36, 59, 31, -29, 21, 15, 36, -52, 7, -36, -52, -47, 10, -23, 18, 5, 7, 8, 21, 25, 18, 27, 15, -37, -23, 14, -17, -9, -48, -78, -26, -20, -40, -53, 59, -51, 41, 43, -52, 35, -44, -9, 57, -8, -6, -43, 41, 91, -2, 27, -8, -14, -98, -21, -17, -79, -44, -8, 7, -16, -1, 17, 14, -3, 89, 13, -44, -25, 0, -32, -30, -45, 31, -41, -42, 13, 10, -7, 39, -55, 43, 62, -26, -43, 61, 19, 7, 45, 41, -11, -12, 10, -42, -2, 1]
2711Aj6Ql5N8n6K5k1M5NK6j3k7JNK5l3rJ4qk6R2Nj32L1P3p1jqK8rk0L5L7J8j3
2746C4p3R8o6%L6p3P5m5J6pL5k2q3R2n0K0n2R4K5k2j8L6L2n3k9nk8O7k4k1L4j4
2778IKjj2j0J0k8K7J0Jj7j2M4j4K1Orm2kRP7j33M5j5J2L6k8q4J06p3J02o3J1N2
2811C7k4n5J02m7qJ10r1nk1O6n4PL9k4K7j33O2k3L2l5j2Q4n2P7m7M7q9K4K6l7
2841a7k8N1L4l3rJ3K6o8L8N0r2K6L2QJ2k4Rk5M8l2J5l0Jo3Q9j8rk7J6j6%kK7L0
2875C2lk8RJ3kL0Km3K7l9L6Np4O0j7QlNr9P0K3l9L2L1j5j5M7p9O1n3L0n4M4J0
2909A2j3K0o0%M0Mk6j7J8N1l9K8NK5m7K0lj5nJ7k8K1P6l7k7jK1n5n3J0P4k7P0
2942E9l8k7NJ9l2P4l3J2J4o0k9M7n9O5Mk8%j7j8N9ml2k0JO5j5l5M3KkK7k0J4n2
$$ y = [1, -15, -7, -42, 16, -40, -15, -36, 9, 14, 40, 27, 0, 1, 6, 31, -2, -11, 3, -5, -31, 61, 66, -66, -35, 38, -33, -34, -42, -14, -23, -43, -8, 29, 47, 34, -39, 59, -7, -7, 29, -44, 31, -14, 2, -5, 30, 8, -75, 17, -33, -13, -65, 29, 54, 32, 14, 50, 82, 29, 0, -5, -33, 34, 10, -11, 23, 9, 11, 10, -2, -12, -2, -30, -3, 7, 8, -9, -21, 23, 9, 30, 36, 27, -15, -17, -8, 69, -64, -19, -34, -22, 14, -14, -98, 8, -65, 37, -26, -15, 37, 13, -42, 60, 13, 5, 115, 24, 19, -2, 64, 10, 17, 56, 32, 59, -74, -12, -35, -3, -38, -50, 34, -18, 59, 12, 59, -30, -6, 20, -17, -45, 6, 40, 7, -2, 11, 37, -31, 7, 57, -35, -9, 23, 31, 43, 19, 28, 3, 51, 19, 34, 4, 5, -58, 31, 13, 4, -23, -7, -23, -23, -25, 2, 32, 29, 1, 10, 23, 21, 51, 53, 10, 37, -2, 34, 39, -35, 25, 8, 16, 13, 18, -81, -11, 12, -27, 5, 36, 21, 6, 53, -26, 35, -18, 12, -42, 2, 12, -1, 19, -41, -41, -1, 3, -23, -40, -22, 29, -10, 18, 23, 48, 1, 21, 18, 3, -2, 15, -13, 8, 84, 47, 20, 19, 40, -15, -68, -58, 16, -11, 59, 21, -6, -1, 18, -14, 60, 27, 39, 53, -7, -36, 11, -48, 17, 21, -7, -7, -24, -42, 17, 13, -19, -39, -38, 27, 12, -23, 20, 22, 20, 47, 27, 41, -11]
2976a1K6j9l0P3p5P3l8P4j08R0m6J3l2M0o3L3L5m0L2m5R4n9Om5P4o6OLMJ3l9j9
3008d6N6j4LM0k2J6Op7M9Mjk1l7Q7m1m6N8J9K4kk6k2j1lJ2L7lp8L4oJ1k2JO8l6
3043A1L0k5m8K5l1j1K6L1p6N5Qlln1P7pk5K3Jl0J9k1L2J9Lr1J29q3o6Q8l0L6N0
3076F2l0k6L9q4Q2m1k5j4M5L4n7j6M2Pk9MJK4l9K5k4M9l0j8j1P7k7j7L1k1M5l6
3108B2L2j2l6j5J1J6L2r4j4L9j1Q5k0q0j0Q6m5J10p4m6qJ0rL4K5o7Q2r2ORj4N7
3140Ij3o5J6K6N6o2N8J7m5j3M4m3KKJ7K5lqMl7N5m6j6nO9l5K8pk1j4J5j2O9m9
3174A8m4M3K2m9k9N6l9l1KO3j6j7J9q6Q9N6p3L4j1k7N0K3n2O5l7J9l8j0K7kk1
3205DK2m1L5orJ0n7P9j4j9nJ9j6ML9%n1M6lm6J5k1QKJ6jl8rJ9N4m1J2K2j2L4q9
$$ y = [-11, 15, -4, -34, 39, -36, 37, -1, 73, -35, 55, 9, 22, -10, 30, -33, 0, 35, -5, 27, -18, 76, 17, 23, -22, 52, -14, -8, -5, -1, 12, -27, -46, 10, -4, -1, 39, 17, 33, 39, -38, 11, 15, 14, -7, -44, 43, 2, -44, 14, 33, 57, 55, 29, 7, -4, -7, 5, 42, 39, -39, -5, -11, 0, -22, -21, 47, 11, 41, 16, -32, -7, -38, -49, -23, 8, -68, -13, -5, -8, -11, -62, 15, 8, -17, 6, 7, -23, -4, -25, 7, 26, 29, -62, 67, -16, -82, 6, -24, 12, 62, 32, 6, 45, -39, 43, 2, -23, -37, 8, 42, -15, -31, 11, 18, -11, -7, -6, 18, -21, 4, -20, 29, -1, -19, -30, 47, 20, 3, 34, 13, 58, 22, 54, 42, 6, -9, 2, 18, 50, -44, -58, -19, -30, 55, 35, -45, -55, 31, -14, 96, 22, -24, -32, -22, -31, 3, 28, -39, 43, -49, -43, -34, -48, 9, -4, -69, -53, -27, 29, -33, 25, 42, -3, -16, 28, -15, -13, -11, 6, 31, 28, 20, 24, -13, 42, -4, -20, -25, 44, 9, 37, 30, 9, -5, 10, -2, 67, 18, -26, 17, 39, -10, -39, 17, -22, -53, -51, 12, -4, -21, -2, -88, 1, 57, -16, 18, 7, -20, 30, 53, 1, 66, 29, 48, 10, 0, 27, 25, 4, 26, -15, 20, 14, 5, 15, -42, 37, 23, 4, -1, 18, 2, 6, 45, 45, -6, 40, 37, -9, 6, -15, -7, -5, 11, 10, -28, -37, -18, 36, -5, 7, 29, 17, 51, -38]
3241c8R9j3rm2k9oN2j3Ko0O0n8O8l2K4j4RPK2j4o3L7Pj0k9M8k3j6J4l3N8k1JK3
3275HmlpJK7n1N5qK6k0nJ0m7J8j3OJ9j1k3L3j5m6L4lKK8m0OQ5k8nl3l0L5L0m6
3311a5K2QRk7k3NK1j7N1m2N9l1OJ4rJ3l2J6J2K0l5m4K7O1r6P5k9l8L1l8jN6l6
3344gL8k1l5P4r2PJO5pJ8n5m8O7q5J65j17M9jn7N3K3m7mK4rj5j3K0N0l1o6J22
3376F6m7k4k3M5j5k8pP3k9J1J7q5lN7K8n7L1L0rl2Pj5JJ2LL2l8lpL4L1q2J05n2
3410B7k3j1j6M5j8JL2K7q3L2K5o6N7k3k7P6q2K2k3MP4o2k3k2J00q9P7m3m7O3l0
3441b6K1J4On8N9J5j1J0nq1K2L2K3j3PK9j1m4M0j2J2j6jL1j6m5M5L2n9pLj3j2
3474b9K4J8k7k0L3j2l3M3j8J7J2k9L6nj1j3N4l3Mj8R5n8l4j1JL6J1J5k7J2K1r2
$$ y = [-38, 61, 48, 39, -3, -32, -38, 14, 1, 3, -57, 3, -55, 13, -19, 5, -9, 0, 7, 29, 15, -48, -11, -4, -14, -43, 5, -18, -34, -20, -53, 5, -16, -15, 8, 4, 1, -6, -5, 22, -29, 26, 18, 44, 24, 19, 29, -18, 0, -13, -7, 12, 1, -22, 11, -4, -50, -16, -19, -17, 11, -29, -23, 62, 34, 29, -4, -34, 1, 31, -15, 7, 15, 24, -3, -26, -21, 0, -17, 34, -8, 51, 20, 26, 40, 31, 44, 12, 28, 40, 60, 25, -19, 8, 69, -27, 48, 19, -19, 12, -26, -27, 29, -7, 31, 10, -25, 49, -43, -36, -35, 30, 23, 41, -14, -62, 5, -80, 85, -32, 17, 16, -41, 12, 35, -12, -16, 8, -1, -16, -29, -9, 41, 10, -56, 66, 19, -5, -28, 17, 2, -26, -33, 40, 11, 22, 39, -46, -49, 8, 36, -21, 10, 40, 31, -1, 6, -9, -8, 4, 7, 39, 1, -2, -9, 25, 56, -26, 79, 27, 4, -7, -23, 22, 4, 5, 37, 64, -19, 13, 38, -28, 29, 6, -21, 55, -27, -5, -28, -24, 50, -12, -35, -57, 43, -46, 31, -12, -59, 4, -26, -5, 9, 15, -43, 16, 31, 20, 30, 25, -56, -34, -2, 21, 8, 15, 44, 33, -11, 29, 17, 29, 13, 12, 43, 27, -18, 27, 59, 0, -7, -4, -17, -29, -5, 13, -14, -34, -1, -13, -46, -3, -21, -4, 8, -21, 15, 10, -1, -14, 40, 7, 11, -7, 88, 30, -4, -15, -14, 22, 33, 48, 21, 33, 54, -38]
3506c8N7j7j9J11j02K7OLkp0N2k0j2k6N4N8k6n2lM9m9O6k4jrlj8K0k3%lqM0j8
3540@L7l1jnK9l8N0J0m7K7JJ2o3L1ll8K4J4J2j2j9jN4l0m3K1k7P3n2%jNM3J9J
3575E2m5K5L3l7j0j7M1l3n0Q6p7L9K7o0j9lO0J7npm9M2rk1lL3m3K0M8o3kN0pK9
3609D2p5PP2m4j4N2n4lL3K6pL7m0rOJ0p8M5j3N6m0n3O4k4K8m1M2n2R4p9OK4l2
3642a4L1l9J6J1On5L3m3P2k2jO5m0j6L0n6LN0J9n8M9K9Oq4n0P1M9l1j4K1k2K0
3674C6qn1j1lO1k2KK1p2R4r5O7K4n4N2k9l1K2%k0K7k8M1k1Nj4L1qoM0l7KOk0L1
3709C2o4k4N7J5k7L7n8J36r9J1j4l0M1r5J07k6K9l1K5qM2q9P4o7NK7k2L7Jj4n
3740CKL8m9M5j7k3M1l5J3l5qQ3m0j4J9J4nq6LK6K1jpMML3j6J2o0N2l9j6KN0k3
$$ y = [-38, 19, 2, -17, 94, -8, 19, 25, 28, 26, -44, 8, -12, -24, -50, 4, 62, 36, -16, -19, 30, -19, 47, 23, 22, 13, 10, -8, 12, -11, -11, -14, -22, 18, 0, 37, 6, 5, 0, 29, -9, 41, 51, 4, 31, 32, 44, -19, 12, 9, -29, -5, 9, 21, 9, -10, -11, 43, 13, -30, -9, -36, 37, -15, -15, -16, -11, 32, 51, 52, 7, 32, 65, 28, 18, 1, 42, 9, -41, 45, -32, 7, 34, -26, -45, -48, 12, 29, 24, 17, -32, 10, 1, -20, -23, 10, -33, -13, 35, -28, -30, 20, 13, 42, -33, -26, 46, 2, -12, 40, -14, -17, 16, 42, 35, 72, 32, 23, 29, 39, -39, 6, -7, 49, 9, -44, 20, -4, 24, -17, 25, -27, 67, -12, -6, 18, -14, 17, -22, -6, 5, 11, -44, -11, -54, 18, -4, -5, 60, 20, 4, 34, -22, -19, 31, 50, -8, 41, 70, 76, -8, -58, 13, 62, 31, 17, 38, 16, 36, 28, -23, -34, -37, 24, 2, 4, 25, -47, 47, -48, 19, 43, -11, 41, 12, -19, 3, 3, -17, 10, -18, 23, 2, 7, -7, 24, 16, 10, 50, 13, 15, 21, 1, 32, -32, -56, 1, 16, -11, 26, -32, 104, 5, 16, 2, -28, 13, -82, 25, -1, 28, -3, 22, 14, 56, -33, 41, -26, -21, 6, -16, 21, 22, 8, 3, 5, 43, -6, 39, 22, -1, 40, 5, 18, -17, -25, 58, 18, 4, 23, 37, 32, -54, -51, -25, -4, -5, -12, -8, -4, 29, 13, 25, -35, 17, -22, -38, -36, 14, -9]
3775iL8m4nK4l5M3rJ9j6N3n2j8J2j8K7l7lN1j9l4N1L5n6n1R8m8KK9j6j5nk6J8
3808a6J7j3JOQj4K4M1r4M8J1%j0j6QL0On9K2j8J8j3rN9n1L9j6K3l8MK0j7K8k5
3842DNk0j5Rl1L2j5Pk4L2k5L4j9N3p4K3O7m5j5Q0l9k6K1J3JJ2l4L4j0L2j07K2
3874a8P8p7k0M5K2L5n1j5lO9q4OP2ol3K7k9l4ml3K2k8P9k1j1o6P4L3m9Q9n7k6
3906a4l2M3K9Rk1NJ9m4k6Q5m8m5J47r9mM1lm3p2L5M0LJ6k9l5j8O7j8lN8l8jok
3940dnk4pL6J0N2p5J8Pl9PnLJ6O0n0M8p4NJ5M3l6J2n5P8J6n2L4l5m6Q4n0L5o1
3974c9M2kJLmq5M5K9k8k2N9J4ppk0j0MP1k9J3Mp5N0L0m4l1J5L1M3K4o7nQkjK4
4010C2o0M2l1K4K4K9r8Q4q7K5J1rO2q2QJ7l9R4K1o9K4p9K9L7j7K0j2RK0l7J4J
$$ y = [-9, 29, -15, -20, 4, -31, 12, 3, 22, 6, 59, 7, -11, 1, -17, 10, -27, -30, 21, 2, -32, 19, 54, -2, -53, 45, -3, -1, 28, 12, -3, -8, -34, -16, 1, -12, -11, -5, 3, -11, 13, 54, -40, 8, 19, 19, 9, -7, 1, 31, 37, -22, 0, -18, 0, -13, -22, 37, -14, 25, 9, 32, -6, -2, 18, 1, 29, 4, 9, -11, -26, -17, -48, -16, -31, -24, -48, -16, -41, -7, -26, 27, -47, -24, 43, -2, -17, 63, 24, -2, 19, 32, 33, 45, 11, 45, 35, 67, -40, -18, 60, -17, -37, 8, 30, 65, 14, -1, -4, 65, -19, -13, 59, 53, 20, 47, 18, -16, -20, -53, -31, -59, 20, -1, -12, -78, -4, 29, -20, 69, 12, -14, -46, -3, 26, 35, 14, 19, 38, -6, -32, 53, 5, -40, 107, 8, 4, 45, 42, -1, -73, -38, 2, 5, 21, -8, -43, -61, 6, -12, -15, 43, 5, 4, -2, -4, -9, -33, -40, -4, 6, 58, -17, 1, 8, -31, -24, -29, -26, -10, 50, 0, 48, -26, -21, -6, 37, 1, 13, -42, 36, 52, 0, 34, -1, -47, 37, -13, 22, -39, 3, 1, 2, 5, 1, -84, -39, -10, -38, -60, -1, 13, 6, -1, -21, -31, -27, 44, 15, 28, 32, -43, 7, 37, -7, -38, -23, 8, 51, 75, 8, 3, 11, 9, 8, 32, -28, 14, -17, 7, 31, 60, -38, 46, -41, -16, -5, -14, 48, -34, -26, -9, -48, 46, 67, -2, 22, -57, -28, 9, -8, 12, 0, 9, 29, -8, 6, 7]
4042GJ8K6l6J2k2knk5N9j3O3m6k1J3J4l8j9L8m4M8pm1K4j3j2qMM4m0%N2%J3o9
4076b6M2rJ1Jkn0K5K4M2mm6l6L5MQm4K3J0j3O8n7j0K7l7k0N4m8j8Q7o8MNJM1K2
4111D6l8j1k3l2N8l5J7J7K3l2L7m5PON0j9j4j9L6nRl2l5L3j8N2k0k2K8p8O7m1
4143c3L0kP6q6O0l6K4q9M3Rn6M3N5lj0k6k2J8l3KR7Rm9qkL0r3L7LK5k9L5Oj7j8
4178a0N2J2k3j9o0MO6nL3k1o6O7n%jj8L4q5M4K6j7j19Q4jJ06p0n8N4N9q2L2L6
4210D9p5L2J2k5N8j1o1J7l0pP0Rk8k8k6M2qJ4m8K3PMJ0j0J9l1O0m7NJ9k3Pl4K0
4244a5K4O9j05N8m2O3n7L0j4m0K7m1Q9l6L2l8k9k7J10n3j7n1P0%PMj7J4n1K2k
4275a6L7rJ5l2J5r8Q6n0O8j6L5k8k1J0M8J6p1K3K1K1p0N2j5m0LN7l2L3K0p9k0
$$ y = [7, 25, 51, 15, 27, 5, 3, -2, -27, 32, 19, 82, 36, 15, 28, 42, 4, -15, 23, -21, 27, 20, -21, 3, -10, -22, -30, -26, 18, -22, -22, 30, 30, 43, -26, 16, 7, 18, 19, 17, -33, -8, 16, 58, 54, 8, -28, 7, 11, 19, -25, -2, 8, -5, 63, 6, -4, 23, -14, -34, 20, -28, -46, 41, -27, -23, -18, -17, 24, 46, 8, -3, -26, -58, 0, -35, -18, -1, 22, -10, 27, -18, -11, -5, 45, 26, 12, -7, 29, 24, 33, 1, -34, -1, -19, 33, 13, -9, 19, -59, 8, -33, -3, -5, 71, -15, 45, 9, 33, -56, -13, -4, -60, -17, 38, 35, 25, -1, -23, -5, -38, -36, 61, 70, 21, 13, 11, 41, -52, -15, -12, 13, -16, 19, 25, 8, -10, 42, 54, 31, 12, -48, -44, 22, 17, 50, 29, -37, 30, 25, 25, 24, 6, 40, -45, -1, 25, 8, -111, -27, -28, 78, 8, -50, 4, 63, -19, 13, 49, -26, 6, 18, -7, 51, 40, -21, -4, -34, -41, 29, 38, 10, -18, -44, -2, -10, 4, -44, -21, -14, -10, 0, -10, 9, -22, 38, -9, -4, 15, -8, -1, -35, -15, 9, 78, -27, 31, -11, 52, -5, 25, 11, -29, -2, -43, 46, 10, 42, 4, -25, -52, 58, 5, -12, -63, 7, 7, 14, 18, 1, 15, -36, -14, -16, 21, 12, 27, -5, 10, -88, -2, -52, 16, 0, 35, 7, -14, -4, 44, 60, -11, 12, 33, 54, -16, 36, 21, -19, -16, 41, 9, 42, 62, -17, -37]
4306c7K8K1j9J7n2J02m7l7L4K3m1o5O0j9O9o2o9P7K3J2k4K5Kl5L6NRo5N9l7N4
4337D7k9l1K0l7J1K0O2p7J9k9N9j05P4qJ0l6M0m8K3Pj8K0L2m5pM1J7p0Q6o1M2
4368B9m6OrM6k6k3K0k7J4J3j1l1O6j5LK4j9m9L0j7l5K4Q0o1J09p7j5p2R1n0K1
4399gJJ9k9J0J5m2L4K1k9L1l4L5o0O0j0j4M8q1JL4NMok3J7L2n9J1J4Qm0J08o8
4432Fl0O0m3MJ7M7q7mM1Lm2l6M9K5K0K3q5J9Rj1K3j7j2RmK6M1r5M9l0N9n2N3l1
4466DJ4J9l3j2K9k7j5J3M1o8O4m5j4N9M5p3m0kkN2k0%L2o6P3km4K6j2m1N0JJ0
4499A6K1k1l7Q6o5P0m9k9L7m9O5o4k7N3K7jJ4k3Mm6ML4KkL0q6pR7p7j6L7p1P7
4532DJ6n3L0j6l8P2l7J8M7k8L0l4J8J8n7p6P7PN0Jm3l4N0j6J8J0o2N9k5J7m9O7
$$ y = [-37, -9, 12, -7, 10, -42, 60, 13, -24, 10, 33, -8, -73, -13, -32, 37, -25, -94, -17, 6, 18, -6, 19, 21, -14, 22, 27, 36, -29, 30, -7, 47, 18, -13, 7, -30, -19, 1, 63, -14, 5, -24, 35, -70, 4, -4, 6, -30, 10, -38, -15, -8, -26, -6, 26, -19, -26, 15, 32, -38, 48, -13, 29, -17, -11, -20, 26, 0, -23, -3, -30, -16, -3, -14, -45, 21, 6, 9, 33, 14, -35, -5, -22, -57, -33, 47, -14, 95, 18, 3, -69, 22, -28, -7, -6, 13, -16, -6, 9, -33, 1, 22, -7, 24, -10, 25, -35, 25, 15, 1, 49, -32, -31, 3, 8, 12, 6, -17, 0, 32, -27, -16, -2, 6, -34, 74, 6, -24, 36, -7, -3, 14, 61, -26, -30, 11, 14, -28, -64, -15, 10, 30, 53, -32, -13, -4, -15, 8, -9, -21, -12, -16, 10, 51, -44, 5, -25, 34, -18, 35, 4, 18, 37, 4, -8, 21, -6, -21, -8, 33, -35, 29, -16, -30, 29, 74, 1, -39, -41, -43, 9, -11, -11, 21, -45, 28, 26, -18, 8, -4, -45, 5, 6, 16, 37, 16, -21, 65, 0, 70, 21, -8, 29, -20, 45, -19, -46, 7, 34, 33, 47, 24, 28, -18, -14, 20, 22, 20, 50, -36, -43, 54, -23, -39, -2, -73, 4, 20, -33, -3, -19, -57, 15, -22, -4, 43, 15, 45, 11, 29, 47, -10, -86, -9, -2, 48, 49, 6, -28, 22, 6, 24, 34, -28, 31, 6, 23, -26, 41]
4564D1j4k1l4PK5%k8k9N4q7N3J9l2j0L8L2l1L9p%k9k2N9l0l7M8M3j2Qj13P6j1
4596ek2L5J1rr1R9j1mK3o7L6M7l5J5Qm6j0K7K1l4N6q5M4o9J00l6j6K9o0O5Lo4
4628d5N9q0N5K3J3qJ5n2RQL3k3J3o6J5O5o9M8j0m2QJ4J2mJ0pK6p6M6KM5j00M0
4661b3Qk8qR0m8pnj3M0m0R6o2K1nl0l7J00o3K6j6k9K9L3p6K4%L8l3K0M4m2L0q1
4694d7L4j7p5R7k3K3qk6M7k6O3l3L0l7K5r1P2lM5l5m3N7j7l7O3p7nP3jl3JL6o6
4727c4O4m6MnL5jKL8Jj15M4J6MQJ0l3QL7n9J1JOJ6j2k5JlJ1k1K8k7J4P4o8K1l6
4763c1J31oj03K0K6J1m0K6j6n7N4j7jO0r9N7m8O9q1J6N3k7j0l8Q2p3k6J00m7M0
4793B5j1o7M9j1J4J0NKK2o3Q1n1K1k2j4pJ6mk4K1QN2m3n6L0J1j7O9k6j8O0n9m1
$$ y = [41, 27, 6, -28, -21, 4, 4, -24, -53, 1, -86, -33, -14, -46, -56, -18, 14, -17, 22, 15, 15, -14, -36, 23, -7, -44, 4, 47, 35, 43, -70, 6, -5, -27, 8, 19, 10, -81, 18, 7, 3, 26, -41, -5, 42, 7, 22, 30, -16, -26, 1, 22, -12, 44, -41, 3, -66, 34, -2, -18, 11, -49, 16, 19, -45, 14, -66, -11, 12, 25, 17, 32, -20, -11, -3, 30, 7, 20, -46, -31, 34, -35, 13, 3, -39, -31, -17, -5, -9, 1, -6, 20, -56, -10, -8, 37, -63, -23, -15, -43, -51, 39, -9, -16, -21, -34, 6, -34, 62, 0, 21, 16, -14, -51, 49, -14, 12, -4, -33, -4, 29, -47, -23, -23, 15, -18, 2, 46, 4, 34, -47, -13, -30, -105, -8, -31, -8, -16, -42, 5, -21, 42, 9, 39, 2, 27, -64, 8, 5, 50, 15, -28, 29, 12, -25, 38, -39, -44, 29, 28, -5, -4, 32, -34, 30, -16, -12, -17, 18, 17, 19, 57, 58, -57, -13, 3, 7, 15, 25, -8, 0, 37, -22, -11, -10, -4, 12, 0, -25, -24, -27, -16, -37, -9, -36, -22, 52, -16, 5, -31, 100, 94, -9, 11, 37, 48, 8, 34, 18, -39, 15, -2, -3, 57, -42, 15, -33, 36, -45, -29, 24, -3, -13, -51, 31, -42, -68, 32, -15, 25, 14, -53, -4, -15, -1, 9, 14, 16, 38, -25, 56, 5, 26, 4, -10, -17, -1, -5, -29, -8, 0, 52, 9, -47, -17, -6, -23, 46, 20, 2, 62, 3, -38]
4826c8M9j3RJ2rk5L5o0OK0J2L5l2%LJ7k1L2k1N7o8J5Om0mQ2o8N7j0n3LO0n8Q6
4860G6p7K3n5J8K2m0L9o7J36n6Qn1QM9Pj9ol2K0K8k3m5O7m9k0M6k6k7J07n4nj7
4892a5J7M8m7n6J9M5j9MMom5K3O1n0k8L1L1Qj2l5P2j18O6K6n2lK0j3j1R2o3J7
4924A1m3Q7q0K9RJ1k2oN6q4M8L%l4M8ok1j0L8Nq1Q2J4j09M6J6j8K4l4k2K5k8J8
4957b8MJ5J4J0K2n4k3M0nrMJ3NO4k4j1p3P0k6j4K6j8l3K4M7j20J21l9L1m7Ml5
4989d5O0j8l0P8m5k2P7p7LM0q4J22l0k2j1M7o3%K6k4M1Ol7L0Rk9l2%K7M9l1k0
5021ej1m3J07j0p6K8O2p9%M5rmK4k9pk5l0N8j1j4RK9n4L2jM1o9mL5K9j6k5M3K8
5055D8k2j9o7P4k8klL4lN1m8l8L0k2J4okm6K9O9r9M7lJ9n3O0O0m9j8o9O6j5L1
$$ y = [-38, 11, -2, 7, 19, 10, -15, 20, -40, -34, -14, -2, 33, 1, 1, 4, 21, 0, 32, 11, 68, 0, 15, 21, -19, -23, 59, -9, 48, 38, -15, -12, 48, -10, 76, -1, 22, -33, -15, 7, -33, 6, -61, 75, 19, 27, -24, -16, 33, 40, 21, 15, -17, 3, 31, 8, -37, 30, -19, -39, 7, -19, -46, 61, 7, 2, -15, 2, 50, 3, -53, -34, 11, -8, -4, 0, -6, -51, -28, 33, -17, -45, -14, 17, 25, 13, -22, 50, -68, -2, 24, -28, -31, -11, -24, -35, 57, -6, 11, -32, 55, -25, 4, 13, 24, 2, -4, 52, -32, 16, 19, 19, -15, 33, 27, 6, -4, 34, 39, -42, 40, 54, -55, -9, 7, -11, 13, -21, -43, -18, -46, -28, -24, -9, 5, 15, 37, -17, -40, 0, -5, -14, -10, 3, 8, 72, 48, 37, -36, 34, 8, -6, 20, 2, -31, -7, 40, -80, 41, 2, 33, -14, -10, -45, 15, -3, -33, 45, 0, -22, 55, -22, -19, 21, -63, 59, 29, 7, -4, 43, -20, -20, 6, -18, 23, 29, -8, 22, 31, 2, -30, -30, -3, 46, 15, -5, -16, -59, 48, 38, -38, -10, 52, -27, -27, 18, 9, 5, 29, 0, -7, -32, -62, -4, -15, -29, -20, 9, -45, -13, -14, 27, -42, -46, -11, 18, 2, -23, 20, 48, 26, 7, -60, 14, -14, -16, -19, 15, 12, 63, 15, -23, 7, -15, -1, -7, -9, -55, -26, 43, -56, -9, -12, 7, -46, 14, 74, 25, 7, -62, 4, -11, 20]
5088B0j9k8k7O4K4rj0jJ6k0pJ8J5Lp3J8M0K6pMl9k7m7P9mK1k5j6M4j04Q0m6L1
5121fj3M0j0Kl1L0k0PLo0L6k1Q5l5m7O7Jl0Qk3Kj2O1J2k9l0L4K5p9oL0j1O5m1
5155Dn3R8n8kNnJ2rl5N5pk2pL7j7K1J3l5m2L9J1j0l5N9j1q6J07j5j6K5L3p3PK3
5189A1m4lN9qo7LrL5j4Q2l3%n4PM0Rj5o8Q7l4L1k9k7L9j5N6ko8L1K5j9N%j3j7
5224a9J7N6p6JK5k8M6j0j3Jm5P3mk4L8m2k9K1lL0QJ2ll8j5Q7r1Pl8P6j9Q3m8m6
5258a0loK3j9k6N9m5J6L0l9L4J4kMj00N4N4p7N1L0jj8n7%L1m9P8J4Kq9J6nJ7N0
5292C1Jk9l2L4lM4k6l6L5k5R0p1On2P9m1K9l1L8k5j3Om0K1P8m1j7Mm6J3K7Mp0
5325e8N6n8J02j2m9NJ7L5j1l8J5m4N9o7Q9m3m1L2j9K1N1l7M2p3O4q6J03m2k7K5
$$ y = [20, 1, -27, -54, 10, 34, 25, 15, 14, 30, 10, 3, 21, 36, 39, -34, -16, 24, 50, 43, 47, 8, -19, -66, 13, 9, 30, 5, -11, 33, -71, 9, -37, -6, -19, 21, 11, 13, -18, 12, -8, -1, 2, -58, -22, -43, 42, 7, -40, 27, 28, -2, 6, -17, -15, -27, 34, 46, 17, -13, 21, 46, -33, -39, -9, -20, 45, 4, -49, 49, -9, -11, -6, -11, 1, -8, -43, 12, 5, -17, -24, 13, -4, 17, 30, -5, -47, -8, 3, -7, -42, 17, 6, -80, 27, 12, -4, 21, 54, -19, -12, 11, -33, -36, 23, 15, -52, -49, -58, -23, -37, 45, 12, 12, -42, -35, 5, 14, -1, -69, 18, -16, 15, -14, -41, -2, -17, 39, 37, -31, 0, 25, 6, 11, 11, -2, -19, -2, 54, -22, -21, 4, -24, 22, 12, -1, 0, -45, 28, 24, 0, 38, -4, -33, -12, -15, 15, 23, 35, 32, -6, -21, 66, -25, -18, -56, 20, 1, 84, 36, -10, -13, -19, 4, -15, -41, 18, -27, -11, 19, -20, 14, 28, 26, 30, -70, -16, 38, -39, 12, 42, 41, 23, -34, -34, -3, -52, 26, 40, 42, -47, -31, -36, -19, 31, 32, 3, -29, 5, 2, 46, 20, -16, 19, -6, 84, 13, 19, -33, 46, 5, 34, 3, 41, 16, 3, 9, -31, -10, 68, 27, 10, 14, -32, -19, 8, 12, -58, -2, -60, 42, 30, -19, -14, 3, 38, 27, -11, 4, -40, 19, -48, 41, -2, -43, -11, -30, -9, 42, 5, 47, -26, 38, -48, 55, 13, -14, 11]
5355A1k5P5l8j5Mj3P1p0Qm3J5j1M4J9l5KK7m8l4j0N8J4n2%OL5j6L9Qm0O5m3%N2
5389F0l1j9k7oL9J7p0O5mM1q8L9K9m9k5Q4m7l5lQ9l7m6K1L8n2j2J8j7l5M4ll1
5421e3j1K5j1K3J2J1mJ1M5ol6l9N3K0J6l4J0k4l9j3P3J1n8M8km5k4M3l5N2qJo8
5454e6L5N1n6J5N1o8M4l3k0L5J1K3n7O3ll2m2K0NL3nL0J6m4p0P0N3j37Q5M3o5
5485eL2o4R4k5J5q4N1Kkm4mK5j8J2n6J36j17L7N6o3LK1j3kl1l4Q5K5k2M0p5J2
5517a3K1lj0P4p9L5L3o9L4l3pK0L2j5l7l4J7K1K2j7M9n6nK5O3q4j1J3k5K3l4R1
5549D1o3mj4N3n2P2l5k1m7P8k8L9k8K8l4l7O6l3JPJ9L9k5l2J6j4J6j1l6M4L9j0
5581C4m3J5k9PL0l7NM2o2O3k0j2L0Kqj6l0M0rK1l0l3Q4m9pK7M3j1k6J9l7n5L3
$$ y = [11, -14, 61, 23, 8, 12, -1, 70, 0, 8, -35, -20, -31, 13, 32, -3, -1, 26, -22, -56, -66, -8, 6, -46, -46, -40, -5, -21, 18, 26, -14, 51, 8, 8, 60, 29, 10, -17, -23, 16, 33, -37, 28, 24, 65, -23, 16, 45, -4, -29, 55, 8, -27, -30, 59, 22, -24, -3, 35, -17, -29, -11, -28, -63, -19, -22, -53, -64, -39, -50, -27, -15, -4, -8, 3, 48, 42, 6, -33, 20, 40, 56, 22, 32, 8, -31, -44, 29, 40, -18, 30, 28, -17, -41, 2, -33, 19, 11, 12, -56, -21, 30, -26, -11, 40, -28, 16, -17, -37, -2, 9, 32, -25, 38, 35, 3, -39, -19, -14, 19, 14, 44, 60, 16, -54, 16, 69, -68, 17, 60, -5, 27, -37, 57, 32, 47, -37, 14, 16, 14, -30, -34, -9, -27, -15, -71, 65, -52, -15, 41, -22, -19, 2, -11, -13, -44, -78, 7, 32, 10, 50, -25, -13, 8, 5, -5, 69, -10, 25, 58, -11, 23, -10, -17, 3, 35, 20, -17, -51, -34, -13, 9, -8, 41, -15, -20, 5, 68, -16, -27, -14, -39, -16, -50, 41, -22, -26, -40, 13, -39, 33, -2, -23, -70, 8, -20, 19, -9, 19, -15, -52, 14, -19, -18, -11, 8, 47, 22, -10, 6, -8, 8, -3, -39, 5, 44, 34, -9, 6, -23, -16, 14, -23, -18, 24, -38, 25, 5, -7, 23, 25, 17, 1, -29, 11, 2, 23, -7, -40, 44, -5, -12, 15, 58, 47, 21, 40, 3, -52, -19]
5614a9KK2lqK2j3L9o7J0K7pj0m2M7M3l0m9j9qM0L6l7j2M5j0j0nOjL5n0O2l0j7
5648a1K6K4k3Qm4pQ4l8l8j2M7j6k7L7J1j3j2nlk1M7m0L9Rn6J4j1L8K3m3L4l7K9
5681A3j1rJ2J7jJ3p3j5L4L8j1Jk4N4m1PK6pRnll2kK9m0k1K0L5j5n6K3l6N2j9J6
5716b2K3nl4P0m9n1P7j0LM3o2k6N8Ln1Q4m5%K8L1k1l6K1m8K1k2N3j9l8L5Ll2l3
5749e1O4j8N9k7n7O7q6J2M3j2J5m6M7k2PNJ7oL6o9j2n4J18k5k5N9m0jk0M2L1o0
5781il0K4PK2l5P0j9n4j2mL8J3K2k5M6j07L1j6lmM1J4p6Q0Qm0O4r0N3L9n9K0k4
5814a5M1Jm4J5K2J3j4j5J4M1m8jl2j6qK9N0l0k0LK9r5M2M3M3o7N8J2r6P7M0j21
5846d9R2qn6M6k7j2Rk8M0pL0jL2n7k9M7M5m4J5o2L9kj5k5K7lk8%K0O8n1j0j5J3
$$ y = [-19, -17, 5, 2, -6, 16, 3, 42, -25, -15, 12, 5, -5, -47, 0, 43, 13, -36, -55, -63, -23, 13, -24, -36, 9, -1, -11, -16, -10, -11, 24, -26, 36, 6, -11, 15, 39, 16, 24, -20, -27, 57, 19, -19, -31, 16, 0, -27, 10, 21, 8, -4, -9, -12, -33, 14, -26, 13, 22, -34, -20, -31, 7, 30, -13, 21, -16, 13, 2, -7, 5, 22, 21, 34, -39, -54, -20, 18, 7, 8, -16, 38, -3, 4, 30, 23, 32, 27, 24, -8, -10, 19, -21, -42, -22, 13, -2, -58, -35, -71, -19, -38, -22, 1, -4, -38, 32, -17, -68, 9, -1, 2, 45, -17, -43, 15, 18, -33, 51, 6, 6, 34, 65, 44, 8, 29, -19, 2, -20, 33, 14, -24, 11, 14, -18, -51, 13, -5, 54, 27, -30, 37, -49, -37, 6, -6, 9, -37, 10, -12, -5, 0, 17, 11, 47, -22, -34, -88, 30, 5, -20, 39, -1, -2, -22, 20, 51, -9, -39, -15, -8, 14, -21, 49, 30, -24, -36, -40, -2, 11, 33, 8, 54, -53, -22, -38, -41, -45, -4, 10, -66, 14, 22, -18, 46, -44, 9, 48, -11, 9, -15, 26, 27, -17, -2, 20, 33, 19, 4, 18, 59, 11, 10, -22, -38, -46, -17, 33, 3, -17, -14, 15, -80, -38, 5, 48, -19, 39, 51, -45, 32, 72, -49, 43, 35, -21, 25, -2, -14, -5, -33, 7, 0, 30, 29, 61, 4, -25, 22, 67, 23, 38, -24, 15, 13, -2, -27, 0, -3, -31, -31, -11, 57, 6, -4, -19, -6]
5880fm7J1M1Ojo8M5J05j10O3K2p5oM5j0K9K9l6p3Q3m2n0O3K5p5K9R8j60J02J0
5910D7k0j07k7M6Q5j8k1K4K1j4oJ3n7n6N8R5o9K8l5K2k8n5Q7oJ3K5j8j7m1K9j2
5941a4k9L2K4l0k1M5kK4K1n7J7j6K4rK1nl3Rj3oOMjJ3n9L6KN4l6l7N6n7M7M6k8
5976B8k3J6k0l2jk4M1JL3J4j7J8m6Q7l6nq5Q4J2m5j0L1l5LJ8j8l0N1Jk5K6LK4
6009C9q9M8kj2O4k8O4n9pj3K5m3KnJ8K8k1k5Q4n2m6KN0m3j6K2J3O2m0j7j4K1m4
6042c4QpOj2K5J8n2N2mk2Lk%l9O0jN6m3Mk4Qo1R6J9l2m5L9jp2N2%K2k7K2j2jO
6079El1O3j4np0P0pk1MQK6l7k3M7j9m7O7pj5PKm0O4r8J06j3m2L5m6O4n9Q5pk7
6113B5n0L2RK5j3k6ORk2J4M2j2j11J9N8ql3K3k6K8k2J9L8l9N0n3N6J4o6k0J9M9
$$ y = [-6, -53, -42, -1, 5, 4, -64, -19, 86, -24, 39, 61, -14, -20, 25, 15, 44, 73, 37, -36, 47, 5, -45, 18, 43, -32, -3, 95, -65, 37, 47, 27, -80, -107, -61, 24, 6, -15, 9, 30, 16, 10, 23, -34, -90, -32, 63, -6, 22, -13, 9, -19, -74, 13, 7, 20, 45, 27, 10, -31, -2, -14, -43, -11, 13, -17, -38, 7, 5, 29, 50, -7, 10, -6, 18, 9, 30, 25, -8, 1, -12, -18, -12, -8, -9, 4, -55, -19, -17, 37, 1, -36, 20, -37, 10, 56, 28, 5, 21, 1, -31, -32, -56, -15, -14, 19, 33, 16, 34, -12, 75, 39, 34, -51, 33, 45, 0, -10, 21, -14, -11, 7, -11, -41, 10, 11, -14, 12, 15, 39, -50, -2, -4, -16, 48, 20, 84, 25, 18, 5, 30, -13, -11, -16, 2, 30, 9, -16, 68, 16, -30, -28, 22, -21, -37, -15, -2, 60, 20, 3, -11, 10, -34, -26, -33, -27, -39, -14, 4, -48, 4, 0, -22, -19, -21, -21, -60, 0, -1, 55, 12, 16, -8, 0, -61, 35, 54, 22, -23, 16, 15, -57, -5, -5, 17, -10, 12, 0, -1, 5, -26, 37, 23, 18, -52, 18, 11, -10, -6, 2, 28, -9, -32, 15, -4, -51, 16, 9, -6, 1, 3, -37, 27, -71, 35, 22, -20, 15, -31, 33, -26, 59, 52, 25, -25, 7, 16, 41, 28, 2, 8, 17, -5, 9, 51, 39, -72, -53, 5, -3, -36, -13, -39, -11, -33, -14, 24, -15, 35, -18, 38, 52, -14, -34, -15, 34]
6145C4k6m3%M0KJ7%j1Qo4K4Q7o5M1k9J1m8K1K3nkl3lL4n9l1K1N6nNpN3p0M1l8
6180b1QJ6m3M6m6K3PRM4l6rk8P1j1K5r4M1pJ5mj1L2n5N3J5m9P4r5M1Om0ojj9O5
6215A6l1l7J03o1mRk5K3k6K7k8lL1pL3Ln3L4J5o6N8k3KJ0j0Q3q7K7j9kK0oml5
6249c3L7Qm7M0nj0k0Q2q7Rol7J9O8k0j7L1k6M2qK3m3rL6l1kk5M6K1J2r5K5M0m
6283A4j5LK0LJ7j5j8J1n2N6K3j4k2j4l0J9LJ8l0K8l4k9M9Lm0N5mK5J1q4M0k4P4
6316D7%p8NK7j4J34j30j1K0L1m5M6l0K7n8J7l2R9q7JJN5m1K3l7N7m7OO1j3l4q
6348hNK8j1J2o2k4pQ9J8l4J8l8L0lj3qmN5Kq9L3m4J00k6M9n8kP9r8oJ2K3m4k3
6382d9N6l8PN3k4j9j4K4o1P0J2l7L3L6J2n9Qn5M0NK0Rl9RqM3%Ml5K5j5L6l1n6
$$ y = [34, 8, -35, -35, 5, 7, 24, 24, 13, 21, -43, -19, 68, 3, 44, 15, 26, -22, -1, 22, 17, 15, -18, -21, 13, -46, -77, -56, 0, -5, 0, -7, 46, -24, 17, -21, -13, 3, -40, 6, -40, -17, -10, -1, 43, 7, -2, -30, 41, 30, 55, -39, 2, -5, 10, 6, -5, 27, -28, 25, 40, -9, 65, -30, 11, 17, -23, -29, -30, -49, 16, -15, -52, 51, -10, -14, -5, -30, -7, -33, -6, -34, -37, -6, -13, 20, 23, -30, 4, 19, -47, 11, -12, -10, 0, -10, 73, -14, 13, -6, -8, 12, 6, 2, -33, 4, 12, -35, 5, 0, -10, -30, 52, -35, -26, -32, -69, -50, 18, -2, -19, 12, -14, 28, 20, 43, 0, -9, 27, -4, -6, -31, 15, 36, 48, -47, -22, 18, 14, -1, 2, 22, 25, 42, 27, 9, 20, -32, 24, 47, 33, 11, -3, -33, -14, -11, 7, -23, 5, -29, -58, -9, -6, -46, 9, 5, 30, 41, -43, -3, -27, 47, 47, -31, -26, 1, -13, 121, -9, -20, 0, 31, -14, 32, 2, 29, -29, -12, -44, 55, -32, -31, -30, 25, -16, 7, -30, 27, -20, -14, 47, 34, 0, -8, -3, 25, 14, 26, -36, -60, -67, 22, 40, 6, 24, -14, 16, 13, 0, -8, -12, 43, 45, -44, -11, -55, 45, 19, 68, 10, 8, 87, -11, -17, -5, 18, -26, -49, 7, -31, -24, 29, 5, -14, -28, -4, -65, 5, 17, -20, 13, 49, 61, 2, 10, -45, -5, 0, 20, 29, -10, -1, -9, 34, 34, 38, 3, 28, 13, 49, 18, -38]
6416c8ON9K4l8rn6P5Mor8J45j10N3j9qKL7o%m7J1M6k2k8R2q9J2l0OJ4mN2j2k6
6450hJRoK7o8L2k1M7K0p0P5m2l8M5n2M5o3Q5r3J14k4j0q2P0L0j08J1J10m3l3O3
6481B3j30J14L0q9K0OP4o9K8J3k3j3J7L7k0nj7j1K3j9M3Pk3r%n5L9jJ5j3KLLJ7
6515A7Kl4K1m1MM2j7%K5L8l9l7K1oO7l7r0R6k7oO3k4n9K9j3L9o1k7N4k4K6n3N1
6548@jk6J5K3j0nK5o8j0L2N8r4L6kM7m4n4N2K1l1L6J4Jn3Q3m4rL5L0k3k6JL4j3
6582C0K5j4l2j4m7QJ04m6J5k3qNOl8K1j1qK5Jm1J2M4k4L1k5Q4j07lk3P4J9l0k2
6615a2M6p8O3j2q4M4M6j0K8j6j3K0l1jL7j2rJ3J2k9j4k7M6l5N8m2k7K9mJ1K4j8
6647Cl8K2RJJ5m0qpjN3lMm6J00p1om2N8j6J8m%jj6P7l7l6J8JJ5l4lM5q6O4l2L9
$$ y = [-38, -32, 27, 51, 13, 4, -52, 23, 27, 21, -77, 68, -42, 11, -8, -16, -14, 23, 17, 17, -30, -19, 27, 5, -23, 69, -20, -8, -38, -32, -18, -22, 30, 18, -8, -7, 2, -4, 23, -45, -13, -34, 13, 33, -37, 38, -4, -42, 3, -49, -4, -67, 18, -75, 39, 15, 5, -77, -7, 23, -85, -74, 36, -7, -40, 23, -107, 7, 37, -52, -32, -26, 48, -21, 7, 20, -3, -16, 1, 38, 18, 13, -4, -15, 8, -11, 32, 39, 16, 7, 7, -48, -9, -10, 5, -8, -6, -3, 0, 17, 19, -15, 6, -35, -31, 11, -6, -6, 19, 57, 18, -19, 2, -4, 63, 26, -64, 32, 5, -1, 62, 38, -21, 8, -5, 34, -27, -54, 0, -24, 2, -51, 0, -1, -27, -12, 11, 1, -4, 21, -47, -57, -25, 33, -61, -25, -27, 20, -24, -78, -26, -5, -36, 0, 14, 15, -38, 45, 1, -8, 27, 57, 34, 8, 9, 43, 30, 55, 41, 9, -5, -52, -44, 60, 14, 29, 6, -2, 3, 9, -29, -8, -19, -27, -2, -1, -42, -30, 14, -10, 21, -4, 80, -27, -30, -53, 21, 40, 10, -12, 34, -44, 19, 7, -77, -33, 13, 3, 31, 15, 2, 22, -9, -10, 27, 15, 6, 19, 31, 2, -12, -39, 7, -28, 30, -12, -39, -10, -14, -3, 21, 3, -35, -13, -4, -3, 12, -28, -36, -43, -44, 9, 6, 10, -36, 64, -7, -13, -55, 3, -13, 5, 1, 1, 0, -16, 61, 24, -12, 6, 7, 22, -12, -15, 30, -56, 8, -24, 15]
6684A5k6m9P3k9K5k4QL5nl0pM3m1m0P9Ok6N2Ml4mp6Q1j4k1M8l0j4Lk6O0o3jN3
6718B5l3Mk3L6K6k5m2kK2rL2j7L9k2Lno2K3K2M6j4j2l9L4K6p8Q1l6qrN4l1M3o7
6752a8j6O6l2kKm9N1N3p5j8LK8j5KrK6j1J3L3o8k7K1J8k4N5K8k9l6M1L3k1K5l0
6785A8j6L2m9J8o3R2lJ5Qjp1L2Lqm8K4M5j8L4o1N1j9k3J5l2J0KJ0rj4rj1N3m1
6819c4L7J5l3LK4%m2P6o1P1l7k5M8p1P9l4m7N9l6%M9k8k1pPj6L9J1l8qJ7k8M5
6852A4j4L9J6k5o5P1k6kk1J9k0J8J2L7k1l6OK9n0Q9p9N6k5K8n0P5on2J7rM4o9
6884@M9p2J0N1l9k8N1r6J13p3J5k7L1m1M3J3j9O6Nq2L6ml6k5P1rL9l0j8j5M0j
6916A8m8L1k9Q4k9m4mK9m4oM6k5J9oJ9j9nM9nn6k0mO3l4K2k1rJ23j35N1k4j8K4
$$ y = [15, -11, -60, 13, -16, 9, -15, -7, 28, 23, -7, -14, 29, -12, -52, 27, 33, 7, 59, 63, 29, 25, -51, 30, 16, -5, 43, 13, -1, 2, -24, 36, -27, -28, 25, -8, -4, -27, 9, 35, 10, -32, -34, -12, -21, 11, -6, 33, 11, 14, 9, -53, -30, -8, 38, 24, 12, -27, 7, 33, -45, 36, 0, -8, -17, 37, 6, 49, -18, -34, 32, 0, -2, 0, -49, 2, 55, -20, -38, -35, -7, -22, -20, -29, -3, -14, -1, 32, -36, -63, -42, -24, -48, 7, 35, 6, -30, 11, 44, 23, 48, 18, 2, 34, -15, 3, -60, 32, 29, 44, 52, 51, -20, 12, 15, 7, -41, -17, 28, 10, 44, -17, 34, 15, -8, 7, -25, -15, -13, -3, -12, -26, -35, -46, 7, -34, 3, 18, -15, -12, 12, 12, -30, 46, -15, 56, 19, -6, 42, -29, 50, 16, -31, 28, -8, -8, 41, 13, -8, -15, -8, -24, 15, 26, -12, -20, -3, -31, 14, 0, 39, 55, 30, -35, 36, 10, 8, -13, 6, -14, 4, 16, 53, 32, -4, 2, 31, -19, 70, -9, 47, 22, 50, 0, 75, 69, 17, 34, 25, 69, 0, 49, -23, -13, 38, -1, -29, 22, -74, 39, -34, -19, -46, -15, -56, -13, 0, -19, 47, 52, -30, 6, 2, -34, -59, 12, 3, 42, 12, -6, -21, 19, 18, -30, 1, -28, 56, 27, -17, -21, 8, -36, -42, 4, -21, -2, -8, 11, -8, -13, 36, 31, -25, -45, -49, 14, -20, 2, -19, -28, 95, -40, 11, -13, -31, -7]
6949gMr5J29J5l2lOk0j6J3j2L4l3K3nL8l9j5K8n5J1M2l9jM6j2j3PL3p6J6K0m4
6982e2P7m6L8j8Jk2J7n3R9k6l9j4J5L7J9OJ9o4j3L8l0lolP0m7L7j1o2L6l7L6r
7015a0k1oj7N7mj0K3n2O2j5l2O5o6k4K2J9j9O9q4K8L2l5K9jK6l1N0n2m3J18n0
7046B8j3j0J1k1O0j34R5J0kk2K3j1Jj7K1K0m9k2j8N7mL7p0J6K6K5jq8J43j02k6
7077c7J0M6rL1p6JN5k6K0%P0r8L6l9j8M5M5r9L1m1J06o3J9l8J4K3o8J00p1L9k9
7108b1K9k9O8n4j1JJ0K1o4l1P0M2l6j5N2l2j17J44m4j8M3ko0J07o5K0%l0K9m1
7138c4L5l1j4M4K3Pl4JK5l2K1m3P0m9K6j3Pj5m3M9L9r3N1Jqqj1Q8j00K4L2qO6
7171G3o1lo2K1PO2l8m0M1o1K7J6ll%j5O0M1m8n1Q3n4j5lJ0K8j2K4n3J2LJ7L1o2
$$ y = [-7, -3, -98, 31, 46, 14, 11, 17, -3, -19, -6, -18, 16, -17, 6, 1, 39, 0, -15, 13, -42, -31, 11, -28, -29, 17, 5, -8, -1, 32, -44, -28, -8, -52, 25, -21, 17, -1, 0, -22, -5, -58, 41, 15, -24, -38, -23, 14, 33, 39, 58, -6, -19, 19, -11, -14, -20, -23, 47, 0, 37, 26, -36, 0, -37, -1, -10, -31, -37, -54, 3, -1, -11, 12, -40, 22, 7, -25, 40, -26, -50, -28, -9, -28, 41, -43, -15, 17, -18, 11, 10, 36, 5, 55, 3, -40, 78, 28, 15, 5, 16, -5, 55, -79, 16, 26, 24, 2, 25, 14, 15, -2, 19, 39, -10, -32, -50, 7, 3, 40, -30, -14, 12, 37, 36, -52, 91, -11, -37, -27, 19, 10, 41, -35, -34, 21, -5, 15, 15, 85, -13, 23, -16, -34, 11, 56, -43, -12, -53, 53, -10, 9, -29, -15, 8, -60, 40, -31, 8, -21, 8, -21, 47, -7, -18, -17, -7, 14, -50, -81, -11, 31, -5, -20, 32, 0, -117, 27, -17, -35, 8, 6, -54, 53, -12, 8, 8, -22, 7, -34, 1, -30, -44, 0, 23, 30, -4, -3, 22, -10, 11, -32, 38, -11, 15, 2, 9, -6, -49, 0, 39, -54, -3, -2, -10, -18, -29, 59, -41, -17, 15, 7, 73, 12, 9, -53, -32, -25, 37, -1, -41, 0, -61, -34, -18, -21, -24, -24, -39, 21, 62, 14, -37, 46, -8, -23, -26, -16, 12, 0, 24, -29, -17, -14, 3, 34, -28]
7205b8K8P3p0j8L2l7NJ9K8k8p0P3LJk4J1j1J0oML2p7R1n9K5m8P3jm3%kM2Ok4q
7240BQpL9kk6%j7l2N0l6L1k3K5J7qqk1N4k2l9pM4Pn6k4P6lLm2N4km7nR0j14J7
7276b4JP8m4K5l5Rj%J4lqj5n2KM9M7k5j9l0L4rk8J0M2J0o1l3P4J8j2j5J1M8o3
7310ePl6J4k7KLOM0NPl3KJ1MK9k9Pm3L7j4m3N0L6p1P9Kl2k4K4k2j4Q0p0K6Nnm2
7347c4L5mj2l1j2J12l7Lj9K9ml6m5L1L7l3j2J8J2M5n3K9j0k0J6m4O3n6N7j5J4
7378B4o0M0l1L0koO3p5J2l1P6l6JL2J8l2n5L0J6l0oj7K6K8k3j0N9m9j8L3n7P0
7410B0j1qk5M2l2Q8l6n3N5J0m3Rorn5O5PJ9rRk2j3j6rQ%J0k7O6l9jn3O0j7joN
7447a8K1J7Rq0M%O3J7j2lqqm1M9k0N2l6M0k2L4Krn7L3%JPo0J9mO0o7P4J2o8N5
$$ y = [-28, 0, 73, 3, -15, 17, -20, -15, 4, 32, 4, -66, 7, 10, 11, -13, -2, -13, -3, -9, -5, 27, -50, 41, -18, 7, -41, 32, 31, -12, -12, -14, 28, 34, 10, 2, 10, 3, 42, 40, 14, 14, -3, -35, 15, -21, 10, -13, 12, 29, 21, 13, -8, 46, 24, -15, -22, 22, 29, -27, -51, 25, 22, 25, -17, 37, 35, -12, -17, 73, -41, -24, -23, 55, 11, 36, 1, 10, 9, 9, 23, 20, 12, -3, -55, -53, -4, 43, 18, -1, -31, 3, -6, -34, -24, 18, 28, -33, -66, 8, 26, 14, -1, 10, 58, -5, 2, -34, -20, -47, -45, -42, -36, 4, 9, 16, -17, -15, -4, 0, 29, 0, 7, -36, 1, -13, -56, -6, 30, -41, 38, 40, 8, -16, 8, -14, -28, 52, -18, 8, 13, 8, -34, 1, -3, -15, -46, -58, 54, 17, 20, 1, 30, 26, -10, -55, -24, 13, -20, -32, -14, -2, 43, -10, 19, 9, -11, 5, -39, 24, -32, 25, 10, 24, -36, 4, -27, 3, 1, -5, 58, -17, -5, -36, 40, 4, 5, 37, 55, 23, -32, -2, 14, -16, -22, -39, -13, 15, -8, -18, 41, -8, -26, 7, -50, 20, 9, 1, -24, 18, -14, 74, 38, -15, 40, 50, 7, 16, 10, 1, -54, 11, 18, 37, 28, 37, 15, 2, -14, -23, -15, -15, -5, -32, 34, -5, -6, -59, 1, -16, -17, -23, -18, 3, 20, 29, -51, -47, -47, 16, 33, 21, 18, 10, 2, -39, 10, -10, 42, 6, 46, 24, 58, 60, 51, -6, 27, 27, 28, 35, -25, -6, -10, 50, -17, 57, 69, 1, 56]
7483E6m1Mq7N0LQOj9K6PmMJ7K7p0QK8l0rM0l6L6j9j2j4M8l7j7kP8k7l9J6K9Qj7
7519A9l6K5M6m3j9m4L4jN2j9j2o3lM2m2N6k3P4m4L0J0l7J7J9J6Ml2l0M3Nq0NQ5
7552E4n9M3kjK7l7l5P9j06L5n0N6pj2K2L7l2Mj4oK4nl4M7n2Rj8N2j0n5J15p8O6
7585E7J4k4k2L9l7Ol3OMol0J0Q5n6k2l1M1O6j03kM2L0k2nLJ5n0Lk6O3K6p0ORO6
7620E2p6L6Lk1M8n4j4jR4m2J1J0o9N9Jj2J6nLn0N3p5N7l0OO5q5N0l1m9L9M4l0
7653CRJ6J1j0j6n5L4J7jJ0k2k5M6j1L5Lj7J2jk7n0O0J1MJ5q2prQ9p8P4m3M7n2
7687a0j0R0m0q0N4M4o4J0Pl2K2P7j08J6NL9J8o5M2nl2N3n6j4M8J6Qm5k0Q3k9q
7719A4j2K4Oj2K1m1O0o9Lj4J4K3o3K2lj1NQ2p9JK6qORpk3k0O1j6rK3Qp6N7k7R6
$$ y = [56, 15, 19, -68, -18, -15, -7, -1, -20, 6, 13, 9, 13, 30, 57, -13, -5, 23, -7, -16, 24, -12, 24, 5, -7, -21, 27, -10, -27, -29, 49, 22, -17, -1, 28, 36, 19, -17, 8, 54, 11, -8, -52, -18, -19, 33, 14, 2, -61, -64, -22, -64, -8, -31, 43, -1, 29, 39, 2, 19, 38, 54, 58, 26, -4, 39, 44, -36, -31, 54, -5, 38, 36, 35, 62, 25, -10, 69, -37, -2, -52, 4, -3, -15, 7, 44, 12, 16, 2, -4, 20, 15, -19, 28, -24, -15, -33, 19, 9, -46, 69, -9, 57, 71, 47, 25, 64, 27, 33, 0, 6, 10, 4, -26, -16, 69, 13, -9, -40, 1, 67, -36, -38, 4, 34, 12, 7, 10, 25, -25, -22, -48, 15, 41, -29, -23, -14, 52, -24, 12, 15, -6, 42, -12, -26, -27, 67, 25, 36, 46, -23, 36, 37, 25, 41, 36, 39, -11, 42, -33, 24, -6, 0, 65, -20, 30, -1, -50, -11, 33, 3, 12, 28, 39, 29, 13, -42, -8, 9, 8, 18, -4, -29, 17, 6, 41, 44, 27, 39, 38, 11, -39, 21, 32, 36, 51, -31, -38, -47, 42, -36, 38, -5, 42, -10, -20, 70, 30, -50, 4, 48, -16, -6, 1, -31, -9, 68, -40, -24, -19, 20, 38, -27, 15, 10, -22, 31, -25, -39, 9, 25, 33, -12, -32, 51, 22, 14, 2, 26, 32, 20, 41, 0, 60, -9, -6, -20, -6, 17, -46, -24, -27, -38, -33, 49, -30, -29, -3, -11, -5, 4, -3, -26, -46, 15, -1, -10, 13, 21, -55, 2, -25, 71]
7755G1Jqq4lK8O8n9l5J6N1j6q5O0R4j5n6l0l4J1N8k5o1M9O8k9Mp8N7K0k4J2j04
7787g8J29pn2M6o3M8k2KmnJ3Kj3N4q5K9J9k5j3L7m2L6L8m2l3L3J8j0m6K0O1n3
7819hLO1j07K8J4M3Jk7K9m8m5N1m7O3l7j0M1K5k4pM9k8N4p6mJ5OM4nJ1j06N6k
7852A3onL5n2O7q2L4ok5P%O2n0J0jJ3KK3n1J2K4J5m2J6J2KjKo9R8m9k9P2k0Jo6
7888c4R1Pkr5K8rj3M1rMMk5J5j2m2lL0K0m7Q1Pk0J9L4n9K4k8Pj2J5n8P3n6N3l1
7923brk4N5Om8J00m2k4poO3jo0%M6ol8k2oK6k6M0k1J7j0J0j4Lj4J9lK5m9P9p1
7958a4O7m6l5J9K6j7KN1p4JN3m0PL2nj3Ro4P8n1J0M0K3m1l6Rk9rN9L0k6ml6L9
7992A5L2l2nJpjoK5J3m1k8R7k5p1K9JMm8N9k7J0P3p2K7Jj0J0K6n6M3l1m1K2j4
$$ y = [71, 72, 64, -20, -23, 5, 73, 14, -21, -5, 46, 30, -55, 5, 99, 84, 28, -2, -36, -25, 33, 8, -53, -4, 64, 35, 39, -39, 18, 38, 14, 26, -78, 51, 44, -8, 38, -25, 23, 1, 3, -1, -6, 7, 9, -4, 50, -35, -6, 13, -12, -25, 12, -30, 6, 44, 2, -31, 2, 20, 10, -36, -16, 45, -8, -5, 56, -51, -23, -9, 34, 35, 8, 37, -11, -56, -5, -52, 11, -26, -36, 5, 30, 6, -1, 48, 20, 74, -2, -6, 9, 15, 59, 54, 65, -41, 15, 13, 7, 2, 37, -15, 52, -30, 4, -2, -27, -20, -20, 42, -8, 2, 1, 14, 16, 39, -12, 0, 24, 39, -3, 13, 25, 27, 26, 28, -41, 57, 8, -21, 51, 31, 32, -34, 57, 64, 62, -33, -5, -14, -27, 14, 5, 9, 13, -12, 3, -9, -51, -54, -24, -4, -51, 30, 37, 17, 36, 70, 11, 35, 7, 14, 2, 17, -41, 32, -24, 29, -2, -11, -35, 20, 26, -22, 78, 36, 12, 5, -1, 62, 61, 1, 1, 47, 41, 3, -19, -25, 1, -25, 15, -6, 11, 1, 11, -3, 0, -14, 5, 2, 27, -22, 57, -14, 53, 7, -28, -9, 17, 0, 2, 53, -21, -20, 33, -7, 0, 32, 27, 14, 23, -41, 37, -14, -4, 36, 59, 18, -18, -9, -38, -47, 12, 42, 16, 12, -24, 15, 47, 15, 10, 11, 4, 3, -3, 22, 35, -6, -34, 63, 38, -33, -4, -3, 1, -47, 12, -15, -5, 68, -4, 23, 24, 14, 24, 50, -6, 37, 6, -35, -13, -27]
8026b7K0M6k0m1Ll2M6N8o3PNl1K6l9N1ML3p2QM5p0Q0m1J2K1jj9J5K2j2n9N5k8
8059BOk1J7m8K0L8l4M1m8N6jm8RJ9l6O6m8l2O4Qk2k9M7K0m5n9P4l7K2pLM3n0m3
8093e3L9J8j9M3l3rL9m8J4oLR5l5l2j8K3j2L8o1PP0q2P3o4J7n3K8l0L4kM6l9j5
8126b4J6m7P9m5K7oQrk7N9QMo6K8j4k5L5K2Lp0J9L6L6o0L3J3l1KJ6k7K3l9L5J7
8160B9j8k5N2m0O1rn4lO3o4J4K3j5p0N8N4n7J1Jj0lj4M6Kl0O8j09O4Krq1
$$ y = [-27, -7, 39, 19, -22, -19, -51, -5, 53, -10, -3, 2, -29, -3, -42, 9, 13, 46, -26, -18, 27, -43, 37, -4, 8, 29, 28, 9, 24, 46, 34, -25, 30, 2, 8, -13, 4, -44, -24, 14, -20, 21, -27, 29, 28, -20, -11, 8, -28, 38, -10, -42, 22, 30, 8, -21, 26, 46, 1, -58, 16, -21, 1, -6, -3, 40, -10, -53, -14, 4, -15, 28, -5, -14, 25, -23, -9, -15, -12, 83, 48, 16, -2, 21, 9, 47, -14, -7, 63, -19, 54, -10, 7, -46, -18, -48, -14, -16, 30, -9, -24, -8, -55, 24, -21, 6, 0, 8, -1, -28, 31, 39, 43, -23, 5, -9, -34, 1, 23, 26, -44, -25, 11, 47, -13, 20, 33, 2, 4, 20, -7, 16, -23, 12, 29, 11, -14, 38, -2, 59, 50, -4, -7, 56, -8, 6, 29, 14, -56, 2, 56, -1, 10, 11, 1, -2, -16, 30, 32, 2, 70, -39, 25, 27, 18, -63]
8191f3
$$ Imaginary data points
##PAGE= N=2
##DATA TABLE= (X++(I..I)), XYDATA
0@%%%%%%%%%%%Qj6J6j6J6k4L2m0M8n6O7p5Q8j06J30j52J76k02K28k64L02l44L92
34B08m40M96n60O26p00P82q70R68j076J191j317J456j610J775j954K156k375K616
52A372k884L182l515L888m311M795n356O014o799P754q947J0488j2562J5523k0142
67a1500K8414m7893J83207J75584j40954o8178j25398o9550n8494j4231k1669
78a70662R770J8202M6280L6511N9597N1544L7419J6356L60l7663l8746l8687j9714
91b9433N47J0458M195q06k0820j7813j2436p471P672K1382K0228K7085K1302R563
105C3653J349O1Q256J4326Q950N848j4826l6125l0149k2719j7052K107P616J853
119c6852J244k24N29L731J2708K9710L4261L0363K3120l606k7290l1338l2148
$$ y = [0, 0, 0, 0, 0, 0, 0, 0, 0, 0, 0, 0, 8, -8, 8, -8, 8, -16, 16, -24, 24, -32, 35, -40, 48, -58, 72, -80, 96, -106, 122, -142, 160, -184, 208, -232, 264, -296, 330, -370, 412, -458, 510, -566, 625, -692, 764, -846, 929, -1025, 1131, -1244, 1372, -1512, 1670, -1845, 2043, -2268, 2527, -2829, 3185, -3614, 4140, -4807, 5681, -6881, 8642, -11500, 16914, -30979, 152228, 327812, 186858, 118680, -6718, -76268, -134762, -148993, -170662, -160892, -142690, -96410, -59899, -302, 51242, 88661, 105017, 105377, 67714, 28968, -9719, -29433, -28886, -18428, -14233, -15039, -35859, -53672, -66108, -73579, -65907, -44525, -24297, 2788, 24090, 33653, 35002, 35063, 43319, 57645, 66595, 72443, 57617, 21492, -8657, -31376, -48428, -46321, -38705, -36852, -35608, -35832, -35303, -31572, -18864, 10846, 45107, 75470, 98590, 94984, 67694, 36356, 4208]
132D208k3323j0937r545q193q056n332Q109J5472K1388L0154K4511J3901L510
145E5867j5289k7184k7786j9473k460O509R414Q806l220n744L457M736R545J5562
159A2740Q690K747j160p444q687p226J316J1195J0106Q169O43j6078j7922j0907
173a3818o004M678Q469L425K29n302n336j361j061O232J1781P645O420j78j0849
188D970j0449o310R71R093O811L077l276j2056p141r82K62R134J1060N952N009
203A6125l92o330o159n215J787N801J991R63o204j2587m434Q37M338J1210P428
218I159J452j585p176o441m086k451O194P934M892M985k820q264l787j827K202
233a619N110L11k161n458p549n01J558K809Q595N034N57o3o337p397k985O21P264
$$ y = [4208, -19115, -30052, -39597, -47790, -55846, -61178, -53069, -37597, -16209, 13945, 38456, 52357, 55867, 40578, 13394, -14392, -33865, -36325, -29816, -20402, -11596, -14816, -20560, -17103, -12367, -2822, 12740, 21430, 24177, 23017, 15573, 6886, -340, 976, 12171, 22277, 30446, 31089, 15011, -2911, -13818, -19822, -15144, -6675, -3250, -3021, -8323, -13659, -15020, -16081, -9849, 1932, 9577, 15997, 15819, 4970, -5479, -11789, -10818, -1725, 5086, 8163, 4887, -7169, -14310, -15292, -15030, -5896, 5164, 11116, 16125, 15733, 9403, 3244, -1971, -184, 5617, 7608, 8571, 2367, -10220, -14654, -13817, -9479, 1731, 9159, 10611, 9026, 1850, -4591, -8677, -11128, -4934, 3000, 7892, 12877, 10057, 1793, -1994, -3821, -1619, 3491, 3802, 1641, -3817, -11366, -11867, -10309, -7500, 1095, 6129, 6686, 6623, 286, -7111, -10096, -9475, -2211]
250b211Q324M835K930m292o644j610k807r38K538j476k100j122k710M59K495M548
266B19Q014L821l17k855r370q098k243Q8M901O441L008J786j281k332k60j946
282d24m7K191j679j644j320m268r73K471M090O536L645N75j477n423l263j11j013
299b134K530K889j084q16k474l886j236n57K038L862J101J488P4k785Q56K007
315A873J029K910N80k186k496m476k717m73l61L211K920K08J359o14k176R10R28
332D29J256K092l20o40j738l089K68M95M61L363J058q57r2k585k199m14r33J126
350b319N62p44J180l60n78K808J395J531K867m13j473j856l613j792j141r45J513
367c378r5m01J641l92M63K692Q03J665J984l85j46j839k830r82k051r66J180j055
$$ y = [-2211, 6113, 10948, 13878, 9586, 2942, 1332, -1475, -2413, 125, -1351, -3451, -4573, -7283, -6824, -4329, 219, 8233, 12054, 11737, 8882, -488, -8586, -10829, -10741, -5840, 601, 3609, 5395, 4114, 1782, 1522, -424, -471, 1720, 41, -1603, -2923, -7191, -8164, -5693, -1603, 4933, 8578, 9153, 7676, 2253, -1010, -1121, -2134, 396, 3285, 2201, 1385, -1089, -4975, -6211, -6768, -4730, -868, 233, 1721, 1795, -990, -134, 1873, 2902, 5812, 6392, 4206, 1710, -2766, -5483, -5956, -6317, -3106, -186, 22, 1381, 767, -1409, -499, 429, 1685, 3777, 3457, 2817, 1079, -2010, -1742, -1247, -786, 2577, 3635, 2778, 2686, 101, -2098, -2512, -3445, -2319, -1757, -2501, -1321, -1681, -2259, 549, 1944, 3475, 6342, 5929, 4456, 2600, -1013, -2805, -3946, -4891, -3378, -3473, -3874, -2233, -2625, -2162, 530, 1333, 2998, 4982, 4597, 4451, 2612, -218, -1200, -3251, -4217, -3037, -4092]
385d092K19K158J067K907L045J182J370q28k377k030m486l470j243j681J391L395
401c473J932K980K301O97R88q07j967j768l377j600L56m42J831K503J156K414
417C724J380p76r86l106k916j511j814M47J412N70K747L034J381J961r3j522r58
434B974j840j023q33k163o09n60j059J084M47l55J397J305J843K930J567J882
450F987J150j76N05j420l507l168m357l622o08k02J135K561K061L125K496O76
466C636O10j259j943k60j331r47K7r47M03J660J140J665P0j477q00j854j284N09
484b382m50O82K319J349J671P17j150p58j236p71M42j056r46Lr04O26J540Q8Q48
503F32J72o95K31p50q37L83j38J390K453M47L15n71k153o44l06o72K71p98n04
$$ y = [-4092, -3873, -1715, -648, 2259, 5304, 6486, 7856, 7028, 4651, 2621, -1865, -5335, -6578, -8259, -6868, -3473, -1541, 1439, 3740, 4437, 5425, 4618, 2651, 883, -2494, -4094, -3738, -4180, -2349, 154, 1310, 3724, 5104, 4328, 3342, 236, -2680, -4191, -6005, -5558, -4146, -3576, -829, 2205, 3586, 5547, 5454, 3932, 2974, 1134, 111, -722, -2885, -3494, -4054, -5113, -4029, -3582, -3937, -2540, -1235, 608, 3538, 5105, 6987, 8137, 7961, 8466, 7046, 3539, 371, -3986, -7608, -8216, -8418, -7283, -4722, -2661, 464, 2960, 3636, 4246, 2987, 1044, 784, -547, -1494, -1467, -2414, -2011, -351, 789, 2454, 2524, 1047, 247, -1607, -2891, -2382, -2832, -2150, 169, 1518, 3189, 3906, 2756, 1998, 762, -9, 433, -623, -1569, -1566, -2470, -1844, -304, -216, 632, 804, 109, 340, -410, -1247, -864, -1002, 388, 2841, 3288, 3603, 3032, 879, 235, -71, -743, -472, -1270, -1774]
522a774N09m39M40O98o63O76P37p56k12j148j470K51O93J736K051K43M16K99o30
541A657P55M15o26M63l58o06k78j618j333m07m64J195J159l73K42l95m62J331
559B97P86L50M61j065r44r65j771o32l64K0J850J606Q31J148p0K7J024L49L80
578C318o79j911j321j482j105N97L80Q63K041J110Q83K23j196q62o95o41K08q66
596a135j184l02m11P61K074J306J330Q86m14m63j348j841q36p68L10J509N88N96
614F58M47k68N40O14k12l58j688j889j197j341j13J013R50K259K544J251J020
631D230j71q90m63p74p99o63j797j305o47m89J190J446J004J712Q70R4l9j189
649A320j178m55o73M44M05o07k0j78j65R66P36J91L36q78o83m44j005J01M99L69
$$ y = [-1774, -1265, -1704, -1264, -566, -1229, -553, 184, -572, -784, -1932, -3402, -3151, -2458, -722, 1329, 1572, 1988, 2287, 1657, 2412, 2827, 2201, 2664, 2306, 1700, 1422, -196, -1529, -1936, -2400, -1205, -46, -419, -177, -572, -1034, 297, 1083, 1433, 1894, 829, -115, -1080, -2851, -3483, -3847, -3827, -1977, -371, 460, 1608, 1538, 1565, 2589, 2938, 3318, 2639, 728, -593, -2075, -3180, -2583, -2203, -1340, 701, 1811, 2694, 2917, 1721, 859, 164, -477, -269, -1135, -2319, -2621, -3032, -2271, -197, 1109, 2439, 3325, 2911, 2448, 1100, -741, -1577, -2345, -2035, -526, 62, 658, 1105, 837, 1377, 1991, 1779, 1421, -267, -2156, -3353, -4694, -4807, -3794, -2844, -585, 1959, 3210, 4230, 4059, 3169, 2706, 1932, 1133, 470, -1327, -2632, -3279, -3768, -2578, -1132, -128, 1584, 2454, 2548, 2509, 1320, 142, -313, -986, -542, -137, -744, -764, -942, -1107, -141, 595, 786, 1122, 244, -439, -883, -1888, -1787, -1288, -919]
669i19J573R78P0K81n96n46K11k57k1l52j399n51n40l15Q63M35N07J191K61J69
689A043J03p40j08J22o9M73k90j022l41n38r7R97M58O94O87j82N5l40q35q1m18
710d29l17M49n45m19M1k33O81J195O04P16J9o07l56p64o03K0k96J13M83k85L1
731e02jm21M11N19L91N71l48l74M9l28L37M79j29J44j04o86k72o03l76K97Q4N93
753b69O53k85k3l9l89N53K74N0L23m04k65K9m36M7K19j30K97p7o38o0l16j29O37
776c78L18M46M10m92m5k55m27L76J9l2M52j05k08J54l84J06L00k21L06l11o28
797e99J3j85k7Q10K21K28L47l23Nj62m40K59O8j48M88l02l07L0l93K3K72j03J45
820h0j15m93K08r3j5P05Q3J55M23m29j82o3m26K12J40j07M02l16l69K07l30M1
$$ y = [-919, 654, 1632, 1702, 1983, 1387, 841, 1052, 795, 774, 422, -977, -1528, -2068, -2383, -1520, -1085, -578, 613, 874, 1043, 1146, 406, 298, 420, 351, 824, 534, -488, -829, -1367, -1464, -467, -9, 685, 1372, 1190, 1245, 905, 70, -11, -429, -746, -297, -842, -1261, -1220, -1453, -772, 423, 1027, 1743, 1762, 1155, 799, 35, -568, -548, -844, -731, -248, -533, -502, -503, -924, -513, 6, 397, 968, 620, 246, 295, -33, 304, 783, 654, 798, 694, 8, -264, -867, -1243, -946, -862, -269, 384, 99, 76, 37, -352, 201, 475, 525, 848, 444, 179, 208, -228, -181, 38, -92, 205, 128, -510, -570, -886, -1015, -378, -60, 386, 796, 304, 259, 4, -423, -47, -28, -60, 392, 287, 79, 233, -151, -45, 255, 34, 340, 29, -599, -586, -771, -798, 12, 233, 461, 808, 485, 490, 328, -112, 147, 215, 67, 555, 253, -54, -24, -417, -394, -122, -225, -80, -195, -688, -480, -573, -588, 117, 200, 355, 778, 349, 167, 104, -322, -110, 30, -77, 325, 9, -360, -153, -483, -442]
842d42M14k04J55K49l24K67J2O1N19N6J44J93o40l25j09n90J51M7j76L15j17j11
864d55L63j78K00M24k25K06j14n02n3j17r7L89R3J24L84k73L1j0l63Q7jk68J47
887b08j91q7J56J22L41M93P2L13j1m36j65l25l73L1j02p1K16j12J02K16%K53J21
910C55k86M1l25m29R8j84R4M22J17L62K69o5K23j72j84N9k32l45m3l77j39K11
932e30j47L88K52P8M20m3l9K18k56p6J71k71l0ml26J30m6o0K17r9j7J89l92n5
956c28Q2k65J33J22m8L60O0Q3K93o7R6J93l88j67j27n34j53j28k16K75J21L7N20
979d6P0K53L79j79K77O9k39j4k30l65l5j89j27K82l22J55K19k17K16J39k25K68
1001A39M0r1K03j24o4K45k25O9J61l67J21k08k60P9j02j33J85j25J15K31q8J96
$$ y = [-442, -28, -232, -77, 172, -152, 115, 127, 188, 707, 763, 907, 1100, 460, 135, 26, -564, -413, -366, -542, -227, -344, -455, -92, -270, -70, 354, 129, 335, 221, -281, -334, -451, -548, -159, -66, 58, 442, 169, 200, 190, -173, -86, -87, -355, -208, -399, -486, -330, -208, 133, 626, 698, 1011, 1000, 564, 399, 74, -299, -268, -370, -441, -225, -337, -235, -19, -19, 234, 355, 69, 110, -215, -644, -546, -730, -636, -214, -97, 265, 534, 469, 692, 520, 336, 395, 163, -182, -225, -602, -741, -530, -677, -289, -37, 41, 461, 418, 379, 597, 341, 265, 436, 165, 135, 131, -195, -65, -111, -171, 46, -53, -70, 119, -273, -328, -246, -511, -378, -256, -304, 56, 116, 199, 492, 425, 521, 714, 326, 159, 32, -502, -655, -783, -999, -724, -603, -566, -46, 24, 277, 656, 477, 754, 823, 584, 570, 340, -25, -60, -249, -376, -94, -416, -261, -42, -259, -43, 96, -129, 139, 179, 88, 291, 167, 103, 348, 123, 192, 353, -14, 107, -101, -361, -282, -384, -517, -332, -457, -342, -111, -199, -3]
1023cJ78k4K01Pk54J72k84o3Qk50N5J02j53K85J50k25L38pj84K46j96l9N6k34
1047a18m3P4j76K28lj10K57K7rJ71j46L8J21j68Q6j00j49M1j83m4J46j32kR9r6
1072a91J35J08o3K06Lp3J61j10o4R6l38J0M6l11L7j1j56K35j28Q9K79j19J26K31
1096A98q4K55J45k06J89q6j77R8k47j40o7k85L8O9k00K43Q4j6L52qm3K61j07J8
1120B84J31l00J05o0l01J10q1j88J16j90l1J85j54Q8K45p4K00J15p7K39k4r6Q3
1143C25k51K1M2k38L8K3k34J79n1j38J81n8o8J98q8K0J47l6J70J12j72J97r0j64
1167F5J48k46j02J03k04J8J05j37J84J9j3K11j01pJ51j23Q8J12j83K2J35k00J52
1190A97o7j71K6j37o8J29j44N1J20j35R4P4k3K14q5l8K21k62j3J59k27Q7J01k00
$$ y = [-3, 175, 151, 352, 359, 105, 277, -7, -70, -62, -312, -257, -155, -308, -23, 127, -98, 240, 233, 49, 295, 99, 60, 116, -118, -161, -87, -263, -35, -38, -148, 109, 136, 127, 298, 152, 190, 311, 143, 229, 129, -20, 21, -162, -206, -60, -192, -194, -95, -191, -56, 52, -11, 195, 198, 125, 286, 176, 112, 208, -130, -120, -74, -385, -348, -359, -515, -280, -408, -319, -40, -159, -33, 198, 114, 369, 514, 308, 497, 411, 234, 332, 85, -55, -122, -407, -369, -300, -500, -257, -173, -189, 163, 155, 112, 373, 266, 284, 415, 115, 220, 160, -141, -31, -112, -300, -184, -374, -405, -220, -374, -286, -41, -115, 85, 200, 123, 362, 338, 242, 325, 74, 95, 137, -101, -63, -40, -274, -95, -146, -284, -103, -161, -229, -31, -119, -99, 48, 12, 182, 294, 122, 319, 229, 65, 213, -33, -135, -32, -236, -218, -113, -250, -66, -47, -60, 151, 50, 43, 194, 71, 159, 271, 88, 110, 245, 45, 197, 130, -41, -15, -152, -220, -91, -235, -184, -64, -199, -105, -31, -54, 160, 75, 37, 258, -4, -17, 142, -85, 2, 103, -97]
1214i7K11o9j02J53j49kN8j87Q7K0r4Q6M8o0K10N5m2J14j55L1J25k65P2L9k32
1239a45O1m9j23J94j23K7J20m1L6P5n9J48j3j03J46n6n4J15j55JJ55k14L1Kj22
1264a46M8p9q1J79p9K2J89o2Q5J28r4R0Q4j03R8k17j06J02j66l4N8j27M0J22p6
1289a25J13K6q8J60p4r7J89j51O9R6j90O1J30j44J12m8n7P5p9j10J37k01J16N3
1313b7j16L5J32j49K23j9o5J03nj6J58j80L1M1j61J29j11MJ0j23n6M4j17N8L0
1338a47p5K41M3j58K52pK3J29j80N2M4k28O0o7j79N2Rj33J33l2m0K25o6R6J39
1363A86k8R3N3j29J11p3q8L2j77J2Pk12L6k7n1J17k6K5J61j0L5J34p3Q6J7j24
1389H7P6l5p6K2k09J2L9j25k7J32j46J17K6q2J73K6P0R1p3M4J55j14m0M7j80N1
$$ y = [-97, 114, 45, -57, 96, -53, -55, 3, -184, -97, -77, -171, -85, -37, -97, 113, 168, 126, 240, 85, 116, 241, -24, 48, 87, -145, -84, -133, -256, -62, -185, -158, -38, -79, -43, 32, -27, 121, 108, 5, 151, 95, 41, 156, 1, 2, 157, -57, -26, -24, -146, -98, -177, -258, -79, -158, -136, 53, -9, 76, 204, 110, 200, 284, 181, 279, 62, -44, 58, -108, -142, -84, -211, -171, -49, -125, -12, 14, -74, 86, 12, -85, 104, -47, 22, 118, -72, -11, 119, -25, 87, 39, -18, 57, -22, -132, 5, -196, -80, -27, -143, -108, 24, -125, 98, 79, 14, 117, 112, 96, 254, 74, 105, 146, -15, 114, 3, 7, 17, -106, -162, -118, -235, -177, -147, -222, 19, 62, -96, 156, 149, 172, 301, 121, 173, 217, -11, 49, -18, -197, -145, -136, -269, -136, -168, -208, 17, -49, 47, 186, 158, 251, 304, 175, 286, 213, 125, 157, -20, -8, -1, -213, -177, -204, -255, -138, -164, -139, 22, 12, 47, 181, 108, 194, 211, 87, 163, 128, 52, 74, -135, -123, -84, -209, -236, -104, -250, -133, -107, -189, -16, 10, 80, 171, 98, 142, 297, 183, 143, 190, 10, 61]
1415F1o8q6J8q2l5J06j54J24J45j51J45L6p7J17M6n6O2j46l3J25k14O2K7p9R5
1440a2n7n6P9k5n4K27K4j45Q2o4R0l1j58J71n2q4N3M9n6J08o8N8l2r6Q6q6q7N6
1468h0k7r4J24K5L6J31q8M8N0k4N0r6n8J11j97QR8j30j7O0k0J9L5m0K9J4j6L5
1496a4n4j4R7j9J03O9n7Q8m7p8J52j67OJk14P4nj04Q0%n0J05J8l7J38o5P1R8j55
1525B0Q8Kj75K4M1j52M0n5j3J04o5J03k0PJ08N8j04J40j3n5P6j6j16J19j53j0
1551a7O6j86O5j27l6R1k0m3J87l4K9R7l2L2J18j13J26r1r5M4l0r9P6j16n3L9o8
1578a90J34L0l4O5k3L3Q6p0L1O5j8k1k3q0L6k1j08J26j04O5j7KnN9r5P3k0l3N1
1607fLKM6j9l1J05o2J6J7j35R6n7j2O5j39O5P8p1j2R4q4M3qj3K5qNQ8n0l5J13
$$ y = [61, -7, -93, -75, -157, -192, -86, -240, -116, 29, -122, 23, 59, -18, 99, 145, 89, 151, 5, -28, 97, -117, -55, -28, -107, -12, -69, -125, -46, -71, -125, 102, 126, -19, 63, -1, 89, 58, -100, 71, 19, -65, -12, 37, -19, 89, 21, 79, 47, -49, 37, -49, -136, -80, -107, -201, -77, -52, -16, 115, 27, 75, 125, 101, 151, 55, -3, 108, -89, -81, 17, -113, -130, -70, -90, -71, -36, -76, -47, -33, -49, -14, -68, -82, 15, -4, 99, 168, 111, 199, 152, 74, 226, 59, 65, 66, -148, -74, -79, -183, -103, -103, -153, -48, -30, -67, 71, 6, 77, 175, 20, 108, 110, -65, -41, 0, -152, -112, -167, -180, -76, -141, -38, -58, -51, 57, 115, 11, 151, 138, 83, 159, 143, 27, 146, -7, -17, 49, -137, -72, -199, -235, -144, -164, -207, -20, -54, -25, 72, 40, 72, 190, 77, 203, 112, 17, 61, 31, -68, 8, -108, -161, -122, -190, -56, -26, -60, 5, -18, 15, 101, 31, 62, 127, 109, 88, 65, -15, 21, 0, -108, 18, -86, -21, -38, -36, -41, 18, -77, -4, -24, -57, -6, -3, -1, 45, 26, -5, 100, 38, 54, 71, -64, 32, -25, -37, 28, -111, -46, 32, -39, -51, 43, -41, 2, -6, -19, 6, -2, 3, 91, 41, 6, 119]
1638A19r4J00j4q9J6l4j16O9r6n4P7N4l4J2mJ05j4j0J90j46L8L8Mj11P0r7Jk0
1666d0j20J35Mj16P1nj7R1k9N5P3p3J24n6k4L2m8nnj3j26J9Ok9J3j2Q5j5o4J06
1696A7l6M0J28r0j1O9j70J05ln6Q7j01k8RRo6M4r5P1M4j5P5j0m0J66p1m0J8l0
1725B0K5j8L0k3l5n1J8j5J5K4lk4J06n9ljj9pL8r2J74l9o4R0J0k4M0p3j3j1j29
1756a13O8q7k1P5m6J6O1J6Q4M5l5L3O8j30R2j6k8q3p0l0O8o8M2M7MJ7n5jQ3L1
1786F7q4K9j6L4k5k1R1L0j22R9j7o3J7r3j2m0j6L9rj1J18M6J7jJ4L0o2Q4n1K6
1816I8j43m2O1n0Ql9Q3K0K4k8M8q7J5O0Jj14P8j4MOl7J84n2KP3j38K3kq3M2n9
1847e8p6O7o3N0O8p3J49N4q0P6n1o3O0l7l1M2p8K5Pp7N2Q7r6P8n9j6N9j4p0O6
$$ y = [119, 25, 125, 111, 22, 38, 4, -112, -43, -139, -193, -116, -62, -96, -84, -88, 17, 3, -7, 183, 37, 75, 113, 117, 6, 76, -21, -20, -40, -160, -25, -21, -137, -66, -71, -88, 3, -26, 29, 102, 29, 153, 97, 73, 105, 57, 52, 47, 34, -92, -73, -67, -96, -83, -95, -10, -25, -89, 17, -19, 21, 149, 59, 48, 117, -53, 52, 49, -7, 80, -21, -49, -40, -31, -97, -53, -148, -77, -33, -48, 27, 17, -23, 143, 72, 32, 50, 20, 45, 27, 57, 34, -1, -52, -34, -49, -34, -10, -13, -37, 69, 10, 7, 6, -13, -20, 18, -74, 100, 61, -3, 87, 97, 73, 113, 40, 27, 16, -113, -45, -132, -153, -78, -124, -108, -47, -31, 53, 98, 63, 96, 164, 34, 126, 110, 82, -1, -71, -101, -33, -101, -59, -12, -8, 9, -46, -47, 36, 67, -17, 12, -4, 30, 5, -16, 75, 105, -17, 82, 65, 2, 19, -74, -86, -126, -142, -103, -112, -123, -5, 41, 58, 57, 71, 101, 39, 123, 72, 98, -45, -87, -26, -76, -68, -107, -24, -4, 20, -8, 40, -47, -32, 28, 29, -85, -7, -21, -17, -11, -48, 136, 84, 86, 159, 21, 44, 42, -41, 1, -58, -134, -67, -130, -80, -12, -85, 64, 118, 38, 114, 63, 0, 60, 23, -8, 34, -44, -19, -12, -89, -37, 50, -46, 32, -27, -43, 16, 2, -68, -2]
1877bq5J02L5l7N8M5r2J27m5j01m7l5P6Rn0k1M1l1O6M4o2mJ11p5M0Kk8N0o5%j7
1908Im7LL4n3M3m8j0O8m7N8J7l4L6j8k5L4j4j4KN6kl6J4QM7n2n6Rp6M7l8L9pL7
1942a6L0j1P8m3K9J9qJ3p5J0n8k6N0m2J0K8k7O1o1K7J1o0j9O3L8k2O9Ro8Q9L1
1973A29j05%NJp4K4Kj6J6j2qO3Ok6L0p5L4K7KMqQpLJ3%m5j9j2n2O2Kq7O9LQ0J0
2010D7J6%n6N3k0M2rn3K3p5nM7o4l3J08q1M0o8R1j5k5O1K9m6L2L3o5M3L9m5K2
2041F6q1rJ8q5L5JMN7l3j1J02J5o7RK4j5K4q0K1L5l9J9Mm6M1m7j7kOK3Oj6N7l0
2075a1l7P5n5oJ15r3K4J9n8N4k4J3k2K2LK2p6K0N2o4pJ5j5P8m0%n4O5O0k3k9M4
2107F7l7J6J5q7J9L5k5p1J14j29N9k3n8Q1K0rK5K1m4M0K1P0p4NKM2n9k4%J2l8
$$ y = [-2, -87, 15, 50, 13, 71, 116, 24, 151, 106, 5, -42, -77, -1, 8, -42, -63, -22, -53, 13, 57, -5, -9, 102, 27, 67, 69, 41, 91, 26, 26, 9, -38, -35, -1, -54, -11, -59, -69, -1, -48, 10, 27, -7, 29, 11, -14, 20, 6, -8, -6, 50, 48, 12, 26, 34, 81, 29, -27, -18, -94, -47, -85, -46, -53, -16, 14, 3, 81, 38, 67, 86, 78, 91, 16, 26, -32, -58, -8, -50, -40, -12, -39, 22, -39, -12, -1, -61, -80, -17, 21, -1, 68, 77, 9, 98, 129, 24, 24, 29, 30, -44, -20, -18, -34, -18, -30, -38, 25, 31, 5, 35, -40, -6, 21, 23, 27, 19, 27, 20, 23, 36, 36, -9, -28, -40, -92, -30, -28, -115, -46, -43, 37, 47, 63, 63, 7, 60, 40, 82, 73, 20, 43, -32, -37, 10, -54, -87, 21, -60, -20, -88, 3, -12, -37, 24, 53, 7, 39, 72, 7, 50, 89, 44, 66, -15, -24, -6, -91, -56, -55, -51, 6, -27, -38, 64, 79, 12, 21, 45, 30, 54, -26, -5, 30, -9, 10, 14, -32, 9, -38, -55, -57, -51, -28, -22, -38, 19, -11, -48, 27, -28, -34, 81, -12, 12, 31, -27, 27, 3, 16, -6, 16, 19, 41, -35, -15, 37, -27, -34, -19, -34, 44, 4, 4, -50, 15, 75, 52, 23, 67, 30, 46, 61, -26, -7, 28, 3, -68, 46, -83, -24, -47, -105, -24, -4, -13, 12, 33, -11, 29, 50, 120, 46, 51, 53, 95, 36, 12, 12, 24, -14]
2138a4j8j3N0j6m5P1O0l8l3j2Q8l3o6M2l7N6j1p4J1Jj4M7l5nK0J4%ll1M5k8K5
2170Dj6Q4l1k2L3r3P1m3j1K4j4l3L2O1j00M7m2J7L0j9M3pk2M7o8Q5m6M3m6p7M8
2201b1j2N0n5l2J6J6L7J4m7R6o5N9n2O1Rr0L2Q3o5Mj5O0o8j3p6L8m3P7j0l4m2
2232h8J04k7m2M9K4J0k5Jj3oJLl9R3o0k0OJ7m1L2O6r3M9j2M9l5ON1l7M3J0m7m1
2265a2L8K3Lk7n4M0m0k4N2kL8m8oO0%j7n3N8K2J8k9l8%J0m5m3N5m9K0K2k3OJ6
2298b9O6l1M0l8J1K7Qn5M4l8o3K6j7K7L8qm6K2PL4l4MKpn4P7J3l7K4J8m1M8%J5
2332E3M1j17j2P9j7l6k0k8K6J7M5K1m4Nk8NO9l6j3oj4p2R7M3r6L5j5jJ2j4J6k7
2364c2P1p9M0p1J8J8J7P5J7pk0l1l5nK6M0r4M2L5r6P6j1K3m4M8m2P9o7J8Q8o9
$$ y = [-14, -32, -45, 5, -11, -56, 15, 75, 37, 4, -8, 80, 47, -19, 23, -14, 42, 31, -43, -32, -31, -45, 2, -33, -38, -18, -4, -4, -7, -38, 7, -21, 4, -12, 72, 41, 19, 52, -41, 30, -13, -24, 0, -14, -47, -15, 46, -54, -7, -49, -32, -2, -21, 22, 15, -7, 40, -28, 57, 11, 54, 8, -69, -21, -33, 17, -38, -70, -54, -38, -1, 13, -34, 62, -3, 56, 4, 65, 74, -16, 16, 99, 34, 38, 23, 83, 15, 2, -74, -36, -79, -2, -12, -46, -88, 16, -11, -53, -4, 20, 30, 5, 6, -7, -13, -12, -9, -48, 45, -15, -35, -29, -12, -53, -21, 45, -48, 1, -11, 38, 3, 9, 60, 23, 66, 76, 29, -12, 26, 49, 52, 25, -29, 11, -29, -53, -1, -3, 35, -13, -19, 41, 41, 24, -29, 29, 51, 69, 40, 2, 2, 12, -33, -76, -21, -70, -50, -28, -51, -45, -29, 37, 6, 46, 8, 19, 46, 54, -1, 43, 5, -58, -32, -49, -22, 16, 8, -38, -16, -9, 25, -9, -5, -3, -10, -64, 13, 26, -11, 13, 31, -10, 38, 38, 53, 94, -23, -35, 44, 27, -9, -29, -57, -31, -14, 31, 52, 8, 13, -15, -10, 59, 23, 10, 4, -10, -82, 15, 58, -38, -3, -18, -19, -7, -21, -5, -32, 39, -40, 0, -71, -53, -35, -18, 57, 74, 67, 47, 16, -19, -24, 2, 42, -52, -10, 25, -71, 5, -6, 17, -27, 21, -21, 58, -9, 9, 97, 28]
2395B8m5K3P6o5M9p5m1P4k2NJ6Lqj3rj3L6o8lO6J6kM1j3m9l9O6o8P5%k6o7P2n2
2429c2K5k2oO9r0N4L2n7M5J5m1L0Km2O9n4POk5J5p1M8m0N6l2L0m7M1Mk6R7j8p
2462C5N7q2mj4K5j9n0L2pL8k7Ok7M0O1r5O3j1L3k4j5%j8K2j1M4l8m4J7N7o1pO
2495a8m4P5m1K1k7m3P3k4K3K6p1L3N6j7j4M8p8J5L6j6j5M2j35J40j8n3Qm%LK2
2526CkK1rMl3KrL1l9P2j06O1n2QK2L4k1j2l7M6L1k1L0l6L6m0M7p2R6m6K0K0l9
2559A0j9L7k7n1Q8l0M2j02qQ0j0LK4J9Ml5R%K3l8ok9Mk0Jo0J08r8Q5j9j9K5l7
2592d6k2O5KO0J2k7n6NJ0%K9l7J3M1n6N5k0o6O7p4mJ07r9M3p0L8L6N%L5o4o2J31
2625E1l5j2k3n4K8L6k5K9NJ6J8l2O6K5n9nk6j6kJ5%K2o1N0n5M4L5Mq2K7K5J1O4
$$ y = [28, -17, 6, 82, 17, 66, -9, -50, 24, 2, 7, 23, 26, 18, 5, -4, -17, 19, -49, -52, 14, 30, 28, 69, 56, 7, -32, 34, -34, 41, 41, 15, -52, 20, -32, -7, -29, -35, 34, -56, -2, 30, -27, 18, 33, -8, 22, 24, -18, 51, -3, 4, 10, -15, 0, -71, -23, -63, -7, -39, -9, -56, -15, -11, -37, 60, 42, 35, 92, 10, 6, -8, 17, -2, -52, -20, -27, 11, -16, -10, -37, 3, 64, -31, 32, 21, 54, 30, 15, 15, -3, 19, 8, 52, 14, -30, -13, 44, -17, -24, -18, -62, 13, -28, -7, -34, -77, -4, -28, -5, 21, -50, -17, 39, 22, 8, 56, -22, -7, 29, 13, -2, 40, -95, 45, 27, -26, -18, -22, -22, -19, 3, 1, 22, 13, 17, -16, -14, -23, 8, -31, 41, -65, -4, -56, -48, -26, 8, -13, -25, -62, -16, 15, -6, 24, -12, 24, -16, 31, -41, 55, 9, 29, 49, 10, -9, 28, 1, -50, 38, 8, 50, -52, -60, 20, 10, 13, 37, 56, 60, 25, 34, 34, 57, 19, 13, -16, -12, -32, -31, -91, 17, -81, 4, -15, -34, -9, -46, -68, -3, -1, 59, 71, 44, -12, -7, 3, 3, 32, -5, 8, 49, -7, 48, 28, -38, 29, -45, -49, 58, -41, 2, -68, -30, 6, 11, 11, 46, -18, -80, 51, 16, 4, -19, -73, -45, -9, -34, -5, 0, 16, 34, 2, 68, 93, 34, 29, 3, -13, -15, 0, 0, 22, -39, 11, -44, 0, 35, 39, -43, -16, 9, 20, 84]
2658H4q0l2P9o0P6k8k2k1K9l1j8lO6q2L7j8M4m7jrJ4M6Pl2K4J0J3k9l3K7L9k3
2690B6m2l1M3PJ9N7j29P8p1j3K9P9o1n6M2M0m5Q5o0k7N6m6J2m2L1L3k2o0P1l7
2720c4J2M7p5R3m4l0L3M3n4O9m4l5R8p2qK2J0n5L1k6l3J2qPJ4QO1m5NJ1K1Nm8
2753iK5l2l9J04k8K3n7l1P2n0M2j58J76l2k1K9j0K0n9J05r4K1j6L1j2J5j6J0o
2782CK2m4j4j4L2%Ko1Q0j6j0N4q8K8R5n2l2P6n0Jjk1k2J02q4J0rJ6k0Qk2J7rK1
2816bQnJ8M2k3n4M2k4J3m2K9J1m0M1j4ooj9j8N8m4j9J04j00Q4j4J8k9l4M5n8m
2848d2M9J8n4MN6p6jM8lL3l7Lk6Kk4Q1nn8K3K4qk4Pkj0l7N3j4j2K5J2MK0qJm6
2884b4R0n6l7O1mpK6mo7N1n0M6k5qok7L0j7K3kN6o4K8J9%n0N3nm5O7l1m2L2kj9
$$ y = [84, 4, -28, 51, -9, 67, 39, 17, -4, 25, -6, -24, -27, 39, -43, -6, -24, 20, -27, -28, -37, -23, 23, 30, -2, 22, 32, 45, 16, -17, 10, 49, 26, -16, -47, -4, 3, 22, 79, -50, 28, -43, -56, -27, 52, -9, -65, -23, 17, -28, 57, -3, -30, 26, -20, -8, -50, -19, 14, -8, -68, 3, -34, -22, 25, -50, 43, -1, -31, 2, 45, -9, 60, 16, -19, 79, 7, -1, 21, 31, -24, 7, -19, -52, -40, -48, -41, -27, -19, 42, -3, 2, 13, 34, 39, -9, 16, -16, -55, 49, 21, 44, -13, -44, 28, -22, 20, -138, 38, 6, -15, 14, 4, 24, -35, 70, -24, -3, -19, 12, 0, 15, -1, 9, 3, 25, -19, -33, -47, -15, -15, -13, -74, 6, -10, -20, 34, -54, -26, 69, 17, -15, 61, 11, 12, 11, -10, -32, 70, -14, -4, -13, 3, -17, -9, -31, -14, -23, -2, 6, 1, 19, 61, 38, -16, 26, 2, 15, -27, 2, 13, -27, 14, 0, -6, -12, -31, -49, 9, -35, -54, 50, -50, 34, 20, 38, 9, -25, 20, -38, -42, 7, 25, -29, -25, 31, -45, -46, 2, -1, 32, -5, -2, -28, -26, -50, 31, 26, -32, -9, 15, 7, -17, -10, -12, -22, -59, -6, -20, -32, -7, 5, 9, 29, 21, 22, -24, 66, 10, -27, 34, 30, 23, 49, 45, -22, 29, -21, 25, 0, -8, -14, -41, -11, -28, -5, -7, 49, -15, 13, 32, 32, -18, 35, 30, -15, 52, 21, -21, 11, 9, -10]
2919a0n%N8o1K7Pk7k7jM8L3k6l4P0k6k2M6o7O8m9j1M2J8J1r1K0M9J5p8M9K9o7
2951a2L2k1p1R2%Ro6M7l5N1k4J5l8J5kj5j3K2Q4j43R7m4l0L0K7K4J7j9k0K6l9
2982dJ4j3pK2m2M1L2p3J8j9N9J9j27K4O8J7jl5J5k2J2m0J1L7j2lJ2p1R2Jo5K3
3014a7j3J2J1j6M7lL7j13P2nM9o2J8oj0JRkK0Lo6O3j10N8N6m0J8j9L3j9qM7m9
3047dk1J9L5o2qO2l4j0j6j9Q3m1O2r8P3k5M7o6RM8L0o4J2N5n5J3l9J1L1o8L8J2
3079A0n1O4l2JK8j9L4ol8J2n9P4l4l6K0P5m2K0l5KL5n5kN2m6J5O2r6O9l5k1M8
3111A4J0J2l4L3p7Q4m0J0J5l0j6n9P0R1j25j8M9o3P3J8l2rJ6Kj5l1O8K5m8j4J8
3142cj8N3Lj29N9L8l0jJ6R5n9o1P8Nn1lL0l2K2m4N6j8k0Mk3%L0l8L5M0l2j2KP3
$$ y = [-10, -15, -15, 43, -18, 9, 16, -11, -38, -39, 9, 42, 16, -18, 52, 26, 4, 50, -17, 51, 2, -9, 33, 51, 62, -29, -9, 40, 55, -23, 26, 55, -12, 20, -1, -72, 20, 20, 29, -37, 10, -25, 26, 2, 17, -21, -6, -8, -23, -36, -14, 70, -73, 24, -20, -50, -20, 7, 31, 48, 29, 9, 35, -4, 10, -3, -10, 12, -30, 11, 43, -30, -12, -31, 28, 47, -80, -56, 12, 29, 28, -7, 8, -14, -2, -42, -31, 6, -6, -9, 3, -68, 24, 25, -40, -17, -30, -18, -7, -23, 24, 21, 58, -55, 17, 12, 61, -1, 17, 11, 1, 2, 11, 9, 29, 32, -34, 29, -81, -23, 33, -7, 11, -8, 25, 6, -2, 45, -4, -25, -6, 29, -33, -41, 21, -13, -23, -39, -58, 25, -16, 46, -52, 21, -4, 43, -23, -14, 34, 64, 0, 12, 67, 12, 25, -14, -3, 28, -40, -2, 10, -41, 23, -9, -8, 20, 1, 35, 29, -9, 3, -56, 18, -16, -52, -32, 43, 1, 21, -14, -12, 23, -32, -34, 18, -28, -13, 49, -47, 22, -13, -34, 14, 24, 36, 2, 35, -42, 42, 2, 12, 27, -3, -19, -78, -8, 83, -42, -60, -11, -74, -1, 17, -15, -24, -8, -6, -21, -52, 16, 41, -7, -21, -3, -21, 32, 35, -94, -35, 3, -27, -28, -12, 83, 24, -37, 41, 46, -5, -8, 22, -10, 12, -32, 24, 6, -14, -10, -33, -33, -3, -41, -6, 34, 2, -10, -8, 65]
3176F5p3JJ8rJ1N6m2n6jM9k1K2moJ5m9n2R0qk4L4J3n7K1J5K9n6k9M9J0J3Po6j
3210c6RK4j12J49o7L4N3p2O0m7n6R5j8L0p6K9J3K2k4j7R4j11N1m7k4O0m7O0l4
3239ek2R2l3L3l9j9J1J3l6lK1j8K3l1%J3J8J1l6L5j08N3L8J5l0J6j2qN7p1L5n2
3271c9J10m0l4k5R3r8MP5m4k3L8jk0O1o4K0l6N2L6j12J13n6Pn4nNM0l9j8J3J6
3302b5J3l5LN4Nk9J2JJ2L3n2J5MK6l3m3O5Qj0l1k4M0k1j2K0JJ9q6O4qnJ5JJ7n8
3337d4kO6jk2K1J2l6l8O6l0LRl0L8k9j8L9KQ3m3L7o8JKj4j3qk9l6O4oN7j9n9P7
3372C2k5j9Kj9N8m4KL8m%l0rN8l7j6OK3o6M0oOK5l3rL4Mm0L5J9p2O4Jj0j6L2m8
3408b4k0lM1K6J9o4M7j1lq4J08K6j15L5L4K1j4Rj9K7j8mr0O0M0l7L2m0o5M6qJ6
$$ y = [65, -8, -7, 11, 2, 13, 69, 27, -29, -30, 19, -2, 20, 16, 10, 25, -24, -76, 14, 6, -18, 16, 29, -28, -7, 8, 37, -19, -48, 1, 11, 24, 31, -35, -36, -27, -3, -115, 34, -33, 1, 54, -18, 42, -5, -61, 34, 16, 46, -30, -1, 12, 34, 10, -7, 87, -24, 27, -20, -44, 16, -31, 29, -5, -27, 65, 32, 65, 26, 7, 18, 31, -5, -8, 13, -5, 18, -13, -13, 0, 18, 29, -7, 28, -80, -27, 11, 26, -4, 12, 0, -8, 49, -22, 13, -39, 71, 31, -3, -28, 65, -33, -29, 46, 2, -21, 17, 16, -4, 57, -7, 13, -23, 29, 65, -47, 66, 10, 17, -37, -42, -37, 3, -36, -54, -41, -25, -12, -47, -44, 10, 15, -14, -2, -1, 11, 44, -8, 7, 11, 37, 4, -39, 26, 34, 24, -7, -31, 9, -12, -24, -4, -3, 16, -70, -6, -14, -19, -4, -3, 14, -44, -46, 20, 19, -3, 18, 30, -6, -44, 22, -8, -5, 4, -26, 12, -17, -35, 4, 6, 89, 46, 83, 15, 16, 18, 4, -9, -17, -46, -82, -18, -24, 33, 14, -45, 32, 7, -12, -10, -29, 29, -15, -13, 25, 21, 21, -9, -18, 40, 3, -13, -7, 16, -50, -10, -16, -10, 15, -18, -27, 7, 11, -29, 6, 25, -47, 17, 18, 8, -8, 24, -24, -44, -47, -6, 20, 39, -25, 22, 11, 8, -76, 32, 58, -57, -22, 12, 33, 19, 28, 9, 36, 18, 14, -76, -16, 24, -13, 19, -21, -86, -40, -48, -32]
3440c2J1J2K7J3p2N4N2q5Qj1j3L5J9l0L0J1Qn6kQm0Q5o4K4k7L0j1o3L5O4r2M9
3472b3O9j10M6L8KJ4lj2m5K1Pq5Q0J7q3J08j1j14O9%O1j33M3L5K7j6kM2q7L2J7
3503Dl5K6RJ6m0J7j7k2M7k8O4o3O1m8m3J1N2k4Q5o6o8N1j2MN9n3L2k0m8N3Jn1
3535d6O6L2r4N6L5n3K9L9q5K7n6J0L6k4K1k8P3l8ql2M9j9K4J4np5J9N8on0N9k5
3567Cj9J2Mj6Prp1J03NJ1k1Ok3J9jn2M0n4K2O2j14O3j7P0o0j3j6Q1j7l2L4J3k2
3600bj0P5k9m8JM0j06J26j8L6m6p4L7J4Oj7RJ2J0K1q8N9k7jO3m3j7K8N2l6J2k5
3632A4q5L9L5J1k3kmkK4mj7MN4l4N7n0RRL2p5K6n6O7j2k8L2Kn5P3j2n5J9k0q%
3667c5okM4l6K3N9m5Ol3n9P9nM3j8j2j1l0L9mJL6m2J1Rj4k2P5o7k6M5l8Q9k4k6
$$ y = [-32, -21, -9, 18, 31, -41, 13, 65, -20, -12, -23, -36, -1, 18, -12, 18, 29, 37, -19, -21, -13, -53, 32, -32, -8, -35, -5, -16, -79, -44, 20, -72, -23, 46, -64, -18, 20, 22, 36, 33, 21, -24, -3, 4, -81, -1, 16, -67, 41, 30, -84, -15, -15, 46, -87, -44, -9, 18, 2, 0, 42, -45, -13, 4, -31, -5, 4, 20, -20, -3, -20, -42, 5, -23, 41, -22, 39, -9, -52, -41, 11, -13, 72, 6, -62, -11, -23, -19, 40, -13, 19, -1, -49, 4, 5, -46, 20, 52, -42, 14, 49, -4, 25, 64, -21, 6, -50, -40, -4, -28, -7, -35, 38, 0, -8, -40, 9, -10, 14, 28, 23, -52, -33, 25, 19, -31, 28, 3, -16, -4, 0, -16, -9, -18, -89, 14, 19, 30, 9, 15, -8, 11, 10, -42, -2, -56, -34, 28, -86, -23, -40, 30, -30, -43, -59, 22, 5, -27, 7, 20, -2, -12, 63, 34, -14, -13, 27, -79, 47, 29, 65, 19, -55, -18, -4, 2, -15, -6, 6, 16, 37, -51, 8, -19, -20, 43, 0, -17, 11, 63, 27, 39, 14, -71, -32, 3, 14, -9, -11, -15, -17, 7, 3, -14, -10, 44, 10, 67, 17, 26, 35, 67, -8, 18, -38, 29, 17, -11, 21, 23, -32, 41, 29, -26, -7, -27, -35, -35, -41, -43, 1, -35, -12, 47, 2, 8, -25, -84, -5, -10, 33, 15, 3, -8, -38, 1, -3, -2, 34, -8, 3, 12, -2, -24, 51, -16, -42, 3, -35, 54, 30, 4]
3701DK0n6L3j5L5l8K4j5P3o3m4J1J1Jn5N3K0K5m5j0N5n8J7kj3L1m5P6K0n5RM6
3733E0o7N9m0kj9qK3K1L7p7k0k4K5J7K7K5qj1k7O7m0nK2K5jk4j0kl5N0Pl5J9k2
3767ck3j7lJ1J5O4j08kM6rM2MJ2J8K9j12L5k3Pjj7R5j8l6J6J0%j7k2J8l5K8L3
3800C7p0K9j0l5R1m5l2PRL5Ol7jOL8j7n5M5j2L4Qj7l2pK2L3k4k9M0m4L6j6mR0
3834G9o1m8J8j3K2k6J0M8J7o9N2l0J7Lm4K4k4k4P5k9n3L5j5K5M4k4L2p8J04j07
3864d0P4l0M3n0KL8j7J7k0o8J04j6k0j2m5M3K6km1M5p2M9mm4J2P4n4K4J0m2k8
3895d4L7j5O4k6m6K8K4jk0L7k1k7K6J2l6j3R0k3K9p3L3M0n8j9L7K7j7m8m3O5m5
3926b6JJ1K8l4l5N2k3K4k4J5L4k6M4m0Jl6O5L9o9OK2P2q9o4Q2m6pL4l5O1m1j2
$$ y = [4, 24, -32, 1, -14, 21, -17, 7, -8, 65, 2, -42, -31, -20, -19, -74, -21, -1, 24, -21, -31, 24, -34, -17, -19, -32, -1, -46, 30, 50, -5, 4, 50, -17, 42, 2, 0, -19, -27, -4, 17, 54, -23, -43, -67, -42, -25, 2, 27, 19, 8, -19, 48, 8, 3, 25, 50, 49, 25, 15, 13, -22, 28, 35, 0, 19, -3, -26, -43, -46, -35, -20, 44, -64, -66, -20, -29, 13, 17, 29, 47, 76, -36, -1, -24, -17, -18, -35, 60, 42, 6, 22, 32, 32, 15, -7, 11, -24, 4, 37, -33, -4, -14, -49, 42, -3, -35, -28, -19, 16, 22, -15, -16, -10, 28, 11, -44, 1, -11, 23, 31, 14, -18, -25, -3, 30, 6, -23, 17, -27, 9, -7, -11, 79, 18, -30, -12, -25, -3, -29, -19, 29, 46, -23, 29, -1, 16, 19, -25, -1, -25, -49, 26, -3, -56, -21, -36, -11, 33, 9, 41, -37, 67, -40, 34, 4, 47, -3, -1, 37, 20, 37, 17, -51, 53, 37, 17, 5, -40, 3, 29, 27, -14, 31, -41, 8, 4, -40, -28, 46, -8, 16, 26, -16, -44, -7, -22, 42, 16, -30, -2, 22, 21, 1, 38, 17, -10, 16, 28, -8, -21, 69, 46, 75, 2, 35, 75, 17, -2, 35, 62, 45, -3, -46, 19, -26, -25, -14, 14, -20, -55, -3, -26, -2, -26, -11, 23, -3, 41, 1, 2, -34, 31, 70, 1, 7, 29, 101, 12, -52, 30, -16, -23, 11, -24, 37, -4, -16]
3958a6J0J9j4M0p3j3L2J4l1M2k6J0j2M7k5ql4L7M5o4k6J5L1lL8m9J6k3k1P3l6
3989eL8j7RK8o7l6M4k0L6Ooo3O4jL7m0p7J09o7M7L0j5l4Op0Q6j7%m7J01l4l4k0
4022b9P4l9mJ7m2K2N3m9J8n9N4j7qO6p8N3n7jK5J2Rq1P0M2p1P8lj2m1Jj0J7J6
4055B6j3n7K7J2N4m9m2JO3l5m4R1j3k6K1J7o0J1K0Nl4M4k4P1j46N2O6o5LQn2Q4
4087A6j9l4L9J4K5k0k5M4k5k6J7l2m4R4o4OO7j2l4K3oo3K5M4Qk3K0L2j9p2M2L2
4119C0jj6L5m5K6pK6j4qj2l8j7M9j4K4K3p0PL5n1M7ljn3O9j6oK7m2kN3m8J6L1
4153C4l1M2j10M6N6rk3l2J11j20N0l5P4k1ml3j4K9jOj2J0J7q1L8n2P5k5L7oJ4
4184C0pq1P9o4L6N3m7m3N1k9M6on4L1J9J5J3k0m6k4L3OJ2J5J7kk3q1J02m5M0p4
$$ y = [-16, -6, 13, -1, 39, -34, -47, -15, -1, -32, 10, -16, -6, -18, 29, 4, -4, -38, -1, 44, -20, -46, -31, 0, -3, 35, -14, 2, -21, -42, 31, -5, 33, 16, 25, 53, -14, -50, -6, -26, 10, 16, 10, -53, 11, 10, 47, 7, -70, 39, -28, 19, 49, 34, 0, 6, -64, 22, 5, 5, -42, 59, 25, -9, -29, 45, 6, 2, 19, -23, -1, 52, 3, 21, -38, 16, -1, -9, 57, -21, 32, -25, -26, -1, 11, 20, -61, 9, 51, -20, 58, 55, 43, 2, 3, -7, 10, 26, 13, -44, -17, -5, 49, 0, -42, -41, 22, -13, -57, 34, 21, -5, 16, 33, -27, -16, 4, 9, -25, 19, -5, 66, -80, -28, 38, -27, -24, -16, -68, 16, -3, -37, 2, 16, 41, 21, -4, 40, 15, -11, 6, -26, -70, 24, -40, -34, 33, 21, -13, 10, 4, -59, -34, 10, 18, -5, 15, 47, 28, -44, -2, 30, 29, 13, 48, 3, 29, 22, 48, 34, 26, 14, -24, -41, 8, -6, 18, 41, -29, -22, 13, -38, 9, 6, 5, -48, 21, 5, -1, 26, -16, -18, 35, -13, 3, 34, 3, 45, -65, -19, 37, 28, 5, -27, 84, -36, 14, -21, 53, 32, 28, -5, -19, 10, 9, 15, 3, 13, 30, -51, -13, -65, 10, -15, 22, 16, 30, 23, -58, 21, -43, -7, 46, -1, -44, 7, -22, 24, 18, -36, -5, 14, 29, 42, 22, -24, -48, -15, -9, 3, 18, 35, 33, 10, -71, 31, -14, 26, -48]
4216d8N7l1J8K9L7j4j00P3j6lN3n3J4j2m1j0O7k9kj6J9%J6J8l6l9O5q4Q4l2pL0
4248GL3l1J8k7K2L8k2n4LN0o5j8PQ3o4N0q7L4M4J2l8k9P2Ko2RK6J9k7pk6J7J4
4281CJ8l1L5j8j4j2M8k3m0K3J8J1j2M2n6P8p3L5qJ5nk6o2M6O1n7N2o0K3K2m1l4
4313d2K3kLm1O9K8m9oM1l1K3K7k6Jl1L8o5K9K3k1Pk4L1j6j4l2L3KO4Or7N4j3K9
4347B1n9M5J3ql4K5KRmkn7J09j05M3oqK3nl0LK6QOl1N4q4N4l0M0K4o3jM8l3rK3
4383Gk9N0m5n8P5k4L6m3M7r5N1O3n2Nk0K7Nj8J2L0j8K4o2K1o6O1Rj6M1J7m1M3
4415C7No8Q7j31P8K2l7MM2m5PM7p4L1M0n8K2n8M2l7M4p2M2L7k2MM8n3l1PK2K2
4447DqKQkj0K6Npqj0k4O6J3p0P0j08K0OL8K3n6J4J6K6K8k7ko0M8Mk5J0n4L6JL3
$$ y = [-48, 9, -22, -4, 25, 62, 48, -52, 21, 5, 2, 55, 2, 16, 4, -37, -47, 20, -9, -11, -27, -8, -8, 8, 26, -10, -49, 16, -68, 16, -16, -23, 7, 40, 9, 27, 0, 22, 60, 38, -16, -13, 37, -28, -46, -39, 44, -20, 30, -57, -23, 21, 33, -5, -34, 38, 40, -22, -13, 13, 32, 5, -2, -28, -11, 3, 21, -10, 25, 7, -7, -19, 29, 6, -34, -11, 7, 18, 6, 48, -8, 70, -3, 32, 24, 39, 34, 8, -54, -8, 53, -4, 48, -12, 11, 33, -8, -42, -19, -21, -18, -59, 10, 38, -11, -17, 24, -7, 16, 43, 17, 18, -13, 25, -40, -11, 12, -9, -2, -26, 5, -11, -25, -57, -24, -22, 42, 48, -49, 5, -8, 21, -38, 7, 20, 12, -22, 3, 5, 14, 10, 8, -49, 60, -45, -2, -8, -16, 7, 2, -28, -25, 1, 9, 15, -16, 38, -46, 8, -22, 18, 42, -21, -22, 26, -7, -16, 7, -22, 28, -17, -75, 0, -24, 12, -31, 16, -79, -28, 35, -17, -12, -32, -5, 0, -18, -6, 24, 6, 30, -32, -11, -77, -16, -7, -23, 18, 35, -6, 37, 42, -26, 61, -70, 8, 30, -7, -3, 39, -6, 1, 48, -26, 5, 45, -13, 9, -49, -7, -44, 0, -72, -30, 7, -15, -11, 37, -16, -47, -40, -18, 4, -4, -2, 6, 4, -6, 20, 25, 18, 10, 0, -24, 42, 55, -15, 55, -53, -33, -27, 11, 34, -22, -8, 8, 34, 62, 35, 33, -27, 21, 25, 0, 10, -44, -8, -7, 26]
4483B6o1L6m9M2M4k2k8pokNL9L7n2O6j17L9KN4l5j4k3M7l%nkn7P1op3O7L1m5j0
4518a1%j9M7j5l6L8j3M1J6l5j1k2RL3r9O6Q6q1j9P3m5J6k8M7l4jQJ3m5j6L6Jo
4551fM0j0j8l2N7Nm7M8r6M2M8k6K4o7J6rL5L2o6L8K0q2N2k0l3RL3J4o3J9O7J7
4583D1m1M9n3m4jQ5kk9n3K4P9k9q2P4l9K1k7L7j9M6k4n6LM4L9l2m1J19o3k8k0
4614b2J3L5oL4m4J5l8j2l1L9L1m4M9K8k6K3m5O0l5l1l1K1K5l4L1K9j7J7q1N9o
4645FmJ3Jj7pk9pK6N6j8n4M3l1N4n4J4PJ8j08R1k8K8kmK6L5k4%l3K4m2P1jj3K4
4680F1q8j9J1O2Qm7K6k3k8M6J4m3K4N8k7j4K6l2m2K3KMl5R2qL3m3n9L0J5m6J9
4712@K5n8O0k6%L1Kk4jj8L3J4m6k0M5rm4J3N4k0Jj0k1L0k8j0M7K0l1j4o8J04m5
$$ y = [26, -35, 1, -48, -6, 38, 16, -12, -19, -25, -27, -22, 17, 54, 2, 68, -49, -10, -8, 46, 11, -3, -26, 21, 18, 18, 13, 11, -46, 25, 19, -54, 13, 44, -1, -11, -11, -30, 17, 2, -34, 4, -9, 32, 48, 13, 2, -20, -11, 22, -77, -11, 75, -6, -25, 48, 3, 19, -9, 38, 4, 3, 11, 24, -21, -37, -1, 0, -6, 34, 24, 6, -26, 31, 36, -11, 37, -59, -17, 31, 5, 29, -38, -22, -31, 4, 36, -30, 8, 28, -54, -2, -22, -55, -46, -13, 1, -62, -43, 24, 41, 0, 49, -4, -48, -49, 36, 34, 5, -48, -24, 55, 26, -56, 18, -21, 0, -27, 10, -9, 37, 13, -43, -40, 4, 43, 11, -30, 89, 26, -2, -22, -9, 26, 20, 54, 10, 25, -13, -25, -56, -17, 14, -30, 19, 47, 21, 44, -1, 59, 24, -7, -38, -17, 8, -26, 5, 34, 17, 34, -47, 12, 6, 2, 15, 16, -1, -8, -37, -44, -18, 38, 20, -34, 9, -22, 32, -22, -8, -1, 17, -91, 0, -28, 0, -2, -6, 20, 55, 31, 31, -2, 22, -20, 51, 50, 37, 61, -27, -46, -35, 27, 35, -12, 14, -9, -37, 9, 23, -20, 4, 62, 35, 21, 47, 15, -27, -4, -2, 2, -33, 59, 51, 84, 41, -18, 12, 27, -19, 0, 25, -33, 27, 1, 1, 32, 34, 10, 9, -9, 24, 38, -8, -28, 17, 8, -36, -23, 31, 11, 12, 2, -19, 11, -17, -27, 20, 40, 9, -5, -73, 31, -14]
4745a4J4J3RnM1m3n0M0L9K1q1M5k2k8K1pM8l1n6M7qOM8j14N0J7n2L6J7O1l8l0
4777fj3J4J1o1K1j3O3rk2OM4rnj7Kj6P4k8o1M0qo5M1K7j7K1l6Q3n2L1o9M0J6q1
4811e4O9k5Kk9R8r2K5KJ8l6QM8l6L3L1r1J7K4n6P8o0J2JM9m8N7q8R4n5K0jn7K4
4844a8j1QqJ03j06K7L1m2L9l2l8Q4j9K5n5K6L4J6p1j0K2k2L0p4P2l9J0M3j8K7
4874C4j3n8K8Pl3Q6p1N7k0m0M5n6P3J0q1J2O3j3Lk6j2rK8Jm3J4K2m3K8N7n8L1
4906B3n5L8%J3j9j3j9n5K7M4M1l8O3o9M4m1j8J1O6k3o3R8r8J1J0QO2k1n5K4M8
4937D4o7m4P0j7MkJ8NK4n2P9m8k9%oL4JJK1l4k1M7Rl1Omo4N8j5K7n7N1M1m7Jj3
4973a0ML3m5M5j3l4N1jj8r9O6LrN0j3k0l4N3pkm8M8k6J9J2n3O0kk5J8nj7K4K5
$$ y = [-14, 0, 13, 22, 17, 58, 15, -35, 5, 44, 65, -16, 29, 7, -21, 0, -7, 41, 10, -46, 1, -7, -1, 47, -67, -17, 0, -52, -16, 1, 62, 24, -6, -19, -5, 6, -55, -34, -47, 16, 7, -15, -9, 35, 26, 21, 4, 6, -10, 64, 36, -25, 15, 7, -58, -17, 10, -7, 14, -22, 61, 9, 40, -29, 11, 27, -54, 15, -10, -8, -37, 61, -31, -6, -4, 14, -22, -14, 34, -2, 31, 62, -29, -12, 12, -44, 34, -26, -14, -13, 36, -12, 45, -43, 51, -4, 16, 15, -42, -18, -29, -21, -29, 74, -32, -5, 26, -16, 23, -9, -47, 37, 18, 43, -12, 14, 48, 64, -7, -17, 5, -17, 13, -61, 11, -28, -18, 25, 7, 34, 21, -37, -9, -2, -35, 51, -20, 37, 17, -23, 22, -34, 39, 49, -32, -20, 43, 30, 33, 7, -5, -14, 14, 15, -28, -14, 8, -35, -7, 50, -8, 23, -32, 6, 6, 19, 0, -13, -32, -87, -60, -16, 25, -13, 50, -19, 25, -16, -34, -23, 43, 20, -43, 55, -43, -32, -22, -14, 48, 27, -28, -4, 44, -23, -67, 3, -14, -10, -12, 6, 11, 35, -17, 62, 14, -15, -15, -21, 13, 14, 15, 36, 2, -19, 28, 37, 6, 12, 8, -56, 2, -13, 14, -43, 8, 49, 2, 3, -10, -6, 27, -18, 27, 14, -20, 31, 30, 12, -87, -21, -18, -27, 23, 10, -10, -44, 9, 2, 0, -48, 0, -26, -7, 5, -48, 12, 10, -15, 3, -2, -19, 5, 30]
5007C0m1l7M1J4K3j7j5lmL3po8J15m2rJ7k8j3J3j7J9%k5J5J0k3PK6l7M1J7l5j4
5040a4K5mol4L2l4O1l1lj2M9J5n0k2J9qK1k0l7P0p%m5J4K2J5m7Oj4L6J7rm1N6
5074B0lj6j7l2L1k6jM0L5k3o1N6p9P1ROk3K0J1k8K3j7m3J6M2m2j5O2m6K3J3l6
5106c0oQ9l9k8KM5o0O4p2N1l8N6m6k8P4o3K7J5jj5P4r5k5N3m6P5pj6M3o3J7j3
5138fJ2L8pn9P1q0N8j8k0j3M1L4m1rjK8m9OK6oj1QNnj5M0PQp2L4K5p4P1n1K3Q
5174Fj9L6n5J2L5p3K4N4J3r5P7K5q7L2j1L7j5O0L4j04j4NP3k1Lk7m2L8J2o9R0
5205C4j6J9p0O2n0N3On6pJ3J7%L2m5MJ2lN7m8m4M7J3m5l3j8N2M6rj6rK4k2L6l9
5239cm8O9Nn5N0po5J3O4p8O6J8m2nl2K6J4k1K0QJ7J6j8j6M9n9O6l3n4O9m2L8l0
$$ y = [30, -11, -48, -7, 7, 30, 13, -2, -5, -9, 24, 17, -51, 64, 22, 13, 30, 2, -11, 2, -15, 4, 4, -21, -6, 4, -19, -12, 14, -23, 18, 35, 0, -14, 11, 7, 1, -33, -1, -35, 26, -5, -8, -20, 29, 44, -6, -28, -9, -17, 4, -16, -53, 17, 10, 10, -35, -21, 1, 16, -31, -25, -39, -3, 14, 5, -36, 20, 17, 1, -16, -48, -17, -43, -44, -4, 31, 8, -53, 3, -76, -5, 4, 10, -13, 7, 18, -10, 13, -4, -47, -31, 11, -31, -46, 16, -30, -7, 6, -30, -36, 53, 14, -14, -12, 33, -27, 37, -35, 16, -22, 34, -12, -40, 34, -29, -2, 13, 12, -3, 71, -24, -49, 4, -42, 33, 26, 10, 53, -10, 7, -6, 6, 44, 37, -22, 49, -31, 27, 9, -11, -24, 17, 51, 10, 1, 0, 28, -21, -15, 11, 5, -6, 2, 7, 2, -13, 27, 34, 42, -30, 4, 29, -45, 26, -25, -2, 6, -13, 23, -32, -20, 15, -58, -34, 20, 33, -62, 15, 40, -47, -15, -26, 11, -4, 56, 90, -14, -28, -23, 50, 29, 32, 5, -37, 1, 13, -56, 34, 18, 37, -33, 29, -21, 32, 38, -18, -25, -12, 5, 5, 37, -8, -4, 8, 5, 62, 14, -30, 17, 30, -15, -48, -66, -14, 32, 23, 7, -2, 22, 0, 36, -3, -51, 18, 23, -32, 18, 11, -54, -41, 23, -55, 11, 29, -13, -18, -50, -24, -10, -31, -11, -3, 14, 30, 12, -4, 45, -14, 52, 19, -35, 34, -8, 30, 0]
5272@L7l3J6jJ5Jl3J2K6m0J6j3k3N5p3O2J5m8kn%L4k5lL2o2M3nLj2Nl8L4L0j6
5307DL7pJ0n4P7o2k9lK0K1n0P0p8R5j15JL2j2P4p1L2k0KK0L9q3K0lRL6Rj9k2K9
5341IK6n5j3nR4o1Kj4K5Nok8O4l0Ok7J6o4M4Qln4O9pO0p7K0K4l5l8J8K1K2k0M2
5376C8j1m2J6J7n8J04p8J2l8N2M9j4l6OJ5j5NM6n5J1jK0j4k2k8J7k0k1L5k3O2
5407B9o1P1k6k1j1O1p8L2L2l3J8j2nO2o5Ro3O2%J4k8qJ2J1J8m7N9n7J13o5l4l
5439a4j2M9n7L0J2l2l3L8J1L1Proj07J38j8m0RPp8K5K3J3%K1k0nK8LK2l1L3o0
5472b2L7k8j1N1j3j1ML6jl4l4M1n4l1L7rK3jK3lKLj7l6L4J1l0%M7k7n3M2k5J01
5506E2l9mk1JM8J4n1l1J6k6O2L8l5k8k5K1J3l3O6l3j1M3k0lk6Lj6m0N3L3k4nK0
$$ y = [0, 37, 4, 20, 19, 34, 35, 2, 14, 40, 0, 16, 3, -20, 35, -38, 24, 39, -9, -11, -16, -16, 18, -7, -10, 22, -40, 3, -2, 1, -11, -6, -44, -10, 20, 4, 41, 34, 44, -10, 67, 5, -24, -27, -7, 14, -36, 34, -44, 51, -64, -63, -31, -43, 31, -40, -8, -28, -26, -6, 33, -50, -30, -33, -24, 12, 21, 2, -20, 9, 35, -20, -33, -38, 56, -5, -3, -17, 8, 13, 7, -21, 43, 13, 19, -8, 8, -56, -12, -4, -7, -61, 8, 1, 61, -16, 4, 28, -7, -45, -27, -6, 16, -4, 38, 27, -15, 1, 18, -40, 64, -14, -2, -40, 12, 61, 47, 11, 17, 32, 17, 22, 68, 13, 24, 23, 43, 29, 7, -21, -4, -24, -45, -10, -33, 29, -32, 39, 13, -8, -19, 42, -36, -4, 28, -5, 13, 1, -4, 58, -7, 2, -61, 1, 1, 15, -13, -21, -9, 2, 20, -27, 32, -25, 88, 23, -11, -14, -26, 23, -34, -4, 8, -24, -57, -19, -8, 23, 30, 21, 15, -92, 46, 28, -12, -3, 4, -74, -49, -26, -13, -13, 8, -12, -17, 11, 14, 36, 5, 38, -22, 15, -13, -24, 27, 14, 3, 7, 43, 42, 8, -26, 15, -39, -70, -33, -42, -19, -20, 3, 0, 2, 5, -12, -48, -14, -3, -33, -33, 14, -13, -66, -24, -49, 52, 13, 9, -12, -11, 37, 51, 0, -31, -15, -41, 21, 59, 24, -4, -29, -8, 5, -28, 38, 5, -6, 37, 17, 14, -12, -9, -25, -65, -12, 21, -3, -8, 12]
5539A2l1L5M2l9k5J5l8O7l4l2L9MJ7J4o0l2M8m2M0j4j2J8nLP2q1J5l9Q6o1M0k3
5571aK0L8m7pj0l0K8L1n9J8L3n5Q0J9o7KJ8nM2n9M9l8pL6qk2O0m0l8O3l3j5K1
5604A7OK6l3j5%j1J0l2O2j3J0l2mL8J3o5J9l7lP6Kj4nK9Kk1K5q8L7M4n1l5M1L7
5638C5p7J5K2Kj2o8O9K5M2Qo7k0K0K0M8o2P7p5J4k3l8M6k2k8N8J6m0M4l0k0M0
5669A9l0Nj0K0J4Mj5k9L1L4l4J0J2mok9J3M9l2k2KJ9l6mJM1n2L5k4J0j8J1J4P
5703Fn2M3J6k0J7j3MJ5KjL1j6K0n6m9P0Po2O1l2M4n4j3N8jJ4jk9pML1kl3k4K3
5738AKk3K7m8K6L0k4n6PQ8jppo6N2ok9M0PjK7m4J4Lj1J8L2m4O4q8P2n6K6m1O2
5773D6n1j4K8l6O7Ln5pP3k2j7m9M8m4l4P5o0J03m9Mk7M6n8l3Q9m0N9q4J11o5k4
$$ y = [12, -19, 16, 58, 19, -6, 9, -29, 38, 4, -28, 11, 15, 32, 46, -14, -46, 2, -40, 0, -14, -26, -8, -13, -10, 62, -19, -4, -43, 43, -18, 22, -1, 19, 57, 10, 3, -7, -37, -9, 22, -37, -19, 14, -41, 39, 58, -9, -7, 11, 6, 48, -11, 38, 0, -7, 29, 21, -1, 59, 19, -19, 44, 11, -4, 17, 23, 49, 16, 1, 1, -10, 0, -32, 30, 17, 27, -5, -9, 29, 42, -23, -4, -41, -44, 32, 34, 20, 15, 44, 46, 25, 50, -38, -1, 43, -8, -43, -2, 35, -42, -27, -5, -3, -15, -83, -14, 11, 53, 61, -6, -26, -6, 14, 62, 0, 77, 2, 16, -7, -45, 1, -21, -49, 9, 25, -15, 29, -1, -21, 19, -11, -6, -16, 4, 18, 22, 7, -22, 9, 43, 9, 19, 31, 27, 21, -8, 5, 54, 22, 0, 2, 21, -15, -19, -18, 23, -29, 6, -18, -8, -26, -15, -1, 6, -46, -3, 13, -7, 10, -3, 1, 16, 18, 17, 48, 32, 52, -4, -53, 17, 24, -38, 23, -9, 35, -19, -32, 26, 25, 39, 38, 9, 2, 6, 37, 35, 2, -22, 1, 3, -20, 7, -41, -15, 15, -9, -65, -58, 30, 29, 22, 15, -51, 1, -5, -34, 6, 13, 12, 39, -5, 9, 12, 1, 19, 51, 7, 71, -17, 55, -1, 25, -16, 46, -5, -19, 9, -27, 40, 43, -12, -19, 54, 32, 15, -34, 14, -30, -64, 11, -49, 54, 5, 9, -18, 28, -30, -63, 26, -14, 45, -39, 72, 7, -17]
5804a7N1k4m9J7P9n2O0r4K3M2oj3p7M5PL9j9l0M3j7K4n5K6L6n1L3n1Nj4J4RrK6
5837Aj3J3J7m7N3k0l5M1m3M5lj0N6p4M5k7N5q4M1rkJ4j9J8Mo2O6J7o4Q3l0n0l1
5870e4N5j1k3L0K2p6P6k0j4OK3l1K6j1N6Pq6L4q%j5N4n8K4j0ok8J03o5Mj1jpQ
5904go7P0%Ql2O7J4o6K6n1L0K5Nk3J8l5J8j9j3J4j5K8J7j8m5J13q4M5l2lL9p5
5936d8N1M2p5J2Q0n9MJM7l5jmj5k1N5q6jK0M1J7m7M0Nm9J8J9M0p8N0Pm4K9J4j8
5970A1qm6L5J1k5L0K8J6n7qJO4o7l7J6N3m2K5m6L5J5n2P1j5Jl1K7j1m2M5j8Jn
6003b5N1Ol7k8K8k8L0K1kj0pk0J8lk9O3p5O1L0q5J9M0K2km4m3L1Ok2JN0l2J3K1
6037A9r0Q6k7lOJ7Ol2J6l5N0m8K3j1L7l7M1Lp0O4J9q5L3P0m6J6o1L2L7J0k5m8
$$ y = [-17, 34, 10, -39, -22, 57, 5, 65, -29, -6, 36, 30, 17, -60, -15, -8, 31, 12, -18, 25, 8, 32, -23, 3, 39, -12, 21, -30, -25, -39, -25, -16, -25, 1, -12, 1, 18, -29, 24, 4, -31, 10, -33, 12, 9, -1, 55, -19, 26, -1, 54, -30, 11, 2, 0, 14, -5, 13, 17, -45, 21, 38, -26, 57, 27, -23, -54, 1, -10, -33, -3, 19, -57, 19, -1, -15, -9, 14, -17, 9, -2, 54, 61, -25, 9, 1, 1, -14, 40, -18, 6, -4, -10, -38, 65, 0, 4, -7, -8, -15, -7, -74, -4, -4, 4, -28, 39, 53, -13, 13, -38, -8, 17, 22, -1, 17, -18, 0, -19, -32, -18, -33, -5, 12, -6, -51, 62, -22, 23, -9, -12, 27, -48, 3, 45, -30, -18, 62, 3, 7, 8, 55, 20, 19, 15, 0, -21, 34, -52, -53, -33, 8, 25, -22, 18, 23, -26, -8, 11, 51, -27, 23, 30, -14, 15, 29, 11, 3, -43, -8, 3, -22, 8, 36, 52, -5, -13, -12, 52, -15, -52, -36, 17, -25, 0, -46, -11, 4, -48, 23, 8, 9, -22, 5, -6, -48, -3, -21, -20, -25, 26, 32, -5, -33, -5, -33, -3, 18, 16, 6, -1, -21, -3, -6, -35, 28, -47, 14, 44, -41, -22, 18, 40, 38, -6, -49, -18, -12, -34, -33, 17, -15, -2, 19, -71, 15, -12, -15, -9, 8, 14, -18, -2, -37, 13, -35, -12, -23, 14, -23, 18, 21, -49, 15, 34, -51, -18, 52, 6, 22, -39, -7, 30, 40, 15, -33]
6069c3P1k2l6k4L9%M6jj00Q9k7pL7LK3o3Om4P6p0L5J2m5O4p0M2K7rn0N5n4N0M9
6102F9l8m9O6lj5l7O8o6MoJ8L6p6N0n1K7J6K3j05N4j7J2L1K5j01N1M1o2k3R9o7
6133b6OJ3j7N4k5L4n9J8J4MKLJ7m8L5J2n4K5Mm5R6j07N5n4j7J13l0j4p0m6J06
6164aQj3J5j7k4K8m2NkJ0O2mLm4M4rqm9N5k5L6l2k1l4M0KJ8K6j2K6n3P3j23N8
6198dRj6J2k1nKL5kl3kk8L6j6K0lj1O3o8M8n7K1K6mJ2RL9n3MN0p0m3J8KM9j4N0
6234E5p9L8J4n2L5M0l9k7J9j0OoqRRj2Ll6M2J6m8N1l3j6J6L2pj1J8k5j6k9M4N
6268bJ5l8M4o5M6l1N1J0k8J5l6K5j9L5J1m9L0m1nJ2M4k2M3k9o9K1M5k4jJJ7j9
6300a3OK0q7Q5M5m5m5J2J4m1K8L3j1L3l2P1o0ojk4N1m8NJ7mk2O6j15M8J6N2n3
$$ y = [-33, 38, 16, -20, -44, -5, -5, 41, 40, -60, 29, 2, -5, 32, 35, 58, -5, 1, -43, 33, -37, -2, 10, -35, 29, -41, 1, 28, 19, -31, 24, -30, 20, 69, 31, -18, 48, 45, 30, -7, 61, -5, -1, -7, 11, 47, -29, 21, -30, -3, 13, 36, -69, -15, -32, -20, 11, 36, -65, -14, 27, -35, -58, 41, -26, -20, -7, -24, 30, 5, 39, -20, -2, 12, 16, 18, 21, 38, -10, 25, 37, -17, 8, 12, -33, 63, -44, 11, -43, -60, 53, 23, 9, -61, -107, -1, 7, -6, 9, -8, -32, -4, -46, -41, -43, -33, 29, 25, 28, -16, 28, 19, 11, -38, 17, -8, 28, -4, -25, -59, -19, -17, 1, 27, 15, 41, -12, 61, -62, -4, 5, -11, 1, -20, -25, -23, 12, 10, -23, -25, -53, -17, -33, -13, -16, -27, 36, -32, 16, -41, -20, 6, 2, 14, 23, 62, 9, 13, 63, -7, -50, -32, -30, 19, 5, 55, -24, 14, 28, -24, 11, 51, 12, -15, 4, -6, 0, -6, -14, -5, 4, -8, -5, -41, 1, 17, -31, 20, -13, -29, -13, 19, 12, 1, 19, -6, -22, -51, -7, -2, 13, -25, 19, -46, 0, -31, 20, 30, 2, 17, -19, 6, -13, 22, 33, -16, 14, -27, -32, -20, 24, 2, 45, 16, -53, -32, 13, -11, -12, -11, 6, -13, -7, 13, -74, 11, 56, 11, -34, -22, -8, -49, -21, 12, 1, 34, 2, 73, 13, 7, 6, -18, 33, -15, -10, 7, 3, -19, 47, -68, -20, -4, 48, -5]
6332eOlL0l1l9N9mm2K3k4M6K0l6j5LMj6k5M2MM5l2RRl2J2K4jj9rkO1r8M2Oo0M7
6369aJ6n1O6K0m9mQ5j17J0N0Ql2J4L5o7J8J8Ql8K2m0JL5j7j7M6L1jm3l2O7n9M3
6402B5k8M2m7pJ18r8K1k5J8M5j12P4m9k9N2N1n1K1o0Q2n6M1pn5K5Qm4N1Lj8k1
6433c0L9R0j07K9p1O1J6k5j1LK1n3P8n7L2K2k8j%n9L6O0q0nN2j6J1k6J0P3o0l9
6465c5R5m8Kl5M8Po2K9Rm0O0K6j9m8M9k9l8KN2m8J0k8L4PK6l2k7NK5RPl7O4m4
6499dJ6n1P9l0kM2o0l5P3n8LM8l5M3m7qM0l9J5KplM9K3q1K5m0K2K8k4KJ8K0m6
6533b2L0K4J6km6k2j8N0Jj9j1L3p4O5j0k2N1l6K6Rl0nJ1j3N8l9m8J3k1O2L9o6
6565a6L4L9n3j7L5p6J7O2l6K5n4J1L8n8N6l6N0j9j9M7oMj2k4K1j3o4N8l2K8o1
$$ y = [-5, 1, -2, 28, -3, -42, 17, 13, -29, -6, -30, 16, 36, 0, -15, -12, -8, -24, -49, -7, -3, 42, 10, 19, 28, -4, 8, 32, 31, 12, 3, 1, 62, -36, 6, 12, -48, -1, 15, -36, 30, 50, 1, -3, 82, -35, -25, 25, 33, 1, 15, 50, -17, 1, 19, 27, -11, 11, -29, -28, 7, -10, -27, 19, 50, 49, 6, -26, 41, -18, 25, -3, 39, -8, -15, 103, 5, 26, 1, 19, 64, -48, 26, -23, -52, 0, 51, 0, 21, -39, 43, -13, 28, 21, -34, -9, -1, -45, 6, 9, -9, -30, 9, 99, -8, 21, -50, 11, 27, 2, -9, -6, 15, -38, 40, -17, 15, 37, 9, 8, 8, -51, -15, 45, -35, -40, 12, -4, 7, -19, -9, 64, 4, -35, 60, 12, 14, -21, 27, 34, -28, 1, 10, -30, 30, 56, 37, -11, 38, 9, -29, -27, 25, -23, -13, -41, -7, 0, 26, -6, -33, -28, -3, 6, 13, -24, 40, -4, 12, -39, 40, 10, 8, 50, -10, -45, 28, -30, -27, 21, -14, 29, -18, -26, 14, -25, -10, -8, -15, -18, 31, 54, -27, -2, -42, -20, 8, -16, -14, 4, 24, -22, 8, 32, 48, 46, 0, -22, -40, 10, 11, -8, -19, 14, -60, 5, -5, -27, 24, -12, 14, 23, -7, -12, -1, -14, 44, 5, -43, -30, -51, 11, 50, -16, 18, 57, 4, -13, 22, -54, -37, 25, -11, 14, -40, -29, 9, -49, 7, -29, 21, 2, -17, 30, 24, 28, 16, -8, 13, 0, -64, -6, -38, -10, -71]
6596g1Q9n6J9J9jk6J3K1k9L8n2kM2K5k9l6K4j8O7n9LJ5K9k8K8m2l4N9k1J6L7q3
6628d3L4rJ5L7m5K7j4K7o5J1NN9o7K5K8n1J0M1n7J1L6j6K7n0m2Q0Ok9J5OOJ4m4
6661a2JM1k5Rk7LL4J6q6m1R6o8L2N4m9J9nJ7J4k4l9j6P7o3J8O7j7j0L7n9L9j6
6693A7j8L9K8l5k9Pl2M8Pn3N8m1k4L9j8j6M7m8j6j5Q1l0k6M0n1k7J05n6O1o0K3
6724EM9n2rJ7K3j7qJ0k8k1M1k8JM4j0jk4oK1n6N6qL6l0m8N2k6K3J4m2n2R3J6q1
6758d6O1l5N8o1OnML5k7oj0m1M1P9j00Q7l7Kj9J0P0o2k6J9L1m0j4K2K4M1l6l7
6790a2kkj2O1k9Rj0j7M6k4k5nN2k3lp8M4K0J4Rm3Oj0M5j4j9M2n4J5M4j6L6l8J9
6824B6oJ6k5k5O8n3K0K0JL5j07N9q6J1J10n4Oj4l3JM0jk1nL2n4mLL5pj2R2l7l2
$$ y = [-71, 18, -38, -19, 0, -1, -27, -14, 7, -22, 16, -36, -38, 4, 29, 0, -36, -12, -30, 37, -22, -19, -4, 25, -3, 25, -17, -51, 8, -13, 3, 40, -43, -9, -18, -3, 34, -11, 16, 2, 29, -36, -25, -20, 39, -28, -3, 25, -26, -16, 25, -32, -21, 15, -1, 26, -24, -66, 14, 20, -9, 6, 12, 18, 32, -12, -11, 30, 5, 14, -13, -10, 24, 40, -46, -87, 9, -59, -27, 27, -22, -3, -8, 9, 23, -1, -40, -56, 21, -42, -24, 43, 26, 16, 53, -6, 33, 17, -1, 38, 66, 31, 2, 9, -23, 25, 32, -21, 37, -4, -28, 11, -7, -23, 24, -24, -40, -55, 26, -4, -30, 10, -41, -68, 37, -19, 42, -18, 5, 54, 2, -7, 10, 33, 16, 8, 18, -10, -31, 10, -18, -17, 27, 17, 16, -8, -14, 7, -49, 7, -1, 35, 5, -43, 9, -17, 6, 20, -22, -74, 19, 35, -46, 15, -20, 38, -23, -17, -22, -18, 17, -10, -16, -26, -67, -26, 53, -47, 40, 3, 5, -14, -4, 66, 4, -22, -3, 28, -12, -26, -4, 20, 61, 25, -12, -14, -16, -28, 33, 4, 13, 3, -14, 32, 8, -17, -22, 30, 7, 4, -74, -30, -10, 4, 13, -30, -24, -34, 11, -3, -22, 20, -34, -19, 25, 9, 45, 7, 26, 20, 36, 11, -14, 54, 1, 21, 41, 42, 77, -30, 29, -57, -46, 64, 10, 16, 2, -31, -30, 10, 9, -12, -17, 15, -39, -43, -40, -5, -12, -24, 68, 31, -1]
6858aK6k5j8L9m1K8NO5p4k0j9M6J9j1M0p7Ml2K5N8k2K5o5qL4j4mL4j8J9j2n8P
6891d5OM9k1L4m5N1o5K2P5k7m2m6OL4J5QL2Jp9N1J9Ok9l7ln3J59r0j2J16r5K8
6923B3L6q1l4M1L0nN2p0Lm3P1J6k5m4K9k7K6K0j3L2jl9L9K1j7J4o3N3j8j3l4L
6955a8k8N2M5n1p9R2k7L4l0k8L2K1k7M2n7O7k0n7L1L9o1lM6mJ5n3KMk0M8Mj17
6987a06J16n1R1l0l1O9r3K2K2L1m7J3J7k5L9l9k0N0k5k5M1l9M1l1K5m2O4m0Kl
7017dP0o1K6r5N2j0j1N4k3J2M2o9L6K5p8J2K2M4k5jmL8l8j0j8l3kK1N2o9O0n5
7049d0k6N2j5qPM3n3P1j4K8o7J7L7J7K8j07KQ1j37N2K9K9L4j24L9K5LM2j6p3Q9
$$ y = [-1, 25, 0, -18, 21, -20, 8, 13, 78, 4, -16, -35, 11, 30, 19, 59, -18, -14, -46, -21, 37, 15, 40, -25, -33, 1, -13, -17, 17, -1, 18, 6, -52, -45, -39, 10, -11, 23, -22, 29, -36, -14, 61, 34, -8, -54, -48, -14, 1, 9, 41, 42, -37, 14, 33, 39, 10, -27, -30, -83, 76, -14, -26, 90, -5, 23, 59, -22, -56, -15, 15, 10, 62, -8, -5, -48, 23, 39, 14, -30, -1, -28, -2, 18, 5, 37, 36, -3, 36, 57, 40, 54, -9, 44, 26, 13, -21, -18, -46, 6, 51, 0, -79, 13, -14, 20, -10, -38, -6, 15, -12, 30, -27, 40, 20, -37, -6, 33, -28, -31, 15, 11, 26, -27, -25, -21, -41, 7, 11, -106, 10, -41, 50, 20, -11, 58, -35, -13, 9, 40, -7, 6, 23, -2, 37, -2, -22, 28, 3, -22, 19, -20, 21, -10, 15, -27, 37, -3, -1, -4, 66, 5, 31, -64, -12, -22, -33, 21, -2, 10, 52, -17, 19, 44, -34, -22, 0, 44, 19, 18, 14, 52, 14, 4, -14, -47, -49, -28, 24, -45, 15, -40, -66, -14, -29, -37, -30, 13, -40, 31, 17, 45, -22, -5, 32, 49, 77, -30, -28, 53, -84, -32, -3, 26, 60, -64, -25, 0, 3, 45, 29, -44, 45]
$$ [...]
8191c6
##END NTUPLES=NMR FID
##END=
