##TITLE=1H_DE-80H_X3
 200.13MHz, d2o
 8 sc
 
 19ns.26.2.2025
##JCAMPDX= 6.0         $$ Bruker NMR JCAMP-DX V2.0
##DATA TYPE= NMR FID
##DATA CLASS= NTUPLES
##ORIGIN= UXNMR, Bruker Analytische Messtechnik GmbH
##OWNER= pz
$$ XWIN-NMR		Version 3.5
$$ Tue Sep 16 11:29:45 2025 Russian Standard Time (UT+4h)  Yarkov@DPX200
##.OBSERVE FREQUENCY= 200.1313
##.OBSERVE NUCLEUS= ^1H
##.DELAY= (6, 6)
##.ACQUISITION MODE= SIMULTANEOUS
##.ACQUISITION SCHEME= undefined
##.AVERAGES= 8
##.DIGITISER RES= 18
##SPECTROMETER/DATA SYSTEM= spect
##.PULSE SEQUENCE= zg30
##.SOLVENT NAME= CDCl3
##.SHIFT REFERENCE= (INTERNAL, CDCl3, 0, 14.3821)
##AUDIT TRAIL= $$ (NUMBER, WHEN, WHO, WHERE, WHAT)
$$ ##TITLE= Audit trail, XWIN-NMR		Version 3.5
$$ ##JCAMPDX= 5.01
$$ ##ORIGIN= Bruker BioSpin GmbH
$$ ##OWNER= Yarkov
$$ C:/Bruker/XWIN-NMR/data/yarkov2/nmr/H-C/1/audita.txt
$$ ##AUDIT TRAIL=  $$ (NUMBER, WHEN, WHO, WHERE, WHAT)
(   1,<2025-09-16 11:28:06.56 +0400>,<Yarkov>,<DPX200>,
      <created by zg, POWCHK disabled, PULCHK disabled
       configuration hash MD5:
       00 E9 B6 7A A2 85 ED C7 34 08 36 98 17 FE 4E 26
       data hash MD5: 16K
       31 7C 49 A0 84 F8 2A 8C FC A0 47 76 73 F6 EB A6>)
$$ ##END=
$$ 
$$ hash MD5
$$ 93 46 20 A7 FF 3A 5D B1 26 16 F9 6C F6 D3 80 AF
##$RELAX= 
##$RELAX= 
##$RELAX= 
##$RELAX= 
##$RELAX= 
##$RELAX= 
$$ Bruker specific parameters
$$ --------------------------
##$DU= <C:/Bruker/XWIN-NMR>
##$EXPNO= 1
##$NAME= <H-C>
##$PROCNO= 1
##$TYPE= <nmr>
##$USER= <yarkov2>
##$AMP= (0..31)
100 100 100 100 100 100 100 100 100 100 100 100 100 100 100 100 100 100 
100 100 100 100 100 100 100 100 100 100 100 100 100 100 
##$AQSEQ= 0
##$AQ_mod= 1
##$AUNM= <au_zg>
##$AUTOPOS= <>
##$BF1= 200.13
##$BF2= 200.13
##$BF3= 200.13
##$BF4= 200.13
##$BF5= 200.13
##$BF6= 200.13
##$BF7= 200.13
##$BF8= 200.13
##$BYTORDA= 1
##$CFDGTYP= 0
##$CFRGTYP= 5
##$CHEMSTR= <none>
##$CNST= (0..31)
1 1 145 1 1 1 1 1 1 1 1 1 1 1 1 1 1 1 1 1 1 1 1 1 1 1 1 1 1 1 1 1 
##$CPDPRG= <>
##$CPDPRG1= <>
##$CPDPRG2= <>
##$CPDPRG3= <>
##$CPDPRG4= <mlev>
##$CPDPRG5= <mlev>
##$CPDPRG6= <mlev>
##$CPDPRG7= <mlev>
##$CPDPRG8= <mlev>
##$CPDPRGB= <>
##$CPDPRGT= <>
##$D= (0..31)
0 0.7 0 0 0 0 0 0 0 0 0 0.03 0 0 0 0 0 0 0 0 0 0 0 0 0 0 0 0 0 0 0 0 
##$DATE= 1758007686
##$DBL= (0..7)
120 120 120 120 120 120 120 120 
##$DBP= (0..7)
150 150 150 150 150 150 150 150 
##$DBP07= 0
##$DBPNAM0= <>
##$DBPNAM1= <>
##$DBPNAM2= <>
##$DBPNAM3= <>
##$DBPNAM4= <>
##$DBPNAM5= <>
##$DBPNAM6= <>
##$DBPNAM7= <>
##$DBPOAL= (0..7)
0.5 0.5 0.5 0.5 0.5 0.5 0.5 0.5 
##$DBPOFFS= (0..7)
0 0 0 0 0 0 0 0 
##$DE= 6
##$DECBNUC= <off>
##$DECIM= 32
##$DECNUC= <off>
##$DECSTAT= 4
##$DIGMOD= 1
##$DIGTYP= 9
##$DL= (0..7)
0 120 120 120 120 120 120 120 
##$DP= (0..7)
150 150 150 150 150 150 150 150 
##$DP07= 0
##$DPNAME0= <>
##$DPNAME1= <>
##$DPNAME2= <>
##$DPNAME3= <>
##$DPNAME4= <>
##$DPNAME5= <>
##$DPNAME6= <>
##$DPNAME7= <>
##$DPOAL= (0..7)
0.5 0.5 0.5 0.5 0.5 0.5 0.5 0.5 
##$DPOFFS= (0..7)
0 0 0 0 0 0 0 0 
##$DQDMODE= 0
##$DR= 18
##$DS= 0
$$ [...]
##$SUBNAM2= <"">
##$SUBNAM3= <"">
##$SUBNAM4= <"">
##$SUBNAM5= <"">
##$SUBNAM6= <"">
##$SUBNAM7= <"">
##$SUBNAM8= <"">
##$SUBNAM9= <"">
##$SW= 18.0517328524113
##$SWIBOX= (0..15)
0 0 2 0 0 0 0 0 0 0 0 0 0 0 0 0 
##$SW_h= 3612.71676300578
##$TD= 16384
##$TD0= 1
##$TE= 0
##$TE2= 300
##$TE3= 300
##$TEG= 300
##$TL= (0..7)
0 120 120 120 120 120 120 120 
##$TP= (0..7)
150 150 150 150 150 150 150 150 
##$TP07= 0
##$TPNAME0= <>
##$TPNAME1= <>
##$TPNAME2= <>
##$TPNAME3= <>
##$TPNAME4= <>
##$TPNAME5= <>
##$TPNAME6= <>
##$TPNAME7= <>
##$TPOAL= (0..7)
0.5 0.5 0.5 0.5 0.5 0.5 0.5 0.5 
##$TPOFFS= (0..7)
0 0 0 0 0 0 0 0 
##$TUNHIN= 0
##$TUNHOUT= 0
##$TUNXOUT= 0
##$USERA1= <user>
##$USERA2= <user>
##$USERA3= <user>
##$USERA4= <user>
##$USERA5= <user>
##$V9= 5
##$VALIST= <valist>
##$VCLIST= <CCCCCCCCCCCCCCC>
##$VD= 0
##$VDLIST= <DDDDDDDDDDDDDDD>
##$VPLIST= <PPPPPPPPPPPPPPP>
##$VTLIST= <TTTTTTTTTTTTTTT>
##$WBST= 1024
##$WBSW= 4
##$XGAIN= (0..3)
0 0 0 0 
##$XL= 0
##$YL= 0
##$YMAX_a= 325222
##$YMIN_a= -178647
##$ZGOPTNS= <>
##$ZL1= 120
##$ZL2= 120
##$ZL3= 120
##$ZL4= 120
##$ABSF1= 10
##$ABSF2= 0
##$ABSG= 5
##$ABSL= 3
##$ALPHA= 0
##$AQORDER= 0
##$ASSFAC= 0
##$ASSFACI= 0
##$ASSFACX= 0
##$ASSWID= 0
##$AUNMP= <proc_1d>
##$AZFE= 0.1
##$AZFW= 0.1
##$BCFW= 1
##$BC_mod= 2
##$BYTORDP= 1
##$COROFFS= 0
##$CY= 83.5205535888672
##$DATMOD= 1
##$DC= 2
##$DFILT= <>
##$DTYPP= 0
##$F1P= 10.8118882576601
##$F2P= -7.23987719738617
##$FCOR= 0.5
##$FTSIZE= 0
##$FT_mod= 4
##$GAMMA= 1
##$GB= 0.15
##$INTBC= 1
##$INTSCL= 1
##$ISEN= 128
##$LB= 0.25
##$LEV0= 0
##$LPBIN= 0
##$MAXI= 10000
##$MC2= 0
##$MEAN= 0
##$ME_mod= 0
##$MI= 1.114404
##$NCOEF= 0
##$NC_proc= 0
##$NLEV= 6
##$NOISF1= 3.799351
##$NOISF2= 2.8
##$NSP= 1
##$NTH_PI= 0
##$NZP= 0
##$OFFSET= 14.38212
##$PC= 1
##$PHC0= -1352.778
##$PHC1= -0.009078503
##$PH_mod= 1
##$PKNL= yes
##$PPARMOD= 0
##$PSCAL= 0
##$PSIGN= 0
##$REVERSE= no
##$SF= 200.129724274929
##$SI= 16384
##$SIGF1= 3
##$SIGF2= 2
##$SINO= 400
##$SIOLD= 16384
##$SREGLST= <1H.CDCl3>
##$SSB= 0
##$STSI= 0
##$STSR= 0
##$SW_p= 3205.1282051282
##$SYMM= 0
##$S_DEV= 0
##$TDeff= 0
##$TDoff= 0
##$TI= <>
##$TILT= no
##$TM1= 0
##$TM2= 0
##$TOPLEV= 0
##$USERP1= <user>
##$USERP2= <user>
##$USERP3= <user>
##$USERP4= <user>
##$USERP5= <user>
##$WDW= 1
##$XDIM= 8192
##$YMAX_p= 0
##$YMIN_p= 0
$$ End of Bruker specific parameters
$$ ---------------------------------
##NTUPLES= NMR FID
##VAR_NAME=  TIME,          FID/REAL,        FID/IMAG
##SYMBOL=    X,             R,               I
##VAR_TYPE=  INDEPENDENT,   DEPENDENT,       DEPENDENT
##VAR_FORM=  AFFN,          ASDF,            ASDF
##VAR_DIM=   8192,          8192,            8192
##UNITS=     SECONDS,       ARBITRARY UNITS, ARBITRARY UNITS
##FACTOR=    0.0002768,     1,               1
##FIRST=     0,             0,               0
##LAST=      2.2672688,     0,               0
##MIN=       0,             -178647,         0
##MAX=       2.2672688,     325222,          0
$$ Real data points
##PAGE= N=1
##DATA TABLE= (X++(R..R)), XYDATA
$$ [...]
102E365l15P751J4173Q479m164j1894j2058j3839j0679k23m111j2937p637k640
116d4729J946J6246K5817K4792K1074J4462K882j1494j9269k0079j9604j2384
128b0340l174m226o388m226k708M031J3061J6976J6221R930L818M8n672p265l845
143F241l474j632J456j084n816q780o453l0N472J2348J3971N682M58p29n273m821
159G536o21p42j126l21r46l801o428m148o71J350N720N998o43m108m885m605L6
176a2405M498O192N813L087J591k51l466k712j249j082Q93J210j398l424l643
191f346j362J885M098N876L700p62j650k525l744j334L86L95J560J524J23j557
207B67k382m68O51J402K862N08k707k237j845p59K145L134K628J605j50j080k505
$$ plain form
102 5365 5050 12801 26974 35453 31289 19395 7337 -6502 -17181 -17404 -21515 -34452 -42089 -44729
116 -44729 -42783 -26537 -720 24072 45146 59608 62490 50996 31727 11648 -7956 -20340
128 -20340 -23514 -27740 -34128 -38354 -41062 -37031 -23970 -6994 9227 19157 22975 23023 17351 10086 6241
143 6241 2767 1135 2591 1507 -4309 -13089 -19542 -19572 -14100 -1752 12219 17901 18359 17630 12357 7536
159 7536 6915 6173 5047 4726 3780 -21 -6449 -10597 -11268 -9918 -4198 1800 1157 -2951 -7836 -12441 -12405
176 -12405 -7907 -1715 4098 7185 8776 8525 5059 2347 1098 16 909 2119 721 -2703 -6346
191 -6346 -7708 -5823 -1725 4151 7851 7089 5439 2914 -830 -2164 -1778 -1383 177 1701 1824 267
207 267 -2115 -2583 -1932 -530 2332 2840 133 -2104 -3949 -4708 -2563 571 3199 4804 4654 3574 1069
224A069l201j027j09O90K390J034q55r42r01K80J386J425J223q50k021j060j152
241b621n49J743K000J709J891M65j373k140k187r50p2P20J388o4o36K26j17L34
259b33J245N49M8m31j010j075j225n03R45J063J331J349k57j029p70q40j0N91
277b62N51L88k58k18j57n33lN41O8K64K30n68o06k94J74P09O81P05J15r66q03
298b42o59o95J73N87L96O03M21R3k22l19O4K60j33J33r6p78l62o0L8M46O82L90
320G20J30l04k90l49m77J94K18kL73J04k30l6o8J16J28J13J52k01m41q3k23k23
342f79K20K45N4K04l0o0m8M2J94J74OJ51j21k07j11j48k25K7O7l4k5n5P4J55R8
367c2L70J96mO0j37k04j48k43p5j21l4J10O9L5J47P0Q4J91p3n5j68j35Kj28j1
$$ plain form
224 1069 -2132 -3159 -3268 -2578 -188 846 -9 -951 -1852 -1572 -186 1239 2462 1612 -409 -1469 -2621
241 -2621 -3170 -1427 573 2282 4173 4638 3265 1125 -1062 -2012 -2084 -1364 24 -40 -676 -450 -567 -233
259 -233 1012 1561 1609 1178 168 -907 -2132 -2635 -1690 -627 704 2053 1796 767 -3 -843 -853 -262
277 -262 289 677 419 201 44 -489 -492 49 117 381 611 43 -563 -857 -683 26 707 1412 1527 561 -242
298 -242 -901 -1596 -1423 -836 -440 163 584 677 455 136 200 460 327 460 364 -414 -776 -836 -798 -352 330 720
320 720 850 546 256 -93 -570 -376 -158 -160 213 317 87 51 -17 99 227 340 492 291 -150 -233 -456 -679
342 -679 -459 -214 -160 44 14 -46 -94 -52 142 316 322 473 352 145 34 -114 -339 -312 -245 -279 -304 -359 -285 -130 -32
367 -32 338 534 530 590 453 249 101 -142 -217 -338 -372 -262 -193 -158 -11 59 143 334 261 206 38 -97 -95 -223 -234
392b34J67O6Q9j7J2k2N9j15r0Qo5%J04p2N4L5R6M9j1o0O6j00j5J29p5oL2p0m7
421c3j01k5j4Nj6N2J36O3P3N3k4J9r4j00j6l4p4L5J3oL8p6Q3J8oR9j13P3J56M4
451B28o7J9j6o8K0j64n0r5l1M6pR9J22M2Kj5k1j23J8j7L6J5k5J26J04J4m1l1q7
480C3m8j39k1m6L4K3J35R7R5L8L2o0q4J8M1j60p7r0JQ3K9K3Jj4K0O1j09L8P7m2
510a1J33R0K8L3j25r6pk0k8n9q6lR0j24J06O7jQ4k0Lp0p5j36N2k0J03N2k8N6N6
540D4k0J12P5L3l0L0q8j4j61o1m1l2J27K6L6K0ok4N3O8m1p2j62r0K2q4J04M8P1
569e7J60J37k9J4j08j74k4n1Q2j1p6J08O6K1R1P3j5j17n1q1m8j74j00O7J46J90
595C9J01R1l4M5m5L7o9j27n1j17o5j5n0K02J8N9K17O2j6m8j13j77J1o0m0j05r
$$ plain form
392 -234 -67 -1 88 71 83 61 120 5 -85 -77 -142 -142 -38 -110 -56 -21 75 124 113 53 119 19 4 133 58 52 84 14 -33
421 -33 -134 -159 -173 -168 -184 -132 4 67 140 193 169 188 94 -6 -22 -56 -130 -95 -82 -88 -50 -126 -43 -25 -31 68 -45 28 184 228
451 228 161 180 164 96 116 -48 -98 -193 -224 -178 -185 -86 36 78 80 65 44 -79 -61 -78 -42 -27 -52 74 178 192 151 120 33
480 33 -15 -154 -175 -221 -187 -164 -29 68 163 201 233 173 89 107 148 -12 -89 -179 -178 -95 -66 -43 -42 -56 -36 25 -84 -46 31 -11
510 -11 122 212 240 273 148 52 45 25 -3 -62 -148 -151 -61 -185 -79 -12 -13 71 51 54 -16 -91 -227 -175 -195 -92 -40 -68 -12 44
540 44 24 136 211 244 214 244 156 142 -19 -80 -121 -153 -26 0 36 56 50 26 79 147 106 34 -128 -218 -196 -280 -176 -128 -57
569 -57 103 240 211 225 117 -57 -81 -132 -50 -61 -137 -29 37 58 149 222 207 90 39 -42 -90 -264 -364 -297 -151 39
595 39 140 231 197 242 197 234 165 38 -13 -130 -195 -210 -260 -58 -40 19 236 298 282 234 121 -56 -45 -105 -145 -250 -259
622b59JL6N8J33O5K2J89l8q2m8j57RL7LR1m3J0K0LrJ30k1o5K7j60J0j51n8R2N8
652i7K1K76l0K7o9p8K7K8n3n2j25j32m1j0M2J42J14K40K03o5j3j47k17l0n4l4
678a27n9j15p5P4P5J84J84P6J11j4q1j00j40j32p3PP0K29j38N4l4M6J39M3J4o3
704A55q5q7J4j71L1L1Q6J02M9p0mq1m5K7N5l0J1q8k2K9j5J32R5J0N4N4j35n2j23
733g3J1j9RJ02m0j02O1L6J5J46J1L7J4j60p6n6r1M3MJ07R0j6p7P4q1LJ23j1l1
762E3k5j04J3q3J7J88j12L5J34r2p9l4l5R3O4N2J50j42l5o8o6M2Jo0J5K2j3Q3
790A4q7N6J13l3J2O1j81n2j5o4Q8J72J6O4o9o2O0j77j1N7k5N1P9q8M6J9o9J09
818H4j9Ok4r8n9L9l1Q4J19k8O2l1j20ll7r8Q6n2P3K3p5J25oN6J3P4p7l1m4m4K5
$$ plain form
622 -259 -258 -222 -164 -31 34 56 245 207 125 77 -80 -71 -34 -31 60 17 27 47 50 41 171 150 85 112 -48 -38 -189 -247 -155 -97
652 -97 -76 200 170 197 128 50 77 105 52 0 -125 -257 -298 -308 -266 -124 -10 230 433 368 355 208 -9 -39 -93 -127
678 -127 -186 -301 -376 -302 -227 -43 141 217 328 314 233 133 -7 -139 -212 -205 -135 94 -44 10 -24 22 161 204 218 155
704 155 70 -17 -3 -174 -143 -112 -26 76 125 55 51 -30 -75 -48 7 -23 -12 -100 -122 -93 -108 24 119 129 183 237 102 50 -73
733 -73 -62 -81 -72 30 -10 -112 -51 -15 0 146 157 194 208 48 -28 -84 -175 -132 -128 -21 69 53 -24 50 -31 -28 95 84 53
762 53 28 -76 -63 -146 -129 59 -53 -18 116 24 -55 -89 -124 -31 33 85 235 93 58 -10 -76 -34 -33 -93 -78 -56 -69 14
790 14 -73 -17 96 63 75 136 -45 -97 -112 -176 -88 84 100 164 95 33 93 -84 -95 -38 -63 -12 67 -21 25 44 -25 84
818 84 65 71 47 -51 -110 -71 -102 -18 101 73 135 104 -16 -19 -56 -154 -68 -120 -47 -24 -99 26 20 76 89 163 86 55 11 -33 -8
849ho7Q1NJ8M5k0m7K7j4q2K6M5k3P0p0J4K7o7J7M9o3J08o9j3Km2N2k1RM6j04p0
881a39M1J8mJ81n1M7O2m7kpj07R1n9p9M1o7J6k9P8m3J27mK5j5o5J6Jj20K9J01
911C6j26J21q4n2R7k6Q1k2N6j9r1NK7n7n0K9R3O4j6L1m8N8j9mk9o3pj36m2Q2L4
942g7J02k3Q5J09j28O5L8j51k5rn3rj3LP8nL9P8j4l6L3o7o9q4Q5Kk5n6P4K3M7
973A7Q0p8J9O4p3l5J8q0M7j7KN4k4N6O5k3k6O0j07%k4n4k8K1m1N1K9k5J11Nl8
1004B6J09q7jl6J5m9j21J51n2q2N8K1M7j6L1j5K1K8mk1j2QNn3P1k0n4N7pnK0k4
1036Il7Q2r6Q3rp0P6M7m9K5k8L7qj13lJ4N8j11M0J5O6q6K7O1j7K2O8p1RMJ5n7
1068CL3p8L8j2j3M3j8n8L9l2j2J13Om1K0l4PK4KJ8m0Om6l6K9L3p5Q2k9N9l8j6
$$ plain form
849 -8 -75 6 11 29 74 54 7 34 20 -62 -36 9 -14 56 -14 0 27 -40 -23 26 -37 71 2 -11 -9 -51 1 -20 -11 35 -69 -139
881 -139 -98 -80 -84 97 46 93 155 108 106 99 -8 83 24 -55 -14 -81 -65 -94 -16 -59 68 64 89 74 9 25 26 -94 -65 36
911 36 -90 31 -53 -105 -8 -34 47 25 81 62 -29 -24 3 -54 -104 -75 18 82 66 97 49 107 88 84 55 -8 -15 -151 -193 -111 -77
942 -77 25 2 87 196 68 133 171 20 -5 -14 -67 -76 -89 -86 -8 -13 26 104 90 54 87 20 -49 -133 -48 -46 -71 -127 -53 -30 17
973 17 97 19 38 102 29 -6 12 -68 -21 -38 -36 18 -6 50 115 92 66 126 19 19 -5 -59 -87 -66 -107 -56 -27 -52 59 64 26
1004 26 135 48 47 11 26 -23 -144 7 -45 -127 -69 -48 -1 -17 14 -1 20 48 44 23 11 19 24 -29 42 22 -32 25 18 13 33 9
1036 9 -28 54 -42 41 32 -38 38 85 36 61 33 70 62 -51 -54 -40 18 -93 -53 -38 28 -58 -31 30 13 35 103 32 41 45 60 3
1068 3 36 -42 -4 -16 -29 14 -4 -62 -23 -55 -67 46 52 11 31 -3 4 28 30 48 8 14 -32 -68 -39 -6 -81 1 -28 31 -7 -23
1100b3jN8j4j7K1rPj0l9N6Qp5O9q7Q4Mp0PK0K7RrJk2Pm0L2K5q0J7N1j7o6Q9p7
1135f4P1o6M8K4%k5L7j2qK7l7q%L4njK7ro4K2M4qn0L0Qo0M8qj0LJ8Nk3j1k8RK9
1172a3l0OM2Qj2p2P0k1n2J04j3k9Oj9J3J4M3o4J3lN3j8nJ7l4n4Q2lo0O9K3m8n
1205Hl5N4o7J2M7j1oRj5mJ4Pp8L8rM6p5K3O0l6M3o6N2j2K8p1P9j0n2L3L0m3PP1
1239G1n1K3j3m2pK5k1J2j2l6M5j3O1l0m2N9Pr3L9K4Qj8LJ7QK0q5N2m7O9o1J4Q
1272fLj6J4j1M4q8J39j00L5j5K4N5r7OO4m1JkK0n7N6n1M0L9o8K0Rl2O7n6m6P2
1304B2m1rk2pKL2L3n7M4oL6L1p6J9L1l1j6O5l9K2j11O8P8r7mQ0j17L4L6j3J3K5
1336B5K8m2j3J9ok4K7Qn6M9Lj0l8N9l2MJ5l2K2l1J6L4j3o9O4J2O1k5m0Lj1l4J6
$$ plain form
1100 -23 -24 34 20 3 24 15 22 12 -27 29 37 -38 31 -56 28 32 -38 -31 -11 16 25 16 17 -5 2 -38 -6 19 -61 -44 7 -10 -76 13 -64
1135 -64 7 -59 -11 13 13 -12 25 13 5 32 -5 -13 -13 21 16 15 42 33 -31 -9 35 27 -23 7 15 -45 3 -5 -15 -12 6 11 -12 -23 -51 -42 -13
1172 -13 -43 -37 5 13 1 -71 -1 -22 -74 30 17 -12 -6 -25 -12 2 45 -19 -6 -9 44 26 21 38 4 -50 32 29 -31 38 61 13 8
1205 8 -27 27 -40 -28 19 8 2 11 -4 -8 6 13 -65 -27 -36 10 -65 -42 18 -18 25 -41 11 -1 27 -44 35 25 -27 6 36 -7 0 71
1239 71 20 43 30 -12 -19 6 -15 -3 -15 -51 -6 -19 42 12 -30 29 36 -57 -18 6 14 -4 -1 16 24 44 -41 11 -36 33 -28 -14 -6
1272 -6 -3 -19 -5 -16 28 -60 79 -21 14 -1 23 78 -19 -13 51 10 11 9 29 -28 28 -23 17 56 -12 8 17 -15 52 -4 -50 22
1304 22 -19 -28 -50 -57 -55 -23 10 -47 -3 -9 27 58 -18 1 32 1 -15 50 11 33 -78 -10 68 -29 -33 47 -70 -36 0 -13 0 25
1336 25 53 11 -2 17 11 -13 14 22 -34 15 18 8 -30 29 -3 1 16 -16 6 -25 -9 25 12 -57 7 19 80 55 15 18 7 -27 -11
1369a1M8k0l2L2J0l6J7jN5o4K2k3l1j3O6M9j20j9N3kM3Jk9j2l9Q5rjj5k7j1K2
1401a2K4q2K5M5J5Qk9K4j2J8Po1N4m8P8l3q0P9p2MLM6m8jJ7l5N6k4R4l4N6j30
1433d8O0j1n2N0J2K0n0o2P9j1KmM0q7R6m0l1M7Nlj0M8l3Ol9oK7m8RRM4L1r2jN6
1468A3l7R3n9l6M7l1O8j12L5n0R5k2J1j5J6l0J7M4n5L5o8j2P3K1k5L7m1k5j6Q1
1498E2k8m1N0k8k7K8k9Jpj4L1j3Kj7O5l6O1r4M2m2J0N5k7M0%k0p0N8j2NN6m8o3
1531f0Q9j1l5O3j8n2L9l7N9j1k2O6q8J6pl3NL8%l6L7L1J6q7M1j3Rm7M1l3O8pj4
1564GK0l8K5L7n7M0l6MJ6M3r0NJ0K9rLk3J6k3M9l0NJoM1l6N7o5J8j1k6lL7n1Q5
1599D4q6J02m6pn9O8j2rk1j5Q1m9jJ2M7J3l2r0Q2j3J0o0l1O6Lj0k3J6NL2K6m6
$$ plain form
1369 -11 37 17 -15 17 27 -9 8 7 62 -2 20 -3 -34 -47 19 68 -52 -71 -18 -20 23 24 -5 -17 -56 29 20 19 4 -23 -34 -12
1401 -12 12 -70 -45 0 15 23 -6 18 6 24 31 -30 24 -24 54 21 -59 20 -52 -48 -45 1 -47 -48 -31 -66 -10 -34 60 26 82 -48
1433 -48 12 1 -51 -1 11 31 -19 -81 -2 -13 -11 -15 25 -62 34 -6 -37 10 15 12 2 50 17 23 -16 -22 5 -43 -34 -25 19 50 -42 -43 13
1468 13 -24 69 10 -26 21 -10 58 -54 -19 -69 26 4 15 0 16 -14 3 47 -8 27 -41 -53 20 41 16 53 12 -13 -29 52
1498 52 24 -17 33 5 -22 6 -23 -22 -29 -43 -12 -25 -23 -40 25 -11 50 -44 -2 -44 -34 21 -6 34 34 14 -56 2 -10 -5 51 3 -60
1531 -60 29 18 -17 46 28 -24 15 -22 37 26 4 70 -18 -2 -9 -42 -37 1 1 -35 2 33 49 -38 3 -10 -1 -48 -7 -40 28 21 7
1564 7 27 -11 14 51 -6 34 -2 2 18 61 -29 -24 -14 15 6 9 -14 2 -21 28 -2 3 4 -2 39 3 60 -5 13 2 -24 -27 10 -41 44
1599 44 -42 60 14 7 -52 16 4 -5 -26 -41 40 -9 -10 2 49 62 30 -60 22 9 19 -41 -72 -6 -3 -13 -36 -20 -15 17 43 -3
1631cM5j3m9K3m8N6Pl1K4j5Rj5rM2k3l4J1j5oO5K1n6j0Q7o5J2M9r8K3L0k9M4k6
1664CL8j1m6K6l1J6L1k8j7K7k4K8Ml5O1n2PJM3o0K0m1L2L0l4M0k9Pk2j2K8j8K4
1697Fo4O0K1k5k8Q1m2j1j0K9n0M3PloOmj4M2n4L2j3K3J9o2k4N8K0J5p0j7L1Lk4
1731b5K6k6k2j3P5j4K5j0j9K5K3n9M8n0j7M1j0L2j2qn3O3k9N5j35O6K3m6LK6K4
1762GL7q1J12r7K0L0j3m4L1M2l6J8n6O1n7K5Rk5L3M1n0L2l2k3k9M1K9J4j0k1k2
1793a4L0j5K7qkm3k4N5Mpk5J8j3M6p4J7K5o8R1k7K7r1M5j9J50q1k2Rk0N3n0j3
1825a9J5K9Kj9K0ol4M8j8l6PLn4M9J1J4L8n6nl3NL9n5L4j1J3OL1Pp8O2J3J7r9
1859f0P0k9L7kj7K0J4j5l8P7k8l4J3j2J9n6N9k0K4lJ3n3j6k1J01K1q6K3K5p6J6
$$ plain form
1631 -3 42 29 -20 3 -45 11 18 -13 11 -4 5 -10 -19 23 0 -34 -23 -38 -44 21 42 -14 -24 63 -2 10 59 -39 -16 14 -15 29 3
1664 3 41 30 -16 10 -21 -5 26 -2 -19 8 -16 12 16 -19 42 -10 -3 -2 41 -19 1 -40 -8 22 -12 28 -1 6 -16 -28 0 -18 6
1697 6 -58 2 23 -2 -30 51 9 -2 -12 17 -33 10 17 14 8 14 10 -4 38 -16 16 3 26 45 -17 -41 17 37 52 -18 -35 -4 -1 -25
1731 -25 1 -25 -47 -60 15 1 26 16 -3 22 45 -14 34 -16 -33 8 -2 30 18 10 -43 20 -9 46 -89 -23 0 -46 -43 -17 7
1762 7 44 -37 75 -22 -2 28 15 -29 2 44 8 26 -30 31 -26 -1 8 -17 16 57 7 39 7 -16 -45 -4 25 39 29 8 -14
1793 -14 16 1 28 20 18 -25 -49 6 10 3 -22 -4 -17 29 -45 -28 -3 -71 20 -7 20 -71 -26 -45 105 24 2 11 -9 44 -6 -19
1825 -19 -4 25 27 8 28 22 -12 36 18 -18 -11 -8 -62 -13 -2 12 50 -6 -11 -44 -39 0 -55 -21 -32 -19 -13 18 25 -53 9 22 39 -60
1859 -60 10 -19 18 16 -1 19 33 18 -20 57 29 -5 8 -4 15 -41 18 -2 22 19 32 -21 -37 -58 43 64 -22 1 26 -50 -34
1890c4K6l8J01n9K3m2J1j0k9L8PK4L8j1p4j1O2M8r9j0K9MM9L0j08Q9o3M6l1pK1
1921B0l3j8N0m7j2K6O9q5J9lJ8j7N3p7L4m3N4Kn8M6on0O7lRj5Nj5l2K4lPL4l1
1955a1j8L3M0p3M3pm6N5k6P2n3k2LO3p9M1J6l2j5j3J5oN8j6%nm6N3rqj3k6P1l0
1989IOKK3l7N4n3m3Q4m1K3n8J1O1o5J5J9n0KL5j5K0L1q2j6J13m2l0QK7k0J5k0
2021a4k2L0k2M7l1m9Q4n4k8L2k2L4N3p6N2oJ4m0P7n5J4qJ7J4m2l5N3j4J1n6J5
2052b7O4Lo2n0K0M0M2q7N5J9l3L7ol4K9j1jr5L0M7K7%Okl4K9lK4m4M6m4L8J2k3
2086A2j8L5l4l2J09n3m7K8j8k0pmL2k8Q1j3j00R9k4k7MM9Np1O1m3K1Ql8J9L1Q
2118B5K3Jl1QM2o8J7j5l6Q7k2k1M1l5k3k6K8n7M5N4m9nL3jk7lj2L9m6ON2K5k9
$$ plain form
1890 -34 -8 -46 55 -4 19 -23 -12 -22 -51 -13 -6 18 56 45 -29 -40 22 70 -29 -39 -10 -6 43 73 -35 54 -9 37 6 -1 20
1921 20 -13 -31 19 -28 -40 -14 55 -30 -11 -14 4 -13 40 -37 -3 -46 8 10 -48 -2 -8 -58 9 6 15 0 5 -10 -42 -18 -21 -14 20 -11
1955 -11 -29 4 44 -29 14 7 -39 16 -10 62 9 -13 -10 53 -26 15 31 -1 -16 -29 -14 -20 38 22 22 17 -29 24 15 7 -6 -32 39 9
1989 9 15 17 40 3 57 4 -39 45 4 27 -31 -20 41 -24 -9 10 -40 -38 -3 -18 2 33 -49 -65 48 6 -24 -16 11 -9 6 -14
2021 -14 -36 -6 -28 19 -12 -61 23 -31 -59 -27 -49 -15 38 -38 14 8 22 -18 59 4 18 10 27 41 -1 -36 17 3 14 -42 -27
2052 -27 37 40 -22 -72 -52 -12 30 -57 -2 17 -16 21 15 -19 10 -1 -2 -97 -67 -20 7 7 13 11 -23 6 3 27 -17 29 -15 23 35 12
2086 12 -6 29 -5 -37 72 19 -28 0 -18 -38 -45 -49 -17 -45 36 23 -77 22 -2 -29 -25 24 29 -42 19 -24 -3 5 -33 -14 17 25
2118 25 48 49 18 26 68 0 17 2 -34 53 31 10 51 16 -7 -33 -5 -62 -17 37 -12 -17 16 15 -12 -15 -27 12 -34 -28 24 49 20
2151B0M3o5j2J9L4Qj3j2m8KK8O0j00O6q6O3k9N0L1n4K2Mn9PN0n1K6j7K0Rrl7L9
2184ImK6n2nO2l5pK4mj9%L9J4J1o4K6k0k3M9j7J4j2J7k1l5l5J9R3Ll2o9L3K2m3
2218c6qQ6o2K0j1k4pN6j0L7m6l2J9N2j7nl8J6JoJ8K2p1N4L0p9N3kJ1m1N5j3m2
2251b0J0L3k1rn8M0K8M6m0j0Ok4J0rN2k0q8L8J3O1l5l0k1N5J3Nn1J3M3j3o6Q6
2283C7k5K9o5R3n9L9k9J3j0K5m7KM4m0j6J1J9l1k6O6k5K4l7P1o8k5L4K4n3Nj2
2314c2K5K1K9n0k8J2n1J02n0J7k1PQK3k6N8m5M7n4J2k4K4j0K7L0l4j4j1K4l2L5
2345A9k7O8o6jnJ9m1QN0Jk9l6K8j3L9j1l0J9o3J09qk9jJ8k1L0l4k7M6j5L5j0k9
2378gM4Pn5M8k4K5l1J3n9L1RN7p5L3J8k6L0o1K5J4j1J4k1N3n7j8M8l0N2k2j7l2
$$ plain form
2151 20 63 -2 -14 5 39 47 34 22 -26 -24 4 64 -36 30 -56 7 -22 28 59 5 27 31 -28 -21 29 -22 4 -13 7 16 7 -30 9
2184 9 5 31 -21 -26 36 1 -6 18 14 -5 -5 34 48 59 -5 21 1 -22 27 10 24 12 29 8 -27 -62 -43 50 53 21 -48 -15 7 -36
2218 -36 -44 42 -20 0 -11 -35 -42 14 4 41 -5 -37 -18 34 17 12 -26 -10 -9 -15 3 25 -46 8 38 -41 12 10 21 -20 35 22 -20
2251 -20 -10 23 2 -7 -65 -25 3 49 9 -1 5 -19 -9 -18 34 14 -74 -36 -23 38 3 -27 -48 7 20 25 -26 -13 30 17 -49 37
2283 37 12 41 -24 69 10 49 20 33 23 48 1 3 47 7 -9 2 21 -10 -36 30 5 29 -8 63 -5 -30 4 28 -25 -20 -32
2314 -32 -7 14 43 -7 -35 -23 -74 28 -22 -5 -26 -19 -11 12 -14 44 -1 46 -8 4 -20 4 -6 21 51 17 3 -8 16 -16 19
2345 19 -8 60 -6 -7 -12 7 -34 -26 24 25 -4 -40 -12 -25 14 3 -27 -8 -71 38 30 1 0 18 -3 27 -7 -34 12 -3 32 22 -7
2378 -7 37 44 -11 37 13 38 7 20 -39 -8 1 58 -17 16 34 8 38 -23 2 16 5 19 -2 51 -6 -24 24 -6 46 24 7 -25
2410b5K1K8L4r6J5M5N2n4j3l4pM1m9N8Lj9k6j5J00o6l6Q6p0j7pO0l2N4k1j2L3
2441C1p2M3J0M1m6L9o6J21j33L6j7L6k9J1K5p7J7L8J2j7L9n5K2K0j3OLn1JPK4
2472Fj1nm4P2m1rp8L9Q8n7K1kM2n7LM7M1l7l4O2l2k0L2n0O0j3jJ6k2J7l8K0NJ
2506B1l5L9k4l1J6kK9K1j1l9n7O8J0Ko1M2L0l5LL7n2Q8m2j8k3M4Oj9K7n7K3jK9
2539B8K3j39J51m3m5n4R5N0o5K3Mn0O8p9jJ2Q6q2K5K9m2RRK2m8n8PR7n0j2l6N8
2571hK9NJ4n6N1Lm3k5KJ04p3Ll0K1K9j4m7O9o0K0J0l9lP7m1OL7o2J0pL6mj2k0
2605a8M1n9K4m7P8m5J8J3n9K2N1ook3MJ7j0jl5R2m2j5K5n9L1K0J5o9M7K4l2k7
2637c1pQJ0L1j9po1K4L7n8Q8l4L1l5N2k0L0l6L2k4m9K7N7n9J3j3M1m6O5k0q4L2
$$ plain form
2410 -25 -4 24 58 -38 -23 22 74 20 7 -27 -34 7 -42 16 19 0 -26 -41 59 -7 -43 43 -27 -44 -51 9 -23 31 10 -2 31
2441 31 -41 2 12 53 7 46 -20 101 -32 4 -13 23 -6 5 30 -47 -30 8 20 3 42 -13 9 29 16 22 25 -26 -25 -18 6
2472 6 -5 -10 -54 18 -23 -32 -110 -71 17 -40 -19 -21 21 -36 -33 14 55 18 -16 46 14 -6 26 -24 36 23 22 38 16 33 -5 15 20 21
2506 21 -14 25 1 -30 -14 -16 13 34 23 -16 -73 -5 5 7 -54 -12 18 -17 -14 23 -29 59 17 -1 -24 20 26 7 34 -23 0 -1 28
2539 28 51 -88 63 20 -25 -79 16 66 1 24 28 -22 46 -33 -34 -22 64 -18 7 36 -6 3 12 34 -14 -72 -65 32 -18 -30 -66 -8
2571 -8 21 26 40 -16 35 38 -5 -30 -28 76 3 6 -24 -3 26 12 -35 34 -26 -6 4 -35 -38 39 -2 4 41 -21 -11 -18 18 14 2 -18
2605 -18 23 -36 -12 -59 19 -26 -8 5 -54 -32 19 13 7 -16 -12 5 -5 -6 -41 51 9 -6 19 -40 -9 11 26 -43 4 28 -4 -31
2637 -31 -38 -30 -20 11 -8 -15 -76 -52 -15 -73 15 -19 12 -23 29 9 39 3 35 11 -38 -11 46 -13 0 -13 28 -18 47 27 -57 -25
2669b5mM4lj4O4n9LO8p2k9m9J00o8L3l6K3L2l8J0m4O6j7L0K0p1K2L4q3O4K3n6
2700c2L8N1o6j3K1j7L3l8J8RLK8mmj4K0J4m2l9M3lKL6m6l9L2k0M4k2o2J05m3j
2733hl2M2ll8j3L3mK8J5p0Q7k9j1J3l0L0%p9J16L2j20N8j3j2M0n3N9k1k8N9K0
2764F8n3J4n9J8ln9M7j2L5kn8J6M5k4L5m9N3o8L9K7NknJKk8L8k2k1OL8m0J3k4
2798b9O3o3N0l1kM6pK2o2M5j5J6q7P5m8Q9m3Rk1j1Qo5M4L5k5Krj3l2N1L1nj6m0
2832c8M5m9J04m0N3p9k5K7L9q3N8M1Jn1jj8M1k2M4J8o8Nm2R9q1jK3J7l7MKj2K9
2865CK7l1M1o7K0qJL9K0mp0M4J0n6R0n5j0mJ2M0r0P2m8qP2l9L3n8PRRJ4k4N4k8
2900A7m1l8L3M6l4K7L5n4pPN4l6m5Q3m2l4K4J8j9K5k1l5M7J2K0p2R2Qp1J8J0j0
$$ plain form
2669 -25 -29 15 12 -2 62 3 6 74 2 -27 -76 24 -44 -11 -47 -24 8 -30 -20 -64 2 -15 15 35 -36 -14 20 -63 1 24 -32
2700 -32 6 57 -9 -22 -1 -18 15 -23 -5 4 7 35 31 27 13 33 47 5 -34 9 6 8 44 -2 -41 -9 -29 15 -7 -69 36 -7 -8
2733 -8 -40 2 -1 -39 -52 -19 -23 5 20 -50 37 8 -3 10 -20 10 10 -69 47 79 -41 17 4 -8 32 -21 38 17 -11 48 68
2764 68 15 29 -30 -12 -15 -74 -27 -39 -4 -6 -64 -48 -3 -27 8 -41 12 -56 -17 10 15 13 8 9 11 -17 21 -1 -22 -16 22 -18 -5 -29
2798 -29 34 -29 21 -10 -12 34 27 49 -13 32 17 33 -54 21 -27 62 19 28 7 -4 4 -61 -17 18 -7 -5 -14 -27 -59 -8 23 18 2 -38
2832 -38 7 -42 62 22 75 -4 -29 -2 37 -46 12 53 54 3 2 -16 25 3 47 65 -3 2 -40 59 -22 -23 0 17 -20 -16 -14 -26 3
2865 3 30 -1 40 -27 -7 -15 -14 25 45 41 -29 15 25 -31 59 4 -6 -10 2 42 -48 24 -24 -32 40 1 34 -24 -17 -8 1 15 -9 45 17
2900 17 -24 -62 -29 17 -17 10 45 -9 -16 -9 45 9 -36 47 5 -29 -5 13 -6 19 -2 -37 10 22 42 -30 62 70 -1 17 27 17
2932A7j0Ql5M8k4n9O9m2N9o6N6%p6O5k1j4j2N1n8Q9j01J19n9k6K5K7J5n2P0k4
2962C9Mo1N6L8o6jn3lM3m0l4Q0L5k1k6R0o7k1Rj3M3pq8K2L5m1J18j08K0J4J4m9
2994c9Q5K0j29Q2J2qo4J2M3N1p2kj6L1pOK1l4M7n3k4Q7l8JK4n1J8k6Lk2N9m8j5
3027d6N4k6j3L4j9M8l7j8O4n5j9oN5k5j3q5J11mJ4MLn6M1Jkrj6Q3j02Q3m0k1O8
3060E1l9n3rK1O0j4om3M1rj5j0N0l7j6M5K3n2j7J1j6k0L1J3J3J2RL3k6m5J5L5
3092C6J4m1k7mM6r5L0K8jM7o6M3K8n3oN4m6K7m8M3L3k8M7l2k4jJ1m2N9j5l0K2
3124IJ7K9j2q2J0O6p1OlO4o1L9J9m3O3j5p7j9P9n1QOQJ3j6k7O4Kl2L4k9m8K1O6
3158C7q4MM5K9Nm4LK7n9P0k3j0M%J6l7P9m4j0M8o0qj5L6k0K1QM5n1k9N5o6K1O
$$ plain form
2932 17 7 15 -20 28 4 -55 14 -28 31 -35 21 21 -55 10 -11 -25 -37 14 -44 45 -56 63 4 -22 3 30 45 -7 63 39
2962 39 43 -18 38 76 10 9 -44 -47 -4 -44 -78 2 37 16 -10 80 13 -8 1 -12 31 24 -64 -42 -7 -48 70 -38 -18 -4 10 -39
2994 -39 46 66 -63 19 31 23 -41 -29 14 65 -7 -9 -25 6 -1 5 26 -8 39 -14 -38 49 11 12 36 -15 3 -23 -20 -42 17 -31 -46
3027 -46 8 -18 -31 3 -16 32 -5 -23 41 -14 -33 -39 16 -9 -22 -107 4 0 14 18 21 -35 6 7 5 -4 -20 63 -39 44 4 -17 51
3060 51 12 -41 -50 -29 31 17 11 -32 9 0 -15 -25 25 -12 -28 17 40 -12 -29 -18 -34 -54 -23 -10 3 15 24 57 31 -14 1 36
3092 36 50 9 -18 -22 24 -71 -41 -13 -14 33 -33 10 38 -15 -21 33 -13 14 -34 9 42 14 61 29 5 4 15 -27 32 17 -13 9
3124 9 26 55 43 -39 -29 37 -34 -28 -31 33 -28 11 30 -13 50 35 -42 -61 18 -33 -25 -19 -11 2 -14 -41 23 25 -7 27 -2 -50 -29 37
3158 37 -47 -43 2 31 36 -8 -5 22 -37 33 10 0 4 4 20 -17 62 18 8 56 -4 -12 -27 9 -11 10 18 63 12 -17 38 -28 -7 -1
3192al7NK2J9Nl3O5q8J7%K3L9m4N9r7J03p8M4%LJ0k3Po2L2L1J9j0L7q0K2m8L9
3225@Ql9L9j0k5L5J6n9M3l3MM6n9J6PJ0K5j2pLok9L6k3K7mk6N6r5%P6j4rm9O1
3260IKk1M9o3j8L7Pn0O1K5k2l3O3pq7N0Nj6j4N1l1n3L3O%N1l6J7k6mO5Mk8k8K5
3295B3l2k0L0J7l8N5k6m0N6K5r3N0MK5m5Oj4J5j5L3l3K0N3k7m9%J7N3r7mL7LK6
3328A5k5J2nj7pL4Mn4K6p0M0L6K0K0l7M3K0j1n4P3q0LK1k5j4L8j7m7J14r1O6j1
3360B0Rm4k7K8N1k7l2P0k2k7j9nJ6M9p8K6J4O0l3k6LK6n2k0P3l0l0R3n5K2m6K0
3392Gl7L7j8K5J9j9l3NL6l5J4l9NM2m1M5J0M7k3n9LK5l3PNM0n7kpLj1L4J1j5J0
3427AK1K0j6mk7N1o4R3j3o6%k2kjK3k0j9OQN3m2k8L7jK2n4M4rl2L9J6l6L7pj7
$$ plain form
3192 -1 -38 -33 -11 8 13 -20 45 -43 -26 -26 -3 36 -8 51 -46 57 -21 23 23 26 36 13 20 -42 -10 21 40 30 67 -13 9 -39 0
3225 0 8 -31 8 -2 -27 8 24 -35 8 -25 -21 25 -34 -18 -11 -1 24 12 5 8 2 -27 9 -14 13 9 -17 39 -56 -56 20 6 -3 -52 9
3260 9 11 -10 39 -24 -42 -5 2 -48 13 38 16 -17 46 39 -48 2 7 -9 -23 28 -3 -56 -23 -17 -17 34 -2 15 -11 -15 50 54 26 -2 23
3295 23 -9 -29 1 18 -20 35 9 -31 25 50 -43 7 11 36 -9 -3 -17 -2 -17 16 -17 3 56 29 -20 -20 -3 50 -47 -51 -14 -11 15
3328 15 -10 2 -3 -20 -27 7 11 -43 -17 -87 -47 -11 9 29 -8 35 55 44 -10 63 -17 -14 7 -18 -32 6 -11 -58 56 -35 31 20
3360 20 29 -15 -42 -14 37 10 -22 48 26 -1 -20 -25 -9 40 -38 -12 2 62 29 3 6 32 -20 -40 33 3 -27 66 11 33 -13 7
3392 7 -30 7 -11 14 33 14 -19 -14 22 -13 1 -38 -33 9 -32 13 23 70 47 -12 -9 16 -17 -10 -5 35 -22 -24 -31 -28 -39 -5 6 -9 1
3427 1 22 42 26 22 -5 46 -18 75 62 -4 -4 -26 -28 -29 -6 -26 -45 -39 -31 22 -20 -48 -11 -12 10 -44 0 -9 -41 -2 14 -22 15 8 -9
3462iN8J6l5k2j5N3or9P1Lj3K0m6N4KK2m8l2L0l3O0o1N5oj3pk5j9O5l1jN0n0L
3496ik5L2O8j6l1Rm5j9O4l8L2rl4PM9k0lj4m3J3Q8p1J7JqJ3J1k0l5Qj4K8k1K0
3530a5N2q6Q2l4j3kl8M3R0l3j15P8p3P7K9p1J7qJ6jJ8K0J1k4j3k1j8QM5m7O9k4
3562A9k6jj7O6m5J3m1M9M5r3L0j0Nj9L2j5j4M4k7%mL7n0J5k4N5l7P8K6o8j7L7
3594D3n4K5J0o2N8k7J4J8l5M2Mp8NJ04n6O8j04J4L2m2L4JJ8k6n8J01l7Qo4P4k5
3625En3L9Pl6K3J5l2K7M9p1j7M4%K2nj6JJ0P4j22N2j8PK2qNo0J7k9Q9j7l1k5M9
3659A7p5K6N8j4p6O0llkOL9L4o2LK9K4j05Q9n6P7j1o4M2q0M7n2O3rk3j1K8o1O7
3692BJ6kNl1lj1K0J4K1J0q4OK3K3l6J5NQj2L3j2l1K8K7n0%n0M3N8l0%K2l3k2L3
$$ plain form
3462 -9 49 65 30 8 -7 46 40 -59 12 15 2 22 -24 30 32 54 6 -26 4 -29 31 -30 25 19 6 -1 -26 -45 20 -11 -12 38 -12 -9
3496 -9 -34 -2 66 50 19 28 -17 -36 28 -10 22 13 -21 -14 35 15 12 -2 -45 -32 56 -15 2 3 -5 8 19 -1 -36 -28 -42 -14 -35 -15
3530 -15 37 -49 33 -1 -14 -16 -54 -11 79 46 -69 9 -64 13 42 -29 -12 -20 -4 -5 13 33 44 20 7 -14 -32 -24 21 -26 43 19
3562 19 -7 -8 -25 41 -4 9 -32 17 62 -31 -1 -11 -6 -25 7 -8 -22 22 -5 -5 -9 28 -22 -7 -31 24 -13 65 91 23 6 43
3594 43 -11 14 24 -38 20 -7 7 25 -10 32 36 -42 -37 67 11 79 -25 -11 21 -21 13 14 32 6 -52 49 12 20 -44 30 5
3625 5 -48 -9 -2 -38 -15 0 -32 -5 44 -27 -44 0 0 22 17 1 2 12 86 -36 16 -2 5 27 19 24 -36 -19 -48 41 24 -7 -32 17
3659 17 -58 -32 26 12 -64 -4 -7 -10 -12 -6 33 67 5 8 37 61 -44 45 -11 66 55 -9 33 -47 0 -52 11 2 -21 -32 -4 -65 2
3692 2 18 16 21 -10 -13 -24 -4 10 31 41 -43 -37 -14 9 -27 -12 -7 1 -11 22 10 -21 7 34 -16 -16 -66 -23 35 5 5 27 -6 -28 5
3727Ej9Q6j07K6J5j0j8J5J9m6J4J5N6n0Nj2l6J58j02J3k8m0Qk4M9K6o6P4jo4L5
3758dk0P1p3N4J5l9j8k6J05l1on7L7M2m4Jl3j1K%P2ok1n1J5P1kl1m7mK2MJ0mm
3793a1J5J1n2N1M8l5k1J7No5%Q6n5J3O0o4j4O3rm3K8k6j5J0M6k0j5J5jl0O4n2
3825Dk2NM2n8K9l0O5J2m1j4N5q3M1k6M3l3j6J8l2J11n2l7M0k0Jn9K6R1k4J0n5
3856iP5q8P4l8r6N4Q5o7M1rJ8K2j10K7K2NK5o3J7p6P9M6j07J11n3L2k5oK2Jj1
3887bJ1l2J9L4K6j3l3PJ9p4P3kp8J3N9o5P6j7NnJ3n8kNj6K3JK5k9M2n8Rl2Q1n4
3922b9j2Q5o0L3o8M8M1pno2oL5n9J11k0k5P5p9Pk2ln8Q1ll8O5o8O5On8mQ2m5l4
3956c1j2P2%l7j2RJ7m8Q8k6L8r3R4l8m0L0l8kL3L0m6pm8P3Kj3j0l3R7qk9rJ2K8
$$ plain form
3727 5 -14 72 -35 -9 6 -4 -22 -7 12 -34 -20 -5 51 1 6 -6 -42 116 14 27 -1 -41 -33 -57 -8 18 -48 26 25 -39 -4
3758 -4 -24 47 -26 28 43 4 -14 -40 65 34 28 -29 8 50 6 7 -26 -37 -35 -35 37 31 10 -41 -26 45 43 12 -35 -39 -17 -13 -3 -7 -11
3793 -11 4 15 -37 14 62 27 6 23 28 -37 -37 49 -6 7 67 3 -11 52 43 0 28 2 -13 -3 43 23 8 23 22 -8 56 4
3825 4 -18 -13 29 -29 0 -30 35 47 6 -8 47 -36 5 -21 22 -11 -27 -9 -41 70 18 -19 21 1 2 -57 -31 60 36 46 -9
3856 -9 66 -22 52 14 -82 -28 57 -10 31 22 40 62 -48 -21 1 6 31 -32 -15 -91 -12 34 -73 38 -15 17 -8 -14 8 9 -2
3887 -2 9 -23 -4 30 56 43 10 17 36 -38 35 33 -45 -32 27 -38 38 21 26 21 34 -24 -26 -21 -37 -14 -13 12 -17 25 -33 -24 -56 25 -29
3922 -29 -41 44 -16 17 -51 -3 38 31 26 -36 -42 -7 -66 45 25 0 75 -4 3 -19 -22 -80 1 -2 -40 25 -43 22 28 -30 -34 48 3 -31
3956 -31 -43 29 29 -8 -20 -11 6 -42 46 20 58 -35 59 21 -19 11 -27 -29 4 34 -12 -19 -67 6 8 -5 -15 -48 49 41 12 3 15 43
3990D3p2K3K5Pp2k3N0MRj1J6p3K7N2p1n1J28k2o5lN0N8n8K4n0L9rqN2pj3j2N6
4023D3m1m7J07km7L3q7Q1k0q9J29p7M3j7k7L0o5L5PK1r2N9L0nl4L2ML5mk3nkm9
4056d4N6k6RPJ3Rmn8P2r7O2pl1L9knJ2jl2Q1r4K7M6J6j7m5jJ1m7L6k4L8lJ8J9
4091C3m3l1j4N5qJ4%M0l9oNk0Q6j35L9O6m5J6kNj7pOpk2pK4p3P3oO2o0O0Pr7O2
4127A4lOn7j0K1J6ML2p7O0m7K0K1K9RJ1o2%N8o8Kj9M9KJn5K6RM4l4K0K9qr0J8
4162b9K5l5O7k2k3k0L0j1J9k1M2q3J0M8K1nnJ1o2K3K6kl6K7RPj5L8n0M5K7j17
4194f1K6L4N4o2K7k2L1q8R8j5J6k7m4N9Pn2k4L0J3RJ7Kj2J3MoJ6n1k1J6K3PJ3
4227C0ql2K4JQm1K7k3N4j6Ql4L6rk4O7m6p8Q6l2k3Q7p8mJ6kj4k1K6RK8Mj8J8o0
$$ plain form
3990 43 -29 -6 19 26 -46 -69 -19 -15 -6 -17 -1 -74 -47 5 -66 -117 11 -11 -76 -79 -29 29 -29 -5 -55 -16 -25 -33 19 12 -1 -13 43
4023 43 2 -45 62 60 13 46 -41 40 20 -69 60 -17 26 9 -18 12 -53 -18 -11 10 -82 -23 7 2 -32 0 4 39 35 12 7 5 -44
4056 -44 12 -14 -5 2 15 24 20 -38 34 -63 -1 -8 -39 0 -2 -7 5 4 -28 53 -41 -14 32 48 31 -14 -15 -4 -51 -15 -39 -1 -4 14 33
4091 33 -10 -41 -55 0 -8 6 6 46 7 1 6 -14 72 -63 -24 42 -3 13 11 16 -1 -8 -2 -9 -31 -38 -14 -87 -14 -20 42 -18 42 49 -48 14
4127 14 11 17 -40 -50 -29 -13 -9 23 -54 6 -41 -21 0 29 38 49 -13 -13 45 -23 -21 -40 9 11 12 -43 -17 -8 36 2 22 51 43 -47 -29
4162 -29 -4 -39 28 6 -17 -37 -7 -18 1 -20 22 -61 -51 -3 18 13 8 19 -43 -20 6 4 -32 -5 4 11 -4 34 -16 29 56 -61
4194 -61 -35 -1 53 -9 18 -4 27 -61 37 22 38 11 -33 26 33 -19 -43 -13 0 9 26 28 16 29 33 27 43 -8 -29 -13 10 17 30
4227 30 22 -10 14 15 23 -18 9 -14 40 24 32 -2 34 25 1 68 22 -56 30 -2 -25 62 -16 -20 -4 -6 -20 -41 -15 -6 22 26 8 26 -34
4262c4O1l8rj1M7Nn7J8N3j8J1KJ8n4J8n1NM8k7j5NN7l6j5L3k5L7p1N0l4KJ1N1
4295C7m7Ok2lN1L3m0m2NL7OL4o7N5l3rmj7K8Kj1J7K5p1Q2q3K3K3Qj19J36o0O7
4328D7l3j8MmpM3p1O0L%K2m5K3j0k6M4j8o3N1k3L2K3jmJ4l6NJ4j2j4l3L4pj9n
4363c0nJ1L8j2j3N2m4k0N0MPj1l0j5RLm0k1pR7l8N6m2q9P5m9K4R1Or4K4N9m7j2
4397a3N9p5N5k1k8K0%j7rRK0Nk3K5J9j1j6Qj5LJ6jJ3L2m1k7j0LJ3PK9k9J6KPk8
4433cJ8l0kJ6J4l0O0j9rL9k7nK8qn0RRL3m9j8L7n8K3J3n4MJ01k3n2K8m7mM1oR5
4468G4p6J0j8OL8n%j1k2k1N0k6M7k1j1l6N8k3M6p0L1k7l3M9n9P7j4n2M8ln9M0
4500a3OL2m3K5K9m3k6J1O3k5oNOk8K7m1J0k8k4R2NJ2p1M2L4q1N1k1%l7K5k9O0
$$ plain form
4262 -34 27 -11 -20 -31 16 21 -36 -18 35 17 28 30 48 -6 12 -39 -34 14 -13 -28 -23 34 -2 -17 16 -9 28 -43 7 -27 -25 -14 37
4295 37 -10 -4 -26 -29 22 55 15 -27 -22 15 21 55 -12 43 10 1 -3 -20 8 10 -1 16 41 -30 52 -31 -8 15 23 -96 40 -20 47
4328 47 14 -4 0 -4 -11 32 -39 21 24 24 46 1 24 14 -12 32 14 -49 2 -21 11 34 33 29 43 7 12 26 14 0 -33 1 -6 -25 -30
4363 -30 -35 -24 14 2 -11 41 -3 -23 27 31 38 27 -3 -18 -9 -6 -46 -67 -74 23 -15 41 -1 -90 -15 -64 -40 51 57 -37 -13 46 -1 -13
4397 -13 46 -29 26 5 -23 -3 -3 -20 -29 -20 0 5 -18 7 26 15 -1 7 -8 -5 11 10 23 55 14 -13 -23 -20 -7 0 29 0 16 18 25 -3
4433 -3 15 -15 -17 -1 13 -17 43 24 15 54 27 22 50 42 -8 1 10 43 -6 -24 13 -45 -22 -9 -63 -59 42 19 -33 -5 -52 -56 -15 -21 74
4468 74 -2 8 -10 -4 34 29 29 18 -4 -25 25 -1 46 25 14 -22 36 13 59 -11 20 -7 -40 9 -50 27 13 -39 9 6 -53 -13
4500 -13 -7 25 -18 7 36 -7 -33 -22 41 16 10 15 21 -7 20 -21 -11 -39 -63 29 34 46 -25 17 51 -30 21 0 0 -37 -12 -41 19
4533A9n6L9QKN3r8K0M1Nk6J4k3J7J7k6j9L2n1N5k0QJ0o5QP3l5lL3k7L7jp7K1M6
4567C1l0J3o2O9o1P5l1K5m0jR1p5L3n7Mk7N4m1j2j5L1N4mj0j2m6k0K8K9l6M9m2
4599c6Q9n8Pj6M1n1L8m5OJ39j34L9n7L4Ol3J8mQJ7J9%j14P9k7N6l3k0J8L0m5k
4631c1J2j2M6j9k1M3Nm8K0L4j8j7k3J1M0J6Pn9j1J8L5pj0j5J6N4q5K7k2nK0rM1
4664C3n4K1oo0L3pQ2n1K6n7K9M6p2K8J0jn7P3m0L2kk4M7m5N3l7K0pl0L3nqJ2l1
4698a6m7P5j5j6O3k9j0Qk5JRK0k0K3o6OO7o0J6j3P7q9M1Ml6N4p3N0L7k0J1Jk3
4731EN2j4k6n3O0j6pj5J2j4kPL6n1K4k6K3J8m9K8K9jo2J4RM1J7l5q0R8k9j2L5
4764A6rn7L0N4m7k9PN6l9M4l7K3l6J1O5ln0P1o4J2l2K1ok2m%M5p1jK6k0K4mK6
$$ plain form
4533 19 -37 2 10 12 65 -33 -13 28 33 7 21 -2 15 32 6 -13 19 -32 23 3 11 21 -44 -36 37 2 -1 32 5 42 41 -36 -15 31
4567 31 1 14 -48 21 -40 35 4 29 -11 -12 79 4 37 -20 -16 -43 11 -30 -42 -57 -26 28 24 14 2 -44 -64 -36 -7 -43 6 -36
4599 -36 53 -5 2 -14 27 -24 14 -31 -25 114 -20 19 -38 -4 2 -31 -13 -17 -9 8 27 27 -87 -8 -35 21 -12 -32 -14 16 -29 -31
4631 -31 -19 -31 15 -4 -25 18 23 -25 -5 29 11 -6 -29 -18 22 38 45 -14 -25 -7 28 21 11 -4 12 66 -19 8 -14 -19 1 -8 33
4664 33 -21 0 -6 -66 -33 -40 42 -9 17 -40 -11 35 -37 -9 1 0 -57 16 -24 8 6 -18 29 -16 37 0 20 13 -17 16 11 3 15 -16
4698 -16 -63 12 -3 -19 44 15 5 13 -12 -11 -2 18 -2 21 -45 -39 28 -32 -16 -29 48 -41 0 4 -32 22 -51 -1 36 16 27 28 5
4731 5 57 43 17 -36 24 8 1 -14 -2 -16 -18 -11 25 -26 -2 -28 -5 13 -36 -8 21 20 -42 -28 -19 22 39 4 -76 22 -7 -19 16
4764 16 7 -50 -20 34 -13 -42 -35 21 -18 26 -11 12 -24 -13 52 49 -1 70 6 18 -14 7 1 -21 -25 -25 20 -51 -52 -26 -46 -22 -26 0
4798@K4Ml0oj7k4K3nM1k5RlP3j12N9l5J27q8k1K3L4j3k2j7j6M5j9J0J7j0j9K8
4830C5m8L3j8j6J4k4k3LJ20n8m5K6rQl3M8O3j05n4R6K4K2p4L1n3jJ17n0J4r5Q4
4861C2o5J0Lm9P9K5k6o5N3K7o2L1L9l1j2rJ8q9L7M1pK7k0j1j0jM0k3j5lJ2J9p
4894a2Kn9P6RJ0l4N9K6o7J1p0R6j8o7L8j7M7l5J9k4j6J1Q4j12M2L2l3m0n8J17
4924A7l8rPmNJ2j9M1K6m3l%N0m3m9J4kL3%k3rJ9M1l0%L3k5M0k7J8n1Q7o9m5O6
4959B0j3J7k2l1l0M2J0j6K4l5N7m8O0l4NL9m4k8P2o5l7K3RN0m4jM7pk1j2M0k1
4991FJ1L9p0k2L1k4O8On5K0o1J1N6m2jj6P5J2o9N4l3J6j0J7l2kK9k7M9jk9N2l8
5024B0Pl4L4p6M5N8j6M2r8K3j4L3l7Q5j31Q8k6K8rpm5nN1Oj8k8k2Q4l0n5N8k7
$$ plain form
4798 0 24 28 -2 -8 -25 -49 -26 -31 10 -15 -6 -9 64 -48 11 -24 103 15 -6 17 51 38 16 -1 -17 28 9 19 36 26 7 35
4830 35 -13 20 2 -14 0 -24 -47 -44 76 18 -27 -1 -10 -2 -35 13 76 -29 -83 13 37 59 -15 16 -37 -38 79 29 43 -52 32
4861 32 -33 -23 -20 -69 10 35 9 -56 -3 24 -38 -7 32 1 -11 -20 -2 -91 -54 -13 -20 7 -13 -24 -34 -35 5 -18 -33 -36 -24 -5 -12
4894 -12 -10 -69 7 16 26 -8 51 77 10 21 -49 47 29 -38 0 -17 30 -5 14 -10 -26 -15 69 -43 -1 31 -2 -42 -100 17
4924 17 -21 -30 -23 -27 -22 -10 -29 12 38 -5 -8 -8 42 -1 -50 -36 -38 -5 -5 -28 -37 -18 23 -7 -7 26 1 41 14 32 -19 68 -1 -46 20
4959 20 7 24 2 -29 -59 -17 -7 -23 1 -34 23 -25 35 1 6 45 1 -27 45 -20 -57 -34 -25 25 -19 -20 27 20 -1 -13 27 6
4991 6 17 56 -14 -36 -5 -29 39 45 -10 10 -51 -40 16 -26 -27 -43 32 44 -25 29 -4 12 2 19 -13 -15 14 -13 36 35 6 58 20
5024 20 27 -7 27 -49 -4 54 38 80 -18 5 -9 24 -13 72 -59 29 3 31 22 15 -30 -35 16 22 4 -24 -46 38 8 -47 11 -16
5056a6M9J7r7O6JJ7m5j5N2k9K3k9nK5j6L6pQm2j6M7Kk4l4L7j5k6O1j9J0k5k3M2
5089A0o4O4Nk8k4L3L1n9OO5J4l4Pp2O5Mom0M1j0J1m8N6NJ7l6j5L8Nj9j2J0kl0
5123a2RL7l7O2l9J3m6oK0Kk1jm0P5p4M7jj2M9J3m0rO0l4J2j4J5n4L3J1NL4k3m5
5157a1KJ7jk9k1J4k4Q8m7k1K6Nj2L8pK5p8L3j5k9J06o5K5k6lKl6N6k5k9O3J3k0
5190A4l8M8l0K7j3k1J5K0l4nl5R5l7l8M4j3l0J0L3k6KPrJ8l0L8Oqj9N4j3r9K1
5223d6K6L2k9N4n1QqJ3L9N7j42R4m4mk6K9Q2n7J0j1MJ5m4K1p8Q6q4Q3n0K7o1L8
5255a7N4l8J8K5l4Lj2j3j7j2J8L8pn4M7n9P3j4P8r8O2ol4K1K7j5J2n9J8L4j6R
5287C2L5m8n0nM4p0R0m2J4q2O9L2Ko4J9j0Q6o7Pj4mrnP8l8J9qK6K9q5Q6l9qK8
$$ plain form
5056 -16 33 50 -47 19 20 37 -8 -23 29 0 23 -6 -11 14 -2 34 27 35 -7 -23 24 26 2 -32 5 -10 -36 25 6 16 -9 -32 10
5089 10 -54 10 15 -13 -37 -4 27 -32 -26 39 53 19 26 -46 19 23 17 -23 18 8 19 -29 27 32 49 13 -2 36 41 22 10 20 18 -12
5123 -12 -3 34 -3 59 20 33 -13 -19 1 3 -18 -19 -59 16 -58 -11 -12 -24 25 38 -2 -11 49 15 27 13 28 -26 7 18 23 57 34 -11
5157 -11 -9 8 7 -22 -43 -29 -53 35 -12 -33 -7 -2 -14 24 17 42 -36 -3 -18 -47 59 -6 19 -7 -10 -8 -44 12 -13 -42 21 34 14
5190 14 -24 24 -6 21 8 -13 2 22 -12 -17 -52 43 6 -32 12 -1 -31 -21 12 -14 -12 -5 -14 4 -26 12 18 10 -9 45 32 -67 -46
5223 -46 -20 12 -17 37 -14 -6 -14 -1 38 95 -47 47 3 -1 -27 2 84 27 37 26 30 45 1 22 -56 30 -54 29 -21 6 -55 -17
5255 -17 37 -1 17 42 8 11 -1 -14 -31 -43 -25 13 6 -48 -1 -60 13 -1 77 -21 41 35 1 22 49 34 46 -13 5 39 23 32
5287 32 67 19 -31 -36 8 -62 28 -14 0 -82 -13 19 21 -43 -24 -34 52 -15 -8 -22 -26 -35 -40 38 0 19 11 37 66 -19 67 28 20 48
5321D8jm7j6N9k0l1K4M0q7M8l3O2n0M4Pj8k5PPl1K4l6J7j4oK2j2j7L2j7k5L2k0
5354c3k1M9j7L2k7Kj0L4K1Ojo8j4Q0k4l5O1Oj8m3Qk8O8k9k9N9o4O6rn3J6rL0k8
5388b2Nk8P8o0m6P1%Jj6%L5k8lN8k3prrJ8L7o1QM4kl6RN2q3M6j4o1K6J01j71R3
5423Cp1R0Qq8Q5j08Q5oj9KmkrJ9j7N5n4K0m4P2j3%kL4r3M5L4J9j3m0J5M4j1l4
5457BoJ7Lm0L2n4kj0P4QJ3j9p1K8lk1N3qN4p1l4Q7k0O4n1%M0r7P9o2N0J7o9PJ4
5492DL4l2l4M9M6p6J5K7k2J0n2Q1ol3J5l6K3k4J7p1M6n3M0PJ2J0Ml6J2j8R4l8
5524A5p5Q9j1K8j01KK6J2rM4J6Nk2j4K3m8J3K9m8K7L6o0Q1m8j0M9l4j2L4n9m2
5555f4Q6kp0N1l1P0%l9K3qn9M8pM0J6o2M6l7M1l0jk3M2k5j0l6Q9lj9J0mj0o2N1
$$ plain form
5321 48 47 0 -16 43 23 -8 16 56 -31 17 -16 46 -4 40 47 29 4 11 18 -13 11 -25 -8 -22 -28 -6 -18 -35 -3 -20 -45 -13 -33
5354 -33 -54 -5 -22 10 -17 -15 -25 9 30 36 35 -33 -47 33 9 -26 35 41 23 -20 -12 -40 28 -1 -30 29 -35 31 22 -31 -15 -24 6 -22
5388 -22 -17 -45 33 -27 -73 -2 -2 -1 -17 -17 18 -10 -13 45 22 15 6 -3 15 52 -9 -1 43 41 5 14 66 -17 29 15 -46 -20 81 -90 3
5423 3 -68 22 30 -58 27 -81 4 -2 -21 -19 -23 -25 -34 -15 -32 23 -31 -11 -55 17 4 4 2 36 -57 -12 22 41 28 -12 3 47 36 2
5457 2 -4 13 16 -24 8 -46 -48 -58 16 24 37 18 -53 -25 -28 -49 4 -4 50 -21 -55 32 12 76 25 25 65 -32 47 -15 35 52 -17 -10 4
5492 4 38 6 -28 21 67 -9 6 33 11 21 -31 50 44 11 26 -10 13 -11 6 -65 -19 -72 -32 -25 -13 -3 1 -35 -23 -41 53 15
5524 15 -60 29 18 46 -55 -53 -27 -15 -24 20 36 41 19 5 28 -20 -7 22 -26 1 37 -23 58 10 0 49 15 3 37 -22 -64
5555 -64 22 20 -50 1 -30 40 40 1 24 16 -43 5 -2 38 54 -8 38 1 42 12 11 -12 30 5 -5 -41 48 45 26 36 32 22 -40 11
5589A1jj5M9l1J1p5QO4j2j0m7J2L7jj0K0n1M8k9PK9M0o1j2j1K8K8J3k0l0j8nL9
5622EM0m1NJ02p7o5R3p6qM7j0l4rj0j0L8q6M7O4j5k5k3N3m8N2lJ7n2O2J5r1L4
5654iK9n0J2Q5j9o0K8p0J10k3J5p4K7M9m1L5nJ2pk3l5K4jl0J7J8%j4j6Rj1Rj4
5687b3K6mK0n5Q2o5Noj2J1K6MK3j9Oj1k3N2j1j7KM0j02L2m1L9NN9q0M0j8M2J7
5720D4q6J8j1MO1l4L0j8j4l4J5L5k6K5qj0N7m0J5k4oKj9LJ4L1M3j05K6n6P1Nj6
5753hN6n0ol4N5m8N1qL4o1J0J0J5Npm0Q6j08M3qOm5R3m8M7n8kL6m9oN5j6mj3L4
5788A7Q3j13K7J4Qj2K8p8M0j1jRj9K0k9KL4m5RK1l7j5K4j5o5J23l1oJ6J1k4qL6
5821A3K5n4k0N9n6M0K7q%l9J2j8L4K3m2kO0n9L6rJ9o0NL8J7q5O0QRp5Q2n2K5P
$$ plain form
5589 11 10 -5 44 13 24 -51 -43 21 9 -1 -48 -36 1 0 -10 10 -41 7 -22 -15 14 54 -7 -19 -30 -2 26 39 19 -11 -29 -34 5
5622 5 45 4 9 111 34 -31 62 -14 -22 25 15 -19 -28 -38 -48 -10 -96 -49 15 0 -25 -48 5 -43 9 6 23 -29 33 48 -43 -9
5654 -9 20 -30 -18 67 48 -12 16 -54 56 33 48 -26 1 50 9 44 39 51 44 21 -14 10 9 -21 -4 14 14 0 -16 -7 -18 -9 -23
5687 -23 3 -1 19 -36 46 -19 -14 -20 -32 -21 5 9 32 13 19 8 -15 37 26 9 11 51 -51 -19 -60 -21 -16 43 -37 3 -15 27 44
5720 44 -42 -24 -35 -31 30 -4 26 8 -6 -40 -25 10 -16 9 1 -9 48 8 23 -1 -7 -5 -24 -21 -7 24 67 -38 -12 -68 3 8 -8
5753 -8 48 -2 -8 -42 13 -35 16 8 42 -19 -9 1 16 21 14 -26 60 -48 -5 -13 -7 -52 41 -7 40 -18 -20 16 -33 -39 16 0 -4 -17 17
5788 17 100 -13 14 28 36 24 52 -26 14 3 2 11 -8 12 -17 -15 19 -26 -17 4 -33 -48 -24 -39 -104 19 -12 -18 -2 9 -15 -23 13
5821 13 38 -16 -36 23 -33 7 34 26 26 -13 -1 -19 15 38 -4 -6 54 -5 31 22 41 -19 -14 24 41 -44 16 24 33 -42 40 -12 13 20
5855B0nJ7o1N5m6O8p0pN3n0L3m5Qj0M0j7L8kk4M9l5Ql7M7j6K6o8L6Rn2Q5o4J9
5888BO3r8Q0m7oM3n9JM6j5l5L8kk1mJ5j1J6M3m6Kn6L9mk1N0k5l0Q5k0K6n8N2l7
5922FL0q9R8K7p3RJ7nok9M6p9J3O3QRk3j6o4L2nj5K2qP8l8k8J8n7Q4K1j2o7ML0
5957AM7r6P2kl2k5L3K4K5n3J1N4q2m3P4n4L5Rk8k7Q8l5l5K2N1o3K6K5J9l3j7M3
5989C4l6K8r6M5K1KK3l9J5K6k0%k4oM5Pn3RK8J9L9j06M9j9J3np1Q6l1Ql7M0N3
6022D7or1Q7n8J5j8M3Nj8J2pRj4k9k9L1K4K5Jl1M8k4J3M2q8P2j4o0M3qn0Q2k1
6055C3K2l8m1M0L1nj08Q8J6m8k7k7R6j8j7L9q5Q0Ml5K1L3qJ0j8k4L4n0pN8rj0
6087C0L9l9j00oR5n0O3n4N1o4R1r3L2M7m7M2p2K8K5M4o1l1kjM2NJ9o2M1l3o7N5
$$ plain form
5855 20 15 32 -29 26 -20 48 -22 -29 24 -26 7 -38 -30 -40 0 -17 21 19 -5 44 9 17 -20 27 11 37 -31 5 14 -38 47 -17 2
5888 2 65 -33 47 0 -6 37 -22 -21 25 10 -25 13 11 -10 -14 1 -10 6 49 3 5 -51 -12 -16 -37 13 -12 -42 43 23 49 -9 43 6
5922 6 36 -53 45 72 -1 8 25 20 14 -15 31 -48 -35 28 36 45 22 6 -58 -26 -31 -46 -24 -32 46 8 -20 -2 -59 25 46 34 -33 -29 1
5957 1 48 -48 24 22 -10 -35 -2 22 47 -6 5 59 -23 -66 8 -46 -11 -2 -30 -57 31 -4 -39 -17 34 -29 -3 22 41 8 -9 34
5989 34 -2 26 -70 -25 -4 -2 21 -18 -3 23 3 3 -21 -27 18 25 -28 -19 9 28 67 -39 10 -9 4 -1 -72 14 -17 -9 -46 -6 47
6022 47 41 -50 37 -21 -6 -24 19 24 6 18 11 20 6 -23 -52 -21 3 28 29 -2 46 22 35 77 -11 61 47 -13 30 22 -28 54 33
6055 33 55 17 -24 16 47 42 -66 22 38 -10 -37 -64 32 14 -3 36 -49 31 35 0 21 54 46 56 38 14 48 -2 -9 49 40 30
6087 30 69 30 -70 -76 19 -31 32 -22 29 -35 56 -37 -5 42 -5 37 -35 -7 18 62 1 -30 -32 -33 9 14 33 -29 12 -21 -88 -33
6119c3k6P5l7J2K9k8J5Qn6N6L1k8o2J05j2k9K5k9L9j0k2l4J5k8k4Q4j5l4n0R1
6149B8o4K0L2k8K8m7K8MK0p4O8l8L9j4jO8j7on9M6j0M1l4ml0K8m0M3j7m0R1p0
6181iRj8K8l2m7L4jO1m2KM4m8O3n5j6J1Rj5Kj3N2j9o%j3L9m1Rq0J17k0m0P7ll6
6216CK5J2k0QJ9p4M8oK9l8L6m1J5l7j9N9m1J1Mn5J27q4k1K5RL0l4L8l3K4j5J7
6248B1l5qR9j11R8r3J4oL8J9nk3k7ML1K1o1K0j2K1n5P6j5Kj2k0O0p1O0l8j8lK9
6281@j5N4m5k2Q3q5K5nN3n8lK9m0J9kK6L7J3j04M5p4J06j5Ll9L3j2R3r0O8j01
6312b3K1%Mk3M9m4N6k7l4OqNK1j3Nj7j8O0M3j05O6lj8K7l8M6m0j3M2n1J6J8J6
6345B6k9L7J0q3j0J4l6J04j1l4L5m8RJ9j4K6l1onO1k9k7rP7rm6KN3j3j7r%K4k5
$$ plain form
6119 -33 -59 16 -21 -9 20 -8 7 15 -41 15 46 18 -44 61 49 20 45 16 55 45 23 -11 4 -24 -48 36 21 -13 -63 28
6149 28 -36 -16 16 -12 16 -31 -3 1 21 -53 15 -23 16 2 1 69 52 46 -13 33 23 64 30 26 -4 24 -16 27 10 -30 61 -9
6181 -9 0 -18 10 -22 -69 -35 -36 25 -17 -15 29 -19 44 -11 -27 -16 -7 -22 -20 -33 19 0 -6 -6 -19 20 -21 -12 -92 25 5 -35 42 39 3
6216 3 28 40 20 28 47 -27 21 15 44 6 42 1 16 -21 -40 19 -22 -11 -7 -62 65 -19 -40 -15 -6 24 -10 28 -5 19 4 21
6248 21 -14 -22 77 -34 64 -29 -15 -21 17 36 31 8 -19 -15 16 37 -24 -4 -16 5 -50 26 11 13 1 -19 41 -30 30 -8 -26 -29 0
6281 0 -15 39 -6 -28 55 -30 -5 -10 43 -15 -18 11 -29 -10 -12 14 51 64 -40 5 -69 37 22 25 -14 19 7 100 10 78 -23
6312 -23 -2 -2 2 -21 28 -16 40 13 -21 -15 -23 -18 3 -10 -5 -22 -40 20 63 -42 24 21 3 30 -8 38 -2 -15 27 -24 -8 10 26
6345 26 -3 34 44 -39 -49 -35 -71 33 22 -12 23 -25 -16 3 -11 15 -16 -22 -27 34 5 -22 -31 46 37 -9 -7 46 33 16 7 7 31 6
6379Fp1O3K3K9j13R5k6j9o1L6L7L4m6N8q8K0L4mk5N1n2k2O8K2m6J0k1l1L7M0m2
6410dk1J8J0k5j9J9J2J7J6RM0k0j0K2r8O6l5Pj6O4m8Ll0k2P0O5j08l7M2ll6M8
6442dK3jl6M1l0j7N4l5n3J09k4m6%%j0RJ8KO3r2J01j8rm4O8o2mj8O3mj5L7q7K7
6476FlK2o4K7ooQ0l3l3K3rP4m4Qk9J5n2M0L7j8m9J5J2l0L9K5k9lj6L9kj8qk6O6
6511E0J5l1Omk8o5N5n2L1M9j8k9N0l4l0K0m7L2J2l5N4J9L6m0j6N8m1j0k6M8ll4
6543hKQj0k4k4O9k3K6K5m7lJ6J3p9P6j4j3N2m8M4pq0Q6j2J6r1O6k5k1N2k8L3l9
6576a2j1K1Ko7Q7J4o3M6%J3J0K0qo6J1NN6n8M1j6k9K3j1m9K3j7M5Mj8m8J9M5K9
6609D1l9m5M7k5l2K8NK0K4l2j4qM5l0rk2J6MQ7l4n9Q1mm6j5L8p%L4n0M9m5K0j6
$$ plain form
6379 6 -65 -2 21 50 -63 32 6 -13 -74 -38 -1 33 -13 45 -43 -23 11 7 -18 33 -19 -41 27 49 3 13 -8 -39 -2 38 -4
6410 -4 -25 -7 3 -22 -41 -22 -10 7 23 32 72 52 42 64 -34 32 -3 4 -12 52 4 7 -23 -45 25 90 -18 -55 -13 -16 -52 -4
6442 -4 19 18 -18 23 -7 -24 30 -5 -58 51 27 -19 -19 -19 -29 -20 -2 0 63 -29 72 54 45 1 69 7 3 -15 48 44 29 66 -21 6
6476 6 3 25 -39 -12 -18 -24 56 23 -10 13 4 78 34 42 13 28 -24 16 53 35 -14 1 13 -17 22 47 18 15 -1 38 36 18 10 -16 50
6511 50 65 34 40 36 8 -57 -2 -54 -23 26 8 -21 29 -5 -35 -15 -62 -30 -18 -53 1 20 56 16 0 58 17 7 -19 29 26 -8
6543 -8 -6 2 -8 -32 -56 13 -10 16 41 -6 -9 7 20 -59 17 3 -10 42 -6 38 31 -49 37 25 41 -50 16 -9 -30 22 -6 27 -12
6576 -12 -23 -2 0 -67 20 34 -29 17 17 30 40 60 52 -14 -3 2 58 0 41 25 -4 19 8 -41 -18 -35 10 14 -4 -52 -33 12 41
6609 41 2 -43 4 -21 -53 -25 -20 0 24 -8 -22 -30 15 -15 -24 -46 -30 -26 61 27 -32 49 45 -1 -16 22 15 15 49 -1 48 3 23 7
6643GpJ6%l8K9m8j4R5o0L1l5L5p6l5J36pm3J1O1n5N7p7M2m8K6j2K4%J3l1l7K0
6675b0K1J6J6j6m7J04j15j3J7K7%N0m6K0J4r8M2L8l9L8K6km9j0nM6J8mJ2p9j9
6706e7Q3k3J0k8l7O5o1Q9om8j4R3o3QpK3j4%rQ%q1M1K9m3J5M1rn7N2J0j8M5m0
6740cj5Rl5P9o5L7j8qlm7N7J9q9J04m2O3o5K5P9pr5OLOL7J6p7L9M2o6Kk7OO1m
6775B4o6J2j0N8k3%k0M7oj9l7NK5j6LJ0J4l5O3o9J1L7K1m2O6nn9Ql9N5n5L3J7
6808Hj9L8p7L8l8M0j7J3l6P0Nj0l9JR4j11M8J5m0J03q0o0N3J6j6J7j5n5J12Lm6
6839A5j2ploJ0K2Kl3k2N9j2j9N4o3L6kJ3J5j8m1k9M7loL9o3N6k1mj7K7k1MJ0j9
6874a2j1N6m4K5n2J6m7M1L2qK7k9J6OM7k2n0k6P6n5MJ0j1K2l7M5l3M5N6l7r4N5
$$ plain form
6643 7 0 16 16 -22 7 -41 -55 40 -20 11 -24 11 -65 -100 36 29 -14 -3 58 3 60 -17 25 -23 3 -9 15 15 28 -3 -40 -20
6675 -20 1 17 33 17 -30 74 -41 -54 -37 -10 -10 40 -6 14 28 -70 -28 10 -29 9 35 33 -16 -26 -31 15 33 29 41 -38 -57
6706 -57 26 3 13 -15 -52 13 -48 41 35 -13 -27 66 3 11 4 27 13 13 4 12 12 -69 -28 1 -42 -27 14 5 -52 0 10 -8 37 -3
6740 -3 -18 -9 -44 35 -30 7 -11 -19 -22 -69 -12 7 -82 22 -20 43 -22 3 82 75 -20 -14 -11 -5 32 48 -29 10 52 -14 -12 -39 -33 28 24
6775 24 -42 -30 -40 18 -5 -5 -25 22 16 -3 -40 -35 -10 -26 -23 -13 1 -34 29 -40 -29 8 29 -13 53 48 -11 -3 -42 13 -42 -9 8
6808 8 -11 27 -50 -12 -50 -10 -27 -14 -50 20 25 15 -24 -23 71 -40 8 23 -17 86 6 -54 -1 15 -1 16 1 -54 58 61 15
6839 15 3 -4 -7 -13 -3 19 21 -12 -34 25 13 -6 48 -15 21 19 32 47 29 -12 -41 6 3 -3 36 -27 29 8 4 -13 14 -7 -3 7 -12
6874 -12 -23 33 -11 14 -38 -22 -69 -28 4 -4 23 -6 10 16 63 41 -9 -35 41 -14 -10 0 -11 11 -26 19 -14 31 87 50 -44 11
6906A1LlJjqk4OJ4K5n2J1K0J2J0O2q8K7J3j1j8J6p7N8O3n1K8l9l9K7L6qk7J6l5
6940b2M6J6l0o0QQ2o3j4K6P5m7O4j24L9%K8j4kn7N7j0m8Q2n7J8LQNN9l1%K1o6
6973hK2mm3k3L6R9k4p9K8p0P6n8L6lj0N7p5J03o7oK0K7Qn5rO3m7j1N6m6J2l3K2
7006fRoq%KNJ9p8J9N0L2n2k3M8L7k3pJ6j4l3N1k6l3lm5O9j4pL4m9J6M3qk5j2L1
7042Ir0M8K8L7l5Nk7K6k6O4k2k0P1o7qj5J8J9lj5k5M4J0k0Nm1j5k6Q4j7L4q0%
7075e0M0J7O9r7J0%k1O2m7j0K7k6M8J1No2O5l3%j3L8l8K1m4P2j2l7p6M1J3N1R
7107C3l0kl7RK2j4K7lK7L0m5Nl1j7J4j6K8L5j6l6K4NN3p9K5JkL0n1M9o1k4M7L8
7141C8o3O3j02Q5pk2k7N7L5n1k4Jm1P7L0m9L6Rk6Rn6MN2o8K7N6m6onl5K6J6%N1
$$ plain form
6906 11 14 11 12 11 3 -21 -15 -1 24 -28 -17 3 15 25 87 -1 26 39 28 10 26 -51 7 70 19 47 8 -31 -4 32 24 -3 13 -22
6940 -22 24 40 10 -50 -42 40 -23 -37 -11 64 17 81 -43 -4 -4 24 10 8 -49 8 -2 -50 32 -25 -7 -4 4 9 68 37 37 58 -8
6973 -8 14 10 -33 -56 -20 79 55 -24 4 -66 10 -48 -12 -15 -25 32 -43 60 -7 -13 7 34 42 -13 -22 41 -6 -17 39 -7 5 -28 -6
7006 -6 3 -3 -11 -11 -9 -4 15 -63 -44 6 38 -14 -37 11 48 25 18 34 20 -13 38 12 -21 -24 -69 0 -14 -21 13 -36 -20 23 15 -10 -22 9
7042 9 -81 -33 -5 32 -3 2 -25 1 -25 39 17 -3 68 1 -7 -22 -4 15 12 -3 -28 16 26 6 11 -30 -45 -71 13 -4 30 -50 -50
7075 -50 -10 7 76 -21 -11 -11 -32 30 -17 -27 0 -26 22 33 38 -24 41 8 8 -5 33 -5 16 -28 44 32 -5 -81 -40 -27 24 33
7107 33 3 1 -36 -27 -5 -19 8 5 32 62 17 22 -9 -26 -12 -28 0 35 19 -17 7 12 65 -14 11 12 10 40 -11 38 -23 -47 0 38
7141 38 -25 38 -64 21 14 -8 -35 22 57 6 -18 -17 -58 19 49 0 36 45 19 28 -28 -24 28 -40 -13 43 -3 -9 -14 -49 -23 -7 -7 44
7175D4q3N5J6n2N6l8K9J4l2m8O7n5L4Ok1J0m0P5K0r4K4K9n7N1n1Q4l2n0%M9k5
7206a5L9l2L9j9q2R3J0m8j8k0K6K9Pok9M0l5mK6J8k3J7n9J11o0Lj6k1N0j6m2N7
7238B0j6K2mj1j3J7kJ8j6k3m6N2K1k9l3JM6k8J5l0J6L0qM8l4o6N3PK2l4jN3k1
7271B6k8L8nm9K1%J9K3k4j03J33m5M1q1L6J2nN8q5l3K5M1l4O4q9Q5m2K6K2o3J5
7302am9K6L6l2K8j9KK0j6l4J3O9q5Q1Qk3nk9J7JK5j8k3m0M0RK3J9o0m5N4L3M2
7335F7r1OK7o3L0L1l7K0qn4Q8k2PJ6j8M2j5n3K0L1l0Qn6J17k6k0pK4q3M8k6J07
7367H0q0K1jn2j4l2J20k9N0n7pj7J9J6j5m4N3rKjL1pm8K1M9o7QLJ4K0k7J5qoJ6
7402A7j3l9N4l8L0rk8O7k9o0O5k0J7oj2m1O6k8MN1r6L8K3J6J5j6J1j2n4J4N0l
$$ plain form
7175 44 -39 16 32 -20 36 -2 27 41 9 -39 28 -27 7 13 -8 2 -38 37 57 -37 -13 16 -41 10 -41 43 11 -39 -39 10 -15
7206 -15 24 -8 31 12 -70 23 33 -15 -33 -53 -27 2 9 3 -26 14 -21 -25 1 19 -4 13 -46 65 5 8 -8 -29 21 5 -37 20
7238 20 4 26 22 11 -2 15 13 31 15 -8 -54 -2 19 -10 -43 -42 4 -24 -9 -39 -23 7 -1 47 13 -53 0 7 29 -5 -6 47 26
7271 26 -2 36 31 -18 3 3 22 45 21 -82 51 6 47 -34 2 14 9 67 -18 -51 -26 15 -19 45 -44 41 -1 25 47 -16 -1
7302 -1 -50 -24 12 -20 8 -11 -9 11 -5 -39 -26 43 -42 39 47 24 19 -10 7 8 33 15 -8 -48 -8 1 24 43 -17 -62 -8 25 67
7335 67 -24 -18 9 -54 -24 7 -30 -10 -18 -72 16 -6 1 17 -1 41 26 -27 -7 24 -6 2 -54 63 37 17 10 34 -49 -1 -27 80
7367 80 0 21 20 -32 -46 -78 42 13 63 6 -1 -18 1 17 2 -42 11 2 4 3 34 27 -21 0 49 -18 -10 -7 7 27 0 15 7 1 17
7402 17 4 -35 19 -19 11 2 -26 41 12 -48 17 -3 14 8 -4 -45 21 -7 -3 48 -48 -10 13 29 44 28 39 27 -27 -13 37 34
7434C4l2N0l9kj8Rj8RJ0pJ9J0p3L8mM8l0J2n9N4j0j1n7M3K0n1L4nK0K3o4O6qJ0
7468B1p6K7k5O2k9Q2n3m8O8j3m7M7pk0kLm3O5l3K0l1%L7m4M0j0J4%n3P1K2o9r
7501c3K0L1qJ8j9M0j53P8O4p0QNj0Q5n3Mj6l0P0j6n5J2N7lj7J1m7P4n%p2N0nj9
7535dpKqM2l0J6pLQk7L0j7J4m4l5R2o2O1m1L2o8l0Q7l8M3j6Lkj%ll1K5k1J8J9
7571CM8k8qrM8n6l3NJ7pP0p1NM8m4j5L4L5l4l5j5K0K6l3J8M9p7J10n3qM0l2n7
7604c9O7j5mPlm2K8J9m3j1O1Ml6R2j55M6K2KM4kk2J0m5j9N0jl0J6k6L1l9O0lk0
7638Dj7O7m9k5j9L8l2L0O0p6L6j4oj4O0K3j16O9k0n1M4k8K3L2n0%N4PL1o6k1L4
7670Hm7m9R5K8l2N8l1m8LQ3r1j1M3n1N1pQk2oL4l1J9Pk6K1qM3m5K1Qpj8jJ5O3
$$ plain form
7434 34 2 52 13 11 -7 2 -16 -7 3 -4 15 25 -48 -10 -14 34 4 16 -43 11 1 -10 -67 -24 -4 -55 -21 -26 -6 17 -47 19 11 21
7468 21 -55 -28 -53 9 -20 62 9 -39 29 16 -31 16 9 -11 -13 -10 -53 12 -21 -1 -32 -32 5 -39 1 -9 5 5 -48 23 45 -24 -33
7501 -33 -13 18 10 28 9 49 -104 -26 38 -32 -24 -19 -29 56 3 7 -9 -39 31 15 -40 -28 29 26 9 20 -27 47 42 42 -30 20 15 -4
7535 -4 -11 -9 -17 25 -5 11 4 7 15 -12 18 1 15 -29 -64 28 -34 27 -14 18 -50 -80 7 -31 12 -4 -1 -3 -4 -4 -7 -38 -13 -34 -16 3
7571 3 51 23 15 6 54 -2 -35 -30 -13 -20 50 -21 -16 32 -12 -27 7 42 8 -27 -42 -22 4 -29 -11 38 -39 71 18 10 50 18 -39
7604 -39 28 13 9 16 13 -29 -1 18 -25 -36 25 29 -7 85 -70 -24 -2 0 44 42 20 30 -15 -34 16 15 -15 1 -25 6 -33 27 24 4
7638 4 -13 54 5 -20 -39 -1 -33 -3 57 -19 17 3 -3 -17 43 66 -50 19 -1 -52 -8 -36 -13 19 -31 -31 23 30 61 -5 -26 8
7670 8 -39 -88 7 35 3 61 30 -18 -15 68 -23 -34 9 -42 9 2 10 -12 -18 16 -15 4 11 -15 6 -2 41 -4 17 25 18 0 -1 14 77
7705G7q9j3K1pL5j4n2N7pK3l6O7o7k6M1Nm2K3J7m4oK1N0o1M8k2K6L5m3oo2J08
7737E7m0n1kk2M8lL1pJJ2k2M4j04N7M3Mm0k3k1O5l4j1K3k8M4j1m3P8Oqjl8J9m3
7771b0o7M6L2J6O6n3lk2j5j2L7j7jk4N0m2k2K6L6m2%Rl9M3m3O2l0K3n2N3%Qk9
7804b6K1M0n7pN0K7n5k0K0lqK1K3Pmm1NL1q0R1qN4r2M2m0Jj7L4Pl3K5q5J03j0
7838A6%Lkk2J2L2p9M5k1L3k9M7n7M7nK1m1l2QK9l0N2p0K6L4m7K8j0K7Qko4P2p6
7872d7L0K1n4P3Rp9N6k8P7n9K5k0k1On4N6K2J4n7PJ12q6K4k1m8K7M1K9p8J2L4
7903B3J1l9M9k5l1KJqN2m7N0n4MJ0k1J0O1j18P6m9K6K8J6o6J4lM5K2j1n1N0k6
7935Am5P5r8P9rm9K6K0l8M2K8k0K4m4J4N6p3LL2k7O3K2n7m1j9L3M3m4l4N5L3m6
$$ plain form
7705 77 -12 -25 -4 -11 24 10 -42 15 8 31 -5 62 -5 -31 10 15 -27 -4 13 -31 -37 -16 34 -27 21 -1 25 60 17 11 -51 57
7737 57 17 -34 -36 -58 -10 -13 18 11 12 24 2 46 -58 -1 42 46 6 -17 -38 27 -7 -18 5 -23 21 10 -33 45 51 43 42 4 23 -20
7771 -20 -87 -41 -9 7 73 20 17 -5 -20 -32 5 -12 -13 -37 13 -29 -51 -25 11 -31 -31 -22 -61 -18 -61 1 -29 -6 -58 -5 -5 3 -26
7804 -26 -5 35 -22 -29 21 48 -7 -27 -7 -10 -18 3 26 33 29 -12 -7 24 -56 35 27 81 -11 31 -9 -8 -25 9 16 -17 8 -77 26 16
7838 16 16 19 17 -5 7 39 -40 5 -16 17 -12 35 -22 25 20 41 0 -32 -24 5 -25 27 -43 -17 17 -30 -2 -12 15 23 21 -43 29 -47
7872 -47 -17 4 -50 23 32 -47 9 -19 58 -1 24 4 -17 -11 -65 -9 13 27 -30 -23 89 3 27 6 -42 -15 26 55 -23 -11 23
7903 23 34 -5 44 19 -12 -10 -9 -17 35 -12 38 -16 -12 -2 -23 -13 48 -70 6 -43 -17 11 27 -39 -25 -28 17 39 28 -23 27 1
7935 1 -44 31 -67 12 3 -46 -20 0 -38 4 32 12 36 -8 6 62 -11 -8 24 -3 60 82 25 -16 -35 -2 41 -3 -37 18 51 5
7967El9R6r6M8Qm3jN2o9P0j2jJQo4N7l4K6K9k9m9O8m5OJ0L8m0M1o4J2J8n0O1J2
8001C0o6j4J08o2L1l4J5MJ2Lk5Pn9O1K3k5L6l1Ml6rK7K6l5lL8m7n0J14n0J1l0
8033b6O9j9Rk7k5j2k8j9Q6n3j1L7L5p1QP8p9O9l3O9p7l6O1k3L9k4qK5L6n8N9n1
8065@J4j5m5M3m4L7J2O5l8k1j5j4j4O7n2L5l7M1n3L9l2LQ3m3Kk7K1l8L2j0Nl3
8097c2K1J0lJ8K5o6rK8J4Qj4m8O2m2J7o5L0Q5pk8j6J4j3M6q1pO3rjpl6K4JL9K9
8132E0o4l1K0M1l2o9M9O0K1m6m6P9m2M4N0p3o9M9j7L6JJ9n2Q6j15J3K6K1j7j6
8162b4J4J4rj9j7N8l9k5J01m5k4jJ8m9J4j7M3J0J4K0J3r4L3jJ1Q8o4j8J9
$$ plain form
7967 5 -34 62 -34 14 22 -21 -22 30 -39 31 19 18 19 27 -37 20 -14 12 41 12 -37 31 -14 -8 2 40 0 41 -23 -11 7 -43 18 30
8001 30 -36 -50 58 -4 27 -7 8 12 24 27 2 9 -50 11 34 9 45 14 18 -18 -27 0 26 -9 -12 26 -21 -71 43 -7 4 -26
8033 -26 43 24 33 6 -19 -31 -59 -78 8 -45 -56 -19 16 -55 -47 31 -48 21 -12 57 -20 -56 5 -18 21 -3 -11 14 50 -8 51 0
8065 0 14 -1 -46 -3 -47 -10 2 67 29 8 -7 -21 -35 32 -20 15 -22 19 -34 5 -27 -24 59 16 18 -9 12 -26 6 -4 1 -32
8097 -32 -11 -1 -4 14 39 -27 -36 -8 6 14 0 -48 14 -28 -11 -76 -46 39 32 4 -12 2 -11 35 -46 -53 10 1 0 -7 -43 -19 -18 21 50
8132 50 -14 -45 -25 16 -16 -85 -36 24 45 -1 -47 32 -10 34 84 11 -58 -9 -26 10 11 30 -22 64 -51 -38 -12 9 -8 -24
8162 -24 -10 4 -5 -24 -41 17 -22 -47 54 9 -15 -16 2 -47 -33 -50 -7 3 17 37 50 -44 -11 -12 -1 87 23 5 24
8191B4
$$ Imaginary data points
##PAGE= N=2
##DATA TABLE= (X++(I..I)), XYDATA
0@%%%%%%%%%%%Qj6J6j6J6k4L2m0M8n6P2q0Q8j07J31j52J76k04K33k69L04l44L92
34B08m43M99n60O30p06P88q79R78j086J201j329J470j622J789j972K172k393K638
52A383k907L207l543L919m345M832n397O060o852P816r017J0567j2656J5643k0294
67a1584K8619m8215J84134J72268j45222o6276j28547q0148o0073n313j2603K5184
79a47776L6446N3512L2299M8128L7370K3263M640o31l3895m0338l8857j9646k756
92d8241J4229J5027J2659o745j0540r410q586k309J1784J3701J8514J9017J3425
105C2525L994P46K259L689K67q34j2269k6144k3069j5319j1107K434J1440Q398
119b2990O898P933N160K228M899J1823J2579J1353J0129k355j6108j8495j7581
$$ plain form
0 0 0 0 0 0 0 0 0 0 0 0 0 8 -8 8 -8 8 -16 16 -24 24 -32 40 -40 48 -59 72 -80 96 -108 125 -144 160 -184 208
34 208 -235 264 -296 334 -372 416 -463 515 -571 630 -699 771 -851 938 -1034 1138 -1255 1383
52 1383 -1524 1683 -1860 2059 -2286 2546 -2851 3209 -3643 4173 -4844 5723 -6933 8710 -11584
67 -11584 17035 -31180 152954 325222 180000 113724 -14823 -94971 -155044 -160357 -172960 -147776
79 -147776 -111330 -57818 -25519 22609 59979 83242 87882 87251 53356 13018 -25839 -45485 -48241
92 -48241 -34012 -18985 -6326 -13071 -23611 -33021 -41607 -43916 -32132 -18431 83 19100 32525
105 32525 36519 37265 39524 43213 43480 42646 30377 4233 -18836 -34155 -45262 -42828 -31388 -22990
119 -22990 -16092 -8159 -2999 -771 4128 15951 28530 39883 50012 47657 31549 13054 -4527
132d527j3698o055k356j793k189n40N622R036J0962J5068J3123O609J442o959
146B3745j5030j6952j2164l167L136O868P980J593j439K261K362K663N836L588
160A1280n69j490k838m200l806M13N174N451N306K423o232r873p369n256q56L187
176i255K870J578R2L9J139M54K104M093K570J437J48m017n493l780n96K780L479
193c58K941P95l228k724n44n49J590L263J806J113M36j292k166j900L53J616P79
210A931P28j397m100k107K27J183L325L298J021l53j666k064j752j468Q59J919
226d16J195J673J03k049j240p3O89J426N14n95j922k527o25L05N59K367K287N67
244B238M45p77j982j601m76R48J536J040Q76n75j604k48Q7j93Q15K08o95m98n42
$$ plain form
132 -4527 -18225 -24280 -26636 -28429 -30618 -31158 -25536 -16500 -5538 9530 22653 29262 30704 23745
146 23745 8715 -8237 -20401 -23568 -20432 -13564 -5584 -3991 -5430 -3169 -807 1856 7692 11280
160 11280 10711 9221 6383 2183 -1623 -1210 3964 9415 14721 17144 10912 1039 -6330 -11586 -12442 -9255
176 -9255 -6385 -4807 -4715 -4676 -3537 -3083 -979 3114 5684 7121 7269 3252 -2241 -6021 -6617 -3837 -358
193 -358 2583 3378 150 -2574 -3118 -3667 -2077 1186 2992 4105 4541 3249 1083 -817 -464 1152 1931
210 1931 2659 1262 -2838 -4945 -4718 -3535 -210 3088 4109 3756 2090 26 -1726 -3194 -2335 -416
226 -416 779 2452 2555 506 -734 -807 -118 1308 1822 1227 -695 -3222 -3847 -3542 -2983 -616 1671 2238
244 2238 2683 1906 -76 -1677 -2153 -1205 331 1371 2247 1672 68 -180 -93 -286 529 737 42 -456 -998
263i98k26J80P39J480R21P8l58j610k043p23KP17J408R77O03n8j97J09k57k60
283D84K05m75p64m02o76m58N18J008J374R07L64k16j123r01k90k96J49N39O5q9
303g7Ql07j53L1L00N47K9p5Kp04k32M06K04M76L48j02l55m77m33p8k02M67M42
326F5J8K25M4l42j17J82L2J09Q6o2j66k95N8J86ML46J97k11j91k80l51j45l9K47
350d00J90J4K92J62LQ7K22j48L3j23k92k81k32j12L0Q8K27J83O6J29O4j16N9N5
374B00n7M2n7m8o0p9K4l2k7K5Rj02J44n0l5K35K0K4j8p0K9j02r4m6k5OJ64J4L2
403F6M3q4kk7j9j32k6j32J29J28K7J29MO4M8q9k7op6k4Ll4Nkm1K2on3j0K4O3Q9
435E4M8O7N4L2r9l3j62j57m0j8o2O7N4J44J02R1O0J7o2j9o3m2j3J2M4J7k8R7n4
$$ plain form
263 -998 -1224 -1044 -305 1175 2096 2174 1816 206 -1837 -2560 -2558 -1841 -433 544 1147 1089 892 1001 744 484
283 484 689 214 -550 -952 -1628 -2086 -1568 -560 814 1721 2085 1869 746 -155 -445 -741 -592 -53 12 -77
303 -77 -69 -376 -529 -498 -198 349 378 303 305 -399 -631 -225 -21 455 803 701 346 -131 -564 -642 -844 -377 65
326 65 83 308 352 10 -107 75 107 216 302 240 74 -221 -163 23 27 373 570 359 168 -112 -463 -608 -647 -400
350 -400 -210 -196 96 258 261 348 570 422 455 332 40 -241 -473 -585 -555 -467 -240 -57 9 138 202 86 145 200
374 200 143 185 128 80 20 -59 -35 -67 -94 -69 -60 -162 -18 -68 -103 132 152 176 158 88 117 15 -79 -125 -150 -144 20 34 66
403 66 109 25 23 -4 -23 -155 -181 -313 -184 -56 -29 100 104 168 216 127 100 94 18 -6 -3 -37 -32 -34 -75 -53 -59 -112 -122 -98 -35 54
435 54 102 169 223 255 156 123 -39 -196 -236 -254 -316 -249 -195 -51 51 142 202 219 157 138 75 33 20 32 76 93 65 162 108
464A08k3k6j26m5k2j6j8R6kP6L7P1mj9j57O3n7%O4M1l0L9Mp2k2j04J9J7J15R7
494A04l2K9R5P8J5o1q0j95n6j76qjK1O2N1J36J77l0q1j3j25N3P9k6LK6J2O0p1
523D6J7N1j12Jk5l6Kl7oJ32J31j8K2k08p6r3o0j2Q1L3Q6R3J05P0j7n7L9l6j1n7
553D8j78o3P0L4R6J87PP4q3n2p9j62q4N1r3jJ42k5P1N9N7J00O8r7p9p9j71o9m
582b55J28J76j0P9J50Oo7j06o8n0k8r1j39o4RJ31J31K50N5O0M7j05j20r4j82o2
608b19k5k9R1J06M1J01k8J28J42k9n5o1j65r7J0p3O6n8JO6O1r2N4l9O6O7J8kj17
637g1l6k7M2M0P3R3p6N8kO3k5q9M4j01OJ9j23j04K8O7J75J88N5Ko6j25n5q7j09
666a43k8n1lJ38p2K7J14R1J84J31j3r4k39j81m4j09k3J24j9J18J67%O9L4%L9m3
$$ plain form
464 108 85 59 -67 -112 -134 -150 -168 -72 -74 2 39 110 106 87 -70 -7 -64 -64 0 41 11 50 54 -18 -40 -144 -125 -108 7 104
494 104 72 101 196 274 289 228 148 -47 -103 -279 -287 -288 -267 -205 -154 -18 159 129 48 35 -90 -37 42 16 19 45 57 117 46
523 46 63 114 2 3 -22 -58 -56 -93 -99 33 164 146 168 -40 -116 -209 -269 -281 -200 -167 -81 12 117 187 170 113 152 116 105 48
553 48 -130 -193 -123 -89 7 194 201 275 192 140 61 -101 -185 -134 -227 -228 -86 -111 -40 19 76 176 244 147 68 -11 -182 -251 -255
582 -255 -127 49 39 118 268 274 207 101 33 -17 -45 -136 -275 -339 -330 -199 -68 182 237 297 344 239 119 25 -157 -219
608 -219 -244 -273 -182 -76 -35 66 38 166 308 279 224 163 -2 -99 -89 -162 -96 -154 -153 -87 -26 -118 -64 -103 -37 30 48 46 -71
637 -71 -107 -134 -92 -52 21 114 38 96 94 157 132 43 87 -14 -8 11 -112 -216 -188 -121 54 242 297 299 233 108 53 -34 -143
666 -143 -171 -222 -225 -87 -159 -132 -18 73 257 388 375 281 42 -139 -183 -292 -315 -191 -210 -92 75 75 144 178 178 217 174
693A74p3o7j96j74K4Q3J57K05J3N6l8O0j10l7p7k8j5p5j5j10K5P5J13J87Q7nj22
720A17p6m7j6j18Q0mj8Q6Mp2j7J28KJ13KN3j22p3j02K7JJ69j15l0k6k3j4%L7P4
750B0j4J0Q3p0j47O8j4K3Q3J6o6L1l0J7OJ4l2Ql0J10j58l0L6m7K10pJ11j30j04
779c3q9Rk3j9J59l8L8Q6p3Mm0L6P4j24L2j7j04r4J04J06O3N7K0o1k5j13N0o2L8
808c9J23m5j8L6j08M3K9n2N1K9o8j2m9j0K7N6J15N7r4q3N1k06J16jk0J38j9OK7
837H0j70J0M7j10M4N0q8O2J3j8J45l4Q1O1j60L6pj83K5M0p5K41Jo6M5j5j7j3o9
866d4P0j4p1O2LML5J8k3L1j7l3pj63O0Kk2J46n5j12J35j7k1M0L9M8K3q0N6o4m4
897a5M3j3m9P0j31j8M4N2O7n2P8L3o5qk7r6J8J7j5N8RnM2L3n1L5m0pJ7j11l6k2
$$ plain form
693 174 101 34 -162 -336 -312 -229 -72 133 146 202 164 224 114 77 0 -28 -43 -118 -133 -243 -218 -143 -30 157 244 239 117
720 117 41 -6 -22 -140 -60 -64 -82 4 8 -64 -81 47 49 162 164 217 95 22 -80 -53 -52 117 2 -28 -54 -77 -91 -91 -54 20
750 20 6 16 99 29 -118 -50 -64 -41 42 58 -8 23 -7 10 16 30 -2 6 -24 86 -72 -102 -66 -113 97 90 201 71 -33
779 -33 -122 -113 -136 -155 4 -34 4 90 17 21 -19 17 91 -33 -1 -18 -122 -216 -112 -6 57 114 134 73 48 -65 -15 -77 -39
808 -39 84 39 21 57 -51 -8 21 -31 20 49 -19 -31 -80 -90 -63 -7 108 165 71 -12 39 -167 -51 -52 -72 66 47 53 80
837 80 -90 -80 -33 -143 -99 -49 -137 -75 -62 -80 65 31 112 173 13 49 42 -141 -116 -76 -151 90 91 25 70 55 38 25 -44
866 -44 26 12 -59 3 6 10 45 63 40 71 54 21 14 -149 -89 -87 -109 37 -18 -130 5 -12 -33 7 46 94 117 37 93 29 -15
897 -15 28 15 -34 36 -95 -113 -69 -17 50 -2 76 109 44 36 9 -87 -69 -52 -67 -9 0 -5 37 70 19 54 14 7 24 -87 -123 -145
929a45J2O7Q8J04N7p9PO4q7j08Pp5k1M1p2N5M2L3R4j3M7P8r8ko2j4n1l9m6RM2
960f5J7R3lK4O6k9n7O7j36J2o3p2P6%j2J06q3J19K3m6L4m9q1j5O0r5J0N6m3J36
990E0k9N9J0k8o1M2j8ml7m4JL5jK7L1j3K4M5K7l2p3Q0r5K8j5n1k2RK0L1m1L5K7
1023A7J8j6Nmnj0k2jKOj3O4o3pqj9N8p5J4K0j8Q3l0m3M9P4n3KJ5k1m1Mm0l5O2
1058c1J2K3o5J1N3l1M7q3Q6L9n2N4m2ll8K7nMl6k0qpO7k4K1jk4K8L1j6Kl8LL6
1092B0l4k8J1L1n3O5L1nl5J4o2O5Nk3L8j1k9mL2qm4K1K2Qn6J8O5m7jL5m3l8L9
1125aO7m5Rl5l6M7K3k3k2j2K7M7m1Kj3M3m9KJ7m6L6j8PM5Kn8jK1k4o1J06k0n2
1158e6O6k1qK2K6k8Ml7N9Mj10J67%j06M3k9K1nRl4N2qk5L9l0n1NK0L2l9M0M1q2
$$ plain form
929 -145 -133 -66 22 126 183 104 111 175 88 -20 -13 -88 -109 -68 -140 -85 -43 -10 84 71 118 196 98 96 34 20 -31 -70 -116 -107 -65
960 -65 -48 45 42 66 132 103 46 113 -23 -11 -74 -146 -70 -70 -82 24 -59 60 83 37 71 22 -59 -74 -14 -109 -99 -43 -86 50
990 50 21 80 90 62 1 43 25 21 -16 -60 -59 -24 -25 2 33 20 44 89 116 84 11 91 -4 24 9 -42 -64 -55 -35 -4 -45 -10 17
1023 17 35 19 24 20 15 5 -17 -18 -16 -10 -23 41 -22 -29 -37 -56 2 -73 -59 -39 -57 26 -4 -47 2 76 23 25 40 19 -22 -18 -58 -93 -31
1058 -31 -19 4 -61 -50 3 -28 19 -64 22 61 9 63 21 18 -20 7 2 6 -30 -50 -58 -65 2 -22 -1 -2 -26 2 33 17 19 -19 -16 20
1092 20 -14 -42 -31 0 -53 12 43 38 3 17 -45 20 25 2 40 29 0 -4 28 20 -24 -3 19 27 -29 -11 54 7 6 41 -2 -40 -1
1125 -1 66 21 30 -5 -41 6 29 6 -16 -28 -1 46 5 7 -6 37 -12 -10 7 -39 -3 -21 -14 31 33 -25 -26 -5 -29 -90 16 -4 -56
1158 -56 10 -11 -19 3 29 1 5 -32 27 31 -79 88 88 -18 25 -4 17 12 21 -13 39 31 6 45 15 -36 -31 -11 21 -18 22 63 -19
1191a9L2J0l6N7o3K8p4K3J9n1M4P2q7ML1m0O8rM3m2K4n7K1LM7j23N7KN1r4N2K1
1223A4k2L0k4K0j4%J2J1l3L4p7N9K1o2O6K3q8J00m2m4j8L1O1m3n6N1k0k5L1k0
1253b4k4K8L4l3mqK2%K1o3J33k2jp6L7K9r0K9l6M1k1J4J3j9lL3j8J6j7M8%o5N6
1286C0Mm6K6pnK5J7l5l4J7K2K1k3J3k5J6l8O0j7k9qM4o3L8J0K0q3O4n5L5jK9n5
1319c3P6k4N3o2pJ2k4Ql1P7o0P7p5L7m5L6J3j7l7ON5k9J4m2J9l8nP1ln6j0L2q
1352b0M4rn1L6l7ljJ03n9l9M5K6n1NJ3lL3n0J1m1J9J3J2K9o6L2K1JL4j11Q5m7
1384b6j5K7k2L7k2L6M1j5K4j16L6O4n0%K4Qk2J9j0p5O8kK7p4j6O3l3J4M1k9l5
1415c3N4lk2Rm6L6K3Jm5%K4m7mL9K5K1%l6J3k0O4m1j8N4J1k0rn1K1KL9r1N7p0
$$ plain form
1191 -19 13 23 -13 44 -19 9 -65 -42 -23 -74 -30 42 -45 -41 -10 -50 18 9 52 10 34 -23 -2 1 48 -75 -18 -16 35 -59 -7 14
1223 14 -8 22 -2 18 4 4 16 27 -6 28 -49 10 31 -31 35 58 -30 70 28 -16 -34 -3 58 15 -41 10 -10 -35 -4 -24
1253 -24 -48 -20 14 -19 -23 -31 -9 -9 12 -51 82 60 59 -17 20 49 -41 -12 -48 -7 -28 -14 -1 -20 -23 10 -8 8 -9 39 39 -26 30
1286 30 34 -12 14 7 2 27 44 9 -25 -8 14 35 12 25 0 16 -22 38 21 -8 -16 28 -35 3 13 33 -50 14 -41 -6 -7 22 -33
1319 -33 43 19 72 10 3 15 -9 -1 -32 45 -15 62 -13 24 -21 15 28 11 -26 -20 35 6 20 -22 -3 -41 -46 25 22 -34 -44 -12 -20
1352 -20 24 15 -36 0 -37 -40 -41 62 3 -36 9 35 -16 -11 2 -1 32 -18 -7 -48 -29 -16 -4 25 -41 -9 12 13 47 -64 21 -26
1384 -26 -41 -14 -36 1 -21 15 56 41 65 -51 -15 49 -1 -1 23 31 9 28 18 -57 11 9 36 -38 -54 9 -24 -10 31 2 -33
1415 -33 21 18 -4 5 -41 -5 18 19 -26 -26 -2 -49 -53 -14 11 32 32 -4 9 -11 53 12 -6 48 59 39 30 -21 0 2 41 -50 7 -63
1449f3j7P0J0k2P7p5M0l8l0J25p7J5l0O4n9%j1L7l3Rl5O2l5K4q9J00k1M1k6k8
1479a5j2N7n5l3N1J5k9kn5P3oq4Q4%M5m0M7p7L6M2n3L3Lj2Qp5N1l3O3J7n3k4N9
1512B6r3N9L9K0o6J2pO2l6p5O9qM7o1j7lP0J1K6o3j9%K3l1J5kO5k7r3R3j18J5
1544f7P9n5M6J3m9N4j2m2M2M2q3L0%q3J25k8J3k4RK0p2L3J5J9o2L2l9O6l3K5o2
1575d8N9O7q4j5l1J07n6Pm9nO9j3K0n0J0J9j5L5l8P6j06O3rJ2j5L2j1q7P5l3l1
1606d5L2NJK2k4K5m5M9L5n6N5n2J3k4L2j00M5j7K4K5j6N0k5PJ3oj3Q7j49M8jk3
1638b8M2K8o6Q8j21O4m0Q0n4K5j6l7N8k3k8M9n3L9o2L6L0Qj8J2o0O2j9p6Q8K4
1668C2p8O8n4mP3l1J0K2q3k4L7N3k0J8k4K3n4K3l6N5k5L3%jn6pO1Qql4j2k1O0
$$ plain form
1449 -63 -80 -10 0 -22 55 -20 20 -18 -48 77 0 15 -15 49 -10 -10 -21 16 -17 -8 -43 19 -16 8 -81 19 -2 39 13 -15
1479 -15 -27 30 -25 -58 -7 8 -21 -23 -78 -5 -11 -95 -11 -11 34 -6 41 -36 0 42 -11 22 25 13 21 -54 -3 -36 27 44 -9 -33 26
1512 26 -67 -8 31 51 -15 -3 -10 52 16 -59 10 2 49 -12 -29 -32 38 49 75 12 -7 -7 16 -15 0 -2 63 36 -57 36 -82 -67
1544 -67 12 -43 3 16 -33 21 9 -33 9 51 -32 -2 -2 -85 40 12 25 1 10 30 -42 -9 6 25 -37 -5 -44 22 -11 14 -48
1575 -48 11 78 -6 -21 -52 55 -1 6 -43 -48 21 8 28 -22 -12 7 -8 27 -11 65 -41 22 13 25 10 42 31 -56 19 -14 -45
1606 -45 -13 -8 -7 15 -9 16 -29 20 55 -1 54 2 15 -9 23 -77 -32 -49 -25 0 -16 34 9 16 29 23 10 97 -52 -4 -5 -28
1638 -28 14 42 -24 64 -57 7 -33 47 -7 18 2 -35 23 0 -28 21 -32 7 -55 -19 11 19 1 13 -47 15 -4 -80 8 32
1668 32 -46 22 -32 -36 37 6 16 38 -45 -69 -32 21 1 19 -5 18 -36 -13 -49 6 -19 14 14 13 -43 -50 11 19 11 -23 -35 -56 4
1701Dl6j0M9NK5m0MN8k7m2J9l5L1ljJ1J5KKjl1m4N5o6KK2O3l1l2L7j3KJj4oJ8
1737gPM7o0qLllL5J8m0K2l4rL6j4K1K5L7o2m4nN8qk8N8n3K4k8l1O0Qn6l4K7J0
1772c1K9l1M4l8J7L4k6j4MM8n0Nj1k8j2K0M1qOJ6L9m6pK9o5K8M6n9k1L4Kj6J4
1805gL8j0j1k2L2m0K7k4M0lk4m3O7Pm5j1K1O5o1m1RN1J4m7L2k0Nl8K1K2J7l6n
1838b0J1oMqNL7l0J0np3O6M5j6k0KK7o5K0L7k0J5K3n4O4o6k2L2K3Mk0K4k6j1L1
1872A8rPn8N1Lj1m0L4J8k5M3l3J2k7K1M9p6%pQJ2k9L9Jm4M0nO%l7J1rj2O5k4k3
1908c1%P4nk8J9m8K8Kj1j6k2N3J1m4L4l0m0RL0OK9j0J2n2J2K9J1n1oL6K2m5k6
1941d8O9Oq0K9m5P7K3Rl3L1MJ5o9J7j4k8O5lo2N1Nn1K2j0L7n0k8O0J0m8JL3J5
$$ plain form
1701 4 -32 -42 7 12 37 -3 1 59 32 -10 9 -26 5 2 1 12 27 29 31 30 -1 -45 10 -56 -54 -32 31 0 -32 5 -8 -6 -5 -19 -25 -7
1737 -7 0 47 -13 -21 -18 -21 -24 11 29 -11 11 -23 -32 4 -10 11 36 73 11 -33 -38 20 12 -16 42 -11 13 -15 -46 14 22 -34 -68 -41 -31
1772 -31 -2 -33 11 -27 -10 24 -2 -16 -12 36 -14 -9 -20 -48 -60 -40 1 -7 -1 15 54 8 1 30 -35 -7 39 -20 -41 -7 -5 -21 -7
1805 -7 31 21 10 -12 20 -20 7 -17 23 20 -4 -47 20 27 -18 -29 -8 57 -4 -45 -36 15 29 -18 14 -6 -1 -39 -18 4 21 -15 -20
1838 -20 -9 -15 -11 -19 -14 23 -7 3 -2 -75 -9 36 20 0 2 29 -36 -16 21 1 16 39 -15 49 -17 -39 -7 16 20 0 24 -2 -13 18
1872 18 9 16 -42 9 12 1 -39 -5 13 -12 31 -2 10 -17 4 53 -23 -23 -30 -22 -10 -39 0 1 -43 -3 -8 -2 -2 -39 -28 -37 -49 16 -8 -31
1908 -31 -31 43 38 10 29 -19 9 11 0 -16 -38 15 26 -18 16 -14 -54 -45 -15 -9 20 10 22 -30 -18 11 22 -29 -35 1 23 -22 -48
1941 -48 21 27 -53 -24 -69 8 31 40 7 38 42 57 -12 5 -9 -37 28 25 -37 14 19 -32 -10 -20 17 -33 -61 -1 9 -39 -38 -5 10
1974A0l4J7M2k5p6O6m0O5p4O6l1m2J15j4l3k2M9l1J2n1mK5JL4jk7L3l5M%j7j3
2006c1J7L7j5p9L9J6K0Jk1jL7p0O0j1K0l1%J4r3N4J2m2J00m8L9%j7k6L4j5QLj9
2039hJ8L6o9K2nl6N7oj2jk1Lj8O3%j9jJ1J3n2M6n2M2jo9M5N8J6n7k2J9J4j6mp
2074a3M0p5j9O2OM5l9p3Q6l4k0P7j00J11n1q8Q0O3j16K9N9Ko9L4l0k2L4o2N1k5
2104e7Q0mk2j3QJ0j1k9L7L0l4P9m7m5N3%o5Q1p2J5Oo6Q6j0j7K9J4o9k4M0JK4K1
2137B9p5N9jL4Qm5k1n5J13m3L1o8J1J3M9n4OM6j9J7m3M5j8m9L7J6j3o7N3n6Q0
2168B0p7P0l3m4R7k5J9k8J2nM3o1l6O1L4Jn0k5j1K4j8M8k2M0l8N1qo3J0j1L2k2
2200a5J6K9j8n6K9K6j4L8pp3P4kmo0K8J4J7l9M1k7J6J2p2Q6n0j6L2M2L5r3k4L2
$$ plain form
1974 10 -24 -7 35 10 -66 0 -40 25 -49 17 -14 -56 59 45 12 -10 39 8 20 -31 -35 -10 -9 25 24 -3 30 -5 -1 -1 -18 -31
2006 -31 -14 23 8 -71 -32 -16 4 5 -16 -17 20 -50 10 -1 19 -12 -12 2 -91 -37 -25 -67 33 -15 24 24 7 -19 15 0 8 11 -8
2039 -8 10 46 -23 -1 -6 -42 15 9 -3 -4 -25 -22 -40 23 23 4 3 14 27 -25 21 -31 11 10 -59 -14 44 60 3 -19 0 14 -2 -6 -13
2074 -13 27 -48 -67 -5 1 46 7 -66 20 -14 -34 43 -57 54 3 -85 -5 58 -58 -29 30 32 -37 -3 -33 -55 -21 -83 -32 -57
2104 -57 23 19 -3 -16 -8 2 -9 -38 -1 29 -5 74 27 -18 35 35 -30 51 -21 -6 0 -66 20 10 -7 22 36 -33 -57 -17 -16 8 29
2137 29 -46 13 12 46 54 9 -12 -67 46 3 34 -34 -23 -10 39 -15 -9 37 18 35 -8 37 19 -30 7 23 10 -57 -4 -60 20
2168 20 -57 13 -20 -64 33 8 27 -1 11 6 49 -12 -48 13 47 48 -2 -27 -38 -14 -32 16 -6 34 -4 47 39 -24 -14 -25 7 -15
2200 -15 1 30 12 -44 -15 11 -3 35 28 -45 29 27 23 -37 -9 5 22 -17 24 -3 13 25 -47 39 -11 -27 5 47 82 -11 -35 -3
2232cJL7m9J1m0M2k1L7m0j9j8P8j3L0n4o1R5J7j5l1K5kKm5RJ0M1nJ8l1O3q6M2
2265B5p9NP5m5L6Jj0l0KN7l2RK0k0n7L9j5K2Pn4N4j9OlM0k6mKL1j8J6m0m4R7m1
2300GJ3Jp9M4NM2qm7K1J2k0L1j6%l7L5J5p2O9o7O0jl5rN8M9o2m4M5LrJ2oJ6l2
2335fl3K2J5k3l3O1ol1jM5l1N6n0j7J4RpM6p0k1J56j26J3L6qj8j0O6r4N7K5j8
2367A8L8l8J4n3l7N8n8K8P3Ml7Rq0P2J5n4L4ll1O2q2J19q9NJ2k2Jj6m0M3O3l5
2399gJO2m8l0J00q3oJ8Mm0J8OL7L3n6J9pn1M8n3O8p1N7l1K9n7QN9n0l6M2k2nQ
2433c6O7m2k5N3J9n5LJ5K1K0j2l2KLj0M4n2K1j1nm3M7J3k0lO4n8K4K9k6l2J8J1
2466A2m0j0L9l9J1n1O7n5M7O1l3j5J5j2MM2l7K9l7j5j3J8J4l3M5j6j1L0km2J6
$$ plain form
2232 -3 -2 35 -14 -3 -43 -1 -22 15 -25 -44 -62 16 3 33 -21 -82 13 30 15 -16 9 7 9 -36 -27 -17 24 19 37 6 69 -17 25
2265 25 -54 -49 26 -19 17 18 8 -22 -20 37 5 14 34 14 -43 -4 -19 3 10 -44 10 -9 -3 -6 34 8 4 6 37 19 35 -5 -49 48 7
2300 7 20 21 -58 -14 -9 33 25 -22 -1 11 -9 22 6 6 -31 4 19 -53 16 -51 9 8 -27 -36 22 71 9 -35 10 13 4 16 10 26 -6
2335 -6 -39 -17 -2 -25 -58 3 -3 -34 -35 10 -21 35 -15 -32 -18 -9 -16 30 -40 -61 95 -31 -18 18 10 -8 -18 48 -46 11 36 18
2367 18 56 18 32 -21 -58 0 -58 -30 43 47 10 19 -61 11 26 -28 6 3 -28 34 -48 71 -18 -13 -1 -23 -22 -38 -78 -35 28 -7
2399 -7 -6 56 8 -22 78 -5 -11 7 11 -29 -11 -5 32 65 9 28 21 -30 18 -35 33 -38 19 -12 17 -40 -32 27 -23 -59 -17 -39 -44 -36
2433 -36 31 -11 -36 17 36 -19 -16 -1 20 40 28 -4 -2 1 -9 35 -17 4 -7 -12 -55 -8 5 -15 -18 46 -12 12 41 15 -17 1 12
2466 12 -28 -38 1 -38 -27 -78 -11 -66 -19 42 9 -6 9 -3 1 43 6 35 -2 -17 -30 -12 2 -31 14 -2 -13 17 15 -27 -11
2497a1O7p7O9r5L6P5q3j8JJ4j0P1n8KL9l7J9o7L1K7j0J1n9J16o7J8L5l9j1OK9
2528B4K7p9J3M6n7P8n7n8J02j8m7J4PjK1J8l6o8O7l5R2r4k1kP5lp5R0l5N2n0N2
2560D2n8l2K2JJ3O2l8k7Q1j12j2R9l3L7p0N4Pn3K6k0m6Q2l0jPk2K0o3R0l5J0k3
2592b2J5P4o9K4lJ0m7L0rp6J01n7%LlK1l1K6j3J6JJ0J4j1J2J0NPp6J7O5n2J8q
2626BJ8j4o4R5l6J8K3m1l7O7k2l9O4j7k6N6n5j5J4L2l4L7n7K0K6k2L0k4l1L3P2
2657G3k3m0j7N6n1l0J3m5P6p6M4P5o8K2l7J05q8jmK3lOLn5J4J5l3J6L8k9NK9L2
2690D5n3l3N4J0l7K6Ln8P5j2n1M8n0K2oJ1K8j7j5J5J5n1Q3m7k0K1K6Lo2K4J3L3
2722D3l6J3k%n2O0j3n0NK2L5j6k4J9k9J8k7L0%m0K4L2j4jQNm1J4l9O3l9P0J1r7
$$ plain form
2497 -11 56 -21 48 -47 -11 64 -19 -37 -36 -22 -32 39 -19 -17 22 -15 4 -63 -32 -5 -15 -4 -63 53 -14 4 39 0 -11 -5 24
2528 24 51 -28 -15 31 -26 52 -5 -63 39 21 -26 -12 -5 -6 15 33 -3 -71 -4 -39 53 -41 -62 -64 11 8 -67 23 -12 40 -10 42
2560 42 -16 -48 -26 -25 -12 50 12 -15 66 -46 -58 41 8 45 -25 29 36 -17 9 -11 -57 25 -5 -6 1 -21 -1 -64 26 -9 1 -22
2592 -22 -7 67 -2 22 19 29 -18 12 3 -73 28 -29 -29 -26 -29 -8 -39 -13 -26 -10 -9 1 15 4 16 26 31 38 -38 -21 44 -8 10 2
2626 2 20 6 -58 37 1 19 42 1 -36 31 9 -30 34 17 -9 47 -8 -23 -9 23 -11 26 -31 -11 15 -7 23 -1 -32 1 73
2657 73 50 10 -7 49 -2 -32 -19 -64 12 -64 -20 55 -13 9 -28 77 -11 -12 -16 7 4 10 13 -42 -28 -13 -46 -30 8 -21 -16 13 45
2690 45 -8 -41 13 23 -14 12 15 -43 32 20 -31 17 -33 -11 -17 -6 22 5 -10 5 20 -31 52 5 -15 6 32 35 -27 -3 10 43
2722 43 7 20 18 18 -34 26 13 -37 -32 -10 25 9 -15 4 -25 -7 -34 -4 -4 -44 -20 12 -2 -3 5 10 -31 -17 -56 7 -32 38 49 -48
2756d8J5N9j1l6L0j9M0q6M9l1L7J2K2K3l1m6R2p3j2k9N8K0n1J6N2r9nQ4l6k5N4
2787B5n4O2j5N5p4K9k0k7K1J5J2j2oq3L0J8N4n0J8RK3Rk7Nm2JLN4k1l3J9J7o6
2820e1JN9nN9o9Ojk0J2M3l4O5n8k5K5K8r4L8L6%o1L3j2O0m8k2J0jj1L3J5K3l1
2853C%kJ2n2k1M2N6m6j7jj2ML0Oj3m4P1m2O2J2k6j1J0l3k4rN9Mp0R4q2j1J6M2
2887GKm3M1o1N9j7J0j3m1L2L9j0l6K1l8O2L0o4j5L2K3j8K7p9R3n3K5k7j1J3j8
2918b8J2N8n6j7L7Pn5O0k6K8K6K3o8M7l2K6k3n2N2j2lj3N8o6j4M7pm3R6o3jn1
2950e3K0L5Rl8O8l3o1N7M7J5l0k3k3ok6J2O1l7oJ3O2q7nj8O3k7k9J24o3p7L9J6
2982aK4q2K3N8L5o1jJ9k4n2J37pq6lK9lJ8l9J0K9j8N0l6%j3j8MJ1qL8L1n3NLk5
$$ plain form
2756 -48 -33 26 15 -21 9 -10 30 -56 -7 -38 -1 11 33 56 25 -21 71 -2 -14 -43 15 35 -16 0 52 -47 -52 32 -4 -29 25
2787 25 -29 33 18 73 -1 28 8 -19 2 17 29 17 11 -72 -42 -24 30 -20 -2 7 30 39 12 17 -25 -24 -21 33 12 -21 -2 15 -51
2820 -51 -50 9 4 63 -6 0 -1 -21 -9 34 0 65 7 -18 7 35 -59 -21 15 15 -46 -13 -25 35 -13 -35 -25 -26 -37 -4 11 34 3
2853 3 3 1 13 -39 -60 -18 38 -8 -25 -26 -38 -34 -4 2 -11 -55 16 -26 36 48 22 11 21 -12 -36 -45 14 18 -52 42 -40 -51 -35 7
2887 7 9 -34 7 -54 5 -12 -2 -15 -56 -24 15 5 -31 -10 -48 14 44 -20 -35 -3 20 2 29 -50 43 -10 15 -12 -23 -10 -28
2918 -28 -16 42 -14 -31 6 13 -42 18 -8 20 46 69 1 48 16 42 19 -33 19 7 4 -9 49 -17 -31 16 9 -34 62 -1 -2 -53
2950 -53 -33 2 11 -27 41 8 -53 4 51 66 36 13 -10 -16 -42 -30 31 -6 -12 1 63 -24 -29 -47 16 -11 -40 84 21 -56 -17 -1
2982 -1 23 -59 -36 22 57 -4 -5 14 -10 -62 75 68 -18 -21 8 5 23 -16 -6 23 5 55 19 19 6 -12 -8 3 -5 33 64 11 16 19 -6
3017fl2P1Mn4J0L0%M2p3k0N7l3q%JN5o8k8M4PJ4l0L3nJ4k5mj5J9J3L4m5nk9J5
3052a7K8k9M5q4N6K8k2K5k2J6m9p2J28k6j6K6o4M8K5j0k7M4o7N1j5n0L8Rj2K5
3082A0J6k0PoK5K6p9Lj8J6K6J7l3K4Qj3k6j9O5l4L0m2K5K9k4J7m7N3k4Kl7qJ5
3115a6J7J0Jj2kp5P7m2J2J9%P0m5lk5krJ7j8K2l6P1k6k3j6K6o0J11r3m1Q9k8l1
3148f1P4j8L2m3m7L9J7KNM1m1l3j8M5NMl9M4L4lk5k9K6k1j4L9m6K0N1p1K4L2l1
3181fk2N0j7L4k3l4RJ0K2K6k5ronn4O7L9m3J5o9Q1m6J7Ml6jk3N1L8nJ0q6kO5q5
3216e9Q8l0j6j0L6j5ML6o2K2K5J9m5o9O7M2l4Pj2Ok7J8N7q7K5M2j3k7K3o3N6j1
3248g%N4p8K4l3N7m8P0Jl0k8Q9j11M1K1q5O4M8nn7K5k2kP1p9LNL1j0M7m3j7QN7
$$ plain form
3017 -6 -38 33 37 -17 -7 23 23 65 -8 -28 29 -4 -12 -12 -11 44 -24 -52 -8 -1 13 -17 16 11 25 0 -4 -19 0 13 47 2 -3 -32 -17
3052 -17 11 -18 27 -57 -1 27 5 30 8 24 -25 -97 31 5 -11 15 -49 -1 24 14 -13 31 -36 15 0 -50 -12 -3 -15 10
3082 10 26 6 13 7 32 58 -21 -18 -36 -20 6 23 -10 14 22 9 -17 -36 29 -5 25 -17 8 37 13 30 -17 36 12 14 -23 -31 -16
3115 -16 1 11 12 0 -2 -77 0 -42 -30 -11 -11 59 14 11 -14 -16 -25 -8 -26 -4 -40 31 5 -18 -34 -8 -68 43 -50 -91 -2 -30 -61
3148 -61 13 -5 27 -16 -63 -24 -7 -5 0 41 0 -33 -51 -6 -1 3 -36 8 42 39 14 -15 11 -10 -24 15 -31 -11 40 -31 -7 25 -6
3181 -6 -28 22 5 39 16 -18 -9 1 23 49 24 15 9 4 -50 17 56 13 28 -41 40 -6 11 15 -21 -22 -45 6 44 39 49 -37 -39 26 -59
3216 -59 29 -1 -17 -27 9 -6 -2 34 -28 -6 19 38 -7 -76 -9 33 -1 6 -6 0 -27 -9 48 -39 -14 28 15 -12 11 -52 4 -7
3248 -7 -7 47 -31 -7 -40 17 -31 39 40 10 -18 71 -40 1 22 -63 1 49 44 -13 12 -10 -12 59 -20 -17 -12 19 9 56 13 -4 4 61
3282F1n2qqn5Q6j3j8L3o4P6l4l5J8nL7p5K7M9k6nK7o2P1k5k4j9lJ1L9L5l9j9p
3315b6Q2p1KJ2K9l4M3j08K7K6N0m4L0l1Kk7M2J0K7j7k9mj3P7n5k6M7L1k1M2r1
3346a8J4k1jL3k8M7q5K0L4m2rO3pk4k1M2J3nqj1o1Q8qn2L4M6j7lJ4n0N4j2J2j07
3380g6J09o8R5j15O6ll1M2l1K2j5KQl0L1On3N7j7K9n2J5p6O0NN6o6L8L9q9K6L4
3412A8l5L2j8L8J1p1O1op2N6l1jK2N3r9M9L3r0L8M6k9%r7J46n9MN0l8m6M6%m1
3444c0K8LjJ2J5l7k4%M4q0J06LM1l7j2RlK1j03M6Rk3L3j9Rj6KJ1NJ7NK8q0L2o2
3479d8R1p7M1J1l1qK0k7%O0K5l7nj8j9M7k7L1km8j9J4K0K7n0L8n7Q2l3M4o0%l
3512a8K7OJ4m4J5J8k2J2J0j7k2K1nK6j8r7Q2K5Mj1k1Kj0L8m2j0L0K4l7J2j6M5
$$ plain form
3282 61 9 1 -7 -62 24 11 -7 26 -38 38 4 -31 -13 -18 19 -56 -29 20 -6 -11 16 -46 25 0 -24 -43 -46 -35 4 39 0 -19 -26
3315 -26 56 -15 -13 -1 28 -6 37 -71 -44 -18 32 -12 18 -13 -11 -38 4 14 41 24 -5 -9 -22 55 0 -26 21 52 31 73 -18
3346 -18 -4 -25 -26 7 -21 26 -59 -39 -5 -47 -56 7 0 -24 -45 -3 10 5 -3 -14 -75 13 5 -47 -13 33 16 13 27 -23 31 19 31 -76
3380 -76 33 -35 60 -55 11 8 -23 19 -12 10 -5 -3 5 -25 6 12 -41 16 -1 28 -24 -9 -85 -25 -20 36 -30 8 47 -42 -16 18
3412 18 -17 15 -3 35 46 -25 36 30 -42 14 -17 -18 4 57 -42 7 40 -50 -12 34 5 5 -92 54 -5 -1 49 11 -35 11 11 -30
3444 -30 -2 1 0 12 27 -10 -34 -34 10 -70 36 39 80 43 31 40 37 58 -45 1 10 -13 20 1 10 -6 -4 7 12 29 34 62 -18 14 -48
3479 -48 43 -34 7 18 -13 -21 -1 -28 -28 32 57 20 15 -3 -22 25 -2 29 27 -21 -40 -26 -6 21 -29 9 -48 34 1 45 -15 -15 -18
3512 -18 9 15 29 -15 0 18 -4 8 18 1 -21 0 -5 21 3 -94 -12 13 17 6 -15 -13 -23 15 -27 -37 -7 17 -20 -8 -24 21
3544B1l4M8k5PqlrK7m9j9Q2k2KN6j19K7L8kj7M7m1J4m0m5J16j10J8oO1l0mK4k0
3577a5L1ql6K0J4N9r3M9n3O5kq4J5QO1o7nL4k0P4j09J4Q7k8J6l3K3n2RN1p0P0
3609B5K9k6m1L2o3N7k2k1JoL5J6n7jM0J2J4Rm6j4N5j3M2l6l1K6m0N9l1kP0q1j3
3642b2J8L7l4Qj1L8l3OnjOKmkKk1K6l1L3m4N6qn0M7n0M6m9L5o4M7Jj1M1L2p0j6
3678d5L7j7P1m0K3j7Rk9k8M2O8q1m4O1k9MkK5nnl1KR5n6k4J9j0k0O1n3j7L3L6
3711C3J1Nj12J02p6J3nN2l3o0O4J9k1j0k3O2p%j1rj7N5j8k5L9JN2j29k2Q1M6m5
3743A2o4O7Jo5M8L2n5Pkol0K7%k2K3K7kK7p2O7J5J1n0QK3n6LM9k1p2N3j0j0J2
3777b5K2%l4O8K1o6k1Q7r2K7M5q1L6j5L4m2M3kn7P7n7J4J3K5pk6K4k7QK2rL8q6
$$ plain form
3544 21 -13 35 10 17 9 6 -3 24 -25 -44 38 16 18 74 -45 -18 20 18 1 48 7 21 -19 -64 52 -58 -40 -46 15 -15 -19 5 -15
3577 -15 16 8 -28 -8 6 65 -28 21 -32 33 31 -53 -38 -30 31 -36 -41 -7 -27 47 -62 -48 39 11 27 -6 17 -35 -26 25 -45 25
3609 25 54 28 -13 19 -44 13 -9 -30 -29 -35 0 16 -41 -42 -2 10 24 33 -13 -27 28 15 57 21 -10 16 -24 35 4 2 72 -9 -22
3642 -22 -4 33 -1 7 -4 34 1 7 2 1 7 9 5 3 5 -16 10 -21 12 -32 24 16 -34 13 -37 9 -40 -5 -69 -22 -21 -32 9 41 -29 -45
3678 -45 -8 -25 46 6 29 12 21 -8 -36 6 74 -7 -51 10 -19 -15 -17 8 3 -2 -33 -31 64 8 -16 3 -7 -27 34 -19 -36 -3 33
3711 33 44 49 -63 39 -37 -24 -29 23 -10 -70 -6 13 -8 -18 -41 21 14 14 3 -6 -23 32 14 -11 28 29 81 -48 -70 11 57 12
3743 12 -52 15 16 -49 -1 31 -24 -17 -19 -25 -55 -28 -28 -50 -27 0 -2 25 -47 20 35 46 -4 4 27 -29 -26 23 2 -70 -17 -27 -37 -25
3777 -25 -3 -3 -37 31 52 -14 -35 52 -40 -13 32 -49 -13 -28 6 -36 7 5 -52 25 -32 -18 -5 20 13 -13 11 -16 -8 14 5 43 -43
3810d3L3L3n4J1lM3j6M3o4M1m7M2j4m0L6Rk4j8RK9k2l5M0L6l0JL0k0l3PNNL7l9
3844a2m3M2%mK4l2O0n1M1j8m2R7r7KM4kL2n8kjl4O4K1o3P8k6Jo0M1J9m0k6Q1n3
3878a7Q3q2M0m0k0K3M3l2lQKPj2L5l4J6o4P6j3Qj6nM0n9j4M3k3P7r7M7K7m1pj1
3912a5J0l9M4mM7k0Jpmm6K7kj3k9N0Oj8pJ7l0j3N0Oj1J2m5O6o5O9n1O1j2o2pO7
3947C3k6k8K5J3k7Mk7pJ7jL8n1L2k0N5p9KO3o7J8P8o3P4nk6J9o4L1l7R%O4k7J2
3981C2m1N0k5%K7k2K0J0j24O0P0r2Q5o4J6J7q8P8J6p7O8Lp4P9m1L9lk6mN0K1o0
4013@K9q1j3J32p4J5k7N8k5n2K0J1j0m5R0r2K0L8J4on1M7L4jl0J3l8P4n8K4k5
4044io2P5J3m7L5k8n9J04p3M6N6m1K7m8L7pm2mj8jM3k1O3j8j2L3p1oJ6L6p8J18
$$ plain form
3810 -43 -10 23 -31 -20 -23 20 4 47 -17 24 -23 19 5 -35 1 10 -14 -32 -23 6 -16 -51 -11 25 -5 -4 26 6 -27 -20 -15 -10 27 -12
3844 -12 -55 -13 -13 -17 7 -25 35 -16 25 7 -35 62 -35 -33 11 9 41 -17 -19 -20 -54 10 31 -32 46 20 21 -39 2 21 -19 -45 36 -17
3878 -17 66 -16 24 -16 -36 -13 30 -2 -5 3 5 12 0 35 1 17 -47 29 16 24 8 3 43 -16 -30 13 -10 67 -30 17 44 3 -4 -15
3912 -15 -5 -44 0 -4 43 23 24 17 13 -33 -6 -8 -21 -50 0 6 -12 -19 -2 -32 -45 5 11 0 12 -33 33 -32 37 -14 47 35 -27 -34 33
3947 33 7 -21 4 17 -10 -6 -33 -40 -23 -24 14 -37 -5 -25 30 -49 -47 16 -51 -33 45 -18 56 51 25 44 -20 11 -26 -17 -17 47 20 32
3981 32 -9 41 16 16 43 21 41 51 -73 -13 57 -35 50 -14 2 19 -69 9 25 -52 16 19 -55 24 -17 22 19 -7 -11 39 60 0
4013 0 29 -52 -65 67 -7 8 -19 39 14 -38 -18 -7 -17 -62 28 -64 -44 -6 8 2 -49 -2 32 31 1 14 -24 50 -8 16 -9
4044 -9 -71 4 17 -30 5 -23 -82 22 -51 -5 51 10 37 -11 26 19 -23 -27 -45 -46 -3 -24 39 21 9 42 -29 -35 -19 17 -61 57
4076E7q7K1RL4oL8m4j2l4J7j7M1j4O2n7K9n9%M9n0N6m8J3MkL6m2K9n2kM9Lo2M5
4110Dln0O7o1L5j2MJ2J7n4K3K3j0N1r7RJ4O5n7M8mn4J8k2M2K1J1l4Rl9J7J8Jk7
4144a5K0lJ7J5r1L6j0J9j9M4k6K7n2j8N9l4R1j07J06q3J8J6J5nK9p2L4qN5m9j1
4175bM6q5L0lj6L2J4j7l8Q5j5p0j3N1k1M9Pl7j1KLj1lMP9ll2l7jk7P9n6J1N0R
4210E3p7L5j8L9Pj7k9L1n0Rk1P8q4L1L2J5m9mP7j16J01k3l0qQO5p9K3Q6r5LO3
4242E6k6J3r3J7N6k2Jm0J7L2J9n9K5n4O5Orj1j5K6%l1K2N3o9K6qO3o8J7rLkk7
4276b6j6O3p2N0J4l1L3kQm2m5J5LN2M4r3P0m8L3%k5k2R2p6QO8p6LN2m9MQ9q0M
4310BKl6N1j7k1M4k8Lk5L0K3km5N0l8MKl5L4l3P6k9n0M4j6K5j7m1N0J7k0J9l0
$$ plain form
4076 57 -30 -9 0 34 28 66 22 10 -24 -7 -24 17 3 65 8 37 -22 -22 27 -23 33 -15 -2 2 0 36 -6 23 -29 -31 18 21 -41 4
4110 4 1 -49 18 -43 -8 -20 -16 -4 13 -41 -18 5 -5 46 -51 -42 -28 37 -20 28 24 -30 -12 -34 8 29 40 6 15 -24 -7 11 12 -15
4144 -15 5 2 19 34 -57 -21 -31 -12 -31 13 -13 14 -38 -56 3 -31 60 -47 59 -24 -6 10 25 20 49 -23 11 3 58 9 -2
4175 -2 44 -41 -11 -14 -30 2 16 -1 -39 46 31 -39 -52 -1 -22 27 34 -3 -14 -12 -9 -20 -23 -19 60 57 25 -12 -13 -40 39 -17 -6 44 53
4210 53 -24 11 -7 32 39 22 -7 24 -26 -17 -38 40 -44 -13 19 34 -15 -19 58 -58 43 20 -10 -18 -10 55 -24 -1 85 -10 -7 56
4242 56 30 43 -50 -33 23 1 2 -38 -21 11 30 -29 -4 -58 7 13 4 -7 -22 4 4 -27 -5 48 -21 5 -3 60 -8 9 0 3 1 -26
4276 -26 -42 21 -51 -1 13 -18 15 13 21 -21 -66 -51 -48 4 48 -45 25 -23 10 10 -15 -37 55 -21 -13 55 -21 -18 34 -15 -11 78 -2 2
4310 2 4 -32 19 2 -19 25 -3 0 -25 5 28 26 -19 31 -7 -3 -1 -36 -2 -35 41 12 -38 6 -10 15 -2 -43 7 24 4 23 -7
4343gMnj2J5LM4kk9m2J0M9rJ5l3J9Jk5j8J0M0j8M1l8p3J07m3p3O3J7r3K0M4m9
4376f7N7L9j7k3J9%M2l4l8qmj0P1qJ8l4j9k1Q6q8K9lJ7lJ6n2L9L2n1l3O2n4K6
4409a4Ml4J07n0jj6N0m5J6l8O5o7J9l2M5L5j32J07LN4p4oOJ3k7oM3Nj5k0O0p6
4441b1M2POl9j4M0o7M9j2Mk6L4J5j5mjL4n1j9N3K3m8K7J7k4j6j4l5N5J2L7l8M8
4474E9q3k9R7o7J0l1J2N1k9RJ5l9KN7k9j4N5l8%Nk7J1l0K8J0rO2j14R4p1K1oK5
4507Gl4M9m2oRL1j3J6K5j24Q0L3po4L1J7K2J7l9K4m0L4rm0MM1np2M1nL5jJ9j0
4541B4m7O5j2m8K9l2PL4K7q2k9O4J1NJ6j7rJ2k2M9J8r8K6K3l5M0m3K5%J2N7q3
4573a3l0M5j7p4P4L1km6L6j9j0N1mRm0J4n5R0j4l0k1K6j3m2Q9K1k9mk8j1PkK7
$$ plain form
4343 -7 -3 -8 -20 -5 -2 42 40 11 -31 -21 28 19 34 1 20 21 -4 -22 -12 28 10 51 13 -60 47 4 -69 -6 11 -82 -62 -18 -67
4376 -67 -10 29 12 -11 8 8 50 16 -22 -30 -34 -44 27 19 37 3 -16 -37 49 -39 -10 -13 4 1 17 -35 4 36 -15 -48 14 -40 -14
4409 -14 -10 -44 63 13 12 -4 46 1 17 -21 44 -23 -4 -36 9 44 -88 19 22 76 2 -4 2 15 -12 -18 25 30 15 -5 55 -21
4441 -21 21 28 34 -5 -19 21 -46 3 -9 -5 -31 3 18 3 -1 -2 32 -19 -38 15 38 -10 17 34 10 -6 -20 -55 0 12 49 11 59
4474 59 -24 -53 44 -23 -13 -44 -32 19 -10 -1 14 -25 -23 34 5 -9 46 8 8 13 -14 -3 -33 -5 5 -4 58 -56 38 -33 -12 -18 7
4507 7 -27 22 -20 -26 -17 14 1 17 42 -82 -2 31 24 -40 -9 8 30 47 8 32 -8 26 17 -23 -19 22 17 -55 -14 -19 16 15 34 24
4541 24 -23 42 30 -18 11 -21 -14 20 47 -35 -64 0 11 16 32 15 6 18 -4 45 63 -35 -9 14 -21 19 -24 1 1 13 70 -13
4573 -13 -43 2 -15 -89 -15 16 14 -32 4 -15 -25 26 22 31 -9 5 -50 40 26 -4 -25 1 -12 -54 35 56 27 23 -5 -16 -9 -11 16
4606A6Qj4j6j8J5k2J3k2J17o4o7J23n4m1P5o9J05j05L1J0qk8J3J0pL6j5rj6K9
4636B6j2l2l3O1l0L8pJ3j0j0k1M9m6M5m9K5k3L7n9M8Rl9M5o8O6%J7r8N8j7j5J9
4668a3Ol2J8k4M1o1Q4lkk1J6K6l6k5J0M3m5K3mrJ5j4m3j3M8M6n0J4K9n2L2nj3
4701a4P9m7J2L1p4l6J13q2L3Lo4J3L5m1k2R5j1J5n0k1JM8j2K0o5J14o5k1N9j4
4731C2q9N9k2kQjM4j01R2Pj2m7L7qj6J0k7J3K2M8k0o1lpL0L0m5J9LM1o1J6RK2
4765B0m6J0k4L8n7P5j2N7n5J9J5o7L6k8J2J1l4K0Q%J7ml7N4o2J8K2L3p4J9l2Q2
4797C4l7j2L3o3Q0k2l4L7o9M4oK1m3M8MJJ8k9N9o4N7n2Qo8K9M5j7l2J0jK5k2j6
4830c4J7l3M0k6nM0pj1J9K5ok5kj1L0K8l6MKn2R2n7M2r4P1L6l9J4lnj9K1J4l8
$$ plain form
4606 16 24 10 -6 -24 -9 -31 -18 -40 77 13 -54 69 15 -26 49 -20 85 -20 11 21 13 -15 -2 8 1 37 22 13 -3 26
4636 26 14 -18 -51 10 -20 18 11 24 14 4 -17 32 -14 31 -18 7 -16 21 -38 10 19 -20 25 -43 23 23 40 -58 0 -17 -32 -13
4668 -13 -7 -39 -21 -45 -4 -65 19 16 14 -7 9 35 -1 -26 -16 27 -18 5 1 -8 7 -7 -50 -63 -15 31 -19 -5 24 -28 4 -1 -14
4701 -14 65 18 30 61 -13 -49 64 -18 15 18 -46 -33 2 -39 -61 34 23 38 -12 -33 -32 16 4 24 -41 73 8 -13 46 32
4731 32 -57 2 -20 -22 -14 -15 29 -72 20 27 15 -32 5 -3 -19 -9 -36 -23 -1 47 27 -34 -37 -44 -14 16 -29 -10 -7 34 -27 -11 -2 20
4765 20 -26 -16 -40 -2 -59 16 4 61 6 25 40 -27 9 -19 -7 4 -30 -10 -2 -2 15 11 -26 28 -34 -16 6 39 -35 -16 -48 34
4797 34 -3 -15 18 -45 35 13 -21 16 -53 -9 -15 6 -37 11 15 16 34 5 64 0 57 5 13 -55 -26 19 2 -30 -20 -21 4 -18 -34
4830 -34 -17 -50 -10 -36 -41 -1 -8 -19 0 25 19 -6 -8 -19 11 39 3 7 9 -43 49 -8 34 -60 11 47 8 22 19 14 -5 16 30 -8
4864hJ3m6L1L2jp8N8m9N0J7o8L2P3o0Q5n5n4M9Mm9M8%j3LJ2j7rj5M3k6k6J9M2
4897C7q0N7j3%MRjm3O2r6O5J1k7JQl6K1K6l2lM7oJ5k5k8K0n4oR8p2J4M5J6j3r
4932A2PL5nj19R7j2k1K2qm8J13J8q9L1k9k1kO2r1L3J5NK7j7k3N3k8j7l4K2O4j3
4964C9l7OK4m3K9j0l6jnM5n8Q9j05P6l9O6l2O2j3n4J0l4mL7j5j9L1M4o6M3l0j9
4996a9K2K0o9K0M1j8j0njJ3k6M4j9l8N5m0K1K5k5OQ6p5j3k9K5K0K2j3J9q5N8l3
5028b1O2Jm8K0M9j55J34j6qJ1m9O5r6N9K5K9Oq1N0l1m6K2k0N9LJl3jM7q3J5KO1
5061C3m2K4l0KN8l2K6oQl2j7l8J4j9K7LL7o2J4j8mN3j8RR8p6N2l4o0J8L2MJj01
5095g6K6K5M0Rl1Q9j25J06l9K8k8m9j8L0OK0n5N4L3q7M8k9J4l2K9L9j3kj3l3k
$$ plain form
4864 -8 5 -41 -10 22 21 -57 1 -48 2 19 -49 -17 56 -4 81 26 -28 21 25 -24 24 24 11 14 26 9 0 -15 28 2 -24 -5 37
4897 37 -43 14 1 1 5 14 13 -30 32 -64 1 12 -15 -14 -6 -42 -21 5 -27 -30 17 11 26 1 -27 -7 -61 -67 31 -41 -27 18 34 21 12
4932 12 19 54 49 -70 27 15 -6 16 8 -40 73 91 2 33 4 -17 -19 43 -48 -15 0 5 32 15 -8 45 17 0 -34 -12 52 39
4964 39 2 8 32 -11 18 8 -28 -29 -34 11 -47 42 -63 13 -26 40 8 70 57 3 13 -21 -25 12 -3 -22 9 53 -13 30 0 -19
4996 -19 3 23 -46 -26 15 -3 -13 -18 -19 -6 -32 12 -7 -45 10 -30 -9 16 -9 -3 83 8 -5 -34 -9 11 33 20 39 -46 12 -21
5028 -21 41 42 -6 14 63 -92 42 26 18 29 -20 45 -51 8 33 62 68 -13 37 6 -40 -18 -38 21 24 25 -8 -9 38 -45 -30 -28 33
5061 33 -9 15 -15 -13 45 13 39 33 41 9 -8 -46 -32 -51 -24 -21 16 -46 -32 -50 -54 -1 -19 -10 88 12 64 30 -30 -12 20 24 25 -76
5095 -76 -50 -25 15 24 -7 82 -43 63 24 52 24 -25 -43 -13 -7 13 -42 12 45 -42 6 -23 -9 -41 -12 27 14 12 -1 -34 -36
5126c6O7m1K1jj9M8o7K8n1M3L9m6oM1l5P4n9J5J3k7J5j0J6k5N0n4RK7k5N8l7q
5158A7Nk0K2o3M7K1k1M3m7J0o9K3Q2l6j5j9RmJ1M8l4J2kJ3mj7mJ8m0oj0K8J0j3
5192eMM1p4Q5k1PjJ2q5N2m3K6J0k7rNLP4p0rN9n4M2kRo3O5Ok9Kl8N6m9M3M2j04
5228d0K9Pj5J4MJ4m3JN1k6j6m0P8l1R0p2L4o7N8m2M1qj4j5L7o2j1N5o2J2J5K4
5260@n9N6m9P2N8r1O3j3l1j6R1r0kK8m9R9p6J4nJ1j3k4J4j0J5M0J1q2L2n8L5J4
5292a5K2m3O4l1pJ0K9j7Kl2kM9j9j1K0Kl2J1L2l7k2Rl4J14m4L7n7l5J2M5n1M3
5324A2J8%knk3n6M8M5l6J1k9l4J2J4K8ll9j4P8m7N7q8J14Kn9k6j8L7j0L8n2O8
5356D1m9k0n4J17l9o2N4l6P0j5k2J10o7K8m5OK8q8J5L1%rJ3J0M6q9K6K6j9mO0
$$ plain form
5126 -36 31 -10 11 10 -9 39 -28 0 -51 -8 31 -15 -21 20 -15 59 0 15 28 1 16 6 22 -3 47 -7 2 29 4 62 25 17
5158 17 22 2 24 -39 8 29 8 51 4 14 -55 -32 50 14 -1 -20 -11 -15 -4 44 10 22 20 33 29 12 8 26 -14 -20 -30 -2 8 -5
5192 -5 -1 40 -34 51 30 37 36 48 -37 15 -28 -2 8 -19 -28 -23 -20 54 -16 -25 34 -20 22 20 29 -34 31 37 8 10 -28 28 -21 22 64 -40
5228 -40 -11 -4 -19 -5 -1 13 -30 -29 22 -4 -20 -60 18 -13 77 5 39 -28 30 -12 29 21 7 -8 29 -33 -44 11 -51 -39 -24 0
5260 0 -59 -3 -52 20 78 -13 50 37 6 -10 81 -9 -11 17 -32 67 -9 5 0 11 -2 -26 -12 -22 -7 33 44 -38 -6 -64 -29 -15
5292 -15 7 -36 28 -3 -10 0 29 12 14 -18 -20 29 10 -1 19 21 -11 0 32 -5 -27 -18 -52 62 18 55 -2 -37 -25 20 -31 12
5324 12 30 30 28 23 0 -56 -8 37 1 12 -17 -51 -39 -25 3 0 -39 -53 25 -22 35 -53 61 63 4 -22 -40 -3 -13 25 -27 41
5356 41 -8 -28 -82 35 -4 -66 -12 -48 22 7 -15 95 28 56 11 17 45 -43 -28 3 3 -6 7 17 63 -26 0 26 7 3 63
5387F3J6j26K3qM3l1K2j9M0nK7k5qKL8o1K0j3K0p5P4l9J4l9N9M2l9Jm0oJ7l7M9
5420aM6l4o1L6j9J4J1k3K1L2l8m2Q1Oq6J04n2L7j4Ok8MJ4qL6q3Q3k9ll0N0K8m1
5453A7n3K3M4J8jm0J1o2N6j7j9j2L4K9ln5O0J9m5l1ON2nJ8p4N0j4J8LpJ7n8QK
5487a1M3j01P2K5Nk5l1N2Mn5P5q2L7jl3K5p1N5k1M1O5q4NJ1l7M6kNJ0Rk7j5n6
5520f7K0Q0l0k3MN4l4Jl0J8j5l0K4MJ8k1J0K7J8nOn5M7L9j31Q6k2L4l5QJ5j3L1
5553C3L7p4L8m2K4m0N4l6l6R5k1m9LN3Om3pK5l3NM3m0lJ4J2j5K7o6%N7Ml3k6O2
5587B8qj0j7J2J7k7j8j3N1l6K1k1J9k0M0J5j8o3N6L0l5n4O9m9K1n3P7Q2r7O9l5
5618C3j2Ll4l5N2k2M3r4J02k4%Rl3%M3k6k3M6Pm1j0N8m1lKJ0j4N7o9j5qj2L9J6
$$ plain form
5387 63 79 -47 -24 -32 11 -20 2 -17 23 18 45 20 12 14 52 -9 11 -2 18 -57 17 -22 -8 -47 12 54 15 16 -24 -30 -13 -50 -1
5420 -1 45 11 -50 -14 -33 -19 -8 -31 -10 22 -16 -58 23 29 -57 47 -5 32 18 24 -4 0 14 6 42 -41 42 13 10 -20 30 58 17
5453 17 -36 -13 31 49 48 8 19 -43 13 -4 -23 -35 -1 28 25 -30 30 49 4 -27 -21 31 26 44 -30 20 6 24 27 20 37 -21 -13 -11
5487 -11 32 -69 3 28 33 8 -23 29 33 -22 53 -29 8 7 -26 -1 -72 -17 -38 3 68 -16 -11 0 -37 9 7 12 22 31 4 -11 -67
5520 -67 -47 33 3 -20 -16 38 4 5 -25 -7 -22 -52 -28 -24 -6 -27 -17 10 28 23 29 -26 21 60 -71 15 -7 27 -8 0 15 2 33
5553 33 70 -4 34 -8 16 -24 30 -6 -42 53 32 -17 -14 39 45 2 -5 20 -13 -8 35 -5 -8 6 18 3 30 -36 -36 21 25 -8 -34 28
5587 28 20 10 -7 5 22 -5 -23 -36 15 -21 0 -21 -2 -22 18 33 15 -48 8 38 3 -51 18 -31 -10 -63 14 96 -1 68 33
5618 33 21 24 -10 -45 7 -15 28 -66 36 12 12 21 -12 -12 31 5 -18 28 35 -6 -16 42 1 -2 0 10 -4 53 -16 -31 -39 -51 -12 4
5652Dj8NN0j0l0Ll1O8l0L8l0M0r1N1l6J2l2N6N2l2n6N2L3k9m0K3j4j4j3LL8J3
5684C5jr3Q1K9n2k1j1O9n1N6n4L9l4P9k3l6K0k6kN9j9l0J8n4K0m5J1R6p4L1m5
5715b8K4O4n5n1M0Nk9LM3o4J16n7J4l1qj8N7m4K1L1L6q5K2k5K2M1o6O9l8Pk8K3
5747A1qM9n0L3Nn3k2N7q2J39n1j0j7L6p9N4J7p6N6n1N8j4N%kl0KJ5k3P6m0M8m9
5780DkM4o2k6M7L3l3n5MO3n0k0P7qJ4k8jKk9O3l7J2K4k1n9O8o3M8j8JJ1L0k7N2
5814E8k7l9%j0L8oJ6Ml7k3K4J1m8N3j1Qj7Rj3mQ4m9l3RK2k6L9k8n7K1N9k6qK7
5848B0K3j1m3K5j0n6R6l2j1j9m0L2M3l9J2L3K5ll6j6N1%k8m3j1P2l3M5m7k9O7
5879C7n0n0Q7qJ3l8jL0o5n5J21k6O7p1L6m5j5J2K8Jm2K2j0M6l2L7j3n0N1m2L8
$$ plain form
5652 4 -14 -9 41 31 1 4 -27 41 11 49 19 59 -32 19 -17 -5 -37 19 71 39 -17 35 68 39 -1 22 8 -6 -19 -16 22 35
5684 35 34 -59 22 51 -1 -22 -33 36 -15 41 -13 26 -8 71 48 12 32 6 4 63 44 14 32 -22 -2 -47 -36 60 -14 17 -28
5715 -28 -4 60 5 -46 -6 -1 -30 -27 16 -48 68 11 25 -6 -14 -32 25 -19 2 33 69 -16 6 -19 3 44 -22 47 9 16 -12 11
5747 11 3 52 2 35 40 -13 -35 22 -60 79 28 18 1 37 -42 12 29 -47 9 -42 16 2 7 7 5 -25 -23 -8 -31 45 5 53 4
5780 4 2 46 -16 -42 5 38 5 -50 -46 17 -33 -53 24 16 30 2 1 3 -26 37 0 12 36 15 -44 24 -39 9 -9 -8 3 33 6 58
5814 58 31 -8 -8 -18 20 14 30 34 -3 -26 -2 9 -39 14 3 11 -6 3 -10 -14 70 21 -12 -3 19 -7 32 4 -53 -32 27 1 -7 20
5848 20 43 32 -11 14 4 -52 44 12 1 -18 -58 -26 17 -22 -10 23 48 45 9 -7 44 44 16 -27 -38 34 1 46 -1 -30 37
5879 37 -13 -63 24 16 29 -9 -10 20 -45 -100 21 -5 62 -9 27 -18 -33 -21 7 8 -34 -12 -22 24 -8 29 16 -34 17 -25 13
5910A3J6j2j1JLJl9N9m6L5k2M2l8K8k5j3LmQO6k6o0K1N4n1J7O3n3n0J3j1J2J3
5943Gj4%K2L0m2m3M8K1l8%K1J2n5J1j1lO7p6L9j2L0j8Rlj5K5m2Q3q4P1l1JL9j6
5977C3rk1k1N7j4qlJ5k6O4o2j3J0l6L5l4L2lpQnnK4j8K5K4j42R6K1k3K8j02O5
6010a5Jj4JO0po1J7J0j0j0k3M0nLJ3M4q9jrJ10m6m3%j4N7K4op4O6k6K7M5m1KJ7
6045D3m0N4q7K7Ok0j0k3K4l1K6k0N1k3M0rL1k2k4l0N7k3jl8O1m6L2oo1M2K8n2
6077d4RK9N0J8l8m7J8J5Om4N2o7O1rl1M7jj9K2l6M0j4j5l5PO9l3K0m6K4nkm1K8
6111a2P3j2k0j8m0L5K2n3Q1j08J4M3pnk3N4j3j1qL4opk4j3l3O3j1K9l3l9K5RM2
6144B8k6k5kK7J0k2Kj5L1l0K4n1jJ05n6J6qm5P4l5J1m1O6j4J3K0q6K8QL9J4km1
$$ plain form
5910 13 29 17 6 7 10 11 -28 31 -15 20 -2 40 2 30 5 -8 -5 -9 -1 65 39 -21 0 54 3 20 83 30 -20 -7 -18 -6 7
5943 7 -7 -7 15 45 3 -40 8 29 -9 -9 12 24 -31 -20 -31 -34 33 -43 -4 -16 14 -4 5 2 -13 12 -30 53 -31 40 9 10 49 33
5977 33 24 3 -18 39 25 17 14 29 3 67 5 -8 2 -34 1 -33 -1 -4 -11 -3 -8 -13 11 -7 18 42 -100 -4 17 -6 22 -80 -15
6010 -15 -14 -28 -27 33 26 -35 -18 -8 -18 -28 -51 -11 -16 -13 0 44 -45 -46 -55 55 9 -34 -34 -48 9 33 27 -47 19 -7 20 65 24 26 43
6045 43 3 57 -30 -3 3 -17 -27 -50 -26 -57 -31 -51 0 -23 17 8 39 17 -7 -37 20 -3 -4 -42 19 -27 5 -1 -62 -20 8 -44
6077 -44 -35 -6 44 62 24 -23 -5 10 16 -28 24 -43 18 9 -22 25 24 5 27 -9 31 17 2 -33 -26 43 10 30 -16 8 3 1 -40 -12
6111 -12 61 49 29 11 -29 6 28 -25 56 -52 -38 5 -2 -7 -30 24 11 0 -8 26 20 13 -11 -24 -57 6 -5 24 -9 -48 -23 -14 28
6144 28 2 -23 -25 2 12 -10 -8 -23 8 -22 2 -49 -50 55 -1 15 7 -38 36 1 12 -29 37 23 36 56 -30 -2 6 45 59 57 16
6177A6m2K6j3N0n0kJ1o2O1L4rk8J4j6J4PJ5mk6J1j8l3Q6L3q5N3ln6L3k6J3J2L
6210A9j9j11J05K6m7M3J0l5lN8L5p9l0M0K5m5QRrl6K6J6nMK1n4jL9J1l9O0n6R1
6243G7j05M7lM8q3mNM5o5K4J4K0k7j5K0jk4J5j4l0O1K1l5K7k6J4l8L7m7J0J2j4
6275c4K3K0nl2JR%ON6q6M7OK0m2K3l0J8L5r7k1Q9L5n0l4K9J6l4M3K0o0J9rK7R
6309A7lqn5P8k4k1N7m3Q7m6m2l9M7l5lM0KoL%Mk5j8L3J1njnM2r9R0L5o9Lm2M3
6345Cm1J7RL1n7N0Qo9N5JJ3m0k8K0K7m5pL3L1Om8K8L5n5M9m8L3J3K0m8J4J0oM4
6379E8q1K4Pmj4J05m7n9%M8l6lJ8p1Q0n8J8J2K4mj2mJ7%lp1LO0j6J0j2K7j9ql
6414a4N2j1j9o4P5n5RQj3JP1j3m0L4k4j7O2m8%J1K8j0o5PL8l2k6L1N3n1NN3l8
$$ plain form
6177 16 -26 0 -13 37 -13 -15 -4 -66 -5 29 20 -8 6 -10 4 11 26 22 -4 7 -11 -44 42 75 -10 43 40 -16 17 -9 4 16 19
6210 19 0 -111 -6 20 -27 16 26 -9 -12 46 81 2 -28 12 37 -8 0 9 0 -36 -10 6 1 5 26 -28 -29 10 21 -18 42 -14 77
6243 77 -28 19 16 64 -19 -23 -18 27 -38 -14 0 20 -7 -22 -2 -3 -27 -12 -26 -56 5 26 -9 18 -8 6 -32 5 -42 -32 -20 -34
6275 -34 -11 9 4 -28 -27 -18 -18 -12 44 -42 5 11 31 -11 12 -18 0 35 -62 -83 6 41 -9 -43 -14 2 -32 11 31 -29 -10 -19 8 17
6309 17 14 6 -49 29 5 -16 41 -2 85 39 -3 -42 5 -30 -33 7 9 3 6 6 10 -15 -33 0 11 6 5 0 42 -57 33 68 -1 2 -40 3
6345 3 -38 -21 -12 19 -38 12 20 -49 6 7 20 -20 -48 -28 -1 -46 -53 -20 11 17 -31 -3 32 -23 26 -22 11 24 44 -4 10 20 14 58
6379 58 -23 1 8 4 -10 95 48 -11 -11 37 1 -2 16 -55 25 -33 -15 -3 21 17 5 1 18 18 15 -56 -53 7 -9 1 -11 16 -3 -11 -14
6414 -14 38 27 8 -56 19 -36 -27 -19 -32 -31 40 27 -13 21 -3 -20 42 -6 -6 5 33 23 -42 -35 3 -29 -55 -24 29 -22 -17 36 -2
6447bl0J7nJ8o6K8L5k3J0K3j7J8rk2O7l7k8nJ24j19L1JnM8m9l7L7L4o5kJ1M8p0
6480d1L2j4N4m2NL6j4m2K6J8l5O5q5P8m8l1mN2l9MO9o1N2k2pL5l0m8O8o0M4o2
6512d7K3J7J0j2jk3M6j7lOl5N8j9N5o8N3q1P7j04P4K2k0j0qj3J5j1LP8l2J3j09
6544f3K9J3P3k6m3M3J8n3l0MJ7N6p1L7l5kK6j3M8J4n9J9M8l0nk9N0p0O9j03J03
6575C5m1k6M6K2k9J1k2j2k0KjK0M9n1N1q2Q8Nr3j3Q0n2K5j2J6LK6j5j2K1LPl0
6608al0N8JQl9O5q1K5j5L4J5o9O8n3P5n8NmL9k8Jj1j1rJ2J6OJJ0l5N0m9j9N7o7
6643c3k0P3l9mQK1l5K2n3O1m0N4o6NK3RM0l8M6n9J3N0n2jJ7J6l8J0O7p3OP5j1
6676E4q0k6M2Mj5L2jj2%P5j21P2nj0lj1N0p9OM5l0K9m2K6j8K6J7J4p2K8L6p5L9
$$ plain form
6447 -2 -32 -15 -20 -2 -68 -40 -5 -28 -18 5 -12 6 -3 -25 42 5 -23 -28 96 -23 8 9 4 52 3 -34 3 37 -28 -30 -19 29 -41
6480 -41 -9 -23 31 -11 -6 30 16 -26 0 18 -17 48 -37 41 -7 -38 -42 10 -29 -25 44 -17 35 13 6 41 11 -37 31 -29 15 -47
6512 -47 -24 -7 3 -9 -10 -33 13 -4 -7 -1 -36 22 3 58 -10 43 -38 39 -65 9 31 11 1 -7 -20 -5 -16 -13 65 33 46 -63
6544 -63 -34 -21 52 26 -17 26 44 -9 -39 -35 -18 38 -33 4 -31 -33 -7 -20 28 42 -17 2 50 20 15 -14 36 -34 35 -68 35
6575 35 -6 -32 14 36 7 18 -4 -16 -36 -34 -35 -15 34 -17 34 -48 40 45 -48 -61 19 -33 -8 -20 -4 -1 25 10 -2 19 22 29 -1
6608 -1 -31 27 28 36 -3 62 -19 6 -9 25 40 -29 39 -14 61 3 8 4 43 15 16 5 -6 -15 -3 13 19 20 30 -5 45 -4 -23 34 -33
6643 -33 -53 20 -19 -23 -15 6 -29 -7 -60 1 -39 15 -51 -46 -23 -14 26 -12 34 -25 -12 38 -14 -15 2 18 -20 -10 57 -16 -10 65 54
6676 54 -26 -52 -10 -6 -21 11 10 -2 -2 73 -48 24 19 9 6 -5 45 -34 -28 17 -13 16 -26 0 -18 8 25 39 -33 -5 31 -44 -5
6709ejj4L2M8m5k8J9l4P7q1K2PL9m3k2M0l1L2n0R5m2k9L6j9m1RK3L1l5L7J3p4
6741c4L9Qm0n1R4Kk4N2k6p1L2N6k9K2q7k2O0L2k8j8N3l9M0j4L7n9lO6q3P2L1m0
6773B8Mj2o2M3P4Lj15K5m0L1K9pj1L0K1o4N2m1J5K6o8L7L5l7rKM0J0l8J4k4L7
6805B8pQpkj0K6l5k5l9O4rRKJ5l4j6L2j1Rj7M1m5M7k3J7k2qn8R3n2J4L7j2rj7
6840a6nQ3l6qqJ2m0k7O4n5P6k1o6R1j4j1p5N1N8l9k8nK0l4O1Ko0N7nk2l7l5R5
6873B3m9K5k9rP9n0o0J18p0M9o7R1Mq2L8j1L9o8L2j7jKP2k8l5k9O9k9l9M1J9k2
6905Fm8L4j5K2k4PM9J7p2PN5k3k1K3J9j9J8p0J03n9M3j1j8KKl7P3K0n7k6qJ3l2
6938b7L1L0l6L6J7o0K5k3L0qLk5M4m0llJ5k3j1O2l4Nj0K7l5K6K6kn8K7M4m5j1
$$ plain form
6709 -5 -6 -20 12 60 15 -13 6 -28 49 -32 -10 -3 36 -7 -29 11 -20 12 -38 57 15 -14 22 3 -38 -29 -6 25 -10 27 40 -34
6741 -34 5 13 -27 -78 16 18 -6 46 20 -51 -19 37 8 30 -57 -79 -19 13 -15 -33 20 -19 21 7 44 -15 -18 48 -35 37 68 28
6773 28 32 20 -42 1 75 78 -37 -12 -52 -21 8 1 -10 20 41 -23 29 -12 3 29 -39 -2 33 -4 -13 -11 29 39 1 15 -9 28
6805 28 21 29 22 20 10 36 1 -24 -63 1 -8 1 3 18 -16 -32 0 -11 -2 -19 22 -23 24 1 18 -4 -12 -70 23 -29 -15 22 10 1 -16
6840 -16 -21 62 26 18 10 22 -18 -45 19 -36 40 19 -47 44 30 19 -56 -5 53 14 -14 -19 1 -33 28 30 -30 27 22 0 -37 -72 23
6873 23 -26 -1 -30 -39 40 -10 -70 48 -22 27 -40 51 55 -27 11 0 39 -29 3 -14 -15 -13 59 31 -4 -33 36 7 -32 9 28 6
6905 6 -42 -8 -23 -1 -25 -18 31 48 -24 -17 38 15 -6 17 36 17 35 -35 68 9 52 41 23 25 27 -10 63 83 26 0 -8 5 -27
6938 -27 4 34 -2 34 51 -9 16 -7 23 15 18 -7 37 -3 -6 -9 6 -17 -28 34 0 5 -5 22 -13 13 39 37 -21 6 50 5 -6
6971fM8pl9L3k9mqL8m6J3J6mp2O0L9l9K4p7L3L2lN3o3J1K4l9P3m4J5o2N3j6n1
7004d4K2J7j6K6j9M1m0pM4NK4k2o4P1l2mK5l8K6o8R3n1L3j8j0J7LMl5M0m7M7r1
7037f8N5n5R9L1l1Ok2p2M1j6M2j5qK4J0l2MK9l1J4J7qJ2qj0m5J03m5M3j46N8J2
7069a2j3%K9Qj8P0p3mN2l5M5L7j39P2j9mO5k4o0MJ1N8k5j5l3O0j5l5nOKk7M2J6
7103B1pk9loJ0L1m0kN2j3p0R2k9M1p0N7o5P4p0L9j4LM4o3J7K5Jl0N9j07L2M2n4
7136c2Q6l8k3K5m6M8m3L2M6J6j07J2K7l2J7LJ8j4RQm3P6m1Mj8K5k2mK8l2j1MM5
7169B3j0qO5q2m3Q9Qj19J15Rr8J6N5l5j9N2L6m8j2L3j9OoL1J9p9K5J2k2l4j3L7
7201a6O0m3m7N8K6q2R1k9o0L4l7O9o2O7J0p0N3j2jn9M0J8j4LL7l6N6p9ml7O3k
$$ plain form
6971 -6 42 35 -4 29 0 -4 -12 26 -20 -7 9 5 -67 -7 32 -7 17 -60 -27 5 2 55 -8 3 27 -12 61 17 32 -30 23 7 -44
7004 -44 -22 -5 -21 5 -14 27 -13 -20 24 29 53 31 -33 38 6 2 27 -11 15 -53 40 -11 22 4 -6 11 14 18 -17 23 -24 23 -68
7037 -68 -13 -68 31 62 31 37 15 -57 -16 -32 10 -5 -13 11 21 -11 -7 22 -9 5 22 14 26 18 8 -37 66 21 64 -82 -24 -12
7069 -12 -25 -25 4 12 -6 64 -9 -13 39 4 49 86 -53 19 0 -4 61 37 -23 -19 -8 50 25 10 -23 37 22 -13 -18 -12 -10 -37 5 21
7103 21 14 -15 -18 -24 -14 17 -23 -25 27 14 -56 36 7 48 -22 35 -30 44 -26 13 -1 2 46 -17 0 25 26 -4 55 -52 -20 22 -32
7136 -32 54 16 -7 18 -28 20 -23 9 55 71 -36 -24 3 -29 -12 -9 9 -5 4 12 -31 45 4 8 -10 15 -7 -11 17 -15 -26 -22 23
7169 23 13 5 70 -12 -55 34 42 -77 38 47 -51 -35 20 -15 -34 18 54 6 -6 27 8 14 8 39 58 -21 4 16 -6 -40 -53 -16
7201 -16 44 1 -46 12 38 -44 47 18 -42 -8 -45 24 -38 29 39 -31 22 10 9 -50 -10 8 -6 -3 34 -2 54 -25 -29 -66 -3 -5
7233eRN6j15K3N9k1J0k9M7m8K8m6j2K3m8P8K7Nk7nK1k2j0N7qn4j5K3K3ok1M4m
7266C7k6k8MJ6L6n8L1k1M8r8RL5%Q3n3m4K9l4KN3n7K9K8Klm7O0k1N1m0o8J0J0
7299b5mL7k7K2l3j1J4L2J4qL3p7O5n0PK1Ll2K4j5J0L2l4Oj0L5m9mpJ7PnL5kJ7
7334C8j1Lk2OKpo4M5k9N4oo0K0J3L5o7M7J2q0J25l5k2nk9L7j0Oj9K0lm6O6p5J5
7368d6J7J3L3m3J9NJ3nK3j7ml3J2j2N1l0M1l9O3n7qL8ql8L5n3kM0Rl6O0j7j7k1
7402a4k8M3l3RoL2Lj5Qoqm5M9kJ3K6J6k2lJ5m7kM0l7j6M4Qj1q3P2rM3M1q5L8o6
7438c8L5L1m5L0QLM8n8m3J3L2j5Nm1M7M1j02J3N8q6O7L5rj9n8O9Rj2ll4j6PM1
7471A3lk0k6K8kP3m3jP6j08K1l3L3l1k0M9L0m0JJ3p2N3M7l8N0n9K7pPm1J2qK6
$$ plain form
7233 -5 4 60 -55 -32 27 6 16 -13 34 -14 14 -32 -44 -21 -69 9 36 41 14 9 30 8 -2 55 47 -7 -22 1 24 18 -3 41 37
7266 37 11 -17 -13 3 39 -19 12 -9 39 -59 -50 -15 -15 68 15 -29 0 -34 -32 21 -36 -7 21 23 20 -27 33 12 63 23 -45 -35 -25
7299 -25 -29 8 -19 3 -30 -41 -27 5 19 11 44 -33 32 -18 -11 10 13 -19 5 -10 0 32 -2 4 -6 29 -20 -24 -31 -14 -7 -12 23 21 38
7334 38 27 30 8 14 16 9 -55 -10 -39 15 9 -51 -31 -18 17 -50 -3 9 -71 54 19 -3 -8 -37 0 -10 -4 -23 -3 -6 -52 14 -61 -46
7368 -46 -29 -16 17 -26 -7 -2 11 6 29 12 8 -25 -13 -25 26 -4 37 -2 61 4 -4 34 26 -12 23 -30 -32 8 17 -19 41 24 7 -14
7402 -14 -42 1 -32 -23 -29 3 6 -9 -1 -7 -15 -60 -11 -13 0 26 42 20 17 32 -15 -17 23 -14 -30 14 22 11 -72 0 -9 34 75 -10 28 -38
7438 -38 -3 28 -17 13 21 24 72 14 -29 -16 16 1 6 -35 12 53 -49 -36 22 -64 3 38 29 10 -48 21 30 18 15 -19 -35 -28 13
7471 13 10 -10 -36 -8 -10 63 20 19 95 -13 8 -25 8 -23 -43 6 36 -4 -3 10 -62 -9 38 0 50 -9 18 11 18 -23 -11 -19 7
7504Gj0o4L8K3Jj0J1L8l7M5j4o2K9J2L3k6qoK1m4K9j1jL2l4K7k1M1l5m0M5n3J03
7537E9j00%J03p2N0o7L5ln0J7OJ5J8MK8l5j5J2jj5RO2j8j7l7m4O2NPm5L8k0J4
7570EM0m6L7j6j0J6l1P5p6L3Mo1K0R2r1N3p8O3j1n9O0pj3j2N2k4j6j3J4J8o2Q7
7602D3m6K2nm0L3j8N0k2o2M5L4j5k0J1J1j2k7M4j3k6L6l3O2o6JK9qLo3L8m0k4
7634g8R5kq5N9K5n4O5k0K6p7P9l8l4J06o6O4p6M5o4L8j3j4l6M0M8qjj8n0M5QN3
7666F2m1J0Ok3L0m7L9J6j20R5Lp5lO4k7K9m3rN1op0Q3J4n0j0j2N4j8L6J1k8o1
7698d0K9K0l6K6rjPn0K0Q2jn7mK5l1J7J3m7qj3K2Q5n0nm8N9m1O8l9J8M1o9l3M6
7732dQ5q6k3K9J6k6K0K9q8LK6P%nKl6jM5rL6Mm3K4Q5j00r%O0oo7N9m2NK2JK5m9
$$ plain form
7504 7 -3 -67 -29 -6 -5 -15 -4 34 -3 42 28 -34 -5 7 40 14 6 0 21 -23 6 -5 -6 26 -8 19 -2 39 4 -36 9 -44 59
7537 59 -41 -41 62 -10 40 -27 8 5 -45 -28 -22 -7 11 15 43 8 -7 5 4 -11 -2 60 42 25 -12 -56 6 11 18 -27 11 -9 5
7570 5 45 -1 36 20 10 26 -5 70 -6 27 31 -30 -10 82 -9 44 -34 29 18 -41 19 12 -1 -13 39 15 -1 -14 0 18 -44 43
7602 43 -3 19 14 -26 7 -11 39 17 -45 0 34 19 -1 10 21 9 -18 26 13 -13 23 -10 52 -14 -13 16 8 11 -52 -14 -54 -78
7634 -78 17 15 -70 -11 14 -40 25 5 31 -46 33 -5 -39 67 1 65 -11 34 -30 8 -5 -19 -55 -15 33 25 24 6 -44 1 9 62
7666 62 21 31 37 14 44 -3 36 52 -68 27 30 -45 -48 16 -11 18 -25 -34 17 11 -59 24 38 -12 -22 -34 20 2 38 49 21 -40
7698 -40 -11 9 -27 -1 -10 -11 -4 -54 -34 48 47 -10 -14 11 -20 -3 10 -37 -45 -58 -36 49 -1 -6 -54 5 -36 32 -7 11 52 -17 -50 -4
7732 -4 81 -5 -28 1 17 -9 11 40 -48 -45 -19 -12 -12 -17 -15 -51 -52 -7 -16 20 24 -19 5 90 -10 -19 -19 41 35 -32 27 -15 -10 12 13 38 -11
7769a1N7k6l8Pj7L8O3r0kJ5j5L8j6n5O4k7K0k1L9k8j3M0p5N1m4M8K6m5Q7m5o5
7800d0M4oRK8o7R3o3J4j0OL7n4LqM0Mm8L6oK9p6L8RQN1r2K1Qkj8Ln5M3PJ4K0J2
7837C2q0P4k6M2q9%N3J4M0o8M0l2k0N6J8m6rK3n0J5PL3p4R4j2Jo4L2K1k1jRl0
7870a8M1j9pJ4n4N1pm1O9m5M9Qk4P6r9M9m7oL8j5J5Qq8P2j1j7M4q1M9L0J8l0l0
7903hOl8P2k0M3k8o4O0n9N1m4k5L3j3rPJ2J8J9j7J1j7L2P6j02J4l0J2KJ3Rrnm4
7937d2Q5jj8jK0o8K9Lj8jj0K8l8k3N1KK8l4N0Pp8J0ol8P5M2j9m8k1N2k1j1L1k1
7971dL8j8lM4j07RL5J2l5O6l5pOnQRJ9k7M7l8r4J26K2m7m5J1k0RO1m2j1J0l6O8
8005B6j4mk3M4n2k0L8J0qK7n4l2Q7l2j8P9m0k6JO0l1rMl0P2j16N8M9k9J7On4L6
$$ plain form
7769 -11 46 20 -18 -11 -28 10 73 -17 -19 -4 -19 19 3 -52 12 -15 5 -16 23 -5 -18 22 -53 -2 -46 2 28 -17 70 25 -40
7800 -40 4 -2 7 35 -32 61 -2 12 2 8 45 -9 -6 -14 26 30 -18 18 12 41 -35 3 12 20 71 -21 0 8 6 -12 -9 -64 -21 -14 0 20 32
7837 32 -48 26 0 42 -47 -47 6 20 60 -8 32 0 -20 36 54 8 -1 22 -28 -13 -6 27 -47 47 35 36 -28 4 25 4 3 12 -18
7870 -18 23 4 -3 11 -43 8 1 -40 29 -16 33 41 17 93 -6 43 -4 -10 28 13 28 36 -52 20 9 -8 36 -45 4 34 52 22 -8
7903 -8 -2 -40 32 12 55 27 -37 23 -36 15 -29 -54 -21 -34 -43 -36 -24 -6 13 -4 7 -10 22 98 -4 10 -20 -8 -6 7 16 7 2 -42
7937 -42 43 42 24 23 43 -25 4 7 -11 -12 -22 6 -32 -55 -4 -2 26 -8 42 49 -29 -19 -25 -63 12 54 35 -13 -34 18 -3 -14 17 -4
7971 -4 34 16 13 57 -50 -41 -6 6 -29 37 2 -5 1 -4 4 13 32 5 52 14 -80 46 68 21 -24 -13 -33 -24 37 -5 -16 -6 -42 26
8005 26 12 8 -15 29 -23 -43 -5 5 -3 24 -30 -62 25 -7 -25 54 14 -12 -11 49 18 9 13 -17 55 -61 -3 46 17 34 40 -14 22
8038B2k5J2Pl4K6lKK2j9n6O4M9j03Q7n5M7o8O8l7pj2K7K9m7M2jp9L1P7q7O2m3
8070blO9p0j0qM0Poj1l9K0O0l9j2K3j5M0n9J1J3L6m5Jk9K0P1j02L8J7lJ6n8O1
8103C2n5J5k2M3j8k9N6k4mPJ0k8mM1Ql0lk7M8m4N4k2l0pj0k2l2Q0K7J4j8m2N5
8136A9n5l2O3J2l7L8K9o8MK2oL6l5J4k6M5k8LNK9m5m4P4K2j7l2o4J05j04K7jK0
8168b7L1j6J6j8M2l2J8k2jQ5r2LJ1l9N7l1JK7L7n1j0k6K0
$$ plain form
8038 22 -3 9 16 -18 8 5 7 29 10 -46 18 67 -36 51 -4 43 -25 43 6 -1 -13 14 43 -4 38 37 -42 -11 66 -21 41 -2
8070 -2 -5 64 -6 -16 -24 16 23 17 6 -33 -13 47 8 -4 19 4 44 -15 -4 9 45 0 1 -28 -8 63 -39 -1 16 13 29 -29 32
8103 32 -23 -8 -30 13 -5 -34 22 -2 -6 1 11 -17 -21 20 28 -2 -5 -32 16 -28 26 4 -26 -33 -43 -65 -97 -17 10 24 6 -36 19
8136 19 -36 -68 -5 7 -30 8 37 -31 -27 -5 -11 25 -10 4 -22 23 -5 -2 3 32 -13 -57 17 39 22 -10 -74 31 -73 -46 -47 -27
8168 -27 4 -12 4 -14 28 -4 14 -8 -9 76 -16 -13 -2 -41 16 -15 -14 13 50 -1 -11 -37 -17
8191a7
##END NTUPLES=NMR FID
##END=
