##TITLE=1H_DE-80H_X3
 200.13MHz, d2o
 8 sc
 
 19ns.26.2.2025
##JCAMPDX= 6.0         $$ Bruker NMR JCAMP-DX V2.0
##DATA TYPE= NMR FID
##DATA CLASS= NTUPLES
##ORIGIN= UXNMR, Bruker Analytische Messtechnik GmbH
##OWNER= pz
$$ XWIN-NMR		Version 3.5
$$ Thu Feb  5 10:25:15 2026 Russian Standard Time (UT+4h)  Yarkov@DPX200
##.OBSERVE FREQUENCY= 200.1313
##.OBSERVE NUCLEUS= ^1H
##.DELAY= (6, 6)
##.ACQUISITION MODE= SIMULTANEOUS
##.ACQUISITION SCHEME= undefined
##.AVERAGES= 8
##.DIGITISER RES= 18
##SPECTROMETER/DATA SYSTEM= spect
##.PULSE SEQUENCE= zg30
##.SOLVENT NAME= CDCl3
##.SHIFT REFERENCE= (INTERNAL, CDCl3, 0, 14.3821)
##AUDIT TRAIL= $$ (NUMBER, WHEN, WHO, WHERE, WHAT)
$$ ##TITLE= Audit trail, XWIN-NMR		Version 3.5
$$ ##JCAMPDX= 5.01
$$ ##ORIGIN= Bruker BioSpin GmbH
$$ ##OWNER= Yarkov
$$ C:/Bruker/XWIN-NMR/data/yarkov2/nmr/H-C/1/audita.txt
$$ ##AUDIT TRAIL=  $$ (NUMBER, WHEN, WHO, WHERE, WHAT)
(   1,<2026-02-05 10:23:56.53 +0400>,<Yarkov>,<DPX200>,
      <created by zg, POWCHK disabled, PULCHK disabled
       configuration hash MD5:
       00 E9 B6 7A A2 85 ED C7 34 08 36 98 17 FE 4E 26
       data hash MD5: 16K
       FA 66 F2 90 A1 2E 8E 10 9D EF EF 3F AA 2D 8D 3C>)
$$ ##END=
$$ 
$$ hash MD5
$$ FC 3F 02 37 D3 20 D1 A1 9B 18 93 24 0E B4 C4 D7
##$RELAX= 
##$RELAX= 
##$RELAX= 
##$RELAX= 
##$RELAX= 
##$RELAX= 
$$ Bruker specific parameters
$$ --------------------------
##$DU= <C:/Bruker/XWIN-NMR>
##$EXPNO= 1
##$NAME= <H-C>
##$PROCNO= 1
##$TYPE= <nmr>
##$USER= <yarkov2>
##$AMP= (0..31)
100 100 100 100 100 100 100 100 100 100 100 100 100 100 100 100 100 100 
100 100 100 100 100 100 100 100 100 100 100 100 100 100 
##$AQSEQ= 0
##$AQ_mod= 1
##$AUNM= <au_zg>
##$AUTOPOS= <>
##$BF1= 200.13
##$BF2= 200.13
##$BF3= 200.13
##$BF4= 200.13
##$BF5= 200.13
##$BF6= 200.13
##$BF7= 200.13
##$BF8= 200.13
##$BYTORDA= 1
##$CFDGTYP= 0
##$CFRGTYP= 5
##$CHEMSTR= <none>
##$CNST= (0..31)
1 1 145 1 1 1 1 1 1 1 1 1 1 1 1 1 1 1 1 1 1 1 1 1 1 1 1 1 1 1 1 1 
##$CPDPRG= <>
##$CPDPRG1= <>
##$CPDPRG2= <>
##$CPDPRG3= <>
##$CPDPRG4= <mlev>
##$CPDPRG5= <mlev>
##$CPDPRG6= <mlev>
##$CPDPRG7= <mlev>
##$CPDPRG8= <mlev>
##$CPDPRGB= <>
##$CPDPRGT= <>
##$D= (0..31)
0 0.7 0 0 0 0 0 0 0 0 0 0.03 0 0 0 0 0 0 0 0 0 0 0 0 0 0 0 0 0 0 0 0 
##$DATE= 1770272636
##$DBL= (0..7)
120 120 120 120 120 120 120 120 
##$DBP= (0..7)
150 150 150 150 150 150 150 150 
##$DBP07= 0
##$DBPNAM0= <>
##$DBPNAM1= <>
##$DBPNAM2= <>
##$DBPNAM3= <>
##$DBPNAM4= <>
##$DBPNAM5= <>
##$DBPNAM6= <>
##$DBPNAM7= <>
##$DBPOAL= (0..7)
0.5 0.5 0.5 0.5 0.5 0.5 0.5 0.5 
##$DBPOFFS= (0..7)
0 0 0 0 0 0 0 0 
##$DE= 6
##$DECBNUC= <off>
##$DECIM= 32
##$DECNUC= <off>
##$DECSTAT= 4
##$DIGMOD= 1
##$DIGTYP= 9
##$DL= (0..7)
0 120 120 120 120 120 120 120 
##$DP= (0..7)
150 150 150 150 150 150 150 150 
##$DP07= 0
##$DPNAME0= <>
##$DPNAME1= <>
##$DPNAME2= <>
##$DPNAME3= <>
##$DPNAME4= <>
##$DPNAME5= <>
##$DPNAME6= <>
##$DPNAME7= <>
##$DPOAL= (0..7)
0.5 0.5 0.5 0.5 0.5 0.5 0.5 0.5 
##$DPOFFS= (0..7)
0 0 0 0 0 0 0 0 
##$DQDMODE= 0
##$DR= 18
##$DS= 0
$$ [...]
##$SUBNAM2= <"">
##$SUBNAM3= <"">
##$SUBNAM4= <"">
##$SUBNAM5= <"">
##$SUBNAM6= <"">
##$SUBNAM7= <"">
##$SUBNAM8= <"">
##$SUBNAM9= <"">
##$SW= 18.0517328524113
##$SWIBOX= (0..15)
0 0 2 0 0 0 0 0 0 0 0 0 0 0 0 0 
##$SW_h= 3612.71676300578
##$TD= 16384
##$TD0= 1
##$TE= 0
##$TE2= 300
##$TE3= 300
##$TEG= 300
##$TL= (0..7)
0 120 120 120 120 120 120 120 
##$TP= (0..7)
150 150 150 150 150 150 150 150 
##$TP07= 0
##$TPNAME0= <>
##$TPNAME1= <>
##$TPNAME2= <>
##$TPNAME3= <>
##$TPNAME4= <>
##$TPNAME5= <>
##$TPNAME6= <>
##$TPNAME7= <>
##$TPOAL= (0..7)
0.5 0.5 0.5 0.5 0.5 0.5 0.5 0.5 
##$TPOFFS= (0..7)
0 0 0 0 0 0 0 0 
##$TUNHIN= 0
##$TUNHOUT= 0
##$TUNXOUT= 0
##$USERA1= <user>
##$USERA2= <user>
##$USERA3= <user>
##$USERA4= <user>
##$USERA5= <user>
##$V9= 5
##$VALIST= <valist>
##$VCLIST= <CCCCCCCCCCCCCCC>
##$VD= 0
##$VDLIST= <DDDDDDDDDDDDDDD>
##$VPLIST= <PPPPPPPPPPPPPPP>
##$VTLIST= <TTTTTTTTTTTTTTT>
##$WBST= 1024
##$WBSW= 4
##$XGAIN= (0..3)
0 0 0 0 
##$XL= 0
##$YL= 0
##$YMAX_a= 148897
##$YMIN_a= -166797
##$ZGOPTNS= <>
##$ZL1= 120
##$ZL2= 120
##$ZL3= 120
##$ZL4= 120
##$ABSF1= 10
##$ABSF2= 0
##$ABSG= 5
##$ABSL= 3
##$ALPHA= 0
##$AQORDER= 0
##$ASSFAC= 0
##$ASSFACI= 0
##$ASSFACX= 0
##$ASSWID= 0
##$AUNMP= <proc_1d>
##$AZFE= 0.1
##$AZFW= 0.1
##$BCFW= 1
##$BC_mod= 2
##$BYTORDP= 1
##$COROFFS= 0
##$CY= 83.5205535888672
##$DATMOD= 1
##$DC= 2
##$DFILT= <>
##$DTYPP= 0
##$F1P= 10.8118882576601
##$F2P= -7.23987719738617
##$FCOR= 0.5
##$FTSIZE= 0
##$FT_mod= 4
##$GAMMA= 1
##$GB= 0.15
##$INTBC= 1
##$INTSCL= 1
##$ISEN= 128
##$LB= 0.25
##$LEV0= 0
##$LPBIN= 0
##$MAXI= 10000
##$MC2= 0
##$MEAN= 0
##$ME_mod= 0
##$MI= 1.114404
##$NCOEF= 0
##$NC_proc= 0
##$NLEV= 6
##$NOISF1= 3.799351
##$NOISF2= 2.8
##$NSP= 1
##$NTH_PI= 0
##$NZP= 0
##$OFFSET= 14.38212
##$PC= 1
##$PHC0= -5292.348
##$PHC1= 6.821927
##$PH_mod= 1
##$PKNL= yes
##$PPARMOD= 0
##$PSCAL= 0
##$PSIGN= 0
##$REVERSE= no
##$SF= 200.129724274929
##$SI= 16384
##$SIGF1= 3
##$SIGF2= 2
##$SINO= 400
##$SIOLD= 16384
##$SREGLST= <1H.CDCl3>
##$SSB= 0
##$STSI= 0
##$STSR= 0
##$SW_p= 3205.1282051282
##$SYMM= 0
##$S_DEV= 0
##$TDeff= 0
##$TDoff= 0
##$TI= <>
##$TILT= no
##$TM1= 0
##$TM2= 0
##$TOPLEV= 0
##$USERP1= <user>
##$USERP2= <user>
##$USERP3= <user>
##$USERP4= <user>
##$USERP5= <user>
##$WDW= 1
##$XDIM= 8192
##$YMAX_p= 0
##$YMIN_p= 0
$$ End of Bruker specific parameters
$$ ---------------------------------
##NTUPLES= NMR FID
##VAR_NAME=  TIME,          FID/REAL,        FID/IMAG
##SYMBOL=    X,             R,               I
##VAR_TYPE=  INDEPENDENT,   DEPENDENT,       DEPENDENT
##VAR_FORM=  AFFN,          ASDF,            ASDF
##VAR_DIM=   8192,          8192,            8192
##UNITS=     SECONDS,       ARBITRARY UNITS, ARBITRARY UNITS
##FACTOR=    0.0002768,     1,               1
##FIRST=     0,             0,               0
##LAST=      2.2672688,     0,               0
##MIN=       0,             -166797,         0
##MAX=       2.2672688,     148897,          0
$$ Real data points
##PAGE= N=1
##DATA TABLE= (X++(R..R)), XYDATA
$$ [...]
1133B159k856J45K288k050K00J331j637j19J340j150o91J712o05j187J865p06
1149C9j092K512j358j500L268k155j215L444k805l80L806m205L85M037m652J345
1165e26L513n221K544K290n542L749J201n187M238n5m377N332j239l454N232k091
1181D07k477M721k931j301M172l511n51L533l415M11K698l259J093J862k813J158
1197b03J584k083Q18Q48j775P83R81j670K26J177j486K51J430j411M39J388j961
1214f64K64J730k199N52J631k884J292J703l138J800J560l239K057Q64l024K865
1230A170J53l208L229p56k612L214j205j937L462j906j394L665k209o92L138k645
1246e33k95K717k730J90K350k841M62K058k646J147J515k705J279J361k597J481
$$ y = [2159, -697, -552, 1736, -314, -114, 1217, -420, -539, 801, -349, -1040, 672, 67, -1120, 745, 39, -1053, 1459, 101, -1399, 1869, -286, -1501, 1943, -862, -1242, 2564, -1641, -1256, 2781, -1871, -526, 2987, -2234, 310, 2600, -2942, 807, 2008, -3179, 1059, 1004, -3373, 1959, 720, -2734, 2498, 407, -2070, 2651, -280, -1581, 2591, -920, -1471, 2062, -1353, -942, 1756, -1503, -410, 1452, -1361, -203, 1381, -702, 116, 964, -811, -28, 953, -717, -491, 686, -800, -549, 881, -530, -91, 1297, -664, -400, 1330, -869, -317, 1314, -1570, -278, 1425, -1713, 87, 1647, -1592, 465, 1329, -1695, 1170, 1323, -1885, 1344, 588, -2024, 1190, -15, -1952, 1510, -396, -1790, 1875, -334, -1026, 2112, -533, -828, 1889, -841, -651, 1699, -1142, -680, 1378, -1268, -121, 1394, -1311, -32, 1329, -1268, 213]
1262B13Q60k368J595M97k205J710M34k072J845O4j842K226l62j556J990n33j598
1279a102J738n87j203J900r25j033J891p45q30J830q50n49J425j080o08J813j149
1296f4p02J508j030o11J787j269n18J968j485l32J951j718o2K020k237M19J768
1313A393k383N30J784k562J159J469k851J651J384k962J946L92k574K520l73k288
1329a765K836r79j668K816j354j023K768j849o30K271j931K1J687j839L33J291
1345I85j974O98R58j348O90L59r31O72M84p66J87N31o75j73O38l56k93P90o23
1364a47l45J259p75n84J607j452P9J476j953L38J763k466J014J444k736J665R66
1381A153k659K287J20k492K811p47j665K609j450j452K827k049m56K501k168J46
$$ y = [213, 1073, -1295, 300, 797, -1408, 302, 736, -1336, 509, 573, -1269, 957, 595, -961, 1029, 496, -1102, 636, 49, -1154, 746, -179, -1212, 679, -66, -896, 934, 84, -465, 960, -120, -728, 1085, -64, -766, 742, -288, -899, 888, -381, -899, 1069, -416, -748, 1203, -515, -577, 1443, -794, -375, 1393, -990, -460, 1324, -1238, -79, 1390, -1461, 190, 1574, -1388, 558, 950, -1624, 896, 523, -1765, 1071, 92, -1576, 1240, -114, -1137, 1631, -218, -848, 1423, -508, -487, 1200, -639, -306, 985, -989, -291, 667, -681, 9, 368, -563, 109, 593, -173, 14, 545, -130, -303, 335, -21, -314, 476, -147, -492, 767, -8, -592, 1015, -437, -358, 1118, -835, -497, 1266, -1200, -186, 1258, -1478, 187, 1153, -1506, 781, 901, -1591, 1220, 473, -1192, 1417, -33, -1485, 1342, -707, -1163, 1338, -830, -684]
1397f84K145k441Q89J412k220J154O70j813J250K00j440J262k82p95J126l80m00
1414c47P06k39k02N1Q4l4k37L89k05m08N38m30o8J011q82k9J302j456M47J051
1434A042j758Q06P79k071J274N69j938J816j36j659K369q89j197K384j515p07
1450h31K102j883j26K045k142K98J664k336J015R82j869J359N11j488J162p5j130
1467g42J244m15j021J390m46n45R72m37k11N86l11j28L00k00k22J62R8l34J49
1486a11L10n52K15M91q68O32L79p68O09J34j112J067j97r11J226m63q93J353p16
1505a75n20J399q29m30J428j264R9J190j364J76J000j384M37P86j146O38N16j174
1523f17P54M49j177R29J14j036J090k80r03J015j34q66R52k41m35Q81l14m19Q43
$$ y = [-684, 1461, -980, -91, 1321, -899, 255, 925, -888, 362, 562, -878, 384, 102, -693, 433, 53, -347, 359, 120, -82, -31, 53, 19, -218, 171, -34, -442, 96, -334, -402, 609, -273, -302, 1000, -456, -9, 1042, -716, 90, 869, -1202, 72, 641, -1297, 519, 383, -1276, 1093, 204, -993, 1391, -124, -831, 1271, -612, -738, 1307, -835, -537, 1127, -1209, -194, 788, -1081, 278, 789, -699, 463, 388, -742, 502, 87, -934, 456, 10, -535, 437, 0, -211, 375, 64, -64, 236, 36, -186, -24, 74, -260, -111, 199, -353, -138, 353, -515, 117, 496, -272, 337, 471, -641, 426, 229, -682, 544, 81, -812, 541, -175, -695, 704, -125, -555, 873, -391, -292, 898, -466, -290, 710, -674, -237, 549, -597, 41, 557, -617, 137, 586, -591, 338, 452, -584, 506, 226, -677, 338, 204, -662, 290, 49, -386, 495, 181, -238, 605]
1542F05n33m96Q15n41j62O27o43j40Q08o45L6O51o29J14M43m92K46L16o27J87
1562f0L61n86J07M29l65P3K25k13j06N25m63j31N47m32j28N50n75l9O74p40K49
1583i8O16r16N59N44j155M85M71j183R23J15j196J130j07j139J405l99q68J483
1601F70q40l47J420j254J77J064j324K09R09j390O02N32j018P43K13r86R21n6
1619B45o72R38n19m04O60l39j24M37l50L5J22k7J63j49M5Oj22K12l1l09N77n32
1641a38j64N68o69K12O42j028O24N69j173R69P0j269J345m07j068J578o99p25
1659g63J414r31k10J199j185J99J073j559P29P21j426P89M63j256J020M7r45J010
1677C89l22n02R21n18l23Q10n57n4M93o95K41K43m42L43J6k2J87l06J89J2j44
$$ y = [605, 72, -424, 391, -150, -312, 315, -328, -468, 340, -305, -269, 382, -247, -133, 310, -182, 64, 380, -247, -60, 301, -285, -178, 251, -114, -41, 184, -29, -135, 390, -73, -204, 343, -89, -217, 333, -242, -281, 393, -347, -98, 518, -398, 161, 705, -450, 35, 506, -677, 246, 361, -835, 295, 188, -951, 454, 55, -813, 670, -170, -517, 903, -351, -174, 890, -434, -225, 684, -706, -104, 428, -590, 153, 366, -620, 301, 245, -427, 511, -8, -412, 248, -91, -215, 222, -128, -93, 29, 2, 165, 16, 61, 67, -55, 157, 126, -183, 394, -138, -302, 266, -403, -191, 451, -577, 47, 616, -557, 412, 482, -787, 558, 151, -917, 661, -38, -763, 651, -280, -490, 709, -476, -277, 796, -763, -34, 687, -739, 50, 513, -743, 277, 324, -621, 389, 67, -435, 486, -32, -355, 455, -102, -156, 337, -358, -117, 126, -316, 27, 43, 21, 208, -98, 91, 103, -41]
1698d1K89k42r3L49n01N3N08p42L47M07q98P82L6q12Q64j55q07J301p68m17J199
1719F59q93j56R72j034L45P96j206N27N56j247Q75K92j106R25j37q20J006l30
1737B4n70R95n44k60R23n49k23N97n55J16L45n82J80L07l99J70M2j55J08j7P6
1758B9p1J24K8o0P1r9k25K88J07n04L43o0k95N45k46l44P53n17J0M41n42J08M04
1781B88o20M27K07o49L60L08q30O78K62o97M40O6n88N18Q7p02P22l26m69Q37l86
1802f7l22O87k96k49O13l84j94O72o76R6L62m62J95K96n22J84L30n60K17L62n50
1823b68K58L48n90L55J03m39M70j84k28K91q2j12K02o3l6N4o1o1J28j42n3P2k2
1846f0J9rO5j28K73J09m39J25L36l67J03J09m41L25K09o58O00r6m64O01k30m30
$$ y = [-41, 248, 6, -87, 262, -239, -186, 322, -420, -73, 334, -564, 218, 254, -558, 306, 151, -656, 645, -123, -540, 659, -234, -390, 582, -452, -107, 689, -517, 10, 566, -681, 194, 486, -620, 305, 168, -652, 354, 24, -546, 449, -95, -355, 568, 19, -204, 393, -162, -46, 299, -283, -103, 204, -195, -25, 17, -138, -30, -47, 29, -42, 82, 110, 50, 121, 22, -203, 85, 192, -312, 31, -29, -324, 221, -25, -369, 384, -133, -123, 318, -224, -116, 288, -332, 95, 302, -347, 13, 321, -509, 169, 431, -266, 174, 240, -348, 170, 257, -445, 277, -49, -518, 319, -67, -389, 298, 2, -247, 366, -18, -212, 460, -216, -120, 242, -220, -25, 271, -251, -67, 263, -297, -80, 282, -268, -10, 338, -252, 103, 206, -233, 237, 53, -175, 116, 34, -78, 124, 61, 25, 79, 18, -43, 85, -57, -110, -38, -60, -41, -50, 15, -113, 160, 269, -170, -45, 291, -76, 27, 136, -305, 20, 229, -429, 171, 75, -389, 212, -18, -448]
1868d48P63l51m26J010o68k9P21r23K99M19q67M18N34q69N80J91q01P48j33n02
1888c34O32l66k77P14n39P0L78m98K52K88m66J34J71m12M08j56j57K29j49r3K53
1909H2k04J42L8k36L72j60j11L57n23K80K42o11L20J79n42N10k1n11Q82m72k93
1930b80P34n33j78P32p83J84N24j053O16K68p18O97k7o54P56k22k49N64n73Q7
1950a08N35p37K05M33o19R8M05n45M07N2m55O25j01m37M61l18N8K30l69K23n0
1971gj97K70j51o4K57m36K86J63l45K19K02m84N39k09n16P34l55j83O12m31j4
1992a10N25o28J94L04o29M21J45o10O07m2n76O10j67l57O70l69j42M35m70J43
2012d6K33m22K38L05n86J38K90m17M11J7m59L82q3j20K10j20KJ03j40o2j0m9J40
$$ y = [-448, 315, -36, -462, 548, -120, -149, 572, -351, -52, 367, -500, -82, 452, -417, 163, 354, -447, 301, 168, -334, 298, -68, -345, 369, -170, -100, 278, -220, 32, 320, -146, -12, 159, -253, 155, -1, -158, 71, -78, -171, 82, -122, 20, 58, -178, 194, 34, -77, 280, -243, 37, 279, -332, -12, 167, -375, 135, 114, -397, 485, 13, -280, 454, -79, -257, 475, -308, -124, 400, -653, -37, 231, -487, 210, 183, -471, 285, 63, -186, 378, -195, -108, 427, -310, -105, 328, -291, -193, 212, -333, 74, 126, -329, 296, 195, -242, 219, -99, -41, 189, -180, 43, -7, -204, 66, -85, -149, 108, -328, -42, 121, -224, -5, 197, -287, 252, 43, -473, 261, -94, -277, 335, -96, -110, 415, -213, -19, 285, -344, 77, 222, -388, 219, 177, -399, 211, 44, -313, 357, -12, -154, 281, -189, -46, 187, -235, 3, 308, -278, -140, 150, -267, 144, 161, -298, 84, 1, -119, 91, -29, -27, 76, -64, -126, -136, -185, -45]
2035d5m8M9P5j99K35l3j16J20r6KR9j71O7K17j88rL11l35%K13k31NK56k39J46
2060H5Q5l19K03j17k23M07j58j02L45k06j35L19k12r3J93j33o6L06l64J31K91
2081B37m34R9J90k83K16J08l25K24K4k14J97J53m08L56j14j60K42p7j89M18l35
2102g5k7L82m39J92m1j17K6K10k27J75L2j39J24j25k1J58o4j3o4o8J33m9M4J06
2126A13k48P1J55k32J44K0j10J87k4k28M77k69k84N04l85q2M62m28O6L58m90J83
2148d0K98n10L14K08n00L30p3l56N80l02k13N09l24j08M22l82K0L67l40J06J85
2169A91l35K00J9k78L83j27j81K29k15J16J73l10K06M6k51L25l9k10J47k15N9
2190f7J76l53K50K15l98L29p2m53O37k78k83M91k62r6N51o24K68J84n57L12J24
$$ y = [-45, -93, -44, 31, -168, 67, 34, -82, 38, -58, -56, 43, -128, -61, 156, -32, -41, 270, -65, -65, 148, -83, -78, 178, -61, 85, 170, -149, 54, -63, -286, 121, -37, -139, 206, 0, -135, 184, -28, -121, 72, -61, -127, 179, -185, -54, 237, -197, -98, 92, -191, 25, 133, -192, 32, 56, -158, 39, 192, -216, 140, 26, -134, 108, 31, -158, 260, -75, -102, 280, -159, 33, -8, -125, -99, 111, -116, 59, 91, -48, 76, -49, -70, 88, 24, 11, -53, -121, 12, -37, 7, 113, -135, -64, 91, -141, 3, 23, -87, 100, 76, -152, 325, 56, -228, 276, -109, -191, 271, -157, -91, 267, -223, -40, 258, -252, 62, 270, -230, 100, 27, -329, 251, -51, -264, 245, -79, -187, 235, -147, -127, 240, -100, 6, 191, -144, 56, 75, -203, 180, 53, -128, 101, -114, 2, 175, -135, 71, 117, -134, 191, 152, -58, 89, -126, -67, 109, -244, 6, 221, -177, 152, 80, -373, 264, -14, -297, 194, -68, -164, 387, -237, 31, 215, -342, -30, 94]
2211I4k91L65o2l73N44k15j16K64m14l9O57o07J85K87n30L78J02n13N07j36j81
2232i4J87k06q7L47k09o3L25k51J42j6j76K03p6k55L42k23KK84k72P1O5j26J98
2255A12l3j16K49k19l5J88k78m2L42j84r1K73l69L50l3m37N47j94l07N35l12q7
2277a41K68j84JL02l62K1K19k17J54J81m22K42j31p3K75r0j88K75j24o6J54p7
2299A7k31K99k14N1J06j42J72j24j5J13j01J04L8j39Q5Q7j06m8O4l3J13n4n0J39
2323A31j21O9mj68N4ooJ0K7j6Q4J9l9J77j39j22J10j02L4O1j44L0J40j99K52K5
2349A57j99M3Q5k46K35L2k16R8J94l06J30J24l71L27q0o3J56p3j87K59j66Q3L3
2372D9r7J4J17k97K94l6j00K05j63j17J90J23k14J85k03Q0J10j64J2J56k34M8
$$ y = [94, -197, 168, 106, -267, 277, 62, -54, 210, -204, -243, 414, -193, -8, 279, -251, 127, 229, -284, 223, 87, -94, 93, -113, -200, 147, -62, -125, 200, -51, 91, 75, -101, 102, 26, -229, 113, -110, -108, 176, -96, -25, 40, -86, 112, 79, -37, 212, -7, -42, 146, -132, -174, 168, -16, -107, 166, -203, 147, 114, -323, 224, 30, -277, 258, -54, -141, 127, -57, -56, 246, -116, -95, 124, -93, 61, 242, -180, 62, -69, -142, 133, 43, -145, 130, 6, -60, 94, 17, -214, 85, -129, -78, 28, -114, 58, -66, -81, 32, -69, 35, 73, -66, 19, 106, 0, -48, 16, -17, 96, 42, -8, 131, 10, 79, 75, -93, -39, -45, -51, -41, -14, -30, 54, 73, 34, 211, 72, -50, 60, -42, -8, 53, -91, -61, 79, -120, 132, 157, -42, 1, 86, -160, 75, 107, -109, -11, 183, -123, 7, 131, -240, 87, 7, -56, 100, 27, -160, 99, -67, 16, 49, -48, -34, 83, -214, 80, 44, -56, 149, -14, -131, 59, 182, -32, 153, -50, 30, 140, -24, -12, 144, -90, -42]
2394d2J33j51R7J7q1Q8j80J9K91k72J94rj77Q0K3j80L12k72J9L44l98J47J78j98
2418a8kJ93k90K34n7k17K15l0l19M17j91j43M14k74L9K15k82O9J03l12K97J04
2440A65l20L21j99j47M24l23PK84l21J80K9j53Q3N3j69K50j1k87J34j20P5Rm8
2463h4Q9N9k12J11J23k00K56j49j33K18j16j03L55k45pJ79l02L16pk18J66k8j79
2486a11L40j61o0J31k96J21K26k70J59M8k85J40M4k71K99M1k37J58j34n7K71j00
2508dj8K13l42J55J39k96J94K4k30J80p7L8J68q5q4J46j83N0J11j91J97Mj72J35
2532G2j39m8J42j98J68ok5J34p0j78K11m4j16J68j13MJ84j49m2J90k33P9L0j00
2556g9Q9M9j47J59l2j71J65n9qJ11q1k7P9j42Q6M6j38M3O1m5k8K8m3J90p8j56
$$ y = [-42, 91, -60, 37, 54, -27, 61, -119, -100, 191, -81, 113, 104, -73, 7, 30, -150, 162, -110, -91, 253, -145, 2, 180, -18, -20, 173, -117, 117, 60, -157, 58, 28, -291, 126, -65, -208, 206, -68, -29, 186, -96, -27, 76, -236, 61, 165, -155, 166, -33, -180, 244, -79, -72, 212, -109, 71, 100, -53, 30, 83, -86, 164, 153, -134, 0, -120, -45, -36, -84, 5, 64, -148, -37, 86, -114, 142, -7, -140, 78, -38, -141, 214, -31, -38, 141, -161, 155, 148, -70, 96, 68, -111, 229, 68, 8, 139, -157, -36, 190, -80, 79, 127, -158, -18, 26, -245, 54, 95, -142, 16, -118, -175, 96, -4, -22, 191, -151, 4, 143, -153, 41, 65, -165, 15, -62, -24, 144, 59, -25, 121, -62, -12, 99, -92, 105, 109, -63, 72, -67, -115, 27, -171, -3, -9, -34, 100, 30, -148, 63, 19, -97, 71, -42, -38, 146, -3, -45, 145, -88, -9, 21, -79, 10, 59, -88, 71, 39, -132, 33, -26, -34, 77, -4, -31, 48, -94, -8, 38, -100, -57, 4, -41, -69, -41, -84, 106, 28, -128]
2582a28J74j74K45k25K9J8J09j90N9J01L6j4nj42O0L3J42M4k05J14o0l2M7j07
2606g1J21j0N0j43L1P0j93R9OM4j8K4L6m4Q4j4Qj76K00j54K3P1O2n5L6m5k05K56
2634I3j04j26J98m3j38J11o7QJ88k23M8L9mK7J22j77N7m8N0Lol9K28k27j51K64
2660H3j21J8J96j60L1mj99K26%p5%L6j52J43j13J12J6m1j6Mj31J65j15l9J12M
2686b0m8J29k17J20J58k06P0N6j14J97j72m1J94j27J0J01pq6J4j61K28l6j43K11
2710A10n5j83J36J19k75J75j01%J18q7J10j4j24J57r8j55K59p2r6R9Q9j27Q3l4
2734C4nK6j03O5N0p8J22j58q7K95r7j64K38k31P5N4q9P3R3j91J19q1r7J07l1O0
2760aR6k28q6M34k63K5Q4k16J81J1pPr6k6J57k3n3O4j06j5J22j60R0pRn3J6n5
$$ y = [-128, 46, -128, 117, -108, -79, -61, 48, -142, -83, 18, 54, 40, 35, -107, -47, -14, 128, 172, -33, 81, 21, -11, 36, -71, 50, 40, 90, -53, -22, 48, -145, -46, -40, 4, -14, 10, 46, 2, 86, 72, 80, -96, 104, -50, -27, 44, 106, 51, 87, 42, -163, 93, -11, -137, 61, 18, -120, -9, -76, -68, 120, -103, -55, -16, -20, 7, 129, -48, 9, -39, 11, 14, 8, -31, 197, -30, -181, 83, -38, -20, 176, 16, 47, 43, -156, 70, 70, -5, -5, 31, -121, 22, -91, 21, 37, -4, -20, -16, -147, 18, -97, -136, -24, -20, -68, 61, -156, -36, 122, -84, -14, 42, -72, 125, -47, -88, 106, -21, -11, 90, 83, -3, 11, -150, 78, 42, -101, 110, 55, -128, 8, 127, -148, 27, -74, -74, 44, -43, 67, 53, -71, 86, -12, -167, 92, 20, -76, 23, 112, -15, 68, 34, 29, 55, -48, 17, 67, -11, 111, -47, -134, 161, 64, -100, 138, -93, -18, 36, -53, 20, 113, -78, 41, -40, -137, -30, -61, -1, 95, -133, -219, 215, -48, -23, 61, -155, 26, 37, 30, 37, -59, -85, 72, 49, -4, 60, -46, -61, 61, -99, -9, -16, -7, -60, -44, -99]
2788i9K33j27o8P4l0R4J2j48J12J12k39J30n2k8K1Q2j27J12q9JN8J0K2l9q9Q6
2814B4o2k3K22j83j14J45Mqk6J2r7K59j94K5N2o6M1l9kM5P7j60J74r3LK7j07K4
2842d0J03m8K4nj17J09o3o2J66j12L0J7j1q2J06J9o2J32j47J4M7n2M1j8j6M9j1
2869A1J7l3L4P6j47l6J70j06LN6n7Q6m8n1m8O7q2M8O9J6j08J3m9R2q2O7on5n8
2898a41J23J67k07j6O6n1P1qM3K1j88O8J59j57M0K7p6O6lk1P6R9j31N2L1n0j6
2925D4p8j39K70j54O8l3q4M4J23k7p1L9LK2P6l9l1p9K5Mq0J13K5j77J66Lo0K8
2953AJ9J1O0r7J4L4j5J17j84K9M3r6j3J86j09K2j7Mj04O2n8P2P8j07N0K0k28J20
2981h6P2r1J15L4M0j21L3m3J42k43J32Qq4J36K4j93J69N5k00K62k35L2J77o4j28
$$ y = [-99, 134, 7, -61, 13, -17, 77, 89, -59, 53, 165, -74, 56, 4, -24, -3, 79, -48, 64, -25, -24, 34, 44, 66, 27, -62, 24, -38, -61, 161, -22, -136, 9, 13, 5, -21, -9, -106, 153, -41, -16, 36, -30, 11, -28, -30, 15, 92, -68, 106, 13, 16, 43, -64, -40, 63, 15, 39, 34, -83, 26, -37, -99, 67, -45, -15, 2, -9, -91, 15, 34, -28, 104, -43, -29, 18, -34, 7, -11, -27, 22, 11, 28, -5, 29, 105, -42, -78, 92, -14, -11, 45, -12, 74, 26, -25, -73, -6, -88, -40, 29, 45, -63, -50, -99, -7, -89, -22, -28, -83, -141, -18, 149, -58, -74, -8, -59, 12, 4, 47, 68, -120, -52, 107, -50, -10, 17, -59, 7, 4, -17, 59, 158, 27, 79, 110, 60, 44, -34, -173, 97, -57, 11, -22, -106, -62, 61, 34, -37, 2, 5, 27, 103, 64, 33, -46, -21, -17, -97, 16, 41, -136, 30, 33, -27, 1, 20, 31, 91, -6, 8, 42, 27, 144, -40, -11, 32, -64, -77, 109, 0, 22, 5, 9, -95, -33, -91, -19, 59, -48, 2, 22, -206, -86, -14, -105, 10, 44, 84, -37, -4, -47, 95, -148, -16, -8, -92, 44, 68, -125, 44, 99, -101, 161, -74, -42, 135, 71, -57]
3006e7M1q4J86m2j46N3J09j00Q9p5K9O1j63P6J71k59J41K4n2l2M3j11K11n4j17
3031e8J18j95P3M2k6M5O9k22K65j02m0K4P4%n0j66J21L5o9J28j26k0K9J59j57
3056d9M8Q5o6O1r1j2M0P8j36Mm6j5J75j19J36k7p0q8P8M9o8K6o0M3Nj0P3p5K1
3085a0J5L4N9j30J7j5j1J87q3j47J55o0L0R6j86RO8J4j00mJ36jk9j13J00p1O7
3112B7m3j8N3mm1l6J63o5kJ5l6r9R2OmM5pl5p4pJ8L4J7q1K18j75PJ01j46N7j0
3143c0O5j19O8o9J3Q7J5L0J8q3q7J90k6j49J23l5o8P3Lp5RJ66l4m5m3KK1k4l1
3172c5J1o5J28K7j25m3J61n2m8nK7%Q3J9j04mj1P5o9K6j14MK23j94N1m1K2J2J7
3201b4K2K5j9P1j64Q3pM1M3j7j12J10o5n6J02o3N5m8O4p4M5p7P5K1j50J41q4N3
$$ y = [-57, -16, -100, 86, 44, -102, -49, 60, -40, 49, -26, 3, 64, -99, -23, 148, -111, 30, 54, 2, -30, 13, -98, 113, 59, -58, 60, -135, -62, -20, -46, -1, 68, -154, 111, 9, -31, -7, 67, 67, 17, -149, -28, 7, -62, 66, -60, -80, -51, 108, -49, -1, 84, 18, 79, -12, -24, 16, 94, -42, -38, -84, -99, 76, -43, 93, 66, -4, -92, -14, 35, -33, -7, -67, -24, -19, -29, 44, -31, -10, 5, 39, 98, -32, -15, -30, -41, 146, 63, -84, 71, 11, 41, 137, -49, -40, 28, 42, -58, -62, 74, 73, 44, -69, 31, -40, 27, -16, -34, 19, 15, -26, -62, 101, 36, 34, 49, 13, -86, 6, 12, 8, 53, 46, 11, -63, -70, -52, -18, -1, -82, 136, -39, -32, 69, -77, -20, -30, 35, -84, -16, -85, -72, 15, 30, 60, 78, -5, -92, 98, 72, -77, 46, 11, -57, 16, 19, -56, -47, 119, 85, 40, -3, -1, 20, -4, -35, -24, -89, 39, 66, -59, -102, 59, 7, -41, -46, -19, -19, 64, 83, -21, -25, -36, 39, -30, -4, -118, -114, 109, -85, -34, -75, -53, -41, -24, -2, 23, 4, 75, -89, -6, -13, 28, 71, 54, -58, 52, -13, -69, 33, -30, 25, -23, 41, -33, 12, -65, 10, 31, -119, 22, -62, -9]
3229i%L4nq6j0N5k6L3J33p9lk4p2j63K82q2j8K15j78l3J8M3j6qq8M4O9j19J03
3258A0q9L9Q8J5Kj22K6R8j27N0q6J19j95K70j96O0J29q8j34J67j12J52n1j20J28
3283C3j71N5J35m1l0pp2J03N1q8J6J3m2Q7o1J2k3OQ8j5o9m2R0j7K7P0j94Q7p2
3312g1LN6N2r5n0J04k5J2o5J12n6R1j08K4j8O0oj6K3j77J87Q3j20J09j9l3q4K2
3340eq8j1J04m7J32j67J8Kn1J39J04j44k5R0k5L4o9j6L8k9n0J00ql7J4q2J25o8
3368b2l4J76j35NN3q6n5J25K4q2k1l4J42J3Nn6m1Lj1K9rj02J50o3k3mJ93k01O5
3397DO5rn3k7J25j36M2kM1p5k5n4J28n0K0L0q3J82j06N0j32O1m7l4J04M5nj13
3425e4J70k3l8j26N0K2M0Q3r2L3n2M1ok4o1R3r3K3%J20j32kL6L0j08m9J56j32
$$ y = [-9, -9, 25, 20, -66, -76, -21, -47, -14, 119, 40, 37, 13, -59, -222, 60, -22, -40, 175, -3, -36, -18, 25, 9, 1, -87, -43, 26, -93, 10, -79, -40, 48, 63, 65, -57, -31, 67, -60, -10, -96, 23, -172, 98, -98, -38, 91, 3, -131, 36, -76, 76, 25, -95, 33, -138, -83, 52, 11, -19, -26, -98, 5, 56, -32, -16, -3, -45, 42, -19, -7, -30, -24, 64, 49, -20, -62, 28, 11, 38, 108, -86, 1, -71, -68, -12, 40, -55, -105, -1, -26, -14, -79, 33, -23, 68, -40, -16, -34, 26, 20, 4, 27, -150, 37, 120, 0, 109, 90, 57, -27, -5, -93, -104, 0, -47, 85, -82, -64, -62, -113, 26, 130, -14, -39, 51, 26, 60, -9, -25, 13, -16, -66, 34, 26, -11, 3, -79, 46, -22, -56, 120, -15, -10, 43, -43, -98, 27, 51, -31, -52, -86, 56, 69, 74, 18, -23, -20, -31, -2, -11, -113, 37, -26, -49, -53, 140, -61, 4, 69, 60, 7, -20, 105, -31, 11, 9, 50, -25, -50, -104, 24, -26, -6, 24, -59, 123, 17, 67, -65, -4, -51, -85, 19, 64, 59, -54, 116, 93, 55, -71, -21, 1, 41, 124, 32, 65, 13, 54, 48, 24, -37, 56, -37, -14, -14, 106, -26, -28, 8, 38, -70, -119, 37, -95]
3453i5L6j8J02m0l5jK2rR0m2Km0K8Ro1o0J06j0K9m1J52n6q8O9n4Q5K6j36QL8k9
3484a3J5k5j9m2J11O0q4L9j03R8j19Q8O0n4n0M2L1j33J6Q4J4k9J23j90K55j85
3510a0Jn7O0J90j55k8m4n2O7J3j00K00m8j2q2K9P2q6m5M4M6K0oQ0j04n9L5N7r8
3539g2L9K4Q0o0k1%M5rl6P3l4m7MN0j7j8oP6%o3J44k07J63p1l6JJ11j24N8o9M9
3570B7mp8J36K0kj06j7M0k1L8r2O6K2j00J14k01Q9rL6P2m6Q3o0Ln4LJ20n4k8J9
3600A6j03J46q4J05j29m8Q2j3K2j9K4Q8l6n1mnj3R2k15J91K6m1l9j01Q0Rn1J51
3628H0k09J20P1q5Q7j28P7j1j1J34q9J3j45J0J49k3J7j06K2qLk8O8k9rQknL5K7
3658C3n2j26K64o7q4k3P2o5L6n3KR6o2O8o4lN3o7P1j19K5j5J12J4k5j1N9q2rJ04
$$ y = [-95, -59, -77, 25, -15, -50, -51, -29, -38, 52, 10, 12, -28, 0, 9, -52, -112, -6, -16, 13, -28, 124, 68, -20, 49, -5, 80, 106, -30, -22, 16, -13, 2, -23, -42, -84, 27, 87, 3, 42, -61, 37, -82, 6, 66, 12, -38, 4, 35, -98, -82, 2, 16, -13, 110, -80, 175, -10, -9, -66, -6, 184, 29, 1, -43, -95, -28, -15, -115, 85, 37, 25, -57, -28, 44, -42, -87, -43, 3, 23, 17, 97, -7, -66, -31, 26, -72, -33, -9, 71, 11, -10, -10, 35, 26, -10, 63, 29, -18, -14, 36, 19, 1, -5, 71, 71, 8, 152, -55, 108, 37, 1, 2, 113, -11, 47, -22, 27, 23, -55, 81, 101, 99, -7, -24, 16, -5, 33, -59, 7, 29, -71, 43, -158, -69, -78, -42, 30, -16, 67, 7, 10, -44, -41, 79, 25, -3, 16, -87, 59, -25, 80, -49, -97, -15, -28, -6, -25, -1, 87, 51, 0, -4, -9, -22, 70, -145, 46, 72, 31, -8, -109, -29, -20, -71, 80, -129, -9, 62, -23, 64, -64, 13, 2, -9, 125, 36, 49, -96, -86, 63, 40, 57, -49, -27, -35, -32, -60, 8, -21, -30, -22, -24, -29, 6, 33, -19, -145, 119, 52, -32, -55, 17, -48, -12, -65, -63, 33, -29, 39, -25, -28, 25, -42, 29, -90, -65, -80, 32, 46, 21, 10, 69, -13, -22, 82]
3688H2p3m6J25o3n2K13j73m1R1Qm8J6l2j12J01J14k06O1J4J50j91J28lmp1J5J8
3715B1o5J10n8m8O4q9R1Jj3k1KJ91k09Q0o0l9k7M6P8j08J22j4p5J9J07j09N9l9
3743A7OM8j04J20p7pJ3K6q8J06j84J41J3n2L8j6q4J02k7J37J5j92Mj4J13o2J1
3770CO7j07O7n8QN2m0J01j7m6n6R4L3j25R0p6N6n0n4M1l9RR6j25Oo6Q6O1j4N8
3800E5k13K23j90J44k9q4J37N3j6r5m8Q7J3Q3j07k5j6j00J67j51J94M4j23K0M3
3825F6l3p3O5m6j8L9K7Q2j43N2L2r2qK7k1mQ9j7j14Q9L6Kj02OJ21j32j0Q6J6L0
3855E2j34M9j1L9j08R4J07j15n5R8J3mm0J32j10K4K2n0j8p4J41j05L5L6o5lO8
3882A8p0N7q4M6O5r9J31j72L5M1Q7j48J91j47J03J1j10P8m3NRq0P2l0K7J18k5
$$ y = [82, 9, -37, 88, 25, -27, 186, 13, -28, 63, 71, 23, 39, 7, -105, -4, 110, -96, -35, -21, 129, -62, 66, 63, 59, -12, 3, 21, -44, 66, 8, -40, 24, -65, 26, 27, 14, -7, -5, 186, -23, 57, -3, -42, -69, -23, 55, -53, 69, 55, -20, -1, 106, -3, 56, 17, 23, 71, -33, 87, 10, 3, 16, 42, -46, 60, -124, 17, 30, -22, 16, 0, -84, 18, -9, 128, 143, -49, -45, -59, 54, -8, 3, 70, -37, 30, -28, -20, 32, -8, 93, 76, 30, -26, 68, 101, -24, 66, -10, 46, -4, -58, -17, -56, -47, 49, -76, -70, -136, -50, 11, -3, 55, -158, 65, -125, 19, -10, -94, 43, 96, 80, -15, -63, 24, 37, 120, 13, -12, -28, -128, 39, -112, 82, 126, 3, 23, 66, 33, -40, 25, -21, -39, 0, 27, 109, -34, 18, 50, -42, -50, -23, -44, -48, 41, 24, -90, -1, 35, 37, -65, -59, 62, -70, -80, 6, 22, 52, -82, -33, -44, -5, -113, -19, 88, -27, -82, 16, 29, 25, -15, 117, 7, 31, 53, 3, -15, -89, 52, -53, -18, 18, -47, -50, 18, -52, 5, -79, -33, 32, -67, 64, -108, -73, -32, 55, -93, 98, -49, 54, 65, -45, 33, -10, -5, 4, -76, -4, -34, -7, 111, 86]
3909H6k3j30R8m2j1J4P7k3q4L7M3j8l3L0L5J9p8K2k6P9m0l2O6m1j68J41q0J5k6
3938i3kJ76O2j23L5k1P9q4j01J86r9Pl3J84l09J14j58K90k2o9q9Q5m0J08J6j44
3964d5Q9Lk7pN7l0K9q2K3np0J15j43R6j5J42k00R1n6k1J03o9J16j6l0j11Q6mn2
3993c3N2j6m8M3J1l2J23q7o3J30l3j01J52j62R4q3O3L6j7j28O6ok0J02j66M8R0
4020A5NK6q4J5O4m9J49o3j17M7n7k3M6O9j89K63q1m1P1j4o7K4M0K0l4r3J26l5
4048C3j1k5O9j1O4M9r4n8o8J58p0j9nk1j0l3P2L2j00jO1n1Q9O0o8j23J52m8r5
4077g2L9m6M8nm2M5J6L0l1j2N9rJ8k3R3n6q7J0O8j17N3J36n3j15J7N9j20J25o
4106B2n0j73K77k5o6O8q7j2Q0r1LOrJ93j08o8j6rM5K2P5n3op3R6k1R2r3K8n7m
$$ y = [86, 63, -67, 31, -11, -22, -8, 69, 46, -38, -1, 42, 24, -9, 21, 56, 75, -3, 19, -7, 72, 32, 0, 66, 25, -143, -2, -82, -67, -93, -95, 81, 143, 20, 55, 34, 113, 29, -72, 114, 15, 22, -11, 173, -136, -22, -180, 110, 88, 19, -70, 15, -25, 83, 99, -45, 44, 47, 20, 13, 70, 40, 69, -13, 10, 5, -65, 50, -93, 3, -12, 130, -70, 21, -35, -56, 47, -22, 94, 78, 48, -63, 23, 19, -33, 19, 3, -45, -2, 9, -23, 100, 13, -50, 80, 47, -54, 98, -64, 30, -53, 10, 46, 29, -99, -33, -39, -59, 43, -123, -75, 15, 20, 46, -38, -23, 41, -8, 141, 78, -39, 8, -49, -72, -26, 43, -146, 117, 36, -5, 66, 52, -15, 9, 49, 69, 35, -58, 68, 33, 22, -3, 66, 55, 119, 168, 74, 16, -52, 106, 36, 17, 12, -9, -19, -52, 20, 52, -48, -49, 12, -39, 50, 110, 42, -81, 71, 23, -72, -33, -79, -31, -36, -78, -33, -17, 13, -18, -30, 29, 20, 38, 15, 108, 52, -35, -25, 43, -74, -21, 115, 62, -53, -36, 23, -97, 28, 22, -28, -201, 76, 51, -15, 53, -34, -46, 34, -57, -54, -48, -57, 136, 28, -40, -56, -65, -20, 2, 77, 24, 18, -55, 41, 20, 112, 19, 47, -10, -14]
4137a4LM6k9N7q0p9m1J68q4O0N0j00Q5J6j9j1K4L2Kj25O6k4p4J08Jn1L4Q0p7o7
4167d3mM8l2O8K1k3Nl4J9j1J6l6kj2QM4K9m8k2l3L8j30Q7n9P6ql6M4L3P5l2k9
4199A7L1j70o0J69k6PJ1K8q3J39n5P7l6j06R7n3j1M2k6JL4k0L8k1o9P9j47J54
4227D1Oj80Q4O5n6N4o6J4J1J2N7p0NP0mJ4q7o9P7k1J4N0j0Q1o3q5R2p3j8kL0L7
4259A0q2J68j64J48p5P3j46oM0N4k8J6j06O8P2N0k52J85o2L5Ml3L4j3P7m9L3J4
4287F5j04o0R3j06J17J28Lj99J00M3q2P3r9l6K8R2p2R3j31LK4Q5m4k6j03J27r
4314Cj7qK5n2J37k38J32k0o2J01j68J19Q3Nk0N3o0j16M7L2N0l2L2J24j71L8R8
4341A15l1j12j6J68j03J4l6JN9m9QK4j7j5n1P4Qo5oJ04l1p8J06r4J6n4j35K76
$$ y = [-14, -11, 35, 6, 63, -17, -96, -137, 31, -53, 7, 57, -43, 42, 58, 39, 28, 52, 84, 86, -39, 27, 3, -71, 37, 38, -13, 21, 101, 24, -43, -47, 1, -31, 37, 58, 35, 40, 6, 25, 14, 30, -6, -8, -20, -12, 32, 61, 13, -9, -42, -4, -134, -47, -106, -30, -38, -74, -30, 3, 78, 46, 17, 48, -122, -182, -13, -39, -32, -21, 7, -76, 63, 8, 85, 49, -57, 40, -13, -24, 18, -8, -7, 27, 7, 45, 24, -45, 34, -113, 41, 47, -133, -49, 16, -40, 14, -52, -38, -27, -15, 42, -28, -23, 47, 43, 57, -30, -99, -22, -43, -29, 21, 11, 92, 29, -56, 36, -37, -55, -57, -27, 10, -72, 96, -68, 80, 5, 78, -68, -74, -34, 20, -8, 8, -98, -30, 42, 92, -160, 25, -37, -2, 2, -31, 3, -10, 67, 18, 51, 65, -39, -99, -6, -112, 5, 133, 136, -63, 37, 80, -2, 71, -28, -64, -36, 56, -16, 77, -54, -51, -27, 58, 14, -12, -115, 12, 3, -14, -22, 3, -49, 88, -150, -18, -38, -100, 1, -167, -48, 35, 40, 20, 73, 13, -103, -56, -24, 26, -6, 26, 150, -21, 17, 115, 84, -28, -44, 124, 21, 35, -1, 0, 59, 10, 18, 42, 25, 10, -41, 33, 41, -24, -30, 74, 43, -35, 71, -23, -7, -61, -196, 80]
4369H0r4k5M6r9RJ58r0O0l3J20q1J9j30J05lm3J50j21q4N0K2NQ0j41j16J18Mj1
4397d5M5jL5q1Q4j67R4k2R3j66R0M2LlN8pm6ol0J75j42R6m0j10K7J3QL2k7J1O
4428A9o5M5n3N5M9o0M8p7M4r9J00l3P5K8j1o0N8k3o2J0j6o2k7J13l1M1m2nn2Q9
4458dM4n5k3PL4k7J25q9J4q0PN1J4o6J37o6N7q1R8q4j18k1J58m5Lj8K4pm4L1l5
4489e9L3OO5Jl2j04O3R7j93J51j18J70k3L7j15Lk0k3P0M9J0j66J94q7m1%P6k3
4517B1K8p0j8j5J09m8N7p6%P3o4p2J42j20J9L3k6L2K2l0L6j06P0P1q1RN0j1j14
4546g9J19q6r8K11KJ9jr0J15K3j44q6R6j4k4OK8M4j57J99j18nM5J8j30J08K4J8
4574D3j30P7M0o2Q2o2l5L4N1m4M0j4o2N4J01n7k7R3j14o0l0P8L8o3N1l1O3j5O
$$ y = [80, -14, -39, 7, -92, -83, 75, -15, 45, 12, 132, 51, 70, -60, 45, 42, -1, 149, 28, -56, -6, 16, 21, 101, -40, -156, -38, -34, -45, 0, -1, 34, -47, 37, -130, -36, -58, 35, -131, -41, 1, 4, 1, 59, 52, 6, 0, -30, 145, 3, 99, 59, -51, -24, -11, -3, 29, 2, 13, 19, -46, -1, -54, 1, 50, -10, 38, -39, 5, -94, 6, -27, 48, 76, 65, 5, 63, 40, -22, -12, -28, -90, -117, -4, -35, 6, -36, -41, -93, -4, 40, -15, -38, -31, 3, -24, 101, 12, 26, -54, -47, 4, 18, -48, 89, 23, 80, -1, 97, 13, -105, -126, 32, -13, -10, -28, -4, -11, -55, -24, -59, -26, -20, 45, 46, 14, -90, -27, 70, -123, 28, -90, 80, 57, 94, -21, -18, -38, -61, 9, 58, 68, -98, 96, 9, -32, -32, 44, 21, 49, -21, -39, -54, 55, 7, 64, -12, -12, 61, -3, -75, 67, -53, -34, -1, -27, 5, 27, -3, 33, -73, -3, 68, -13, -4, 46, 35, -79, 40, -46, -144, 67, 69, 88, 87, -3, 112, 135, -9, -95, 1, -13, -37, -31, -3, 41, -116, 83, -35, -40, 5, 23, -107, 1, 25, 43, -87, -10, 30, -32, 50, -12, -47, -13, 38, -6, 34, 20, -42, 12, 113, 56, 29, 122, 8, -52, -82, -4, 34, -29, 22, -9, 54, 39, 45]
4603D5m4P1j3M1j44R0o1P0n7o7O4J0j5q6O8l8Q1m6p3O3J25j68N3N3n7Q9j82R5
4631c3M0Q5r0P3j20L2kn1J35o6pj04Q0O7%j2p0M2K7J8M1q8Jj22O1M0J04m5p7J11
4661G0j24P2%q8P9m0K8q4K54j71QJ07o2m3%O3r2J59j03n0M7K0p3Q6j16J10j59
4688a02O1P4N6j74L5O4qk8m2P0k7J2J0n1m7J04M7l2p6l0J13l3l9M4N5j33J13M0
4716G6j89O7J29p5j02R2L4j06J61j38L4L4O7N4n8j09O5L4j02P3j60Q8j7p1R8k2
4742d3j4J24n8P4j65J21l4l1Q2q4K1o0O3K0J1R1j25l9k1J9j1N9j19R8L0N1j04
4769d4J23k3K0j4n1L8k07K47p9n6L0O1l0j96K83j22J24j35J2P9pn4Qo9J08jo0
4796a5l2M9on1l6J25j12J75j28R0m0n8O0N1j04P5o5OJ2l2P8K9j3q6Q3M6j25J2
$$ y = [45, 1, 72, 59, 100, -44, 46, -15, 55, -2, -69, -5, 5, -10, -96, -28, -66, 15, -31, -104, -41, 84, -84, -31, 22, -35, 54, -128, -33, 7, 92, 2, 75, -45, -13, -15, -66, 69, 3, -4, -108, -28, 39, 39, 27, -43, -1, 26, 44, 85, -3, -2, -124, -63, -23, 81, 36, -41, 70, -54, 18, 18, -70, 9, -31, -3, -87, 167, -4, 4, 111, 49, 6, 6, 69, -23, 136, 33, -17, 30, 50, -23, 63, -53, 57, -102, -41, 33, 89, -85, -50, 14, 6, -22, -64, 6, -21, -9, 1, -50, -97, 7, 54, 22, -54, -84, 29, -4, -43, 1, 56, -77, 36, 76, -113, -46, 83, 8, -94, -2, 32, -74, 87, -51, -17, 17, 84, 138, 80, -29, 36, 70, -32, 41, -119, -31, -48, -119, -21, -43, -57, 67, 9, 83, -82, 39, 5, -26, 56, -28, -7, -67, -4, 16, 27, 118, -7, -46, -67, -48, -59, 0, -119, -21, 9, 60, -44, 79, 56, 76, 62, 11, 49, -158, 89, 10, -46, -16, 45, 15, -181, 102, -20, 104, -31, -19, 60, 53, -1, 7, -62, 46, 45, -15, -47, 2, -4, -55, -91, 34, -78, 97, -31, 59, 19, -39, 21, 72, -32, 43, -22, -16, -4, -36, 42, 71, 58, -28, 55, 101, -24, -12]
4824a2l6J5k1oRJ94q8j83J25L8K4j34m6J41m1K1N9q4M8m7OQK0M9n6q8J32l0Q6
4853A03j72M1PL9n9O8m9P2j13O5K5j11J13M6o0oJ18j38O2j2kM9j73P5J9J9o4M9
4881A1r4M7kj2J60k16R5J02q8qj3J55j38p3J48q9m6J8O8k4M2O9p5O1r4J7J0N7
4909H8j36Q1k6JL5n3Q1j05O3M1j12lR4m4m2J2O5M6q1P3o7J7L2o0rJ8J4L8l9nK0
4940C7N0j07M7M9j13Q2m7l5O2o5p8J55k9j8J05j56J38m8n6K5K0p2J7k9P5p6j5
4967h2Q9R4j09k6j8l5L6J2n5R2n3M3K0O6j8Jr0N6LM7j52nJ06k8K7K9r5J86q7j62
4997a08O6O2j1OMMr8R7jj20P7QK6n4M3L9Ql0J54k38J36j9n3J64j61p9P5K9o4J34
5027I6j5J2L4k08J32j6j0n4q6J04K4o9R8r8p9J03M0m7M2Ok6J6M6j6qo2J4M2J0
$$ y = [-12, -48, -33, -54, -60, -51, 143, 55, -128, -3, 35, 59, -75, -121, 20, -21, 0, 59, -25, 23, -24, -18, -10, 10, 59, 3, -85, 47, 17, 103, -69, -28, -21, 18, -41, 27, -22, 50, -63, 2, 27, -84, 29, 75, 15, 9, 127, -11, 51, 39, 37, 86, -87, -12, 7, 26, -38, 11, -83, -36, -38, -50, 110, -106, -11, 91, 3, -5, -18, 137, -1, -74, 74, -15, -61, -43, 25, 1, 43, 112, 37, 98, 4, 21, 31, 88, -48, 33, 7, 8, 43, -10, 71, -34, 29, 70, -42, -45, 49, 5, -37, -25, 40, 86, 5, 78, 11, 28, 60, 0, -9, 9, 23, 61, 22, 17, 37, 87, -20, 27, 76, -37, 45, -2, -37, 25, -40, -118, 37, 8, -10, 95, -61, 77, 29, -27, -2, 18, -54, -37, -66, 9, -67, -82, 7, 101, -8, -34, -52, -87, -51, -39, -94, -2, -55, -12, 8, 74, 56, 57, -33, 23, 26, 73, -79, -84, 22, -6, 21, 50, -45, 141, 54, -108, -42, 20, 9, 15, 19, 23, -75, 22, 21, -99, -22, -14, 12, -42, 1, 40, 48, 18, 172, -66, 70, 51, -2, 162, 1, -78, -3, 26, -38, 96, 81, 93, 127, -81, 51, 35, 25, -29, -115, -11, 13, -56, 42, -56, -135, -32, 8, -39, 3, 9, -17, -1, 45, 29, 21, -41, -27, 15, 25]
5056B5p5N9n9J4O2m7k8J4Q6Lk0j8K9l0j9K2o2Q4K2N6j4j21kN0k6P4o3l9R3n7l2
5087a9LM4m5L1J07j64p1R3RN4j3o6L0j7J1n1J85n7j39J22l9m4K3J24j25o8R1J8
5115B7O2j7l8J11j14Qk7N7j24Q7l5q2Q4K3j00J8K5l0mJ22j02N9rN7k2l6jJ4j25
5144a12J11O8r8J28q5L4L1j16M5o8J30j06J9rM1k9m4l3R6K2j59J87r0j2o2M7k6
5171i0J68m6j01J32j78N8R2q3N2j5m0K1JM5M7j52J83j39O8j5k9m4L5q4K35j25
5197dK4j0j14J00Q4o2l0j7Q8O5j98l6P4K4j01J45o9R3J5q0%K8l0p2J34j16l6J80
5225G9j58J23j19N8j0N0j28J30m0l0m0P0Q3q1jk1M5j3O2m5o0J18j09J23Oj50K1
5252c7K1k8K7P4k29Q1J2J21Mj10k3J64p5P%j61K13j29M9N9j06J00j35N8R1j09
$$ y = [25, -50, 9, -50, -36, 26, -21, -49, -35, 51, 54, 34, 16, 45, 15, -4, 18, -44, 40, 62, 118, 104, -17, -19, 31, 5, 79, 16, -23, 70, 13, -19, -16, 28, -17, 14, 121, -43, -114, -21, -12, 42, 29, -37, -7, -24, -13, -64, 121, 64, -75, 47, 8, -36, -13, 111, -14, -82, 9, 27, 89, 72, 34, 145, 31, 39, 12, 69, -55, 32, -3, -85, -1, 22, -78, -60, -35, -65, -69, 53, -49, 10, 1, 58, 36, 0, -1, 13, -112, -1, 67, -31, 97, 12, 46, 77, -39, 6, -62, 68, -38, -19, -28, 13, -16, -60, -93, 3, 25, -134, 53, -37, -49, -111, -64, -90, 78, 32, -69, 63, -115, -57, 35, -48, 4, -11, -51, -30, -29, 16, 63, -89, 94, -45, 23, 8, -21, -65, -30, -114, 121, -4, 20, 10, -104, -4, 80, 18, -12, -29, 59, 124, -74, -110, -36, -12, -113, 32, -37, 56, 71, -9, -9, 19, -11, -83, 51, -65, -101, 79, -79, 44, -75, -17, -27, 23, -105, 25, -15, -45, -85, -15, 68, -13, -14, -35, 10, -3, 59, 14, -46, 72, -37, 86, 92, -58, -37, -16, -44, -17, 57, -172, -91, -79, 42, 46, -64, -87, 77, 2, 9, 9, -152, 61, -68, -19, 40, -66, 34, -101, -43, 48, -61]
5278f1P5Ol2lM2M0j49R5l8O9L3j67QP4L1q0J84j81P1P7r5q4j6J60K8o9l6J52j46
5307a2q3R7J9q8J55j28N8k8K9Lj25P4K7J4l6L5q1J65j35Q3q9K7J14j81JJ5O1m8
5335e7J33m2Jq7k6P1j4J46j02j40J80mj23J4R7j03o0J47k3k8J5o0JK9R5q0L9j33
5363a14Q4qR4p1J27j49m0R6p8N8J7O2j48M6L1P6q8j2J5M3p2J22q9Kj07J66o9O8
5391F2o6ojL9p0N9p5J50q8k2m1m0J21R8j50L6r5J37p0pR3j45K29j6j72j02K58
5418A16p9Q4p8m0k8Q5n7m6K0O2q3M1j5N9J4p3q4N9M5o7R2Jj05K07j61L6j3J02
5446I4j20J7J07j30j1N0n9P9r7K0L4PL2j23M6N3l2R3j%o8J23o2j37N6J1O9p3P0
5475D8J9m0l0J03j09k0RJ4ql6P0m5o5M7J23k5j60K74j77R9q4J3j07J30k2j43J64
$$ y = [-61, 14, 20, -12, -15, 27, 67, -82, 13, -25, 44, 77, -90, -82, -8, 23, -57, 127, -54, 17, 94, -1, -85, -101, 59, 87, 18, -18, 134, -12, -95, 2, 21, -67, 88, -40, 18, -10, 19, 22, -103, -29, -2, 12, -24, 11, -70, 95, -40, 43, -46, -19, 95, -86, -85, -70, -9, -57, 76, 34, 35, -52, -78, -7, -21, 125, 23, -117, 63, 59, -64, -50, 47, -56, -116, 31, 8, -20, -5, -65, -64, -35, 60, -20, 19, -114, -30, -38, 56, -15, 112, -37, -77, 19, -59, -1, 16, 78, -70, -24, 7, 83, -5, -17, -2, 41, -31, 91, 2, 4, -103, 63, -6, 62, -4, -10, -11, 28, -42, 17, -58, 92, 4, -18, -59, -99, 22, 120, -30, 6, -89, 48, -22, -29, 64, -81, 148, 132, -40, -142, 116, 37, 121, 43, 3, -25, 60, 3, -43, -23, 39, -44, -3, -18, 41, 55, -18, -102, -43, 2, -65, 27, 28, -77, 130, -31, 5, -8, 94, -26, -9, 98, -32, -43, 7, -52, 27, -70, -50, -16, -9, 23, -100, -54, -1, -33, 60, 59, 59, -9, 114, 52, -85, -29, -18, 51, -22, 48, 67, 27, -3, 100, -9, -29, -20, -6, -14, -50, 20, -25, -90, -43, 80, 55, -105, 169, -8, 91, 7, 20, -87, 43, 21, -122, 42]
5502D2J4o0l0J13M9j24%N8q7j8L4J9p1N9l4J15p0lJ3l8l9J17j38qpK0N1mj2k3
5532f2Q6n2l1N6q6J23j21K9j7R9M1P8m9q2r0J53j48J05NK5o8J9L6j06m5n9J60
5559al1L0j54R3N8j04R1N7M8j04L6j20P2o4P1k7rJ02m0N1j47J5R5K4j06r1J42
5586a3Q9r9K7Q1o2Ok7L6QJ1j43J46m6M1o9P5Jq7ql7J59q4L4m1M1j40J00Pp6P4
5616Dk7lm5J61o7o4L7r8LM0O7K9n0N8j7n0P9nj02O5m9L5OM5o3o3L7J54j72M3j
5647a3j9M3Nj6j5L1kR7j09l4K7p4N3Q3j08O0N1p1O8k8N2l3O4r7m0Q8j64M2MJ68
5677A13j29Q8N9j67J30l9n2k1J8K5r0J11K2k9J82k74O4J04j43N9l9P1m4J9p8l7
5703g7L2J2j3n8M7J6K2r4K49r4j3p7J00l0j7j7M8Pj03N5P1m4p8N2O1j95J49P3
$$ y = [42, 56, -4, -34, 79, 128, 4, 4, 62, -25, -43, -9, 10, -61, -2, -36, 79, 9, 6, 19, -19, -58, 59, -79, -87, -94, -74, -23, -27, -39, -62, 24, -28, -59, -3, -89, 34, -87, -58, -75, 24, 65, 143, 94, 12, -78, 75, -73, 32, 37, 62, -6, 13, 49, -57, -102, -161, -1, -32, -2, -156, -63, -5, -109, -18, 39, 87, -17, 19, -101, -29, -93, -22, -49, -58, 44, 4, 55, -92, -77, 18, 42, -64, -155, -13, 76, -23, 4, 85, 23, 29, 2, 38, 46, 57, -86, 60, 14, 55, -14, 61, 62, -25, -33, -70, 89, 5, 39, -2, 39, -101, -1, 6, -70, 4, -23, -26, -71, 90, 23, -41, -4, -102, -99, -59, 8, 37, -13, 45, 28, -22, 57, 52, -50, 15, -34, 1, 7, 52, -11, -74, -37, 117, -55, -12, -13, -32, 11, 16, 0, -15, 16, 14, 111, 2, -32, -5, -79, -26, 57, -51, 9, 60, -11, 57, 29, 81, 48, 112, 15, -25, 63, -101, -59, -55, 113, -16, 72, 131, -36, 94, 55, 3, -18, 0, 25, -65, 46, 68, 39, 221, -53, 11, 115, -28, 31, -8, 63, 19, 38, -40, -77, -45, -33, -46, -104, -57, -41, -19, -113, 136, 42, 29, -48, 52, 22, 5, -12, 36, 43, -60, -5, 66, 22, -56, -4, 57, -138, 11, 84]
5731H4m4j31P5j6J16l9L2p3j03R1q3Q3m4R3n3j1k4J10j7p4l7J01J4J0j16P3j08
5758i1K6K8J67j38K2j4k3pP1o2L2M3r9J19j09O8j04J39j32K9Q1Pj78O4N4K9Nr3
5786f6k9P2OM9O6j75J57r6N7j7j12N1J5JJ6m7j7J8P9J15j29l8R6p2k2j9O3Q0j03
5815aRj3J4J7L4p0j9J62j29O5Pj49J18n0J28j90O5p2Q5j22J61j32N7m5N6m5J59
5842A00j03oj52J98j68J58k0JM9j1kq0K3J6k7Rl1o0J72p9l2J35r4k6P7L9r1J2
5870GJj52J11M0L4N4j93M2l6Q9k9j07K30q2q9Q1lm0PN7J14j27L1j4Nn9mo4J73
5899G7j81J92p8R3j22O9j16J49j52PO9j7o7J63k8r5j2J4J33j38J27j81P8p6K07
5924A15k06O4%n9O0O4o4lJ7K7J27o3m2k4rL6p7QJ41j22k2R8n9rk6K1j37J19m9
$$ y = [84, 40, -91, -16, -32, 84, 45, 77, 4, -99, -8, -91, -8, -52, 41, -12, -23, -47, 63, 46, -28, -65, 36, 50, 60, -56, 17, -91, -65, -37, 130, -8, 14, 0, -23, -30, 41, -21, 11, 54, -45, 74, -35, 33, -71, 68, -64, -35, 46, 53, -125, -61, -7, 22, 27, -66, -95, -23, -17, 32, 98, -77, 80, -16, 41, 24, -88, -37, -22, -21, -5, -52, -69, -51, 28, 143, 14, -24, 72, 0, -22, -41, 22, 102, -1, 8, -5, 9, 26, 60, -10, -29, 133, 4, 69, 76, -73, 45, -5, 123, -67, -2, -74, 11, -111, 50, -82, -25, -70, -14, -59, 100, -3, -9, -161, 37, -131, 27, 7, 8, 57, 46, 44, -36, -13, 3, -24, -15, -46, -106, 66, -13, -45, 90, -4, -30, 47, 86, -5, 7, 8, -144, -33, 7, 41, 95, -98, -56, -92, -3, -32, -139, 91, 9, -80, 1, -2, -42, -35, 22, 136, 9, 40, 26, 31, -28, -32, -96, 77, -104, 88, 10, 103, -19, 50, -66, 83, -69, -62, 7, -10, -77, 86, 58, -37, -49, -35, 98, -40, 87, -94, -16, -92, 115, -91, -27, -27, -86, -26, 38, -26, -29, -12, 15, 142, 79, 37, 13, 4, 40, -37, -29, 112, -10, -32, 66, 7, -2, -28, -7, -144, -25, -74]
5953g4L6K1O5p3l3L8Q1L7o0k3PN1j25K8j40J97r6J12n0k7j5J33j67J12l7J8N5
5980G1j49j8K1J82n9P0o4p4MkN4j1o1%l1Q6o5k8j2J03n9j0N6n2P2o6R7p9r3K36
6010A19j09M8L4j18K4j3PR0J4n9p5J05K5j16R0p8PO0j10k1K0n2J18l5J01K7j46
6037d3l6J22ql1k0n5J1q1J04rj2O5o1J36k62J86J52j24M3M6j52PM8O4j33p0J24
6064A1J3q1N4o5K6N4N6o7L0k7O7j5j02J32j27J22r6k9M8lm0M1p7Q0J4j2o3p4J64
6093C4N8L0j05m9j8O1k8M8kq8O5N0k0Kk8N1jj27J16j27M1Q7o9KP6j3mj9O3j86
6123a00K24j79J3O3N4q2K0m9q3K44l4Nj04m8KP7L8j43R6o4L5n4J08r1P2j31K12
6150A01p4m6P3k4L1j9j78J83j18P7M6KQ7r5q1R0j11k4P1n1N3J4M7k2j98J55O9
$$ y = [-74, -38, -17, 48, -25, -58, -20, 61, 98, 38, 15, 22, 73, -52, -24, -164, 33, -63, 49, -1, -28, -43, 90, -77, 35, -2, 16, 71, -78, -96, -75, 107, 48, 118, 54, -20, -16, -18, 36, 25, -36, -36, -67, 19, -46, -74, -86, 17, -42, -52, 4, -48, 24, -42, 55, -24, -117, 119, 10, 58, 92, -26, -2, -15, -8, 82, 96, 37, -38, 67, 92, -24, 66, -12, -5, 55, -55, -76, -56, -108, 10, -25, 76, 103, -43, -79, 43, 35, 4, -16, -71, -60, -141, -37, -46, -58, 7, -54, 82, -180, 6, 158, 34, 77, 123, -29, -22, 26, 90, -43, -113, 11, 24, -57, -3, -68, -42, 12, 68, 1, 31, 4, 71, 56, -46, 86, -41, 81, -15, -44, 4, 1, -39, 2, -75, 5, 19, 7, -56, -130, 34, 92, 122, 17, -32, -50, 11, -17, 31, 29, -59, 6, 56, 36, 38, 10, 61, 60, -67, 49, -78, -37, 50, -19, -17, 59, 46, 42, 23, 86, -100, 124, -55, -42, 21, 75, -7, 13, -36, -119, 125, 91, 96, -8, -56, -54, 23, 61, -82, 14, -50, -15, -69, 39, -52, 20, -111, 101, 27, -19, 54, 30, 61, 42, -136, 47, -71, 6, 52, 54, 141, 46, -35, 55, -56, -80, -9, -60, -7, 7, 54, 32, -166, -11, 58]
6177E8Kr6O0qRn9k5N1Q8j5j37J53j43J1KP5p2R9l6m8P9Kj08J42r4l2M9n5J9P3
6207D4Mj09M1k0lP4j08J00k2L8l8J14k05R4P1l0j6m1j0Mn2R5k0N7j21J36q7Q6
6235G6k16K13k5q7J21j30O2p0P7l5J8j39Q0ML8J29j46J33l8r8O5m5J23r7j7P2
6261F8j23K1M9Kl7O2l3l6k8N2l7J12n7J15k35L2J38P7k55R6J06l9l1O3j02l1O3
6288A2n1O9r3Q5j7l7NP8r9j14K31p1j5k1N8O4n1k6j19J25j66J38P5j17N7n3J23
6315G0k4m6M2j28J14q1j5J83j14n1K5K8n5J9J4J2j9J01pq6JO6j93j0J51K1p3o3
6343a18J48n0Pl0J20j28R5n8J7%J1m3J40o8rkj8LK7q1J02p3K7nj43J12j5M9LN9
6373G9j58Q2o0J11Mm7O3J4j7n3j19rM4K08j99oR5k6j23J12lNj9O3M0m4j71J26
$$ y = [58, 60, -36, 24, 16, 25, -34, -59, -8, 80, 65, -72, 81, -62, -51, -49, 26, -46, 53, 17, -31, 48, 50, -58, 84, -10, -42, 7, -48, -29, 44, 48, -61, -20, -40, -43, 31, -77, 23, 1, 39, 1, 115, -90, 4, 75, 45, 29, -12, -22, -18, -70, 25, 5, 62, -59, 77, -10, 76, -140, 73, 48, -39, 82, -48, 14, -56, 21, -14, 4, -135, -55, -51, -13, 116, -30, 103, 65, -33, 32, -13, 110, 13, -4, 68, -55, -34, 15, 17, -20, 42, 9, -27, -55, -3, -40, 72, 15, 130, -105, -73, 65, 142, -113, -17, 89, 50, 19, 82, -20, -51, 12, -39, 30, -63, 22, 5, -32, -27, 51, -48, -162, 69, -2, -17, -38, 20, 84, 33, 7, -112, 13, -153, -15, 60, -57, 0, -53, 70, 46, 0, 42, -86, 28, -53, -68, 115, 1, -50, -25, 3, -52, -33, -19, -7, -26, 75, 68, -18, -17, 49, -144, -154, -3, 18, -55, -118, 30, -20, -13, -43, 77, -51, 44, -14, 3, 3, 14, -29, 111, 43, 34, 32, 14, 17, 44, -37, 65, -8, 19, 14, -129, -17, -32, 17, 20, 79, -79, 3, -57, 54, 58, 11, 74, 88, 71, 18, -101, -110, -66, 142, -57, -63, 32, 6, -117, -5, -8, -3, -22, 41, 81, 37, -134, -8]
6401hP4J1o4n3O3K0l5lr1J23K2j08Q3R2p4j35K29l5j95Q3N8j58R3k1L5J8o8o4
6429a08K4J06r4R1lj36Q2j30J63J4k7M2n5P9o6pn8J48r4M2ol1J66j37L4o2p0J09
6457A6nj1k4Q3Q0j87K15k01j76J51j7J50j02R1r1n0J01j34LJ01P8j61J09L8j13
6482e6j05K05M7O7j97k2M1K9R3p6L1n3k9K9M4%np1P8N7ro9l1m9M2Jj41J76LP1
6512A01j89J47k8J8j06P3K2L6j6oJ7j4j26L8k5j9PJ11J4j28L8J01J9n4O6p5N5
6539G7p7q8K17j54J1m9R8j44K15j15O4L1j33L0p2Q1j2J4m3O6P3j30Q8J8o6Q3r3
6566a0P3j15K2p1J16n4k0K9N2Ok1L2l9LJ9L8j39K66j82P0r6K2j5%N9Rj02J00p7
6595b5Q2q9m1J38q9po5J68p1m5J88j49J8j05L3N5j7NJ5L6r8M1M3j1lj27J11R7
$$ y = [-8, 66, 77, 13, -40, 23, 43, 8, 5, -86, 37, 59, -49, 34, 126, 52, -83, 146, 111, -84, -1, 57, -101, -8, -29, 6, 24, -44, -108, -84, 22, -72, 19, 16, -120, -38, -168, -5, 9, -18, 24, -31, 48, -18, -25, -83, 65, -29, 13, 7, -24, 142, 5, 39, -23, -93, 16, 11, 0, -24, 59, 139, -48, 167, -34, -210, -59, -76, 74, -28, 63, -28, -78, 23, -111, -108, -7, 71, -90, 19, 57, -56, -161, 44, 91, 158, -39, -61, -20, 9, 102, 26, 57, 4, -25, 4, 48, 48, 43, -28, 50, 107, 98, 29, -2, -51, -9, -8, -149, 27, 30, 101, -88, 59, 31, 49, -57, 16, 38, 74, 58, 52, 69, 55, -71, -33, -58, -77, -70, 41, 55, -73, -35, 66, 85, 31, 97, 22, 77, 0, -88, 129, -25, -14, -63, 35, -109, 106, -9, 55, 86, -47, -17, -89, -8, -20, -6, -49, 17, 90, -40, 48, 66, 0, 83, -10, 63, -52, -30, -101, 15, -39, -59, -30, 22, 28, 7, 39, 0, 3, 22, 60, -79, 187, 5, 75, -21, 1, -14, -14, 45, 54, -48, 52, -25, 57, -32, -73, 65, -24, -31, -96, 72, 1, -44, 144, -5, 13, -92, -59, -4, -21, -16, -1, 35, -63, -22, 21, 10, 7, -120, -9, 88]
6623H8j25R0n4J05q7R0j82P5q2J05l3Q4lR5j52P8m2m1J9n0m4nN8k2L6p9l5J01
6651a2J2K2lqn7J42j90M4J83j88P1n1lK0qM8j26N0o2P2J06j0K3j58n0J84k3l8
6679a0m6J60r5N1P8r4l1QJ8q4J03j18J49j50M7j5o0J34M8o4r4J32l6J0l1K7r8
6706f1K7Q8k04J21K8L2M0r2l7P5k1L3k3Q%k0k8j0k7NJ27om0q7J88r6j11oj4m0
6736a51N3PJ44j22kl7J13M9m6N4k9k4j5N2n7N1q3N2q8J55j99N6R6n4K01j26j04
6763e4N0j24K70r0r4jJ0NM8l7J12j01Q1o8L2N2m7q0O6p3M6n1J35o6L7j51P9L9
6791B5p6r3Q7oj13K26q9P9j1j33M7Q6m6O0q0Oj5o4Q6O5k0p9J00K2J5j15o9J39
6819C4J0ko1j38N1K17j08K3q2P0p1q2J75N1j06J9j4k7o4L3J10jn0K0j08K03k01
$$ y = [88, -37, 53, -1, 104, 17, 107, -75, 0, -82, 23, -10, 74, 71, 166, 14, 92, 50, 9, 28, -22, -66, -71, -13, -35, 1, -78, -113, -12, 0, 22, 19, 11, -46, 96, -94, -50, 133, -55, 16, -35, -38, -18, -26, 22, -104, -54, -116, -44, 62, 52, 75, -83, -133, 51, 28, -10, -56, 104, 9, 60, 138, 44, 13, 21, 39, -45, 58, -60, 89, -61, -14, -29, -89, 45, 93, 29, -65, 67, 31, 41, 10, 37, -61, -34, 54, -150, -29, -1, 31, 71, -21, -58, 17, -4, 29, 6, 14, 14, -6, -34, -44, -71, -66, 61, 55, 15, -72, 116, 20, -91, -97, -111, -151, -98, -91, 53, -69, -71, -108, 5, 54, 8, 62, 33, 9, -6, 46, -11, 40, -43, 9, -79, 76, -123, -67, 29, -25, 176, 50, -54, -4, -128, 142, 52, -42, -43, -33, -28, 20, -17, 95, -6, 75, 7, 39, 91, 44, -36, 30, -43, 3, -48, 87, 21, 58, -93, -14, 25, -51, -144, -57, -63, -176, 50, -39, 40, 29, -104, -57, 29, -17, 43, -37, -31, -46, -110, -24, 41, 21, -58, 42, 64, 79, -36, -105, 34, 44, 42, -19, -157, -106, 111, 3, 26, -56, 14, -57, -139, 36, 87, -19, 0, -14, -41, -105, -72, 38, 37, -13, 7, -101, 102, -99]
6846i9J62r7M3P0p0l1m1J43m4j08k7P5P6m7K2j7K9m1Oj3m2Q3n6L8n4M5J3K3q5
6875d4j18J82P9j38QpQ5o0J2R4j88Q8O4kM4k3K2j10J7o0nJ9k5J04J4n8mk1Q9j48
6905i0Q6k9l3j5J64r5P9K6j57K6k2JqM2n1N1N8j29j4J44j7j8Mk5p8J15J7o1J43
6934A14j28L0O8p4rn0N3P9m6m3k6m0L7K6N2q6p1M7Q8j07J88r9o6k0N6J12k9o1
6962eM4j16J31Qj12l8L8OL0O8j08QJ09m3J4lr9R4N0j59J30m9P6J7j35M1L9P4j05
6991En3m5O5q1J18l2qJ1K3j00L1J04l3p2Q4o7J92j52j44J37j5p5J38Nq1J42p9
7018A8n0O5j7Q9k38KJ46k7o0O3k3J0nM3qn0M4r4O7R5N7k9j71J0J1K2j8M4n6jJ06
7049D5p7J48p4mPp9J02j09R9RN4j62N5K0L0o2l9K10k01J18m9O1j64rK15n7q1l3
$$ y = [-99, 63, -34, 9, 79, 9, -22, -63, 80, 36, -72, -99, -24, 52, 5, 27, 10, 39, -2, 4, -9, -51, 32, -24, 14, -40, 5, 18, 41, -44, -162, 20, 99, -39, -31, -38, 47, -13, -1, 93, -95, -7, 57, 55, 99, 76, 98, -12, 5, -55, -60, -41, -66, 38, 52, -6, -10, -31, 58, -90, -4, -33, -66, -81, 83, -12, 67, 93, -64, -38, -60, -59, -67, -25, -76, -25, 33, -96, -110, 34, 17, -1, 3, -22, -100, 15, 32, -29, 114, -14, 16, 84, 10, 1, -49, 4, 83, 37, -6, -32, -72, -35, -9, 43, -43, -114, -67, 21, -86, 102, 3, -63, -83, -27, 85, 56, -5, 39, -77, 54, 62, -50, -88, -50, -44, -14, 54, -54, -46, 63, 20, 34, 31, -68, 26, 76, -83, 47, -2, 74, 91, -44, -3, 36, 110, 5, -48, -93, -28, -109, 9, -23, -31, -20, 3, -97, -66, 38, 5, -67, 17, -50, 142, -10, -154, -17, -32, -107, 31, 36, -45, 97, 18, -32, 33, 16, 105, -133, -131, 15, -12, -72, -9, -32, -22, -27, 16, 8, -42, 2, -92, -25, 70, 127, 98, -73, -63, -52, -30, -48, -4, -60, -61, 45, -32, 116, 42, 38, 45, -34, 68, -41, 58, 67, 121, -41, 14, 34, 64, 2, -37, 173, -28, 90, 41, 102, -62, -71, 144, 87, 6, -27]
7077b7o2K0j8J58l0J3M1j84L4QMQ4J3l9m5k5J94j79O0j5o5O8o3N9qM5j6j7P9K9
7107A16q6K5N1o3q6J06k4r5Jn7K4O1J07j6r0J14j49J05o0P9m2o4J46r2L0m3l4
7134c6J1M9p1M4O0p8M6j9O5q9N1M1j78P2J24j09J05j38p2K11j22k3J18pql2O7
7161H2q6n4P4MJ5n5r1Q3J37j98M9L9j02P6Q0n6o9O5Q4k6q6p0J36M5j27K7j4J48
7189A10r8k8lN2j06J50j82J22oj0%M3J2r5R4p1P9j69J19n0J0q9M2M5mP9j75J14
7217a5J1n2JN5k0j8j9J9k5J16n8N2Jk32J88Pk7K9P0q0N1k6k3m2P4j07R9j22J33
7246D0k7j6M4j6k3Q0p3m4N5K1o6J3m7J2p2J11k5nN6j7o3Q2p3Q1r8Q6R4j54K4K5
7276Erm2M0j0J80j90RM3k7NJ53p0p6N0j00R6m7R5l0j30M4p5J48n5J02j10k7j6
$$ y = [-27, -89, -69, -87, 71, 41, 54, 95, -89, -55, -47, -43, 41, 54, 15, -30, -55, 139, -40, 20, 5, -60, 8, -55, 4, -4, 41, 25, 8, 87, 116, 30, 55, 106, 43, -43, 63, 39, -56, -55, -112, -88, -27, 80, 64, -26, 88, -61, 44, -16, 63, 21, -43, 103, 11, 41, -2, -36, -25, 24, -47, -3, 57, -21, 25, 6, 71, -18, 33, 74, -104, -32, 92, -17, 88, -50, -122, 89, -33, -56, 62, 55, 47, 15, 82, -4, -58, 16, 20, 35, -20, -111, -28, 109, -89, -40, -1, -103, -27, 53, -3, -72, -7, 77, 51, -35, -105, 31, 76, -51, -24, -38, 110, 12, -16, -19, 33, -73, 77, -105, 17, 11, 1, 1, 44, 56, -39, 55, -16, 63, -106, 13, -37, -27, -116, -74, -29, -33, 46, -129, -15, -4, -56, -55, 0, -20, -38, -57, -38, -63, 53, -5, 47, 48, -184, 4, 11, -16, 13, 83, 3, 54, 28, 5, -37, 37, -70, 29, -93, 40, 13, -3, 41, 25, 2, 82, 9, -35, 20, 41, -25, -12, -59, -47, -119, -8, -33, -38, 18, 1, -62, 20, -53, 28, -70, 16, 110, -44, -20, 5, -4, -46, -6, -16, 164, -26, -17, 26, -1, 4, 157, 87, 11, 61, -39, 57, 10, 105, 75, -55, -11, -86, 62, 7, 109, -1, -28, -44]
7304d4K8O1l1m5k5P8p8m1R0J06r0m1J00r9JM4j17J99K2q2R2j12j20J98l8j16Q4
7331B4p6k1RN6K3j8J16j02O9l7j29J53m5q4p6L9j5N3J9Q9p4J26j64N2Qj7J16o7
7359B7P3j41K0J14Jj23L8j4Pn0L1j1N7N8k0p8Q2Pq3K8J1j0n1jJ11L0j36Q7j74
7388a10J47l4j00M1rK2m8M3QJ12o3k2kl3Q0r8J46qp7J0K9Lp1J29p9K6O2l4j30
7417f0J3Q4jJ26j84K18j82j7K9j1J8m9O7q9K7Qp0Q9Mn4p7R0J60j84NQ0QM0n5L4
7447F7k8%l7p8pP1L1N4j10K7QL0k4K6l0K4m5J5M3J4j51J18K5j18J76n9j72K41
7475A11r1j9J1m0M3k5k2nM2J61k63R8QJ5p1P8k5p0K8O4J5K4Kk5o7M3j6o1J40j01
7505a8r9J17mPRJ8n3j01J33m5M4m4J09l9m5o1M7Q6j17M3J4m8J40k9j12J3k1Q7
$$ y = [-44, -16, 45, 14, -31, -56, 22, -56, -97, -7, 99, 9, -32, 68, -31, -30, 14, -103, 96, 118, 36, 128, 16, -104, 94, 56, -60, 24, -52, -73, -64, -8, 15, -3, 113, 11, 80, 43, -86, 67, 22, -62, -138, -99, -114, -61, -42, 47, -27, 99, -65, -13, -5, -22, 94, 27, 100, -41, -21, 93, 94, -29, 9, -5, 2, -48, -17, -28, 29, 87, 67, -11, 71, 78, -5, 23, 34, 24, -27, -28, 83, 113, -23, 64, -110, 37, 3, -97, -56, -65, -43, -91, -48, -40, 72, 9, -13, -15, -48, 32, -66, 80, 72, -5, 5, 34, 37, -34, 95, 16, 42, 104, 70, -60, -47, 37, 36, 162, -22, 196, 14, -3, 26, 15, 33, -16, 51, -38, -11, -3, -73, 16, 20, -34, -111, -21, 139, -45, -40, 40, 48, 88, 33, 67, 39, 39, 2, -76, -83, -12, 19, 73, -37, -10, -2, 28, 4, 30, 0, 24, -21, -6, 37, 51, -100, 18, 43, -75, 101, 42, -130, 111, 20, 1, 12, -28, 15, -10, -32, -37, 5, 166, -97, 1, 9, 24, -47, 31, 6, -64, -36, 28, 43, 67, 69, 44, -23, 20, 4, -57, 83, -18, -117, 0, -4, 3, 12, 30, -23, -124, 9, -36, 8, -36, 73, 34, -11, -72, -25, 61, -56, -13, 1, -47, 93, 64, -48, -35, -56, 31]
7533C1N9j05O1q1l9J03J02j04j74J92Oq7K0O7j49J48l9o6m1P3J00j10L2q5k1K17
7559A10j13pmK6j58P6R3MN2q8ok1J9O2K8L8j22Q3l8j3n1R2j04p8J16Nm6K9l1Q6
7589C9RJ7o4p5K3mJ4J5L2m9P2k3nr7O1L5N8K9R4j16n5Pj20P4M9j8k8O9j99J52
7619dj0l2Q9m6M4l5Qm4M1j27J88r2j06P6k7J55p5q7J11n3M2k3k4j5M8M6j46J09
7647A1m9j82J18Qj2J27m3j3Q5J9o8P9l1k9n1O4l3k3J8KpOj9j12J89o3N4Rj31m7
7677a24K51j99K6J50p9j1O3pj16j9j9M0J4K7o4M0O7J9Jj0n0rL9p0N1m7M9L1m1
7706Ck5N5J22l2p8J2p9Q9l3l2N7m7J06q7o5P0j00J06L8k9Kk18O7K1J34j46M0L6
7734a3J05m4j06J23l7j27J02K9j10Q1M8l9ll4Q7pp1Q4j43N7R2m7k3Q1o3qm7J4
$$ y = [31, 90, -15, 46, -35, -74, 29, 131, 27, -147, 45, 51, -36, -16, 51, -98, 50, 11, -55, -96, -23, 77, -33, -1, -86, -107, 110, -3, -10, -14, 12, -146, -70, 23, 27, 79, -9, -15, -36, -17, 45, 73, 111, -11, 72, 34, 21, -30, 62, -42, -120, -4, 1, -45, -16, -47, 39, 48, 65, 1, -74, -51, -55, -41, -26, 6, -43, 29, 6, 1, -96, -35, 0, 58, 87, 181, 65, 10, 17, -103, -29, 20, 2, -26, 43, -156, -4, -14, -46, 43, -3, 41, 6, 14, -30, 11, -116, 72, -20, -126, -50, -77, 78, 3, -84, 27, -26, 16, -7, -31, -46, 2, 48, -98, 11, -38, -220, -102, -94, -106, 21, -22, -35, 50, 69, 1, 80, 49, 20, -31, 33, 0, -23, -5, -3, -10, -4, -23, -135, 54, -9, 45, 54, -77, -124, 127, -72, -46, 104, 25, 14, 77, 70, -46, -65, -84, -44, -30, -3, -67, -27, 40, 59, 60, 50, 0, -9, 30, -40, 11, -36, 13, 44, 3, -22, 33, 155, 123, 45, 57, -22, 67, 34, 2, 59, 12, 118, 31, -34, 36, -64, 42, 80, 51, 53, -165, -98, -77, 57, -89, -49, -13, 92, 48, -58, 65, 28, -99, 3, 32, -78, 3, 51, 12, 9, -25, 62, 55, -16, 68, -75, -18, 74, 27, 4, 85, 22, 14, -33, -19]
7762a9M5m3L5p7J0P8q8P9oK7r4k7k1L4J23j16M6j3M6K6n0LQK0jk4o1K9O5r0j1
7793f7R5J50j07j3or9j0n1K00j52J18m9m3J02p8l5M5N9j13k8O9j14J68j01o9J36
7819GL0j47R2P6o9P6j07K0l9O5j6J7O9r4J2kJ03j72R6OpL6om8o0Q4J03j85mQ4
7849B0j3J01j12Ln4P8M8q6n8K07j23j16Q3o3j4N2L9k7J20k86K64j39N5L5L6j20
7875g0M0M1oM2n2O1k3p1R2r2J6M6Qr4N9oK7n4P1R6n8m2J8p5n2J03j8l4l2J61o6
7906C6j95R8P6p8l5N0Q4j19K1J06l3K4r8P2Q5p9k8RQM1k3MM4m2J0k5O2p7J05j10
7936gP3J00k13J23p1J6O4j6j50P4n0Q3K0m2J9n9n8J47m8Qk4K3k5L7N1j19J04q2
7964b2N0J6j1m1O7k5l9N9l0o3P7ko9L8l0M4N7l5L5j2k5j2k0M7j22J9L9M3K6l5
$$ y = [-19, 26, -17, 18, -59, -49, 29, -59, 20, 14, 41, -53, -80, -101, -67, 56, -60, -14, -27, 19, 45, -5, -2, 6, 26, 25, 1, -60, -31, 34, -56, -67, 28, 178, 71, 58, 52, -47, -57, -108, 92, -60, 58, 9, -34, 68, -10, -45, 0, 59, -54, -82, -13, -127, 41, -60, -129, 7, 37, -110, -18, 58, -11, 65, -42, -22, -61, 4, -12, 5, 74, -20, -8, -10, 93, -79, 17, 23, 16, 52, 46, -2, -62, 22, 125, -60, -64, 20, 7, 108, -4, -1, -55, 23, 71, -15, -73, 134, 11, -105, -22, -85, -99, -47, -8, -35, 85, -201, 63, -76, -21, 14, 50, -70, -30, 11, 5, 47, -5, 56, 33, -38, 54, -38, -22, 24, 32, -62, -3, -9, 18, -36, 35, 131, 73, 31, 49, -26, -78, 25, 7, -27, -59, 102, 36, -159, -61, 15, -63, -98, -48, 36, -83, -62, 44, 11, 35, -63, 9, 94, 15, -13, -4, 4, 45, 22, 26, 70, 28, 38, 13, 75, -2, 103, -7, 66, 166, -47, 76, 5, 21, 85, 69, -81, -7, -57, 26, 46, 4, 23, -36, -94, 53, 5, 13, -11, 12, -13, 24, 75, -44, 60, -22, 28, 44, 33, -8, 59, 34, -5, 54, 24, -39, 38, 36, -33, 5, -25, 19, 76, 41, 76, 64, 39, 27, 7, 54, -68, -49, -10, 33, 59, 24]
7994B4P9o9m6q8J60N5j4j67J03J5m4O5j4j59J94l8l8P5o6m6JR2qo5jR7k12J27
8022A2Q2k20J58r2Q9L0j19l8KJ71p8Oj21O6j1J43j08N9l2q1J75m9r9J7J5L9P2
8049H8k10J98j05J9L2J03j09M8j1N0j54K9J8m6M7O2k6p8Q8r2O0n1J16j41k6J58
8075F7j06nK3jmP9p2rK6J8k5j59J58J1O3J0j33kj5J19m0n4J28j34J53n4r8P2J7
8104C3n3Q7j15J00j01k4O7k8k4J10n6p7J13m0J40j14l6PJ5j01J60Lo5r0J35n3
8130g%O7m0j1L4O9j17j9P0j17J41Rj43K13k01J8Q5j81K20j29J19j29J8L6LQ9j17
8157b0M3p1q5N1J15R1p0l7o8kjO6q3k9N2j6M9l1K9k4R6m9K7L9mp4M7o0l3O8pr2
8189h3L4Q9
$$ y = [24, 103, 34, -12, -100, 60, 115, 101, -66, 37, 52, 8, 73, 59, -100, 94, 56, 18, 93, 27, -19, -18, 74, 66, 1, 0, 97, -115, 12, 94, -126, 32, -60, 29, 59, -60, -98, -96, 75, -3, 3, -118, -52, -63, 80, -28, 31, -1, -82, 93, 44, -55, -38, -23, 16, 88, -122, 76, -29, -10, 22, 125, 16, 64, 53, 103, -51, -22, -4, -50, -3, 59, 33, -45, 43, -49, 11, -40, 76, -65, -91, 67, -39, -44, -21, -22, -26, 53, -19, -28, -2, 16, -9, -168, -10, 1, 64, 74, -59, -61, -76, 43, 3, -51, 77, -57, 96, 42, -56, 16, 33, -20, 67, -48, 52, -49, -73, -6, -34, -58, 52, -4, -81, 32, -8, 132, 18, -18, -11, 4, -97, 63, 66, 1, -89, 46, -7, -7, 60, 20, 9, 43, 112, -5, -24, 46, -71, 70, 79, -64, 149, -52, -34, 51, -130, 90, -39, 80, -49, -31, 5, 8, 97, -20, 23, -48, -133, -82, 33, 124, 54, 17, -51, -53, -54, 12, -71, -100, -48, -64, -15, -46, -17, -41, 55, 6, 33, 72, 68, -6, 41, -19, -52, 16, 9, -83, -49, 40]
8191D0
$$ Imaginary data points
##PAGE= N=2
##DATA TABLE= (X++(I..I)), XYDATA
0@%%%%%%%%%%%Qj6J6j6J6k4L2m0M8n6P2q8J04j20J36j60J84k08K40k76L16l60
33a92M08m61N20n84O54p32Q19r12J013j122J242j377J522j680J854k042K249k478
51a299K731l010L318l663M053m495N001n588O273p089Q085r327J0923j3063J6097
66H947k0741K8808m6622J50629o0001k27817K61273j04087q1141J40913j13178
77f3017j4464J97770j31656k5480J00175r1317O0122L2354k07360J31658J29877
88A18662k08101M4912J31577j13752N6801K3109j36775J04432M7663j53101O5324
99a9249L9929o8921J04967l3386j13118J64796J8j71381J01712L4035r6524Q7392
111C0270l2262p6557J46698k8465j06929J10816k4019n0071R2834j01815k7543
$$ y = [0, 0, 0, 0, 0, 0, 0, 0, 0, 0, 0, 0, 8, -8, 8, -8, 8, -16, 16, -24, 24, -32, 40, -48, 56, -64, 72, -88, 96, -112, 128, -148, 168, -192, 216, -245, 275, -309, 345, -387, 432, -480, 533, -589, 653, -724, 798, -882, 972, -1070, 1179, -1299, 1432, -1578, 1740, -1923, 2130, -2365, 2636, -2952, 3321, -3768, 4317, -5010, 5913, -7150, 8947, -11794, 17014, -29608, 121021, 61020, -166797, 94476, -9611, -90752, 50161, -63017, -77481, 120289, -11367, -36847, 63328, -27989, 32133, 64487, -142873, -11215, 118662, -89439, -44527, 87050, -26702, 30099, 53208, -83567, 20865, 68528, -84573, -19249, 20680, -48241, 56726, 23340, -89778, 75018, 75036, -96345, 5367, 39402, -57122, 30270, -1992, -78549, 68149, 39684, -67245, 43571, 19552, -30519, 62315, -39500, -67043]
122f7043J60628j07985o8752J40719o9581j8983R6833j19897K2289J28908j36623
133c9487l205J10554r5019L1318M9815j29872P7502P2747j44697N0821O8092r2150
145d3581O3755J0191r7005J05961J5728j20769P3942J9707p0743P1968k9295o0238
157f0379J14500k7185q6732R2173r742n2640O8501n4728l4492J08036n5870n9826
169e8384R5652l0001l3066O2870o4260l337R1446q0611k6547Q8672m9038k587
181i191N1803p6325L0563O7627j04159P509P2908o8713J7798L3952p3024O0944
193A1692M3245r7750M0039M5265o9339L6250K896o2898P9290M795q8515O5978
205A0948K0546n9982N0853j7627m7687Q1080k3609o6548P4021m393m0404N0711
$$ y = [-67043, 93585, -14400, -83152, 57567, -12014, -30997, 65836, -54061, -31772, 97136, -39487, -42692, 67862, -27157, 4161, 53976, -75896, 1606, 74353, -70344, -19523, 48569, -43581, 20174, 30365, -66640, 39321, 55049, -65720, 8222, 27929, -42814, 29154, -141, -60379, 54121, 26936, -59796, 32377, 22635, -30005, 38496, -16232, -50724, 57312, 1442, -58384, 37268, 7267, -25799, 37071, -27189, -30526, 60920, -19691, -46238, 42434, -6604, -9191, 42612, -33713, -3150, 64477, -39682, -32173, 40735, -27978, -10180, 23772, -49252, 11692, 54937, -42813, -2774, 42491, -26848, 9402, 12298, -50600, 28690, 33485, -55030, 10948, 31494, -28488, 22365, 4738, -42949, 38131, 14522, -52026, 21995, 17602, -22802, 27909]
217B7909m0749j9943P7879n3696l8223P7289l0046j8027N3078n1086N820O5598
229E5803p1524j6529O0805m4885P45L3601n3417L3592M5092p0545J8145M5571
241C6454n0321J6334J3459n3429M4535K4053o4946L1494L1241m2861K3382J073
253A0468m0227M6498O44n6625M1492J5868l7005L4643p425l4225N2850j3599n2537
266c9180N0531J071l7277L9446j6707k0812N8930k9245l4448N5995k4052k5009
278b0757M1327l9017l025N5216n2056q911N7827l8586l88L5523m6923J9429L4652
291C4311n8681J6583L4765m4891J8038J2612m1539L8285J1430n0363L3325J5745
303A9620l7089K5141M41k7851L5676n129l7209L2039N420k6522K3036m371j7959
$$ y = [27909, -12840, -32783, 45096, -8600, -46823, 30466, 420, -17607, 35471, -15615, -9795, 55803, -15721, -32250, 28555, -16330, -15585, 18016, -35401, -1809, 43283, -27262, -9117, 36454, -13867, 2467, 15926, -37503, 7032, 31085, -33861, -2367, 28874, -13987, 9395, 10468, -29759, 16739, 17383, -39242, 2250, 18118, -18887, 15756, 8331, -25894, 26956, 13357, -39180, 11351, 12422, -24855, 14591, -2116, -22928, 36002, 6757, -27691, 28304, 4252, -20757, 20570, -18447, -21472, 33744, -18312, -27223, 30604, -7982, -8370, 27153, -19770, -341, 34311, -24370, -7787, 26978, -17913, 125, 12737, -28802, 9483, 20913, -29450, 3875, 19620, -17469, 7672, 8113, -19738, 15938, 10809, -26400, 5639, 11059, -15463, 7573, 3202, -14757]
316a4757L3234j0854k9700L6027j312l0336K5763p868j9303L7556j7005k7545
328b6100M3781j1022k6582L4689j8456j0639M0941l5474j2431M9931l0827r756
340a1945L6304l7805O231L4299n2082R552L9900m2968J1642K4355l7472L0399
352A0410J5389m9461K9532J4592m2256K4951J917k9473L9066m589l5373L8582
364A3287K514k8441K4300r744j8326L0648j5444k2206L4109m440j8629K2198j1109
377a283r163K9433k0071j8803L4593j0003j8175K6652j3251q084K9685k7063j4365
390a9898L6158k0831j1700K8211k3245M583L1345l6550L865L5412l5878J368K2428
403A5268l4027J7948K0302m1935K0953K2668l6395J8769Q666l1096L0072n11l7078
$$ y = [-14757, 18477, 7623, -22077, 13950, 12638, -17698, 8065, 197, -19106, 18450, 1445, -26100, 17681, 6659, -19923, 14766, -3690, -14329, 26612, -8862, -21293, 28638, -2189, -11945, 24359, -13446, -7215, 27084, -24998, -15446, 24454, -18514, -6872, 17483, -19989, 10410, 25799, -23662, 5870, 20462, -21794, 3157, 5074, -24399, 14667, 10078, -25295, 13287, 15801, -12640, 11660, 1916, -16410, 14238, -1206, -23412, 10697, 6257, -12372, 9826, -1283, -10446, 18987, -1084, -19887, 14706, 4703, -13472, 13180, -71, -8155, 21530, -5533, -19898, 16260, -4571, -16271, 11940, -11305, -6722, 24623, -11927, -8062, 27350, -8528, -7160, 15268, -18759, -811, 19491, -22444, -1491, 21177, -15218, 3551, 12217, -18879, 11193, 10682, -26396]
416b6396L4128M710k9946K8224n541k2689L3621j2942k5124L4664p671j9467K6835
429A2406j3105q324L0011k2047j3635L0014j8862j0956K4666j9711r84K7589k5072
442h010k654L0247k1408l478K0511k4050M718J9749k9379P303K2652k6876P070
455c605J5567k5316J5782J2462l1671J6872J4513k8380J5605Q109k3952K1532
467G518J256k7708K5237L418k4701K2634k551j8887K7885r093k1471L0266q501
480E302k1414K5237j1066j2002K7948j7693j1265L1078j7354r236K5646j9873
492d692j114K3682k8279J592K7564k6787J307K0376k5265R324J5925k9660J3211
505b816J7825k7286J1709J1058k1277J8431L446k6488J9897N043k3980J6912J681
$$ y = [-26396, 7732, 12442, -17504, 10720, 5179, -17510, 16111, 3169, -21955, 12709, 5038, -14429, 12406, -699, -9023, 20988, -1059, -14694, 15320, -3542, -14498, 10168, -9543, -10527, 17062, -8010, -10664, 19583, -1825, -5303, 15208, -8842, -4124, 15625, -13754, -6451, 16201, -10675, -3605, 11962, -13354, 2428, 14890, -16781, 91, 14604, -13776, 1829, 9938, -14014, 7518, 8774, -18934, 6303, 9721, -14980, 7654, 5103, -13784, 14101, 5008, -16463, 13803, 5302, -16112, 9125, -1941, -13943, 14005, -3688, -14953, 16125, -1229, -10465, 15181, -4692, -5806, 17876, -10403, -8811, 18753, -8034, -6727, 13649, -11616, -2292, 13633, -16027, -2816, 15009, -12277, -568, 10490, -10787, 7644, 11090, -15398, 4499, 9542, -14438, 2474, 4155]
518D155j6003K0867m109j8042K3177j380j8403J6008m978j2553J8990r614j2926
531a4811K4296o305j4063J9904p427q562K0800j5420j0437K5040j3503j0366K1760
544A0906j4485l119K0446k2738k43K4304k2882P24J9347k2923J0027J6462k8914
557a3088J3239J6599k8918J1643J0028k3719J9188L520k5029K2291L219k0746
569a1773J9277l294j4924K1383r721j5067K3234p044j2055J6908q785n299J7283
582A0123j1753n839J7786r521o259J2532r214j802J2623j3230l927J6369j0490
595b602n283J4474r153j550J4194j4139q58J7305j5307k089J4110j6011M322J2760
609A0173k0742Q704J3850k2400R400J0676k0550J5054M994k3116J8762L630k1557
$$ y = [4155, -11848, 9019, 4910, -13132, 10045, 8665, -9738, 6270, 1292, -11261, 7729, -1885, -14811, 9485, 3180, -10883, 9021, 1594, -6968, 13832, -1588, -12025, 13015, -488, -10854, 10906, -3579, -6698, 13748, -8990, -9233, 15071, -7811, -7087, 12260, -10663, -636, 15826, -13088, 151, 16750, -12168, -525, 9503, -14216, 4972, 8492, -16537, 5754, 8973, -11773, 7504, 4210, -10714, 10669, 948, -14119, 9115, 2071, -9984, 6924, -1861, -7160, 10123, -1630, -7469, 10317, 796, -5463, 7069, -2145, -3947, 8676, -4554, -8481, 7888, -2602, -7885, 6589, -2564, -4114, 10080, -4059, -4917, 12388, -2919, -5008, 9102, -6909, -2587, 10173, -10569, -1865, 11985, -10415, -1015, 9661, -10889, 4165, 9159, -13957, 4805, 8435, -13122]
622a3122J8474q07j6018K0273p479j3537K3131q975j1466J9526j0988n469J7638
635A1181j5175l143J7370j4510k560J3346j1663K560J0229j3960L924J1187j2491
648c705K492Q538j0799L613N985j2973M743R091j2471K352Q255j0067M680O404
662F138j2696P271P170j4670O457O536j3109R403K598j5186J3358L157j5827J2928
676C528J377j2901J4332l936j1777J7749n576j2040J5523p500o580J5554j1442
689c689l864J7776j2232l698J4895j1297P9J1235j4845K031J2055j3972K019R146
703E639j1291N308N811j2935P998O899j3439N855N035j0373P921K307j1497R388
717B626K683j2140P776K187q667R096j435r007J1624r75r991J0186j857p855J0101
$$ y = [-13122, 5352, 4545, -11473, 8800, 1321, -12216, 10915, 1940, -9526, 10000, -988, -6457, 11181, -3994, -7137, 10233, -4277, -6837, 6509, -5154, -2594, 7635, -6325, -2401, 8786, -3705, -1213, 7325, -3474, 139, 6124, -6849, -2106, 6985, -5486, -3134, 5121, -4946, -266, 6138, -6558, 713, 7883, -6787, -330, 6206, -6903, 2500, 5098, -10088, 3270, 6427, -9400, 3528, 4905, -7996, 6336, 2400, -9377, 8372, 2796, -9244, 6279, -1221, -7801, 7753, -3689, -7553, 10223, -2009, -5707, 9188, -2109, -2030, 9205, -5640, -3609, 8446, -5526, -3507, 5639, -5652, -344, 5467, -7468, 530, 7429, -6010, -155, 4880, -5493, 2428, 4735, -6762, 2626, 5309, -6831, 945, 3132, -5535, 3561, 2126, -6881, 4743, 3768, -6223, 3963, 2106, -5749, 4352]
732D352m839o912J2607m308p143J0857m189l720R974p300l076J0810q655l332
746d874R924p775m94Q646j0023Q34J0309j0278Q30R264r553K310O959j0692M562
761e1O868j2221M534N575j0631O881L244j1173R292K466j1481R272J366r455R469
776C955k403q694J1512l153p661J1068m315m876J0358o930k881J0999p749l071
790c841R117p010r04P264p762M04P054p349K27O345n661J434M548o362K159N546
806E209p154Q87N296o644O93M597o954K843N823q485K510O027p888L654M045r137
822d678N897L269j1090P536L060r856Q533K0r100J1218j989r119J1113l348o833
837e367J0520o308l610J1268q645k954J0307q152J12Q248r229K462P491r495K543
$$ y = [4352, -487, -7399, 5208, 900, -6243, 4614, 425, -3295, 6679, -621, -3697, 7113, -1542, -4874, 5050, -2725, -3219, 5427, -4596, -3762, 6547, -3731, -2901, 6363, -3190, -880, 6079, -4613, -51, 6817, -5404, -870, 4705, -5926, 955, 4199, -6974, 2318, 4784, -6697, 2575, 3941, -5514, 3955, 1552, -7142, 4370, 1217, -6444, 4624, 309, -4567, 5791, -1139, -4020, 6979, -770, -3841, 5276, -1734, -2638, 4626, -3136, -2732, 4322, -3027, -2800, 3545, -2116, -682, 3866, -2496, -337, 5209, -1945, -1058, 4238, -2406, -1713, 2884, -4070, -1227, 4596, -3889, -1379, 4648, -3240, 414, 4459, -4678, 1219, 4488, -6602, 934, 3994, -5862, 2671, 2691, -6409, 4809, 2820, -6299, 4814, 1466, -5367, 5153, -1155, -4765, 6503, -2142, -5096, 5211, -2941, -2829, 5419, -3810, -1348, 6143, -3352, -809]
852h09N897p541K877K470p177M417K358o394L678K241m552L145J219m261L487
867A055J878n457J836L316m522J673K688n409K987L158p007L900L574o993M622
882A299J544p565P261N30q544Q012p10p550Q890k795n620J0551n062m847J0261
897E655o109k395Q719q633K28Q089r650J685P227q821L296M615q745N236L638
912D035p892M901J934o078M756L3n083N379o87m727M527k34l296L955m36l204
928b117L761k47l845L271P38l866K798M1l466M264n2m268M888k64m587N359j132
945A276m147O383k954m435P120l415l339O593m526j619O857n923k3O800o362O13
961a101N486p189K457M599p924L185L675p053L915K665o284N000J105o154N173
$$ y = [-809, 5088, -2453, 424, 2894, -4283, 134, 2492, -3902, -224, 2017, -2535, 610, 1829, -2432, 1055, 2933, -2524, -688, 2628, -1894, -221, 2467, -2942, 45, 3203, -3804, 96, 3670, -3323, 1299, 2843, -4722, 2539, 3069, -5475, 2537, 1827, -5723, 3167, 372, -5248, 5303, 241, -4606, 5655, -454, -2849, 5870, -2763, -2535, 5554, -4096, -2411, 4816, -4005, -709, 3906, -4839, 397, 4035, -3857, 1044, 2978, -3100, 1656, 1689, -3394, 1985, 1298, -3429, 1098, 864, -2432, 1523, 1087, -2117, 1644, 1397, -2448, 823, 1561, -2305, 493, 534, -2932, 1332, 1280, -2988, 1900, 1636, -2951, 2408, 1276, -2871, 3512, 558, -3877, 3243, -172, -3511, 3082, -1444, -3063, 3794, -2129, -2152, 4648, -1714, -1101, 4385, -2804, -347, 4252, -3672, -487, 3188, -3865, 50, 2715, -3569, 1431, 2536, -3618, 1555]
976A555N86n247M998o71m623N677j545m252N658j182l765M998j972k520N289k613
992C71k731M919k628k370M522l120j112M682l878j181N198l266o56M217l760j97
1008i90M015m493L85L824m228L50L059m177J582L028m744J942L054m619J953K534
1024B475m568K627K047n502K876K307m950L056J399m656M285M47m910N066n2n046
1040c099N119j397m073O064k523l811O275k804k647N993l641j361N714m841o95
1055a727N347n017L90L859n249J636L248n333K313K764m538K437J654l768L023
1070A039P21l351K339L89k892K270J61k237K128L42k538J934J084k591J603J067
1086A468k939J707J117l504K533J008l851K995O66l775M343m48m069N183j454
$$ y = [1555, 2141, -3106, 1892, 1221, -3402, 2275, 730, -3522, 2136, 954, -2811, 2187, 215, -2305, 2984, 371, -2360, 2559, -69, -2439, 2083, -1037, -2149, 2533, -1345, -2526, 2672, -594, -1250, 2967, -793, -990, 3025, -1468, -1083, 2741, -1487, -1137, 1922, -2255, -673, 2355, -2389, -447, 2607, -2012, -59, 2475, -2093, 534, 2581, -2921, -45, 2262, -2688, 368, 1767, -2889, 1396, 1843, -3067, 1999, 1947, -3099, 2020, 623, -3450, 2614, 91, -3720, 2555, -249, -2896, 3097, -544, -1905, 3809, -1032, -1727, 3620, -1397, -1007, 2852, -2397, -761, 2487, -2846, -533, 2231, -2307, 130, 1784, -1984, 1039, 1760, -1591, 748, 1137, -1755, 515, 676, -1561, 567, 909, -1629, 305, 1389, -1202, 401, 1468, -1471, 236, 1353, -2151, 382, 1390, -2461, 534, 1200, -2575, 1768, 1320, -2749, 2434, 980]
1101I80l784N674k783k834N821m160j907O065m618l95N102n425J487M248n902
1116b431K556L216n986L167J608n100L997M25m429M201k52l410L944j064k017
1131a575L385j767j621K866j299j063J964j105q19J701p50r63J679R8j491J210
1147D50M14j745J656q0k538K688m21k813L490p83k558M231j940k242N002k891
1163h0j756M848l957o06M537m871P08M165n400J657L188n186L245J789n251M140
1179A170O58m454M221m89l690M353j583k709M346j862j634L618k209p87K944k304
1195d11m64K446k132l14J680j453k5J475j179l42J563r53m06J557q60p00J704
1212A186j371p73K252j700p32K297j998m10K732k443J21K870k965L44K531l110
$$ y = [980, -2804, 2870, 87, -2747, 3074, -1086, -2993, 3072, -1546, -1941, 3161, -2264, -777, 3471, -2431, 125, 3341, -2645, 522, 2130, -2970, 1027, 1452, -2977, 1224, 972, -2438, 1506, 442, -1575, 1810, 43, -1578, 1288, -11, -1074, 890, -215, -1034, 667, -83, -1046, 633, 731, -760, 450, 864, -881, 775, 695, -1843, 845, 424, -2389, 1101, 318, -2240, 1991, 51, -2191, 2811, -80, -1836, 3012, -945, -1551, 2986, -1885, -1177, 2988, -2412, -755, 2433, -2753, 492, 2281, -2970, 1170, 1828, -2626, 1595, 1106, -2584, 1769, 186, -2523, 1823, -39, -1673, 1945, -264, -1051, 1893, -411, -875, 1571, -561, -875, 805, -648, -673, 802, -377, -719, 844, -109, -515, 1042, 182, -518, 1186, -185, -958, 1294, -406, -1138, 1159, -839, -1249, 1483, -960, -839, 2031, -934, -590, 1941, -1169]
1228a169J110J938l685J869J496l497K458P75l280L110o0l030L319l83k750L071
1244A292j136k015L209j451j425L154j971j102K910j867m16K694k281j94K185
1259A586k246rK082k368K72J643k168P29J723k298J029J199k188J319Q88k282
1275a089J357Q83k350J413N80j996J470L49j895J774N5j484J522J15j555J338
1291D87k17j311J561k22j469J628l04j114J603k59j186J787n50j405J887q03j168
1308a055K125j279j205K577j634p27K632j941l91K481k343K48K374k805M71K014
1324A542l056J452J337k879J843Q08k903K349M12k362K634m97k105K560r55j426
1340a246K186j073q08J952j411k40J679j199l3Q91j056K38O49p93%M46l45m70
$$ y = [-1169, -59, 1879, -1806, 63, 1559, -1938, 520, 1295, -1985, 1125, 1065, -1965, 1354, 971, -1779, 1292, 156, -1859, 1350, -101, -1526, 1628, -343, -1445, 1465, -402, -818, 1876, -405, -599, 1586, -660, -669, 1413, -955, -683, 960, -1208, -479, 1244, -1054, -25, 1174, -1014, 305, 1193, -1089, 268, 1151, -1199, 214, 794, -1202, 268, 617, -1278, 496, 551, -933, 589, 704, -851, 487, 270, -1041, 520, 298, -1171, 457, 153, -961, 642, 383, -803, 984, 434, -971, 916, 113, -1055, 1070, -209, -1414, 1163, -471, -1198, 1434, -507, -898, 1583, -760, -512, 1862, -943, -472, 1542, -1514, -62, 1275, -1604, 239, 1047, -1856, 493, 905, -1457, 1177, 680, -1425, 1135, 180, -1246, 940, -133, -941, 1011, -400, -640, 1039, -160, -193, 698, -358, -120, 529, -264, -264, 182, -163, -633]
1358f33O99L6o18Q08j00p90J143l9j117J565o79j127J724j199p68K324j697n13
1376i81K269k125K06K251k596Q63J700k916J474J091k828K117L21k548K595l97
1392D96k004K715j057j383K648j740n86K349j986r5J599j859O39J078j758Q82
1408f2P08j373J054K75q51O62p3o60M26q5j20q3K2K01m86M96Q0o61J086l36q51
1429f31J389p87m82J472j482n4J645j906L41J608k137R37J171k348J627O64k324
1446a297K102k38j862K135p87j409K449j204r85K370j644k33J912j971L12J543
1462A193k173Q17R18j628Q65N24j389J026K22j053R35L4n79N29Nn25N21k0m43
1481b21J02K03l05Q4K42k87J18N11n87J62M73o60J26N91j142N06P15j307N88N65
$$ y = [-633, 66, 102, -516, 292, 192, -598, 545, 506, -611, 954, 275, -852, 872, -327, -1095, 1229, -468, -981, 1288, -837, -631, 1620, -976, -113, 1587, -1329, 145, 1236, -1592, 525, 846, -1702, 893, 496, -1508, 1207, 150, -1233, 1415, -325, -911, 1438, -548, -643, 956, -903, -264, 814, -944, -62, 646, -727, 327, 602, -249, 413, 340, -320, 106, 21, -99, -182, -160, 41, -445, 51, 131, -530, 556, 220, -631, 758, -29, -511, 961, -521, -575, 1070, -836, -495, 1113, -1024, -87, 1084, -1264, 363, 1027, -1297, 805, 567, -1295, 840, 53, -1356, 1093, -111, -1096, 1274, -370, -603, 1309, -662, -350, 1193, -980, -163, 755, -873, -8, 516, -873, 153, 375, -678, 257, 291, -288, 241, 246, -279, 242, 222, -221, -119, 84, -221, -137, 105, -182, -64, 447, -140, 22, 495, -165, -39, 552, -590, -84, 631, -676, -88, 477]
1501D77j218J086J07j097J263k83j133J462n40r41J493q77o64J563r08l18J285
1518G57j056l6J163j191K70R33j243K40P84j207M64N46j166O83O04j201P83L04
1536D31r53Q51n1p79P33o5o51P98j01p42R63m82l72P40k66l38R12n81k71N89l88
1557b3l00O12m18l27O49l61J01L29k04j38M23l23j65M45k42l09M17k44l60O66
1577B28m63j61O79m98k44R67n85j74R47q67JR58j270K86Q52j372N80P62j441J017
1597B02M38j365J146k8j151J277l53r10J306o61p07J402r00j16J250j220J73Q06
1615E89r82N21L79r66O43Q9p49N89k2m48M78j96k69M79n6m7K2L9P0j98R2J4m87
1638d16N86j92l25O62l98k77R07p67m1R21j159K62Q42j164N46N88j372J047L22
$$ y = [477, -741, 345, 452, -645, 618, 335, -798, 664, 124, -817, 676, -201, -865, 698, -210, -528, 757, -299, -335, 828, -363, -93, 840, -403, -163, 621, -586, -122, 424, -742, -59, 545, -656, 127, 431, -522, 329, 278, -501, 232, 167, -484, 314, 213, -529, 434, -48, -420, 320, 54, -284, 628, 47, -224, 365, -23, -323, 289, -129, -456, 193, -168, -67, 262, 58, -80, 343, 20, -145, 300, 58, -251, 166, -78, -438, 228, -235, -396, 283, -215, -459, 508, -77, -251, 696, -171, -170, 788, -482, -196, 656, -716, -136, 626, -815, 202, 640, -725, 421, 393, -758, 519, 166, -744, 562, -99, -806, 596, -304, -420, 830, -390, -217, 589, -393, 128, 507, -459, 184, 273, -476, 113, 91, -357, 121, -75, -344, 135, 79, 32, 54, 93, 163, -35, 57, 71, -416, 170, -22, -347, 315, -83, -360, 547, -220, -261, 660, -499, -237, 605, -559, -13, 575, -797, 250, 572]
1657E72j451J256J7j168J491n77o67J382j191k71J380j151pJ091j393N09P23j116
1675e71P10L05j049J033r7q30Q75l58l72N84l55q9N29m95J53K23k92R6N1j28L85
1696C08m07J71o3k86N32k50k30N99n90M0O28p75L12N57j018O02L81j184Q26J45
1716B98j153J236k65q04J299o48m63J263r16k29J145j053M0Q62j016K48N01q94
1734e49P14J22q90Q81p9p78R02j12n58P41m28k84O99m56j39N54m62l0K38j38J79
1755A27m6m3l8Nr3K7J04m2j61J77J5k01L08P3l79L86j5n29N40j8n18O37l57l16
1779c57O28m77j23O61n55j60P85p05K75N20p37J84M69p00L47K15n63M53N5o08
1799c93N16R6n13M75j05m81N20m5n23P34j16n23N05k12j61N55m42n4N62m65m8
$$ y = [572, -879, 377, 394, -774, 717, 140, -527, 855, -336, -607, 773, -378, -385, 706, -687, -178, 545, -571, 139, 444, -605, 428, 331, -499, 376, 18, -354, 230, -125, -214, 315, -180, -27, 196, -96, 0, 51, -77, 308, -99, 72, 9, -277, 255, 5, -225, 374, -216, -176, 452, -323, -11, 546, -472, 130, 511, -673, 153, 298, -855, 381, 116, -688, 611, -37, -500, 763, -153, -382, 763, -290, -250, 612, -404, -156, 345, -549, 165, 287, -603, 278, 199, -579, 323, 211, -347, 394, -34, -318, 381, -75, -214, 340, -122, -152, 86, -52, 127, 81, 38, 0, 5, -88, -61, 43, 1, -160, 17, 32, -169, 139, 212, -167, 219, 204, -325, 215, 197, -321, 316, -41, -357, 271, -206, -329, 332, -223, -383, 402, -303, -28, 492, -245, -61, 408, -292, 55, 270, -293, 160, 215, -393, 123, 219, -294, 181, 76, -405, 115, 70, -453, 281, 165, -358, 147, -65, -226, 329, -113, -167, 395, -70, -118]
1820a18N70n27j4L62o41J47L74m52K79J98m30L73K1l05L03Q5l30J24L0j99J85
1841C5P8p5j96K13q0j8K69k12k35M77l10j53M32m10J45K24m19J25L34m77L10J98
1863B55o18M55K57p24N71o8n44O38k73l74P68m43k64Q40o85p4P99o64J06L64o59
1884c37L43K87o30M69O8o51O97k39m73P25l13p9M21m20LM92n53J62K52m09K59
1905G4j08j50L17k52qK38k36K33j38j70L09j92r1L86l72m6M54n81K84K45m48M55
1927B03J13o60O76k21n08Q97o44k09P39o88J70O81q96L54N24r57N42K57p89O86
1947B70n3n08O24l32m30P67m35j71O27m95Q6L02m75L51rl34L69j72j39L70k09
1968Dm5O3j30J46J61l77L19j1k26L44l06j13L59m06J30J73l30M73r1m07L91j25
$$ y = [-118, 452, -75, -89, 273, -368, -221, 153, -299, -20, 178, -252, 121, 142, -163, 140, 225, -105, 19, 49, -150, 35, 113, 38, -158, 55, -25, -43, 226, 14, -221, 256, -54, -207, 225, -185, -40, 184, -235, -110, 224, -253, 57, 255, -363, 92, 349, -375, 196, 128, -416, 222, -51, -425, 343, -100, -364, 476, -209, -283, 516, -148, -42, 322, -337, 6, 293, -337, 132, 200, -451, 246, 7, -466, 259, -54, -133, 288, -132, -129, 363, -190, -28, 224, -185, 74, -34, -184, 133, -119, -127, 111, -125, 108, -30, -200, 109, -83, -174, 212, -160, -206, 248, -333, -49, 196, -252, 203, 316, -344, 332, 111, -397, 500, -144, -353, 386, -302, -132, 549, -347, 7, 531, -426, 116, 373, -416, 270, 217, -291, 333, 1, -429, 338, -97, -268, 359, -136, -50, 252, -223, 128, 119, -215, 154, -18, -157, 213, 4, -41, 22, -108, 38, 199, -178, 141, 130, -96, 248, -58, -171, 188, -218, -88, 85, -245, 228, 137, -270, 121, -4]
1990dk85P27m34k41O05o15k1O43p18K83L93p28M32J22n07N92n4m26M23k14k50
2011b77N18k69k07M56l86J03L31l78K06J14k46L6J61l07J78q8r0J69O5j54J11
2032D6j09P1k1M4J1r7J53O2k81J45P3k74K03r2j27L37r7j30J76k16jK81l21j1
2056a75L78k20j8J29l28K17J98l41L10jl65L80j6k84K93o5k35L07j57k18J59K4
2078b8j0K89k42k21L59k48P1L79m65K0K10l26J85J20k26J25J53l31K71N6k26K29
2100A44j14j77K35Mj10J40j52r6L05k05N9P0j20p8J73j42O2o3M2J34j58k8J7q8
2124a46K16j95nK27j65N5K74l75J32J16k23J59Q6k45K27o4l69M42k24j45N13l74
2146h3J5L04l85P6L53n36K18K14m75L43J82n01L82M0m08M47k05j68L84l39nM51
$$ y = [-4, -289, 438, 4, -237, 368, -247, -268, 375, -343, -60, 333, -395, 37, 159, -348, 244, 190, -236, 187, -27, -277, 241, -28, -235, 221, -165, -62, 269, -109, 97, 211, -35, 1, 162, -145, 33, -55, -145, 24, 89, -65, 46, -63, 8, -13, 31, 42, -55, 98, 160, -121, 24, 97, -177, 26, -66, -193, 144, 47, -83, 93, -123, -124, 157, -164, -175, 203, -17, -35, 94, -234, -17, 181, -160, 150, 149, -216, 164, 148, -136, 157, 92, -143, 164, 7, -211, -52, -28, -38, 251, 9, -212, 147, -101, -30, 349, -116, -96, 114, -212, -27, 93, -133, -8, 145, -186, 85, 141, -85, 144, 30, -147, 88, 92, -18, 122, -30, -126, 179, -26, 33, 103, -17, -95, 78, -64, -2, -65, -23, 111, -47, -75, -58, -146, 70, -125, -130, 97, -68, -13, 261, -114, 18, 134, -89, 70, 156, -89, 138, 74, -295, 147, -77, -222, 291, -83, -68, 236, -149, -73, 280, -256, -38, 176, -299, 44, 226, -275, 107, 147, -261, 186, -19, -187, 197, -142, -147, 304]
2168C04m22J10J37k81K90jk77J47R4j99K27j07j29J97l09K32K27m50K90r1j10
2189a21L54k53p2L26m22K46J49m09K32J33m66M49q7k72M27k24j33L98m22m2M35
2210B26m66J80K63n87M33Q3l10K97p5l45M82k61r4M04l66r3M94m86K27K04m02
2231a92L35j44l04M81j57k59M51j71q8K96l15NJ09j56J36k3n3J14p8n0J82j85
2253f6J11J04j93J63o2k41L05q0k40M50l23o3L12l51J64K34n20L37J51m01K80
2274G1M9k02J73l3k27L43k07j04L11j66r3K92k18L0K01l28P9J62l17J68M9k24
2296a91L04j27m5J59o8j21K14j39m7O6Lm6J47k65J46n2L4KK5M1o5k5P0p8P5K3
2322D0n5jP3j27J63p5j04J22J0j6JL2j53J12l8mN9q2n4P3N2j22J23k9r3K18n6
$$ y = [304, -118, -8, 129, -152, 138, 137, -140, 7, 101, -98, 129, 22, -107, 90, -219, 13, 240, -210, 80, -11, -121, 233, -20, -92, 234, -188, 58, 207, -202, 30, 163, -303, 146, 59, -213, 214, -10, -143, 255, -167, -209, 226, -240, -60, 203, -384, 49, 132, -178, 119, 44, -301, 181, -80, -174, 230, -136, -229, 265, -221, 6, 210, -192, 143, -1, -305, 176, 19, -240, 211, 40, -48, 248, -67, -62, 47, -109, 27, 4, -49, 65, -13, -63, 119, -66, 45, 149, -44, 119, 57, -184, 121, 41, -199, 251, -72, -135, 177, -174, -10, 224, -296, 41, 192, -209, 71, 120, -82, 91, 58, -169, 174, -33, -137, 174, 8, -85, 207, -11, 19, 220, -108, -29, 133, -184, -16, 33, -191, 113, -14, -59, 100, 32, -89, 125, -14, -61, 5, 8, -38, 109, -156, -10, -62, -28, -26, -1, 40, -25, -50, 20, -58, 17, 40, -15, -16, 57, -70, 93, 18, -86, 36, 46, 30, 31, 63, -90, 22, -16, -20, 39, -43, -97, -24, 28, -94, 29, 0, -93, 125, 69]
2349F9j70K52n9j7l0j71J86k7q7M3NJk8P6j03k6K47k37K40j99N4J58j33j46K72
2374A70l58K09J83k61O7K16m06J96J20j95K24j17k02J55K6j29J75j48J03J48j73
2395CoM0j50J10j7o9J06o4J9J29l0r6M3k8P2o1r6J68m1j29L20l04m2K55k74J08
2421c4J88l01P5J31k91L53l2j85J65n3k45M01k05l6K24k91J13K69k83K8J7l47
2443c39L26K5k31L25l7j90J75j48l2J69p1Q4J5j76J08N2j49K47k07o9L25k35J3
2466b0J64j94J13O8k73J93l8k29L95j78j08K60k19MJ81k78K02J20l14K63O3k64
2488h9J82q9j93L73j23j49L20m56K47O9j73K44j1k81J87P1k95L31j90o3K04j59
2510d3M7J53k07j4K57l07N1N3o7K87j88j52J08n7k8K22j69J19lj62L8N2j78J78
$$ y = [69, -101, 151, 92, 75, 45, -126, 60, 33, -54, -11, -6, -5, -33, 43, -60, -86, 161, -76, 164, -35, 19, 177, 44, -102, 170, -188, 21, 204, -57, 10, 226, -180, 16, 136, -59, 165, 48, -154, 1, 27, -102, 73, -75, 28, 176, 3, -3, 37, -113, -3, -20, -89, 17, -47, -28, 101, 71, -25, 18, -10, 62, 1, -95, 73, 32, -97, 223, -81, -123, 132, -142, -34, 154, -147, -72, 59, -232, 121, 89, -96, 69, 16, -229, 172, -33, -69, 155, -136, -23, 246, -37, -9, 8, -339, -13, 12, -219, 106, 69, -121, 54, -94, -126, 43, -28, 56, 71, -105, 3, 55, -94, 153, -54, -123, 202, -33, -20, 144, -50, 63, 131, -142, 51, 13, -216, 179, 1, -107, 153, -66, -62, 119, -159, 43, 163, -151, 112, 175, -89, 93, 4, -189, 184, 61, -88, 232, -224, 23, 92, -81, 163, 152, -129, 58, 129, -166, 165, -25, -88, 116, -43, 4, 157, -50, -64, 193, -114, -63, -10, -77, 210, 22, -130, -22, -79, -107, 115, -54, 65, 62, -100, -62, -10, -188, -10]
2534a0N6k26L69k15j00K75j64o8J74j05J06o4j33J69j29j02K34p1J4M7l6r2K28
2557A57k09j9K08k02R6q7o1O8J03m8J44j78M8N7m4Jj18Q4K9m6J7L2P0j25J18l2
2583F3%q7k1Jq8mJ39L8l4J32j45pJ2l2K2K8j25J07j26J38J10j75l4J67k05j5J49
2610Hj57P5R1j3L6lj5p1P1j1j0nk0j36J53r3J06j1K6o3J40j45J05N9j93J58n1
2637C1j08J57q0q6J71r8J1R1j96OLj0J8K2m5J48J4j21K25p1j43K07j64ON3r6k
2664e7J13j17P5J86j52K6r7k6J13j25k1K00k33OQ7o4J23nk9J14k08k9J31O4r8
2689b3J01j01J2O0j36P8J65j88J06m2p9L7r4j6N9N4J3R3r0o3J24j14J4J04j31
2714e7J39j05p7K45r1j55K73j82M7J2n3R2l5n8J24o6j33K03j52J9R0n7J3R4j64
$$ y = [-10, 46, -180, 189, -26, -126, 149, -15, -83, 91, -14, 92, 28, -105, 64, -65, -167, 67, -4, 10, 57, 21, -71, 157, -52, -71, 137, -65, 31, -56, -117, -49, 54, 6, 150, -28, 20, 77, 33, 34, -84, 0, 29, -17, 0, 32, 102, -23, 95, 63, 63, -24, -45, -44, -132, -136, 3, 41, 7, 139, -6, -13, -1, -33, -11, 17, -108, -1, -127, 11, 121, -54, -88, 79, -126, -141, 8, -149, -74, 17, 4, 40, 37, 22, -49, 22, 11, 1, -4, -24, -160, -7, -100, 6, -5, 21, -42, 98, -47, 58, 117, -76, 82, 31, -77, 80, 0, -86, 85, -13, -2, 89, -107, -101, -98, -108, -90, -68, -113, 35, 49, -72, 153, 82, -61, 146, -18, -12, 41, -55, -57, 56, -61, 14, 200, 48, 74, -23, -49, 64, -61, -82, 118, -115, -109, -22, -86, 37, 32, 3, 117, -91, -120, 11, 75, -23, 78, -23, -11, 49, -87, -9, 156, -32, 74, 32, -47, -10, -104, -120, -61, -7, 6, 99, 9, -54, 70, -44, -30, 74, -57, 82, -23, -100, 145, 54, -101, 172, -10, 37, 49, -4, 88, 53, -5, 119, 53, -80, 123, -29, -10, 80, 23, 36, 130, -34]
2739c4M0O0j25J43j1K9r2k0j7J36k14R0Q4r1J9P1j81K09k1k27L44j75j47J37j6
2764ir9K29k17P0K00k31P4O3j88Q6K6n6K33j91QJ2o0R8k1j10J5J84k59J62R0k61
2790a52K35j58%J39j20O7R6j10j07J13o2J33m3k9L8j26K8R2n9KPk6j00K32j15
2815b5P4o8r8J60rm1P0q3j9J88j31j10Q8l9Lnm1K55j94j10L1J64k8Kk1j35J09
2842a3oR2J07l06K60o0m1o1N9k8OR8p2K7j31o2J68n7l2J44Oq7K7p5k9Q0j32J23
2870El8R1j93O6N2J16r1J6oM2J3k1j32J54j01m8kJ5M4K4m4M1J4lM7j49J14q0N5
2899Al0L2k6j46P9L7K1R2j1p8O7j6J9q2j0q4Q7J74j86N5QO0k6n5p7L5J14k1L3
2928F6l9L9Q0r5j2m2P1k5l0o0J02o7O0Jj03J52j31p0K04p2K9K3M0k6q3q4K04j20
$$ y = [-34, 6, 66, -59, 84, 73, 102, 10, -10, -27, 109, -105, -15, 69, -22, -3, 68, -113, 96, 75, -152, 192, 17, -130, 7, -9, -108, 121, -96, -26, 174, -57, 17, 80, -108, -22, 4, -52, 181, -10, -2, 10, -50, 48, 27, -83, -68, 116, -143, 19, 109, -152, 83, -75, -75, 64, -56, 11, 107, -3, -110, 3, -59, 74, 31, 2, 40, -86, -58, 34, -25, -23, -16, -42, -142, 90, -25, 49, -19, -117, 43, 34, -7, 63, -20, -39, 149, 18, -92, -4, -43, -40, -45, -86, 169, -25, -135, -104, 60, 32, 34, 13, -122, -13, -19, 73, 180, -126, 134, 74, 33, -28, 31, 3, 9, 107, 35, 62, -69, -131, 37, -20, -52, 92, 98, 11, 38, -37, -66, 14, -118, 5, -33, 58, -135, -69, -17, 99, 8, 24, 18, 60, 73, 52, -80, 74, -27, -75, -77, -62, -18, 6, -38, 3, 17, 14, 61, -88, 26, -54, 1, -29, 3, -23, -169, -90, -53, -32, 60, 49, -29, 38, 22, 41, -41, -51, -135, -48, 126, -60, -5, 3, 63, 37, -18, -95, -60, 54, 33, 66, 27, 66, 146, 51, 39, -3, 68, 43, 13, -47, 55, -12, 48, 49, -54, 98, -33, -103, 101, 29, 58, 81, 121, 95, 12, -72, 132, 12]
2956A2q7J00j6QRK8j11J27j93J48R2j88nR3j14J85J5j62N5o5Q1J04j13m4J00j84
2982a25J45J37k20J63q4j14K8mL5J84k39J76n7q9J47J1n6Qj30jJ10K4l5j1rO5
3008E9K5j34j7K27k36Q7J8p3J10j38J15M3p4n0P7o3O4jRj16O3k1J18j65P9J80
3034A86j57n8L0p5K8J02j19N9mq0P7k2J8P7r8j1O1n2Q1k2o2J17p0j9J54j77l1
3061f7O8n4P0K7j49J2J71q7l4J01r7M5J4j56L00j88N9L7j57R0j3q7%J40j47J94
3087I2o6m0K0K1r5J58r4Lm4J8Pj06j0J08K9ON0l6o1M3Mj6J01j00m8M5J24j35N9
3116C7j25K17n5p2OK1mJ09j39J40j00r9N8j7l7J01j25J17o0k8P6M9j02Q8n1L6
3142D1k4rj7J9l3J73l03J20O9j00J02o2P0O5j21K1l6M1j19P6R3k2O5j28m1rK1
$$ y = [12, -75, 25, 9, 17, 26, 54, -57, 70, -123, 25, 117, -71, -76, 17, -97, 88, 103, -59, -4, -69, 12, 116, 3, -41, 59, -125, 20, 157, -63, 100, 16, -98, -70, -74, -39, 145, -94, 82, 25, -64, 83, 94, 38, 46, -84, -85, 25, 49, 14, 3, -6, 59, 84, -50, -67, 160, -76, 11, 29, -44, 66, -72, 43, 86, 12, -38, 39, -24, 40, 39, 48, -68, -5, -26, 92, -73, 6, 186, 29, -29, 1, -74, -46, 56, -63, -4, -8, -88, -11, -33, -15, 62, -36, -47, 14, -38, 43, 21, -41, 76, 6, -13, 141, -36, -67, 1, -53, 17, 44, -105, -93, 78, -9, -43, 58, -39, 6, 20, -136, 164, -24, 35, 72, -85, 5, -8, -95, -95, 45, -102, 92, 26, -14, 6, 27, -68, 90, -4, -1, -45, -27, -20, -126, -136, -28, 1, 7, 57, 21, -40, 3, 7, -9, 92, -8, -56, -11, 113, -22, 37, -88, 129, 74, 2, 8, 29, 25, 134, -5, 135, 35, -64, -6, -23, -60, 41, -84, 33, -27, -55, 21, 70, -32, 56, 5, 41, 17, 8, -9, 10, -23, 150, -153, -33, 36, -64, 38, -24, 46, 111, -10, 11, -25, 16, -103, -27, 66, 44, 109, -19, -60, -69, -48]
3169d8P0J07N3k66J94l6K4j49M9L0j31J29M6j0j3p3m1P9k5lm5J24q6J10j11J2
3195a0M7p0J35q1o0P2r2M1J33l8j13J5qJ64k77O3P2j22P2P2n5R7j35J22j73K66
3221A37m8J7n0l5ll3K6j4rN1Nr0R8j19j2R4Q8m3p2J6K6qm3m8J37j05N2j0q9R5
3251A1P4j75J58j61j14K95j34N4N5q9J28L1j69J2R6n0K3J9j44J9Q8k6J08n7q3
3276c1J17j43L4P1j51J08O9m8o2l0k1J98j23lm9R5j9N1k6k0o4M6m3j7o2J26p2
3303f9JJ00n9j7k1J81j70L1M8n7K7l9m3Q0K0J12j52N8O9j25m2N0j4Rk3pO0j6k7
3332c5J00j11R9pj14qJ8O5o8K8K1OJ13j49ro0M5K1M9M5r5P6P8r7l4k2M4l5J01
3361F5L9l9k7q0J50j72J11M3p3K4m4J5J5ol1M1K5j1j09J31q8J31q8O9j40J43j27
$$ y = [-48, 22, 129, 182, -84, 110, 74, 98, -51, -2, 28, -103, 26, 72, 62, 49, -24, -65, 14, -11, -14, -59, 65, -21, 89, -22, -10, 37, -33, 102, 21, -39, 33, -59, -18, 115, 77, -36, -21, -29, 135, -142, -79, -7, -129, -57, 15, -40, 57, -78, 44, -129, 137, 89, 106, 56, 21, 18, -15, 11, -3, -12, 39, 44, -46, 52, -67, -79, 15, 103, 60, -12, 4, 30, 22, -21, -69, 68, -37, 15, 5, -84, 11, 85, -90, 68, -93, -207, 88, -46, 8, 63, -26, 102, 133, -36, -24, 72, 22, 45, 64, -80, -61, 27, 1, 109, 52, -31, 86, -57, -23, 48, -103, 5, 74, 26, -36, -66, -87, 111, -12, -15, -64, 31, 12, 63, 37, 17, -47, -1, -44, -61, -123, 3, -69, -68, 32, -27, -44, -65, 116, -54, -23, 25, -32, -5, -44, -87, -7, 13, 125, -27, 31, 100, -25, -67, -17, -31, -22, -45, -52, 8, -8, -35, 65, -46, 53, 46, -68, -76, -58, 7, -61, -33, -12, -6, 107, -42, -51, -111, -66, -45, 4, 49, -46, 30, 108, 11, -23, -45, -1, -36, 65, 104, 65, 38, -42, 108, -64, 47, 90, 17, 41, -3, 12, 27, 21, -10, 31, 56, 45, -64, 67, -21, 110, 22, 91, -49, 94, -33]
3388c3M0P0j89R7J2o0O4L1O5j78O3p0Q4k1p9Q1K3l5J60r7J04j98O9l2M7O5k1M6
3416A08n6j01J03r6QM4n3P3j42J82l9j47O9P2O9k01J45K9j1r3m4j3R7K7n2L7j19
3443a04M7O4k5Rkn9M4J6RK8m1P7j47P6QJ8k9M4j57K11j10j81J98j3j42K20n8p2
3471g1K6L7P6q5J14k10O2j7J28l4j36J55Kl1R7j41O2Om8N9L2j64J12Kj6L8j00
3498d5o2J35o5l7P9m6R8q4m0K35j57M2m3l5J58j00r5J14q2Q0j9J11j69N9j06M
3524g0R4N3k4l6l9O4m1K2Q4o2l5Q6j15j3P1j2j2q2P6m2L5KK7m5m8J20L8j47O9
3553A8l3M5J4l2n9O8K0k3mJ4j32P5Q4j06J58L2j37j32P0r9K21m4K5o0Q3ok0n4
3581a4O0p2O9J7j53J5mP5k5m2J15Ql0pm8k4P0j7l0L3J49k03Q7n0O2j42J09K0o9
$$ y = [-33, 7, 77, -112, -15, -3, -63, 1, 32, 97, -81, -18, -88, -4, -25, -104, -23, 0, -35, 125, 28, 132, -66, 3, -29, 18, 83, 62, 108, 52, -49, 54, -42, -34, 10, -43, 30, -112, 70, 31, -116, -47, 25, 94, -107, 38, 67, 56, -37, -81, -94, 3, 30, -22, 15, -104, -57, 7, -18, -9, -11, -70, -26, -10, -1, 27, -14, 63, -84, -8, 0, 18, -11, 33, -124, 87, -23, -204, -6, -19, -161, 59, 1, -71, -45, -8, 68, -17, 97, -113, -51, -68, 60, 26, -110, 45, 47, 16, 113, -28, 34, 40, -8, 51, 83, -81, 31, 33, 17, 55, -45, -107, 28, -37, -74, 5, -41, 57, -27, -67, 168, 11, 53, 10, -25, 133, 33, -62, 52, -30, 50, 31, 142, -27, 32, -74, -70, 24, 77, 53, 17, -22, 42, 1, 23, 107, 45, 10, 96, -19, -32, 39, 27, 15, -67, 9, -33, 2, 4, 31, -14, -62, 58, 96, -51, 18, -15, 30, 44, 12, -47, 21, 41, 18, 14, 28, -104, -29, 55, -51, 107, 139, 2, -130, -60, -159, 62, 18, 43, -17, 66, 60, 40, -14, 46, -26, 43, 60, -93, -78, -82, -7, -32, -74, 41, 49, 19, 12, -36, -60, 10, -7, -37, -4, 145, -58, 29, -21, 41, -101, 8, 28, -41]
3610d1J01j7j09M5oK5N1l9K8j45J41j8jNp1M4P8o1l9q6P7N7lL1k3L2m0L7kj67
3640a16J79Mo9J4K0q5J04L8p2M3j60O4l9Q7P4j01Q2k9o2J8j24R4j2n1J44k7O2
3667H0j19J17j30J29l0m9p0J05N9p4m8N5j21J19m7m9P5RpjJ3j62J94j32L7J68
3693A21j38P0m3Lj09P5l4L5Q2m8j6j23O1J10r2J14r1M4j2jK1Lq8j2P5m0J85p7
3721G5p2M0l7r3K5j2O1K3l2M7J6O0n9n9O2r3JJ3K5j23J40j0o0NJ28L8j17Q2nk9
3751D0p9R6j1q0j07J90r8J18p3n0N9m9j7o2O7J2N8kn2K1P8j04J32j02M8n3L6p8
3779f2MN9Pr8R3K0Q7m5j42Q0J5Q5l3o5P3o8J41m8r3M9M3k4r1K6Mm3O2N3lk03K21
3810A04k9j31j2R2j06K4m4M5p9Q3N8p5Q2OK7j11O1M1j09J51j45Q2m4qJ23m4l1
$$ y = [-41, 60, 43, -66, -21, -27, -2, 49, 10, 38, -107, 34, 16, 15, 20, -51, -7, 71, 10, -29, -115, -38, 19, 16, 47, 24, 56, 16, 53, 51, -116, 63, 67, -2, 12, 32, -53, 51, 89, 17, 60, -100, -36, -75, 12, 86, -15, 67, 38, -24, -6, -130, -36, -48, -99, 45, 18, 80, -39, 78, -52, 77, 47, -2, -72, 33, 92, 18, -30, 25, -96, 23, -24, -73, 2, 11, 4, 3, 16, -146, 48, -84, -47, 121, -17, 53, 10, 13, -96, -21, -55, -20, 62, 14, -2, -125, -64, 46, -46, 68, -23, 21, 9, 8, 29, 32, -56, -68, 7, -33, 152, 75, 3, 43, 6, -87, -62, -74, -13, 10, -22, 25, 41, 101, 42, -17, 45, -48, -47, -34, -9, -132, 8, -2, -62, -57, 71, 109, -8, 74, 69, 40, -39, 57, 46, -34, -141, 49, -49, 69, -4, -54, 5, -44, -61, -123, -56, -44, 14, 12, -40, -19, 59, -45, 87, -15, 33, -20, 16, -62, -58, 1, 8, -90, 3, 23, 110, 65, -77, 3, 18, 103, 70, 5, 78, 10, 151, 103, 10, 59, 102, 78, -13, 13, 17, -26, 36, 89, 86, -117, 104, 75, -56, -68, 24, -82, -58, -102, -57, -136, -53, 5, -70, 12, 18, 45, -66, -5, 36, -73, 78, -67, 15, -29, -37, 86, 42, 11]
3837A1Nn3r1J98j26J52L1j08l6L2%M8j1m5L6o3o0J06k4M4Pk9K3q9J45J0j28OP4
3866F5m0j40J12l1K2J4m4Q2k6j37K50o4j32k3J71l2K2j06p1J14Np6J00PM4p5l7
3893b6M1M6j33N9J32j97K07j66O3l4n3J0R1j04J18n3p0l3J90j28q7P1O3o1K2k2
3919e4J00n0K4K3l3O3Mo2P0Rj22jJ41j15l8K3L6j7J8L0p0j12M2R7J17j23N3j09
3947e6P3o0j07J22kL8Q7j37J50qj88J55j78J29Lk6oOK2R1j00N6n5L0j6k7o2j5
3975h1J16j8J6r3jJ13J8J2j15KN1q9N2k1l9k8J30r7J9M7n5n0J12k5J7J27j61J5
4003b6M4J9r3J64j9j05m4J18n8K0j5MK2o3L8k8j08J50p2j04K05j65P1k1O8MJ9
4030B5j30J63o4q8R5qMN2l1j49K06j35j3J28o8o8J62j04J7J00k1o8P4j99J83m0
$$ y = [11, 16, -37, -128, 70, -56, 96, 127, 19, -17, 15, 15, 63, 52, 7, 43, -20, -80, 26, 2, 46, 53, 24, 47, -42, 103, 113, -15, -9, 65, 25, -115, -3, -34, -12, 2, -42, 40, 14, -123, 127, 63, -69, -92, 79, 47, 69, -37, -108, 6, 11, -65, 35, 42, 86, 11, -26, 15, 61, -72, -13, 119, -78, 129, -37, 26, -8, -61, -51, 40, -64, 54, 1, -69, -102, 88, -40, -127, -56, 7, -54, -32, -54, 46, -4, 20, 43, 10, 73, 77, 15, 85, 94, -28, -29, 112, -3, -41, -18, 18, 1, 19, 49, -21, -133, -91, 6, 123, 0, 53, -56, 17, -43, -150, -28, -30, 8, 95, -42, 108, 100, -88, 67, -111, 18, 21, -5, -11, -5, 17, 108, 8, 64, 9, 39, 23, -4, -66, -81, 35, 17, 33, -60, -61, 52, 70, 82, -33, -31, 20, -69, -17, -38, -77, -105, 25, -72, -53, -6, -61, -111, 1, -24, -7, 120, -41, -26, 18, 37, -56, 108, 89, -16, -60, 58, 0, 20, 5, 9, 31, -32, 6, -22, -130, 20, -52, -156, 49, -116, -45, -66, 2, 6, 25, -105, 58, -6, -94, 1, -7, -3, 49, 18, -131, 75, -60, -73, 55, -13, -81, 81, -23, -6, 94, 73, 5, 79, -120, 63, 23]
4056B3j6J22j04l2K2k9oJ2j3qQ3j44J06m8l5M1p7R8L5J7j64J38rj01K05p2Kj13
4084f7Qj0N6J9J9j7l7M8j8r2J17N2m2j14M2P5p5N0j01K1P0M8lj08R3J2K9o2M3
4113E6o5m0N7j6m3r0J07l3N5K5k1N4jn3%L9qn4N3M5J2k1q5N3mp4o4K00j31P0M2
4144F5n7N1o7M5p1nM5M3J1K1m2j44J48J6l3K8j03M0JL5L6N1k23Q7P6Lp5K3k5k7
4174d7J45o4j4L5N4j81LJ0l3L8O7K1o1R0j23L9Q2j21Q8j14L6J32j57R8j61J36
4200bp9J53j35j0R7j9N0j3l4m9J0O2j28mJ05J43j63L5pl3Q7k9j54K32j22M5m7
4227ij5L2nO6Lp3p8L8n3J42jJ3j22M3m1O7rl3j6k8M6LO4j17Q1N5j97L2N9N5N6
4258E8o0p8J14m5N3PNq1kN8m8J9m8J7K1l6L4P6j58J07Oj11P2J25j10Nk7J9Q0p7
$$ y = [23, 7, 129, 25, -7, 15, -14, -20, -8, -21, -29, 54, -90, 16, -32, -67, -26, -103, -5, 30, 47, -117, 21, 12, -89, 116, 44, 46, -67, -59, -69, -13, 6, 25, 8, -29, 19, 1, -91, 26, 78, 36, -78, -36, 39, -36, 14, -87, -66, 4, 52, 49, -59, 34, 46, 75, 13, 56, -9, -49, 8, -8, -51, -141, -34, -67, -12, 13, -8, 46, 45, -8, -8, 31, 23, -31, 22, 67, 79, 58, -27, 26, 22, -52, -116, 84, -47, 23, 65, 8, 59, -8, 37, -34, -39, 6, 49, 60, 81, 39, -105, 43, 59, 26, 54, -49, -9, -8, 27, 63, 114, -109, -22, 54, 57, -18, 5, -20, -47, 98, 34, 20, 55, 109, -72, -69, -59, -92, -54, 13, 34, -27, 63, -60, -21, 61, -60, 28, -86, -50, 82, -75, 23, -138, -2, -81, 72, -63, -73, 24, 5, 55, 42, 8, -41, -31, 31, -97, -101, 4, 147, -16, 19, 12, -21, 66, 37, -117, 115, -7, 38, -9, -24, 8, 3, 69, 72, -1, -79, -41, -94, 48, 47, 60, -62, -19, -60, 7, -2, -35, -51, -79, -33, -30, 34, -83, -2, 53, -144, -112, -53, 2, 58, -2, -80, 34, -11, 42, 49, 54, -27, -29, 29, -19, 0, -48, -31, -10, -46, -12, 64, -94, 13, 19, -92, -20, 105, -5, 0, -27, -8, 72, -5]
4288el3j7j4J25o7J04o4j13j2P0o0K9J22n7J0kj14Q2k2J9N2R1j53LpK8o7n2M6
4317g8J74k5m9k6O8q7K5J5P5r2j00J72j91O2l0R2kjM2K1o9qM6Qj23R6k3M6J0M9
4347I7q5m1o0J29k2o4Q1q4J09k02J11R4j00P0lQ8j69pJ5P4N4J07k37M3j1N6L7
4374H0j10k1JJ62r3Kj4j30J45%j1o4J21r9r5J79n2Oj26J67n2p0J59o7j7O4l9o2
4402c6j4o6M8J15k3mn3J02o4no3M8r7J17P2r5l6J36j20Q4q5Rj2M8m7J51k2j42
4430e4N9K1l6j8O6o8P0q5Nmj3K2O4L5j18O0q0J01M9o8n0k9k7R7j6l7Q6m5Q0k4
4460D3kj10Q2m7L5J11j00j24N8R4p8K9k1P2m2k2O9J7j04J6L4l6n2j1J78j30K9
4487a2p3J54j51O8lL5M4j03K1p3J28l7o6J17o9N6k1p8Q2o1P5k0q2J05n6M4R3j95
$$ y = [-5, -38, -55, -69, 56, -11, 93, 29, -84, -96, -26, -86, -57, 65, 8, 18, 16, -98, -16, -38, -19, 33, 124, -29, -26, -33, -5, -72, -124, -78, 96, 71, 22, -4, 64, -23, 2, 17, 92, 0, -100, 72, -119, -57, -87, 5, 3, 2, 44, 65, -4, -12, 34, 42, -81, 15, -8, 38, 48, 97, 12, -29, -89, 40, 18, -46, 35, -49, 60, -142, -31, 63, -37, 33, 30, 118, -51, -58, -43, 31, 85, 192, -45, -2, -13, 43, 80, -30, -51, -50, 112, 19, 21, 7, -123, 22, 22, 11, -53, 68, -31, -126, 53, 1, 7, -119, 48, -4, -74, 85, 18, 1, 65, 26, -36, -50, -116, -68, 47, 24, 20, -33, 69, 5, 0, -63, -15, -112, 5, 77, -18, -54, 82, -38, 46, -39, -30, -42, 6, -41, 110, 88, -54, 5, 26, -10, -28, 38, -30, 40, -45, -40, -44, -57, -35, 29, 64, -54, 6, -74, 27, 76, 8, -42, -71, -98, -1, -17, -54, 32, -13, 67, 43, 41, -69, 13, -34, 1, 112, 12, -112, -54, 40, -38, -9, -30, 42, 0, -22, 47, 64, -40, -24, 10, -26, -78, -89, 89, -41, -12, -85, 69, -82, -14, -17, 18, 62, -41, -20, -93, 35, -2, -68, 49, -20, 36, 15, -63, 19, -42, 33, 13, -69, 36, -20, 24, 117, -78]
4515g8J16r1N5l2Q8j70J35m6L2L9j13J05n6L2N0Jr0L4J6l0J3k3k5J34o1J3j28
4542h0j9J39k1p5J34n6M7q5J6P3Qq1P2k44J09q%O0N9n5j45K24r4J24n1o7M1K6
4570E1j06M2L6l2l1n0J04K5Rp6N3l5K1qlo8O7j25R5O2n2Nkk8m4P9j4o8R5j28Q0
4601d6J00j17k3N0J29j45M3O9m8K0J63k05JJ48j18km8N6j6L0k0pl4n1K4J28j79
4628i8K28n9j59O4L7OK6p4O9J2m2j42J75j28N6j2q9J12n7p0J86O1m4M8j71J09
4654D4j47M7J0LK02k40J04oJ6j06R3P3k2k5j05K8L1m3P2r1R0Q1j34%O1k7M7j9
4682C7j34Q6K4pn7J8J9j2N4m4r8Q2PJ4Nk9R1n0pq0J16l6R2l0o9P6j45P5RN6o2
4713Aj7J30j11J4J8j0J5p3k3J87j51Ol3J69j17o7rL9K3L5o1n3J32kj7o4K5qk8
$$ y = [-78, 38, -53, 2, -30, 58, -112, 23, -23, 9, 48, -65, 40, -16, 16, 66, 67, -23, 11, 27, -3, 10, -13, -38, 96, 35, 48, -80, -99, 40, 19, -56, 78, 22, 69, -16, 0, 73, 81, 0, 72, -172, -63, -71, -71, -11, 48, -7, -152, 72, -22, 102, 51, -16, 25, 51, -55, -13, 23, -9, -40, -90, 14, 39, 48, -28, 25, -10, 11, 3, 0, -68, -1, -126, -31, 31, -21, -16, -18, -46, -90, -11, -25, -93, 2, -126, -46, 54, -63, -86, -36, 93, -52, -9, 60, 12, 32, 195, -10, -9, 139, 21, 19, -29, 27, 11, 41, 21, 14, -20, -71, -47, 81, -98, 130, 71, -88, -24, 13, 19, 45, -29, 40, 52, 10, -132, 43, -85, -29, -41, -130, -18, -75, -145, 41, 102, 58, 106, -65, 44, -103, -56, -46, -43, 159, -81, 23, 17, 33, -73, 20, 93, 71, 46, -59, -31, 0, -43, 29, -62, 28, 109, -25, -25, 36, 9, 56, 37, -97, -11, 13, 6, -51, -33, -14, -26, 28, -16, -114, -32, -25, -11, -6, -35, 56, 6, -1, -81, 35, -1, 91, 61, -8, 68, -77, -2, 7, 63, 1, -16, 114, 3, 17, 35, 25, 40, -33, -56, 131, -20, -14, -47, 122, 5, -62, -71, -32, -9, 26, -35, -88, 44, 42, 25, -39, -14, -22, -50]
4742e0K6N0j4j14O3R1p0J48j14m4L0jM2j21n1J67l3m6Q8p0o4J45j68K24j62j76
4768b24K06M5O7p0m4MR8m1l3l4k5J46j28O4n3N8j5j05J53j15J05p0j03Q7J61j72
4794c8P2qm2l1L3L0Q4j29O2M9k13N0O3q0J54p1j51J74M6l8L0j40k7J26N5j3p5
4821b8J63k07P1m4Q3j30J85n6Nq1RM4k6R0l8Mj1O6k40P8J10K0J5p5M4K2r4J14
4849I3j42O0Q0j2o4o9L9O3o6K5j3kj26J66p7n0N2k0J45j10j05P5J58j08o2P5l2
4876b7J83j71Q3p9L8M6Om8n7R0J6J1q4J6m1pM5k2p6J8J10m4o8J00l4O8j58J3P9
4905Fk4O9m2p0o4R7M9J0j06n3J91j07p3J22R2j21M6j3j40K53k32J50M8j52k6O1
4931b9Rn4J66q1Q8j93J47q8M8p5J01o0k8K8k03J51N1K5l1K4N1p3l8J04r6P4qK8
$$ y = [-50, -24, 26, 12, -102, -39, 52, -18, 130, 16, -28, 2, 1, 43, -78, -129, 38, 5, -41, 47, -23, -87, 58, -110, 114, -48, -224, -18, 27, 94, 24, -20, -16, 82, 41, 8, -26, -51, 95, -33, 31, -22, 36, 21, -84, 69, -46, 59, -11, -114, -27, 134, -38, 34, 26, -16, -47, -14, 16, 100, -29, 33, 82, -131, -81, -18, -98, 56, -15, -166, 8, 54, 16, 46, -94, -121, 5, 60, 47, -28, 135, -72, -1, -45, 38, -92, 93, 37, 42, -39, -30, 14, -12, 78, 40, 44, 33, 99, -141, -63, 47, 67, 82, 7, 51, 73, -21, 93, -49, 11, 91, 79, 15, -54, -15, 48, -18, 7, -6, -8, -134, 32, -45, -95, -43, -63, 82, -28, -133, -58, 100, -8, -70, 5, -27, 156, -15, 68, -11, 27, 73, 79, 31, -26, 64, 80, 91, 7, 23, -18, -25, 20, -2, -78, -60, 50, 6, -62, 38, 4, 72, -86, -73, 6, -18, 51, 9, -61, -125, -28, 21, 31, -75, -128, 63, -44, -117, 5, 97, -24, 22, 9, -131, 122, -110, 40, 88, -64, -90, -29, -20, -74, 92, 11, 99, -94, 53, -35, 13, -62, 39, -21, -49, -21, -224, -73, -22, 3, -28, -4, 47, -26, -64, 40, -56, 18, 10, 38]
4959C8J8r1K8P1R9k28M3n3J28p6J41j00o8P8j00P2O8j9L8j23j2J19k9O3j37J6
4985a6l4N0jM0p5M7p3l1l9K31j04K7k6J22k44R4pM5q7OJ41o1l7Q0n5k5J32j63
5013f3QJ8K8LJ8n8O2l3j20J45n8M4k8l3J42l6K8j32N2o6R9j9L8j69J58rn4L6K8
5042B9q1K2R1L2o8l0o3O2r9OP4M0J30m8n1j28J19m2L5m2O3o6O6o4JK7L8k4%P4
5072A03j17nl8J06p5L7K6K7q5K8j3K6k4J1K7j25P4n5N6M0K5m1k5Qj25R2J19n9
5100A8Kq9J35j05m8J12M6j64K39j28j72L9o1J98p9M2m3J61p3m2n9J97n3q0m0j9
5126f6K0M2M6m6P6q8%O2n3N5jj4Qj2k3l2L3L5j1qp8P4j36K6N3Q0M1k10M5L2l1
5157h1R0L9QPK8o8J16j77N1n6L2L9Kp2J3rMK5p9pP3R1m3qm8M6P6qr5o0J05L2l1
$$ y = [38, 56, -35, -7, 64, 163, -65, -22, -75, 53, -23, 118, 18, -50, 28, -72, 0, 68, 49, 87, -36, -48, 71, 42, 105, -32, -16, -50, 0, -1, 39, -36, 11, -62, -93, -132, 99, -5, 22, -4, 118, -126, -32, -39, 6, -81, -75, 66, 5, -32, 48, -7, -32, 100, -63, -55, -37, -9, -6, 12, -46, 16, -17, -137, 8, -50, -6, -34, -67, 75, 39, 67, -65, -13, -79, 20, 1, 39, -130, 28, 19, -35, 1, 29, -52, -30, 61, 93, 25, -5, -68, -6, -105, -99, -25, 15, 145, 97, 46, -82, 37, -5, 30, -12, 51, -15, 51, -13, -12, 15, 53, 29, 29, 103, -14, -19, -57, 49, -26, 11, 37, 64, -21, 7, -6, 20, -4, 7, 34, -91, -17, -72, -16, 24, 49, 8, -17, -9, -134, -42, 77, 18, 20, -69, 66, -39, -87, 25, 71, -93, 146, 18, -154, -115, -176, 22, -57, -15, -58, 103, 30, -12, -71, 126, 73, -7, -47, -66, -46, -4, 42, -4, 72, -16, -16, 46, -7, 48, 47, 33, 41, 29, 6, -26, 7, 42, 31, 23, -55, 19, -117, -91, -38, 42, 83, -127, -82, -50, -81, 9, 48, 56, 63, 91, 23, 139, -38, 13, -43, -11, 28, 30, -42, -29, -38, -34, -9, -88, -95, -22, 69, 26, 18, -30, 16, 92, 84, -11, -71, 34, 66, 35]
5190C5rJ3K3q3n4J1M1J25j24k9O1Ol6l3MP8l5R1j04Rq1j6K06k2j55J52j11m2J52
5219G3J8j19k9L8M7M7m5n8Q0r0K5l7j20J17o2P7K5R1p5j9n4R4o5j2Q2j14j5K14
5247A14j63J49p2o6K1k5k4J48p5k3k8N4N0j45Q8j30P9J13Mp9j2M3j24l4Q1J36
5273H0j81J06P2j31oQ2k4nl1O4j31J49k71K48j05J47j11O3J51j27Rn1J5N1j4p9
5299c0j3m7J6K1J9P7j29J08M6ROl6K5p1L6q4M8N7j55P2J40q0J3j03J03k4j3n7
5327d6Mm9J38q9k0j8P9K2kor7J11r6R5j63J34L5p8kM7J9N3o1P5k0p0J7j30P7J25
5357H4o3O9q7Oj6rq3J06p5k0J27j05N3j4R2m7Nj18R7L9l0mK7j16P4J0l6L5l0L7
5387Hn1p2K36p2k1Kj13l4P8O9r5mJ53j17M0J37p3l2J0j07J16N2j87J07n3Ol5P
$$ y = [35, 26, 39, 62, -21, -75, -64, -23, 102, -22, -51, 10, 16, -20, -53, -49, 29, -6, 85, -19, -10, -91, -107, 99, 77, -78, 74, -37, -79, 73, 91, -28, -57, -19, 28, 75, 30, -28, 52, -38, -13, -50, -170, -53, -115, -38, -13, 78, 3, -16, -70, 24, -41, -53, 29, -85, -100, 114, -49, 100, 28, -38, -17, -42, -66, 82, 7, -16, -44, 10, 60, -85, 3, -127, -48, 65, 69, -10, -22, 21, -103, -137, -56, 80, -101, 5, 77, -54, -60, 22, -2, -7, -38, 26, -105, 44, -227, 21, -84, 63, -48, 15, 166, 39, 48, -3, 12, 63, 49, -30, -43, -90, -74, -53, -34, 43, -86, 22, 68, 77, 83, 47, 72, 1, 37, -47, 1, 58, -97, -25, 115, 35, 48, -55, 48, 24, 11, -46, -42, -91, 47, -42, -62, -80, -1, 21, 19, 13, -84, 27, -69, 26, -137, -3, 32, -46, -48, -1, 18, 71, 10, 85, 65, -5, 12, -118, -41, 84, 21, 90, 3, 9, -7, -16, -99, 7, -68, -88, 39, -66, -13, -27, 65, 18, 23, -95, 2, 41, 11, 7, 34, -82, -8, 2, -34, 1, -29, 8, -43, -115, 121, 49, 28, 30, -83, -117, -39, 30, -65, -69, 84, -33, 7, 144, 71, 39, 49, -58, 58, 110, -77, 30, -23, -17, -52, -45]
5415d5L2pK1l9N9j05M0N5j04J29m2k1j12J38Mp6J20l5o2L3P9k6N4n1r1K0k3Q7
5443C2l6n7O3O4m7p1l4J79j18JJ07j58K60j93R1l1m6n5N0J0p1J06r5J26l1q9J13
5470G0j1o4m1O6P1o2k5m2Q6k0J31j14r6K7j0j9P9L1r8JJ07mj11MM7K9j6q1J20
5499E5lr0O5k3p9Q4l8P6m4j05L7O3J3k0K5K6p6J12j78J48l0o5J24k6j48M3k4J00
5527B2K4j54J65kLq0O6r9K8J74j93LJ22k11N0J39j21P3n7J5K8p2J90j46R2r1p1
5554a03P0M5j06QQ4P9j29l8M6L2J7J48p3n2j32J11K6k2O0l3K1m7q0o2M1Q6K5r2
5582g0J33J6m4j33P1L6N8Pr9N5q4M9O4r8J09p0Qq9Q8N9j61J15L9rr4O2j0OK8k0
5612B2q6J1Q2o6LNQ2m8K0Q4q0Q3k4l7o3j6k0k5K9JJ6o7J06%J6k0j0j11L1R4N1
$$ y = [-45, -13, -20, 1, -38, 21, -84, -44, 11, -93, 36, -6, -27, -139, -1, 3, -73, 47, 12, -50, -17, 62, 36, 90, 39, -52, -32, -55, 32, -4, -61, 2, 66, 19, -52, -86, 93, -25, -24, 83, -75, 185, -8, 83, 52, 6, -49, 1, 11, -60, 46, -49, 77, 46, -43, 70, 59, -5, -46, 20, 91, 29, 4, -38, 48, 28, 159, 45, -51, -24, -34, -53, 26, 57, -41, -40, 67, 63, -48, -44, 3, 32, 16, -65, 55, 52, -38, 27, 4, -75, 9, -29, 47, 3, -102, -65, -2, 11, -9, 16, 42, -34, 78, -100, 48, 18, -47, 77, 51, -97, -54, -78, 22, 46, -108, 57, 55, 58, -22, 44, -55, -27, 147, -46, -43, 79, -132, -82, 57, -64, 9, -48, -33, -5, -77, 113, -33, 59, -32, -103, -33, 12, -94, -86, -2, 77, -52, -90, -44, -12, 5, 153, 80, 28, -104, 7, 33, 11, 71, 38, 59, 12, -68, -130, -89, -3, 22, -70, 63, 79, 35, -98, -27, 9, 67, 74, -25, 30, -54, -5, 59, -39, 70, 0, 8, -81, 7, 66, -95, 20, 59, 50, -44, 18, 8, 14, 42, 22, -64, -53, 29, -37, -34, -29, 53, 5, 25, 109, 29, 112, 88, 51, -12, -28, -48, -73, -44, -43, -27, -94, 12, 12, 28, 8, -2, -113, -82, 12, 63]
5643F3m8K1p0n5P5n7J03k3jm3Q6m7n7m0O4P4n5O3p8P2j44J08n4K7L8M2j06O3q1
5672f0k5N9M5n3N4l1l6l3m6o7K15l2L3o1m3L0P4p4m6J20l0m0n1O8Jp3J95q4J08
5701A17j52O4k7RK2J2L6n3K0N4j18J07j04j7L7Kj80J55J00m7o6Q2m5l3K7r3J48
5728E7r2L1m3J84j35L9j13rRJ37k1M3q9J1p0L6J37j64P3n0j2J5L9j6J18j55j9
5755e9J95j58PP5o5r1N7p6Q9n3J4J46k5n1j29J16M1j29J59j48J7N9J8J36j30J8
5781C3o7NKj4L1j06J28o7J01j61M0J17j60K5J54k1m2l4l7K06n3r9l5R7l6J0Po
5809A8q5J03k0j5ro3J14L5j07Q4Jp2J50k37O3J0O4M3j51J37l6L5p9k3r5K33r0
5836HjL5p7K6L0R6j42P0J3j5n3l2m7Q6K5o9Q6l6K3K7m3OML1j4j27J28rl0M9j23
$$ y = [63, 15, 36, -34, -89, -14, -71, 32, 9, 8, -35, 51, 4, -53, -93, -29, 45, -10, 53, -25, 47, -97, 11, -43, -16, 22, 64, -42, 21, -60, -85, -26, 19, -34, 20, -11, -47, -80, -126, -193, 22, -10, 23, -38, -81, -51, 23, -51, -97, 23, -7, -47, -98, -30, -29, -102, 93, 9, 117, -35, 29, 2, 11, 33, 45, 81, 28, 48, 102, -16, 91, -13, -30, 7, 9, -171, -16, 84, 37, -29, 53, 8, -25, 2, -91, 57, -35, -4, -47, 137, 2, 41, -72, -81, -72, 65, 44, 87, -2, 9, -61, -25, 112, -52, 21, -29, -41, -26, 13, -3, 115, -40, -59, 136, -22, -15, 60, -5, -96, -39, -115, -26, -79, -65, 81, 56, 5, -124, -8, 33, -96, 63, -85, -68, -9, 9, 145, 15, 33, -34, -29, -27, -41, -10, -116, 12, -55, 46, -115, -75, 42, -118, -93, 61, 40, -2, -36, -73, 133, 80, -19, -54, 43, 7, 17, 24, 18, -67, 36, 16, 1, -8, -71, 43, 78, -29, 55, 56, -16, 134, -103, -40, -30, 34, 77, -74, 63, 27, 62, -17, -40, -135, 98, 8, 7, 42, -35, -9, 21, 117, -25, 45, 58, 43, -10, -42, -89, -3, 22, -47, 39, 3, 26, 53, 10, 16, 20, 51, 37, -90, 38, 29, -1, 48, -75]
5867g5J16j11Q3j68J41O0j2k7J0l9M2P8j52M1j20J6J61j02N7m7J9p2J06L6Q1j53
5893c1QN0m8QM7k9K7l7Rm1j9J31k2Qk0%J1j%p2L5QJ11j54R5j90J25j9k1J40r6
5924A3j05Q6K6n9J15l0l3j75K81q3j34O6P8n8K5l7l6J22%r7L0k6L9N5j26R9j7
5951A9j2J28j09j46K11j41J5J56o2o2P9j18M8k8L5q2J58p5k7kM3p2K8rq0J48j15
5978g2L3kJ14j16K6Nm4P3r9J16P8r3j9mo1J11j08n0J52J8n6OJO6j06O0n0N3n4
6007b2o9P1j7N0k5l9P6M9m0O5j23j3j4k2J07o9N5j28P7M7K0mmRl1L5o6m9M3Q2
6037E1j5j40L8O9L5o4Q6j41J6N4N7k7r8J66m4k5o0N3j0J1Q3j29RM7r0K47j90Q6
6065G5j63J00J9j24O1J8O6K8j28n2J51qj7L7j07J06j57Q2l0Q9k6Q5p0Rk7l7J18
$$ y = [-75, 41, -70, 13, -155, -14, 46, 34, 7, 17, -22, 20, 98, -54, -13, -133, -117, 44, -58, -1, -48, -29, -101, 5, 41, 122, -31, -23, 27, -21, -13, 34, 5, 32, -5, 4, -37, -56, 75, 53, 61, 41, 41, 52, 51, 51, -21, 14, 22, 133, -21, 74, -116, 9, -10, -31, 109, 13, -92, -6, 20, -39, 76, 46, 13, -162, 119, 36, -98, -32, 46, -12, 13, -24, -60, 62, 62, -35, -5, -31, 8, 63, -63, 36, 19, 7, 135, 26, -120, 91, -50, -35, 121, 59, -3, 76, -42, 6, -22, 13, -69, 89, 14, -13, -15, 28, -44, -16, -25, -105, 43, -72, -39, -41, 73, -43, -17, -12, -56, 17, -82, 34, 112, 19, 0, -4, -65, 46, -62, -112, 40, 58, 2, 8, 9, 75, -31, 29, -21, 32, -22, -91, -20, -37, 13, -12, -51, 25, 74, 34, 99, -24, -37, -51, -73, 34, -35, 20, -108, -31, 16, 36, 32, 28, 37, 6, 41, -25, -74, -31, 51, 36, -104, -66, 3, 38, -26, 60, -81, -65, -11, 46, 19, -79, 87, 43, 18, -42, 11, 1, 12, 95, -34, -25, 22, -68, 179, -11, 75, -88, 12, 31, -93, -32, -14, 52, 80, -48, -100, 51, 43, 26, 63, -44, 62, -95, -13, -43, 46, 20, 105, 35, 44, 17, -20, 98]
6092I8n4m9m3N7k9J42j12oNm2L6N5J1l8L4pj30N1O8j24J90p5j00J11M1r9N5N0
6120I6j66K5kJ5k2j26O3J30k8O8J7q9j1j5J22q8m1p1J69j58J06j8j6J04n7n7J09
6147E9K7o1k8r2R4LN0p7R1l5j3o1Q9L5l7m3J8n3m6O5N0n8R2j47J02m2mQ2p8j2
6177c0j9m7R3o8J21o8o8J68m9o7j5M2M0Mp0J35n7j4n3J00q3j2O2l2K7L4r4k0L7
6206cP6j44J48m3o0m0J40n3r9M3jK7o6P6rN5Mr0J0L2O7j02MM7l3L9rQ2n9n6o6
6237h3J87p8Jl2J6%j1J7o7j9P2j25J76j19K5N3KL2N3j1j71J02n2J2l8J14q0M7
6265B3j12L8J28nn1l7N9o9P8j77J25R0p2m9l5R6n0J28p1j25M8O1r3O3KN9j47J41
$$ y = [98, 44, -5, -48, 9, -20, 122, 10, 4, 9, -33, 3, 58, 69, 31, 65, 58, -72, -21, 47, -77, 113, 38, -62, 49, 90, -9, 46, 96, -70, -45, -47, -32, -54, -180, -117, 13, -15, 53, 70, -19, -30, -45, 77, -11, -52, -123, 46, -112, -6, -24, -40, 64, 7, -50, 59, 86, 25, -3, -95, -1, 2, 52, -25, 66, 31, 18, -43, 46, 81, 44, 1, 19, -34, -80, -15, 35, -23, 69, -78, 24, -18, -22, 60, -18, -30, -49, -96, -3, -71, 50, -18, -86, 82, 33, -34, -49, -7, 33, 37, -33, 102, 45, 31, -22, 78, -5, -17, 45, 13, 40, 74, -20, -40, -3, 73, -71, 77, 34, -26, -66, 74, 21, -78, -35, -36, -9, -75, 1, -8, 47, 51, -39, -29, 3, 70, -32, -28, 19, -14, 25, 16, 98, 39, -17, -83, 104, 26, 27, -5, 11, 11, 0, 17, -50, -69, 3, -122, 54, -65, -40, 13, 15, 47, 100, 89, -82, 20, -32, -20, -58, 56, -24, 23, -89, -51, 77, 72, 21, -16, 43, -26, 52, -125, 0, 90, 18, -31, -66, 30, -20, 108, 37, -88, -40, 21, -72, -9, -7, 52, -95, 46]
$$ [...]
8191b
##END NTUPLES=NMR FID
##END=
