##TITLE=1H_DE-80H_X3
 200.13MHz, d2o
 8 sc
 
 19ns.26.2.2025
##JCAMPDX= 6.0         $$ Bruker NMR JCAMP-DX V2.0
##DATA TYPE= NMR SPECTRUM
##DATA CLASS= NTUPLES
##ORIGIN= UXNMR, Bruker Analytische Messtechnik GmbH
##OWNER= pz
$$ XWIN-NMR		Version 3.5
$$ Tue Mar 31 10:04:48 2026 Russian Standard Time (UT+4h)  Yarkov@DPX200
##.OBSERVE FREQUENCY= 200.1313
##.OBSERVE NUCLEUS= ^1H
##.ACQUISITION MODE= SIMULTANEOUS
##.ACQUISITION SCHEME= undefined
##.AVERAGES= 8
##.DIGITISER RES= 18
##SPECTROMETER/DATA SYSTEM= spect
##.PULSE SEQUENCE= zg30
##.SOLVENT NAME= DMSO
##.SHIFT REFERENCE= (INTERNAL, DMSO, 0, 15.4759)
##AUDIT TRAIL= $$ (NUMBER, WHEN, WHO, WHERE, WHAT)
$$ ##TITLE= Audit trail, XWIN-NMR		Version 3.5
$$ ##JCAMPDX= 5.01
$$ ##ORIGIN= Bruker BioSpin GmbH
$$ ##OWNER= Yarkov
$$ C:/Bruker/XWIN-NMR/data/yarkov2/nmr/H-C/1/pdata/1/auditp.txt
$$ ##AUDIT TRAIL=  $$ (NUMBER, WHEN, WHO, WHERE, WHAT)
(   1,<2026-03-31 10:04:02.07 +0400>,<Yarkov>,<DPX200>,
      <created by zg, POWCHK disabled, PULCHK disabled
       configuration hash MD5:
       00 E9 B6 7A A2 85 ED C7 34 08 36 98 17 FE 4E 26
       data hash MD5: 16K
       ED 13 13 53 0F 22 BE 87 A0 12 CB A0 F8 25 1D A0>)
(   2,<2026-03-31 10:04:09.45 +0400>,<Yarkov>,<DPX200>,
      <Start of raw data processing
       efp BC_mod = 2 LB = 0.25 FT_mod = 6 PKNL = 1 PHC0 = -5299.148 PHC1 = 6.821927 SI = 16K 
       data hash MD5: 16K
       2E BC 16 C7 62 25 FB E2 D0 6E E0 0D 5A 44 90 2A>)
$$ ##END=
$$ 
$$ hash MD5
$$ E8 A6 3C B5 EC 51 F0 F6 76 BB 30 21 C7 28 9E EF
##$RELAX= 
##$RELAX= 
##$RELAX= 
##$RELAX= 
##$RELAX= 
##$RELAX= 
$$ Bruker specific parameters
$$ --------------------------
##$DU= <C:/Bruker/XWIN-NMR>
##$EXPNO= 1
##$NAME= <H-C>
##$PROCNO= 1
##$TYPE= <nmr>
##$USER= <yarkov2>
##$AMP= (0..31)
100 100 100 100 100 100 100 100 100 100 100 100 100 100 100 100 100 100 
100 100 100 100 100 100 100 100 100 100 100 100 100 100 
##$AQSEQ= 0
##$AQ_mod= 1
##$AUNM= <au_zg>
##$AUTOPOS= <>
##$BF1= 200.13
##$BF2= 200.13
##$BF3= 200.13
##$BF4= 200.13
##$BF5= 200.13
##$BF6= 200.13
##$BF7= 200.13
##$BF8= 200.13
##$BYTORDA= 1
##$CFDGTYP= 0
##$CFRGTYP= 5
##$CHEMSTR= <none>
##$CNST= (0..31)
1 1 145 1 1 1 1 1 1 1 1 1 1 1 1 1 1 1 1 1 1 1 1 1 1 1 1 1 1 1 1 1 
##$CPDPRG= <>
##$CPDPRG1= <>
##$CPDPRG2= <>
##$CPDPRG3= <>
##$CPDPRG4= <mlev>
##$CPDPRG5= <mlev>
##$CPDPRG6= <mlev>
##$CPDPRG7= <mlev>
##$CPDPRG8= <mlev>
##$CPDPRGB= <>
##$CPDPRGT= <>
##$D= (0..31)
0 0.7 0 0 0 0 0 0 0 0 0 0.03 0 0 0 0 0 0 0 0 0 0 0 0 0 0 0 0 0 0 0 0 
##$DATE= 1774937041
##$DBL= (0..7)
120 120 120 120 120 120 120 120 
##$DBP= (0..7)
150 150 150 150 150 150 150 150 
##$DBP07= 0
##$DBPNAM0= <>
##$DBPNAM1= <>
##$DBPNAM2= <>
##$DBPNAM3= <>
##$DBPNAM4= <>
##$DBPNAM5= <>
##$DBPNAM6= <>
##$DBPNAM7= <>
##$DBPOAL= (0..7)
0.5 0.5 0.5 0.5 0.5 0.5 0.5 0.5 
##$DBPOFFS= (0..7)
0 0 0 0 0 0 0 0 
##$DE= 6
##$DECBNUC= <off>
##$DECIM= 32
##$DECNUC= <off>
##$DECSTAT= 4
##$DIGMOD= 1
##$DIGTYP= 9
##$DL= (0..7)
0 120 120 120 120 120 120 120 
##$DP= (0..7)
$$ [...]
##$SUBNAM2= <"">
##$SUBNAM3= <"">
##$SUBNAM4= <"">
##$SUBNAM5= <"">
##$SUBNAM6= <"">
##$SUBNAM7= <"">
##$SUBNAM8= <"">
##$SUBNAM9= <"">
##$SW= 18.0517328524113
##$SWIBOX= (0..15)
0 0 2 0 0 0 0 0 0 0 0 0 0 0 0 0 
##$SW_h= 3612.71676300578
##$TD= 16384
##$TD0= 1
##$TE= 0
##$TE2= 300
##$TE3= 300
##$TEG= 300
##$TL= (0..7)
0 120 120 120 120 120 120 120 
##$TP= (0..7)
150 150 150 150 150 150 150 150 
##$TP07= 0
##$TPNAME0= <>
##$TPNAME1= <>
##$TPNAME2= <>
##$TPNAME3= <>
##$TPNAME4= <>
##$TPNAME5= <>
##$TPNAME6= <>
##$TPNAME7= <>
##$TPOAL= (0..7)
0.5 0.5 0.5 0.5 0.5 0.5 0.5 0.5 
##$TPOFFS= (0..7)
0 0 0 0 0 0 0 0 
##$TUNHIN= 0
##$TUNHOUT= 0
##$TUNXOUT= 0
##$USERA1= <user>
##$USERA2= <user>
##$USERA3= <user>
##$USERA4= <user>
##$USERA5= <user>
##$V9= 5
##$VALIST= <valist>
##$VCLIST= <CCCCCCCCCCCCCCC>
##$VD= 0
##$VDLIST= <DDDDDDDDDDDDDDD>
##$VPLIST= <PPPPPPPPPPPPPPP>
##$VTLIST= <TTTTTTTTTTTTTTT>
##$WBST= 1024
##$WBSW= 4
##$XGAIN= (0..3)
0 0 0 0 
##$XL= 0
##$YL= 0
##$YMAX_a= 98179
##$YMIN_a= -99777
##$ZGOPTNS= <>
##$ZL1= 120
##$ZL2= 120
##$ZL3= 120
##$ZL4= 120
##$ABSF1= 0
##$ABSF2= 0
##$ABSG= 0
##$ABSL= 0
##$ALPHA= 0
##$AQORDER= 0
##$ASSFAC= 0
##$ASSFACI= 0
##$ASSFACX= 0
##$ASSWID= 0
##$AUNMP= <proc_1d>
##$AZFE= 0.1
##$AZFW= 0.1
##$BCFW= 0
##$BC_mod= 2
##$BYTORDP= 0
##$COROFFS= 0
##$CY= -3
##$DATMOD= 1
##$DC= 0
##$DFILT= <>
##$DTYPP= 0
##$F1P= 0
##$F2P= 0
##$FCOR= 1
##$FTSIZE= 16384
##$FT_mod= 6
##$GAMMA= 0
##$GB= 0
##$INTBC= 1
##$INTSCL= 3.241238e-09
##$ISEN= 128
##$LB= 0.25
##$LEV0= 0
##$LPBIN= 0
##$MAXI= 10000
##$MC2= 0
##$MEAN= 0
##$ME_mod= 0
##$MI= 1.114404
##$NCOEF= 0
##$NC_proc= -7
##$NLEV= 6
##$NOISF1= 3.799351
##$NOISF2= 2.8
##$NSP= 0
##$NTH_PI= 0
##$NZP= 0
##$OFFSET= 15.47585
##$PC= 1
##$PHC0= -5299.148
##$PHC1= 6.821927
##$PH_mod= 1
##$PKNL= yes
##$PPARMOD= 0
##$PSCAL= 0
##$PSIGN= 0
##$REVERSE= no
##$SF= 200.130009177619
##$SI= 16384
##$SIGF1= 3
##$SIGF2= 2
##$SINO= 0.751879
##$SIOLD= 32768
##$SREGLST= <19F.Aceton>
##$SSB= 0
##$STSI= 16384
##$STSR= 0
##$SW_p= 3612.71676300578
##$SYMM= 0
##$S_DEV= 0
##$TDeff= 16384
##$TDoff= 0
##$TI= <>
##$TILT= no
##$TM1= 0
##$TM2= 0
##$TOPLEV= 0
##$USERP1= <user>
##$USERP2= <user>
##$USERP3= <user>
##$USERP4= <user>
##$USERP5= <user>
##$WDW= 1
##$XDIM= 16384
##$YMAX_p= 333310887
##$YMIN_p= -517789
$$ End of Bruker specific parameters
$$ ---------------------------------
##NTUPLES= NMR SPECTRUM
##VAR_NAME=  FREQUENCY,     SPECTRUM/REAL,   SPECTRUM/IMAG
##SYMBOL=    X,             R,               I
##VAR_TYPE=  INDEPENDENT,   DEPENDENT,       DEPENDENT
##VAR_FORM=  AFFN,          ASDF,            ASDF
##VAR_DIM=   16384,         16384,           16384
##UNITS=     HZ,            ARBITRARY UNITS, ARBITRARY UNITS
##FACTOR=    0.220516191357247, 1,           1
##FIRST=     3097.18202360227, 0,            0
##LAST=      -515.534739403508, 0,           0
##MIN=       -515.534739403508, -517789,     0
##MAX=       3097.18202360227, 333310887,    0
$$ Real data points
##PAGE= N=1
##DATA TABLE= (X++(R..R)), XYDATA
$$ [...]
7603A41697r6444j06869Q9895R0646l0440k202l6700n9242J8260m1320M6071j59885
7591a46533k0479Q3136K9971R5411K9249R51n6802j1724m8465j0641L3898q693
7579c0721j7802m3200J12829k1794k6856N9442j40718R0290Q8697j53619q7112
7568a70564M36J28179P6539j01478J12067l209o5939j23224j124O3061Q1089m9100
7556e3267P497K4278p7684n0756j1556l1016J7675m4585j8649J23359O2591m1849
7544i3962J21577l1209j12921O5718J85637j5799M180j21328r4087J10933j26863
7533a08124o1034K36740q2021j06055N3396M3495O8248L4750r2728j3307P674
7522a8966j40445N0710K7598K719j4225j05230Q3292J6456K1767l7492J2763L8803
$$ y = [141697, 45253, -61616, 28279, 118925, 88485, 86283, 49583, -9659, 8601, -32719, 13352, -146533, -167012, -83876, -53905, 41506, 70755, 71706, 14904, 3180, -45285, -55926, -22028, -30721, -48523, -91723, 21106, -688, -27544, 31898, -108820, -18530, 70167, -83452, -170564, -170128, -41949, 34590, -66888, 45179, 41970, -23969, -147193, -148317, -85256, -4167, -53267, -45770, -21492, -99176, -149932, -161488, -192504, -174829, -219414, -238063, -114704, -52113, -93962, 27615, -3594, -116515, -50797, 134840, 119041, 123221, 1893, -92194, 18739, -108124, -169158, 67582, -14439, -120494, -67098, -23603, 44645, 79395, -13333, -26640, -18966, -159411, -108701, -81103, -78384, -92609, -197839, -114547, -98091, -76324, -113816, -101053, -62250]
7510f2250K455L5818l9564J19511J6889n893o9684j19184O3530J4922R2169p8659
7498b9940J2200o376k1500K2022q165n9851J433J7507m7591O5398j7968l8445
7486a11276L8699J23605o8195r1541l8210M1953K553o850m4179J57279q7783k4539
7474a08484J05512L3701J21987j70499j76648P6003n9946j9548R4992J27125L4149
7463E8344N058r6050L7702J981m94j05924J59155l1132n2500n1884r8607J12393
7451f1958m0980L955Q4379O8074P0551K0024r1124L6333j11730o0168p4282R460
7439a47466N2333Q9438j3822q9191L7932r8426Q8190N6031J10878n1048q4658
7428d9809O627M3895K2654k31086R7840J06153l4946p0235p4914M6317Q8415l948
$$ y = [-62250, -59795, -23977, -63541, 55970, 72859, 66966, -2718, -121902, -58372, -43450, 48719, -29940, -17740, -24116, -45616, -23594, -31759, -91610, -90177, -72670, -120261, -54863, -72831, -111276, -72577, 51028, -17167, -108708, -146918, -104965, -102412, -109262, -153441, 3838, -83945, -108484, -2972, 30729, 152716, -17783, -194431, -118428, -178374, -197922, -102930, 24195, 58344, 63402, -32648, 5054, 7035, 6541, -99383, 59772, 28640, -23860, -75744, -174351, -61958, -102938, -98983, -14604, 53470, 124021, 144045, 52921, 89254, -22476, -82644, -156926, -147466, -95133, -5695, -19517, -108708, -70776, -169202, -81012, -24981, 85897, 34849, -49809, -43182, 713, 23367, -207719, -109879, -3726, -38672, -108907, -183821, -137504, -49089, -53037]
7416e3037O7682L5996n0695m7686n1041n2646J2345m4501K1312K0318J18396L6365
7404A2808p0560o5238P6962m7017N5878o8857j01845J07594N393j4542M0417N6813
7392a2194m2009q831L9706j1054k3559p0254R5452R2223l4057m0645k8046J16918
7380G3650O8905j75628p0051l1828Q194J56778Q161K1997P0942p8000m5722k3965
7368a6567k9271J45613l0453j18122r6797M9963p6104o2625J01554O8084P2058
7357G333m1670j00152J23250l0780L0693q8623n7035k6548J74093N9466Q091J4570
7345G2688k4992j61645K3269K7992m4790K7435J68615p3395r0546M5569j46L3034
7333C088N0170J07053l1869J16451J78291J79605J59364M57741N30878M25484
$$ y = [-53037, 14645, 50641, -54, -47740, -98781, -151427, -139082, -183583, -162271, -141953, -23557, 12808, -57752, -122990, -46028, -93045, -37167, -106024, -207869, -100275, -94882, -109424, -69007, -12194, -54203, -63034, -23328, -34382, -57941, -128195, -32743, 59480, 25423, -15222, -43268, 73650, 142555, -33073, -103124, -134952, -126758, 30020, 38181, 60178, 131120, 53120, 7398, -16567, -45838, 99775, 69322, -48800, -145597, -95634, -171738, -234363, -132809, -64725, 7333, -34337, -134489, -11239, -42019, -11326, -99949, -156984, -183532, -9439, 50027, 58118, 72688, 47696, -113949, -90680, -62688, -107478, -80043, 88572, 15177, -75369, -29800, -29946, 3088, 53258, 160311, 128442, 244893, 423184, 602789, 762153, 1219894, 1750772, 2176256]
7323B176256j90402k75892m81119l38467j30901k21947j69622o4549R1993j03016
7313B92334j11742K100J3795r9328l4440K3964l0013O4911j07736R4262o0777
7302D7330j18509L4803L602j5030p9130J412N3583K3564J532J7289J68373m2523
7290I6296K3771K3886j42109M0382P3726j45083l0997q5047J7933N1398P1703
7279d141Q1004o2647J2417k546K8920o3775p9689r529M2190N1287j22611Q928
7267a20192n149Q7213k8507r4186N5884o0400J31631N0783N7831j42408Q2054
7256A4554j5676m1106L4803j05788k1420R038O5589K994m5617J32567J0799p1506
7244c0769O493n1391O6697N8991o6046P0738k7559L0791n9835j5777J28629Q0067
$$ y = [2176256, 1985854, 1709962, 1228843, 890376, 759475, 537528, 367906, 303357, 395350, 292334, 180592, 182692, 196487, 97159, 62719, 86683, 56670, 121581, 13845, 108107, 47330, -71179, -36376, -32774, -47804, -126934, -125522, -71939, -48375, -46843, -29554, 138819, 96296, 120067, 143953, 1844, 42226, 115952, -29131, -60128, -145175, -127242, -75844, -4141, 76863, 14216, 26633, 24087, 53007, -10768, -90457, -99986, -57796, -6509, -129120, -120192, -125341, -38128, -66635, -160821, -104937, -165337, -33706, 17077, 74908, -67500, 14554, -1122, -42228, -7425, -113213, -134633, -125595, -60006, -57012, -102629, 29938, 40737, -30769, -24276, -75667, -8970, 50021, -16025, 54713, 27154, 57945, -1890, -17667, 110962, 191029]
7232A91029j21309N1748m6577o4244J20942K5399q6904j02802J48025J42041K1643
7221B78991j82334j1695J3436K0191r5332J302L6909Q5087J23496j30300r1007
7210D8744j26010J43307L9511L7755j11755j15757J36364o147P366m483J02835
7199A51730p7154m5611J14809R1890p3985k8373J284n7252r2616P3475o6941r620
7187a8364J6170j08256j09652P8390J3498J0642J03385K0273l3282q9112O5223
7176e1085K7311Q2274q51j96862p8121Q6607J01268J6611P5042K4952k40050N5275
7164i7629K6046J01974k5568k8808Q111j19925j7092J6382K1815n5262k1150R4742
7152i6364O1824j5717M2388q6241Q8160J6324o0614l0101m6237k5650m3169Q7315
$$ y = [191029, 69720, 121468, 74891, 10647, 131589, 156988, 70084, -32718, 115307, 257348, 278991, 96657, 84962, 98398, 118589, 23257, 24559, 61468, 146555, 270051, 139751, 48744, -77266, 66041, 105552, 143307, 31552, -84205, 52159, 46012, 53378, 48895, 151730, 74576, 28965, 143774, 235664, 161679, 133306, 134590, 77338, -15278, 58197, -8744, -18364, -2194, -110450, -220102, -141712, -128214, -117572, -14187, 6086, -27196, -116308, -51085, -23774, 58500, 57649, -139213, -217334, -130727, -29459, -12848, 62194, 87146, -152904, -97629, -71583, 30391, 4823, -23985, -15874, -135799, -152891, -136509, -114694, -169956, -191106, -96364, -34540, -50257, -7869, -94110, -5950, 10374, -50240, -80341, -126578, -152228, -195397, -108082]
7140a08082J02294n2147l646o2777m2987N7809j6866L4507n4876M8718Q1785J17155
7128A00887n1328n4854o9290J28007N069q2110J790j49495P9822N2015o0747N4941
7116d5293M3080q2160r4164P5323j1500o8030K1999l7609J9058O5202l5037n9392
7104b08523Q4849P8126p2782k3909Q137L2877l4250J26791l5686q0982M5621l609
7092h3340j0528J13421j14235p2880k5450k6047M2398L5881Q8045j3658J9728
7081d6665m2L8441J9047q8558j25292J49910J52418n3718j02763M5456l8910J35233
7069H4557j70792o2215J08749o8718j40190n0314J24304R3851J7613q5174n885
7058a54214J55261O9847j03677r7401l0015l473N4245Q1469M8948j82081o417
$$ y = [-108082, -5788, -57935, -61581, -124358, -167345, -109536, -126402, -91895, -146771, -98053, -16268, 100887, 49559, -5295, -74585, 53422, 58491, -23619, -21829, -171324, -91502, -39487, -100234, -45293, -2213, -84373, -178537, -103214, -114714, -182744, -160745, -198354, -179296, -114094, -149131, -208523, -123674, -45548, -118330, -142239, -134102, -101225, -135475, -8684, -44370, -125352, -79731, -83340, -93868, 19553, -94682, -167562, -193012, -219059, -176661, -140780, -52735, -66393, -46665, -46707, -8266, 10781, -77777, -203069, -53159, 99259, 45541, -57222, -11766, -50676, 84557, -86235, -148450, -39701, -108419, -248609, -298923, -174619, -80768, -63155, -148329, -154214, 1047, 70894, -32783, -130184, -160199, -163672, -109427, -27958, 20990, -161091, -167508]
7047a67508M2354k3782l8533R0210j4620J509k5655L0610l2082Q1949O7891K1299
7035C3642M4218m9751p9624k2522k8605K5512L7045r0294k5424K2778m7457K7121
7023a53361R573N2373r8603o732O0866l0670L4698j64704Q96P0090J29960l2012
7011a27626p1482K7878J58440K0701j25657j8863O2104O9048n9558k3783J17577
7000B8779J03235l4469n5858j7442j22463R0627k9200K21P0726K469j61736j15127
6988b40238k9002J31342L4014N080j05200J00823M8747j15245p787O5106P9399
6977c2961M8923p3801m4402J1646M1997L8777J7847J8308k16801n1218P3396R3285
6965g5004J32505p9929j77704J14771K8689j41052L8189j8873j9575l155J22334
$$ y = [-167508, -125154, -148936, -187469, -97259, -111879, -110370, -136025, -105415, -137497, -55548, 12343, 33642, 77860, 28109, -51515, -74037, -102642, -77130, -40085, -130379, -155803, -133025, -180482, -153361, -143788, -91415, -190018, -196750, -135884, -166554, -131856, -296560, -295664, -225574, -95614, -127626, -199108, -171230, -12790, 7911, -117746, -136609, -74505, -5457, -65015, -88798, 28779, 132014, 97545, 41687, 24245, -98218, -7591, -36791, -36570, 34156, 36625, -125111, -240238, -269240, -137898, -103884, -98804, -204004, -103181, -54434, -169679, -177466, -112360, -32961, 15962, -57839, -102241, -90595, -48598, -9821, 8026, 26334, -190467, -241685, -168289, -75004, 57501, -22428, -200132, -85361, -56672, -197724, -159535, -178408, -197983, -201138, -78804]
6954g8804r229L3681J0653k1157k8217K2366j1299k5003L0955J06866O3143n8774
6942C5181k16919N9977J17089M4271j32626N7905j9468j48616J62037p6214Q3244
6931c4139n537o7858r6824Q367M2412N2476Q2665j244j32995O40p3668k2029J64372
6918h3362J26719j27815l3072j17482O608l2616O7533L8286j1697q8474J4496
6907b40876k5525J37637Q0864k02603N0956P081N2888j618M70K3346J331N4851
6895f1198r4813o9908J13391N1216l8178j17165J00033J42113O2310m3504r0917
6884d6620k2074j0109N6026k01427k6438J29534k7123K440m1912Q5270m939n1690
6872a59062O1750Q4437j26443J9657J06116j37057O9218R0250r9467k6491j22938
$$ y = [-78804, -88033, -54352, -43699, -64856, -93073, -70707, -82006, -107009, -76054, 30812, 93955, 35181, -181738, -121761, -4672, 39599, -93027, -35122, -54590, -203206, -41169, -117383, -34139, -39676, -107534, -204358, -195991, -153579, -101103, -18438, -19682, -152677, -152037, -225705, -247734, -83362, 43357, -84458, -117530, -235012, -228404, -261020, -193487, -155201, -166898, -255372, -240876, -266401, -128764, -47900, -250503, -199547, -192466, -139578, -141196, -140726, -117380, -116049, -61198, -156011, -225919, -112528, -61312, -99490, -216655, -116622, 25491, 87801, 44297, -46620, -68694, -78803, -22777, -224204, -250642, -121108, -148231, -145791, -187703, -102433, -107372, -159062, -97312, -12875, -139318, -119661, -13545, -150602, -81384, 8866, -90601, -117092, -240030]
6861b40030N7535J07943N3357k5336j02387Q2159J8249K9413j35793K2056P3473
6850e9361o1016j7619R5830l1841j07871m7103P1738j723L1451J0543k2249J6077
6838a23144j09989N8496P8128L7587j0664J5369K8707j22691J5479k7255Q1520
6827g8457l6637J0200J27990p8409n8280O6773p4063j69821L8516m0627L8702
6816b54113J24116L7614q0820J8131J1327J41209j7745l2751J1881p1135L8801
6805g3485r581r7724l0169l7545R5662l1487l0369O4314J30679K9822O2501o9344
6793C274p2696p0184Q2072J0116o4009J8702P7476r3115j18711n5952L2527J51297
6781i9203l3492J6024K0904j5225j5071o7164R3380r89m2827J08570j43152j23196
$$ y = [-240030, -182495, -74552, -21195, -46531, -148918, -66759, -48510, -19097, -154890, -132834, -59361, -120377, -137996, -42166, -74007, -181878, -228981, -157243, -158966, -127515, -116972, -139221, -123144, -233133, -174637, -96509, -58922, -69586, -54217, -25510, -148201, -132722, -159977, -78457, -115094, -104894, 23096, -55313, -113593, -46820, -120883, -290704, -252188, -292815, -254113, -129997, -92383, -173203, -155072, -143745, -2536, -20281, -53032, -41151, -112286, -73485, -83066, -180790, -210959, -248504, -152842, -184329, -214698, -150384, -19705, 10117, 72618, 3274, -69422, -139606, -57534, -47418, -111427, -92725, -15249, -108364, -227075, -283027, -250500, -99203, -132695, -116671, -95767, -110992, -126063, -193227, -99847, -100836, -143663, -35093, -178245, -301441]
6769c01441k278J47541j0917R3262n214j00196m5387N6231Q4674q196m2246M3106
6757i1061Q272j286j18522m4103o6382O7960P1634n4573k2577P9919k9598o3966
6745b64283J19267J22436K8305q4710N0806m3365j43570m107n6770J4274P9262
6734a82455P6301R740p0629m603L5187O4237m6503j7000J12308J04143j44786
6723f4060l5081L1985j46254n5245p5922L6899J37534m5852N9501R0445r822j37473
6711b13345N7079Q3848P3104K4102n4940l1342P909q3796l577R378j09864Q8125
6699a53319J00136N496j39288l7075J24248M3939k07M7559j03667j174P6396j25720
6687a62676O7974j23147l8484K70297n4482o0512l1076m872j31536k5378L6026
$$ y = [-301441, -303719, -156178, -167095, -73833, -79047, -179243, -224630, -168399, -83725, -91921, -134167, -91061, -82789, -84075, -202597, -246700, -313082, -245122, -173488, -228061, -250638, -170719, -200317, -264283, -145016, -22580, 5725, -78985, -28179, -71544, -215114, -219221, -275991, -261717, -182455, -106154, -96414, -167043, -171646, -136459, -72222, -118725, -135725, -23417, 80726, -64060, -99141, -67156, -213410, -268655, -344577, -307678, -170144, -215996, -156495, -66050, -75872, -213345, -156266, -72418, 686, 24788, -30152, -61494, -53585, -137381, -140958, -131580, -241444, -153319, -53183, -47687, -186975, -224050, -99802, -55863, -56070, -8511, -112178, -113352, -36956, -162676, -94702, -217849, -256333, 13964, -40518, -101030, -132106, -136978, -268514, -293892, -257866]
6676b57866K9860l1235M1012N3522q7899q1303K917J04953J40483m990p9074O1834
6664a07786r6617P295n5584k6029J00688k2743m3383L7029Q9980q587m5098M2950
6652a27885L1o8769M7250l0993k9405L4216R9689l5379k7186p206n0675J47312
6640d9000N8476l427q4989r6133L2747P751O353J8173m3627p6331m390M6765O9071
6627a18561l6143J29457J20522j07867O1460j61230l8133n7728k1674J19111j4344
6616a25130j31466K3660K8575J0184J2156k016p7162J16079r511J11603j01376
6605a44404j52753O6490n3032J07117q0246J3341o7458N2139M6057L5034n0427
6594b28142r841J89006l0336M135Q0485j52538l2707j0424o6473J30433k8279
$$ y = [-257866, -228006, -259241, -218229, -164707, -252606, -333909, -330992, -226039, -85556, -90546, -169620, -107786, -204403, -197108, -252692, -278721, -178033, -200776, -244159, -207130, -117150, -125737, -170835, -127885, -127854, -196623, -149373, -180366, -209771, -175555, -75866, -111245, -138431, -145637, -196312, -49000, 9476, 6049, -78940, -175073, -142326, -134575, -128222, -110049, -153676, -230007, -234397, -187632, -118561, -154704, -25247, 95275, -12592, 48868, -112362, -150495, -208223, -229897, -110786, -125130, -256596, -232936, -204361, -194177, -182021, -184037, -261199, -145120, -154631, -43028, -144404, -297157, -230667, -283699, -176582, -256828, -243487, -310945, -258806, -212749, -177715, -228142, -237983, -48977, -79313, -75178, 5307, -147231, -179938, -190362, -256835, -126402, -154681]
6583a54681j2551p0965l0542R718k1398J4273P0006K816j386R233O8782L3000
6571h3695o2825K7477m7470j1908J0608M6720N252j6950r2174N9240L3317P8949
6559e3459k6393J0678M7721o8512j27288L3883j04100N5512j46906P6595J1741
6548b90528j8631Q7491N2787J12729n3034k27903J14168J67361r6391q9201N0670
6537a90482O3035n3181m609n2701J4649K8334k0476o039J0153l6254O5584J1490
6525a70497P4479m8550j9797j00478k5291m1530J44724K5647J11714r1514j6751
6514a57844L0819Q6737O0249k20002j17521L7367J53348n4207K8128o3659J4561
6503b02024l779N5017J59033O4953k25288p8253L1140r3611M9486J24808K8777
$$ y = [-154681, -167232, -238197, -268739, -259021, -280419, -266146, -196140, -193324, -194710, -185477, -116695, -83695, -146520, -119043, -166513, -178421, -167813, -121093, -115841, -132791, -224965, -165725, -132408, -53459, -79852, -69174, -21453, -89965, -217253, -183370, -287470, -231958, -378864, -302269, -290528, -309159, -221668, -168881, -56152, -109186, -337089, -222921, -55560, -151951, -241152, -190482, -127447, -180628, -185237, -237938, -223289, -194955, -215431, -221470, -211317, -247571, -181987, -170497, -96018, -144568, -164365, -264843, -290134, -331664, -186940, -161293, -49579, -141093, -157844, -127025, -40288, 19961, -200041, -317562, -280195, -126847, -181054, -152926, -216585, -202024, -205803, -150786, 8247, 73200, -152088, -230341, -199201, -292812, -243326, -118518, -89741]
6492h9741k38285J8422k1896L5679J10945L2007K0099M7680k09139J8181J59179
6481a16869L6163p3047j88524J05943O8090P586k3258j114O2429l3861L642K7311
6469a25509n0096N4451Q175K7246m8940l455r7185J6938j2531K3867j1882m6512
6457b65433J16110l1102J55099q0560j6306K0842Q3635m3524n7663m038j1742
6446a34682j05212J16810p0926j21435Q9880n7111m6214N6067J1438K0328K8405
6435b12652L431K9055K6047k2603J6336o9653j5681Q018j03483P6005J3569j00159
6423c51770R2269N6090o0178R0332P3888k0461n1918k112R1641O5287k80405M2372
6411b54965j767M0745r1245m1204L1617r542J71538M1868q6412n1716M667N8210
$$ y = [-89741, -328026, -309604, -331500, -295821, -184876, -152869, -132770, -85090, -294229, -276048, -116869, -80706, -153753, -342277, -236334, -168244, -160658, -183916, -185030, -122601, -156462, -152820, -125509, -175605, -121154, -112979, -85733, -134673, -138128, -235313, -218375, -230906, -207039, -218921, -265433, -149323, -180425, -25326, -105886, -122192, -101350, -17715, -61239, -118902, -122940, -134682, -239894, -123084, -194010, -315445, -225565, -282676, -328890, -272823, -261385, -241057, -212652, -209221, -180166, -154119, -176722, -160386, -230039, -245720, -237702, -341185, -265180, -251611, -351770, -259501, -203411, -263589, -173257, -99369, -119830, -171748, -173860, -82219, -16932, -297337, -254965, -256732, -215987, -307232, -348436, -316819, -326361, -154823, -112955, -199367, -251083, -246416, -188206]
6399a88206K5131K6000j14496K842J310p8063j7917o926M0754m456Q8103O5179
6387a60745K641O4336m5547o2553k2577O8429R7930q3448o3187l913n1487k1305
6375b81426J3690Q1781M5745k3330j8040k5149q2249Q2633q4454j1244N9257L2808
6363b09978q3716N410L9753J4503P0525J43977q7277j33572J22177m8702L801
6352a63099j05908J15916j3933j51178O3458J9192j1441n2795Q320K4124J29228
6341a38116l0236N6948L3574k15816O6657J00253Q5370R011k29597l0131P8726
6330b13357P255K8791p3014J01503O3317L4635P252O0149j13104j5388j0518j4018
6318a36497m7363J3239N7094q0660N194O3233M4658n9088L5269l9663j3059P3468
$$ y = [-188206, -163075, -137075, -251571, -248729, -247419, -325482, -343399, -350325, -309571, -314027, -225924, -160745, -158104, -93768, -139315, -201868, -224445, -156016, -58086, -141534, -204721, -208634, -260121, -281426, -267736, -185955, -140210, -163540, -181580, -206729, -288978, -206345, -290799, -302043, -242786, -209978, -293694, -288284, -248531, -234028, -163503, -19526, -106803, -240375, -118198, -166900, -163099, -269007, -153091, -167024, -318202, -254744, -235552, -246993, -299788, -291468, -267344, -138116, -168352, -111404, -77830, -293646, -226989, -126736, -41366, -32355, -261952, -292083, -213357, -206102, -177311, -250325, -148822, -85505, -50870, -43618, 16531, -96573, -111961, -122479, -136497, -183860, -170621, -113527, -194187, -188993, -125760, -81102, -140190, -104921, -144584, -157643, -84175]
6306h4175N628o8654R7145M2909k4848N5048p0526R4809j0913j42252n5632j7251
6294a78712N241o1295R917N0778l9741j5655J37959N6423j9564M8799k6267K665
6282b9452Q6498K6136o4079k3147p083n182o8240n6255l8363M751Q1718N2557
6270d0141M5924J9082N2705K108k548p8012j30003R0800K9432o1227j18677L4487
6258a56070R591Q5133q2393q4238k5610J3090l5842N4080P9159l0005K8380k3596
6246a68321Q1347j15303j51953K19885J34501l7336r2316L7220l5024K0369J01965
6235d966m4419k3098K6039N703k4277J10642J6837l7010m625j01645J9070R4368
6223C2619k4887L9974K6857n1958M9322P8796r9362m3939J05919R1697j39104
$$ y = [-84175, -78547, -147201, -50056, -7147, -31995, 23053, -47473, 47336, 36423, -105829, -161461, -178712, -173471, -234766, -224849, -174071, -213812, -229467, -91508, -35085, -54649, -5850, -32117, -29452, 57046, 83182, 19103, -4044, -11127, -16309, -84549, -140804, -179167, -174416, -92698, -40141, 5783, 24865, 77570, 79678, 77130, -882, -130885, -40085, -10653, -71880, -190557, -156070, -146479, -61346, -143739, -227977, -253587, -240497, -276339, -222259, -143100, -173105, -144725, -168321, -86974, -202277, -354230, -134345, 156, -37180, -129496, -92276, -127300, -106931, -4966, -49385, -72483, -46444, -40741, -65018, 45624, 62461, 25451, 20826, -80819, -61749, 32619, 7732, 47706, 74563, 22605, 71927, 150723, 51361, 7422, 113341, 205038, 65934]
6212F5934L0281j7178n149p0561k7309k5852N4536N8294L554m3092o703K3687
6200D0442l83J140r5934Q2568p6362L1116J10279o6464J20092K5826j11013p1830
6188a0523M7257j17888M04J07567M886j47938J9227r5202m1352M883M9514n9427
6176b38592P1579R4459m8348J29472j88098q0714k0494J28382J23712r1373r9885
6165b19900K338J2371J03513K8216q7907o6554P3056l9972M7137j14281J10607
6154a51376M3678j89936L8133M6357l64q5212j6044J52890J00985j77197j01527
6143c39613p1089J28801j1214J2224N8776l9325l1478N8790L2977J30n2613K7714
6131b25920J03441m3656q3531n515M9341r181K2549l5267q6939J38065P856q2955
$$ y = [65934, 96215, 79037, 73888, 3327, -23982, -49834, 4702, 62996, 66550, 23458, 16755, 40442, 40059, 41199, -54735, 27833, -48529, -17413, 92866, 26402, 146494, 172320, 61307, -10523, 36734, -81154, -80750, 26817, 31703, -116235, -97008, -192210, -233562, -228679, -179165, -238592, -167013, -72554, -120902, 8570, -179528, -260242, -280736, -152354, -28642, -120015, -219900, -217562, -205191, -101678, -73462, -161369, -227923, -154867, -194839, -147702, -261983, -151376, -107698, -297634, -259501, -213144, -213508, -298720, -314764, -161874, -60889, -238086, -339613, -410702, -281901, -293115, -280891, -222115, -261440, -292918, -234128, -201151, -201021, -253634, -225920, -122479, -166135, -249666, -255181, -205840, -215021, -192472, -227739, -314678, -176613, -168757, -251712]
6119b51712o5929Q3473M6299j3380o693R7766K016l3306M8380j75595N3237j1362
6107b26806N0872P804L6499K6435j42078p8047R7775Q6453N3322K0872j20800
6096a87699r4621M2902Q4465n9821n7101o3697O4423o0959P4853o043j39013L6595
6084c65716Q7040J46383k1220p4445J1229M4400r649k1731L029J06453r1487j18431
6072c04145k2085J17348m1041N4005k4961n7468l3288R8279M6569L4778o7372
6061a99381o8207J83650K6885k5670o7152M7744N1031r5067J4212J6627N1055
6050f4273r5188m6634J11487P4119N2485M8264m0153L2465j06033n5095n4809
6039a43365n371p8216p2726M1939J5455O5699m2895M1274J73097m5143J22574
$$ y = [-251712, -317641, -234168, -187869, -201249, -207942, -110176, -108160, -141466, -93086, -268681, -215444, -226806, -175934, -168130, -131631, -105196, -247274, -325321, -227546, -141093, -87771, -66899, -187699, -282320, -239418, -154953, -214774, -271875, -335572, -271149, -332108, -257255, -263298, -402311, -365716, -278676, -132293, -153513, -227958, -216729, -172329, -181978, -203709, -200680, -94227, -185714, -304145, -326230, -208882, -249923, -195918, -220879, -278347, -311635, -213356, -166787, -132009, -199381, -267588, -83938, -57053, -82723, -149875, -102131, -51100, -146167, -131955, -115328, -64273, -159461, -206095, -94608, -20489, 31996, 80260, 40107, 72572, -33461, -88556, -143365, -148736, -226952, -299678, -257739, -242284, -176585, -219480, -178206, -5109, -50252, 72322]
6028G2322p2105r8068J27920N4355j41448j26711J22811o3114J8206O4828p671
6017d8675j72806K7379M7411o6777J6505P8127J3792O7118K0648L755R7958P0855
6005A55290j22572L6029R112J3777Q9452n2993K4255J45048q4243k4831k11842
5994b3518j74534N6651q1097K43402K1579j66678o33N2199M6130r0302M0728o5088
5982a41161n4786l8158J22285m9016m938K5750K2387M2345J34484j59816m9523
5971a50147L073l7038Q7559r0393N9954M455j9062J43471r4270N1759O6303m6480
5959b0816p8319j22532K1075J40992J23796j79575r3179L21619J0122j62814Q1364
5948D1733l4619j00244m0251o4904q002l7198R5299R4200j1621K9193m477j11759
$$ y = [72322, 217, -97851, 30069, 84424, -57024, -183735, -60924, -124038, -105832, -41004, -48675, -221481, -194102, -146691, -213468, -196963, -118836, -105044, -37926, -17278, -13523, 84435, 155290, 32718, 68747, 77859, 91636, 181088, 128095, 152350, 297398, 213155, 188324, -23518, -198052, -141401, -222498, 20904, 42483, -124195, -124828, -72629, -26499, -116801, -76073, -141161, -195947, -234105, -111820, -160836, -165774, -140024, -117637, -75292, 59192, -100624, -150147, -147074, -184112, -96553, -186946, -126992, -122537, -141599, 1872, -92398, -40639, 25664, -20816, -99135, -221667, -200592, -59600, 64196, -115379, -208558, 113061, 123183, -39631, 41733, 7114, -93130, -133381, -198285, -206287, -243485, -148186, -53986, -65607, -36414, -40891, -152650]
5936a52650q4189J91501j5572l3918Q6928L6716j02638j7174N6169n2994o3654
5925a51475M0844j9487P4284o6150J3851R0747l647j98598O7630K9271j30036
5914b52766L6102J1924L7553j3764M8890O0345j5443K2239j64291q7600J19321
5903a97490L3M1091k6427n2976n847o1599r551o1136J44444q1356K8517J34615
5891a47682j05735k619J42199L9497o1828M868m987j59792Q6626n551L4409O7018
5879a13577n9182p5893P1791K6030L6494p7279K4145l4134J6371P2573m6731j8075
5867a77467j01648J0298O3381P7914k5050L2231J228m5339P3629M1519n7531j30044
5855b36879o5609J16512Q0930L2913n003J11283q6765o9531Q0210J51020l0104
$$ y = [-152650, -236839, -45338, -60910, -94828, -7900, 28816, -73822, -90996, -34827, -87821, -151475, -110631, -130118, -55834, -121984, -108133, -17386, -21033, -219631, -152001, -122730, -252766, -216664, -204740, -167187, -180951, -132061, -71716, -87159, -64920, -229211, -316811, -197490, -197457, -156366, -182793, -235769, -241616, -303215, -312766, -373902, -229458, -310814, -282297, -147682, -253417, -256036, -113837, -74340, -136168, -131300, -136287, -296079, -209453, -215004, -180595, -113577, -172759, -248652, -176861, -150831, -114337, -191616, -167471, -201605, -185234, -112661, -159392, -177467, -279115, -268817, -205436, -127522, -152572, -120341, -119113, -164452, -90823, -49304, -106835, -236879, -302488, -185976, -105046, -72133, -77136, 34147, -52618, -122149, -41939, 109081, 78977]
5844G8977m1818m4649q2098k0130l1445k4537M5956k6523N1790l5195J07618M7512
5832B5458k00455n1183J11894k6586n8178P5299M1257j28314R7803J0961J06521
5821D477Q527j80492N3925P5191J7849Q3690o3469j67478m6992J7624M3025J19382
5809c4741l1873J23055M4455l6540N721P1916P4438L1042q0172J11682n2074n6800
5797A70109Q8972Q818k7472j06497J17803O6988P7938J56888O9469m102j55991
5786D62923j0288r863J15536J37205J7425J40291R055J90587J28638J70291R1495
5775A443295L0673K56134K14739J18916L18435N53855O20251M63399Q46044Q27561
5765E693302R95736J615688L182866N520787Q084431R801683Q724817j22692n851662
$$ y = [78977, 37159, -7490, -89588, -109718, -141163, -165700, -119744, -146267, -94477, -129672, -22054, 25458, -174997, -226180, -114286, -140872, -199050, -123751, -82494, -210808, -113005, -102044, 4477, 13004, -167488, -113563, -38372, -20523, 63167, -302, -167780, -214772, -197148, -154123, -34741, -66614, 56441, 100896, 64356, 70077, 141993, 216431, 247473, 167301, 278983, 226909, 170109, 259081, 267899, 240427, 133930, 251733, 318721, 396659, 553547, 623016, 618914, 462923, 452635, 442772, 558308, 695513, 712938, 853229, 862284, 1052871, 1181509, 1351800, 1443295, 1473968, 1730102, 1944841, 2063757, 2382192, 2936047, 3556298, 4019697, 4865741, 5693302, 6689038, 8304726, 11487592, 17008379, 25092810, 34894493, 43619310, 43496618, 37644956]
5756C7644956p373904q162267n889964l993521k716834j927586j361789j253614
5748D965477p54064m26345m04481l44150k25984k79690j96412j27620o7305q3540
5738B055886k28063r4587j15405k13216L9562l7022m5649j77864j74539l7860
5728I71243J9307k03697k7875j25708M7835j08692j30013O3649L8273P4853J1768
5717F30943j10479K2850r6119l4009j5424k3083r4004N7827M9407Q539K5842P0349
5705D92639N6140q9432n0517m1328j22649j26023j11622M0471R1874O6517R8348
5694C04418o9360j7105K6159p7153j59208j07540K2877P0702M6448l0196o3739
5683e3697R717k4389J5330j03491L05M6165O3169M7340J2400o785m2399L1374
$$ y = [37644956, 30271052, 22108785, 16218821, 12225300, 9508466, 7580880, 6219091, 4965477, 4211413, 3785068, 3380587, 3036437, 2810453, 2530763, 2334351, 2206731, 2139426, 2055886, 1827823, 1733236, 1617831, 1404615, 1444177, 1407155, 1361506, 1183642, 1009103, 971243, 990550, 786853, 758978, 633270, 681105, 572413, 442400, 506049, 544322, 619175, 630943, 520464, 543314, 447195, 413186, 397762, 374679, 280675, 338502, 387909, 396448, 422290, 492639, 548779, 459347, 408830, 367502, 244853, 118830, 7208, 47679, 139553, 206070, 304418, 235058, 217953, 244112, 166959, 7751, -99789, -76912, -6210, 40238, 10042, -53697, -43980, -68369, -53039, -156530, -156225, -110060, -46891, 449, 12849, 6064, -36335, -4961]
5671d961m3469j2135o0502K8173K6799k267J39052p1531J2785N4752n7851O3416
5659G2261j5607j22533J45040j12442m8459O6470j14272m5732N4053J18209j5304
5648a8316r431J4947j17046j20012J55700R5835k7664P7805p3700j29866K6811
5637a24937j13994m9651J5745N8074J60292o918o5393k1578N4688j3219j38891
5626b45782M2802Q8250J16026p6323o5507J61329O9248j12510n7828k8756l6173
5615a45224O8631j06669q5445O6617K31216j75662J6265m3756n4261m304Q6253
5604a46339J59660q7522m9024o8797m0302P9747P5393o7930J9002N5530j07060
5593a77642N9195M7628m8641l9543n8483N5996K070Q8196R0314p3008j09025N0078
$$ y = [-4961, -48430, -60565, -121067, -92894, -66095, -68362, 70690, -841, 11944, 66696, 8845, 72261, 56654, -65879, 79161, -33281, -81740, -15270, -129542, -175274, -121221, -3012, -18316, -27747, -12800, -129846, -249858, -94158, 1677, -25987, 51818, -21882, -151748, -124937, -238931, -288582, -272837, -214763, -54471, -61389, -126782, -148360, -93672, -106891, -245782, -202980, -114730, 1296, -75027, -140534, 20795, 90043, -22467, -80295, -109051, -145224, -76593, -183262, -268707, -202090, 29126, -146536, -130271, -174027, -228288, -232592, -146339, 13321, -74201, -123225, -192022, -232324, -152577, -77184, -145114, -126112, -70582, -177642, -118447, -70819, -119460, -159003, -217486, -161490, -159420, -71224, 19090, -53918, -162943, -112865]
5581a12865l1758o9638R3595J6615J37797j02819j046P5010j83100J49062n7258
5570h6405j48725J17548j61018o366J08M0820L7752m2507N3883l9404N3801q2147
5558b62660p1875M2982J17802P9311k4379j52241N591K5768l2685j033O2945L5773
5546a74701K1439r3460p5218L8477N4563K0145R0274o4445o6917K7515r7513j08975
5534d28816O4148k9127Q1675J0425Q196R1331j3615m511p8023J27043Q8639n0138
5522a32773p4902j05732p4l8637R3080N3882m0645K5603N7451r2227r3302K4206
5510c24070n3652J14304L5345L7989N3992l9145m5373N5984j05894m2159l6290
5499c48969P7524J31939j8887K2271j16769n7451M1486J0000p3374j9954J48454
$$ y = [-112865, -144623, -214261, -120666, -104051, 33746, -69073, -70119, 4891, -178209, -29147, -86405, -235130, -117582, -278600, -284966, -284858, -244038, -206286, -248793, -194910, -234314, -180513, -262660, -334535, -291553, -173751, -94440, -118819, -271060, -265469, -239701, -272386, -273419, -210474, -174701, -153262, -246722, -321940, -283463, -228900, -208755, -118481, -182926, -249843, -222328, -319841, -428816, -364668, -393795, -312120, -301695, -293499, -202168, -215783, -220294, -298317, -171274, -82635, -132773, -207675, -313407, -313481, -352118, -259038, -205156, -245801, -220198, -162747, -254974, -348276, -324070, -377722, -263418, -228073, -190084, -136092, -175237, -220610, -164626, -270520, -312679, -348969, -271445, -139506, -158393, -136122, -252891, -310342, -268856, -258856, -332230, -352184, -203730]
5488b03730M0936K0957o0340n1041M1365P8479j20881j66128Q906R3825P2391
5477b45261k4473J00532o7945J84520j9243j82908n8855J49633J2025k6826j04257
5466b83058Q8385k2198J2526L9271k4808p9577J72072P1347j02937N9569q5374
5455a54782J6065m9361Q849M8023J79557j6940j13591l4764M9654j29419J0452
5444a86257m2031K4986O5583o3412L9053m4696Q7007l9375j35686J5931R7338
5433a81559J41477m2798N7609j34621Q9277o3402q7571J95177j4595k7398n8314
5422a26718l6273J29152j07537n2360m0546L1830N1346K845l1132Q3922q3980
5411a79451J3725J12229J15335k8443N5217N5034j06537o9583J0923k8292P2984
$$ y = [-203730, -162794, -141837, -202177, -253218, -211853, -133374, -254255, -420383, -411477, -317652, -245261, -269734, -169202, -237147, -52627, -71870, -254778, -313633, -164000, -151975, -178801, -283058, -194673, -216871, -204345, -165074, -189882, -269459, -97387, -26040, -128977, -69408, -154782, -138717, -188078, -179229, -131206, 48351, 31411, -82180, -116944, -67290, -196709, -186257, -228288, -203302, -137719, -201131, -162078, -206774, -119767, -159142, -294828, -278897, -181559, -40082, -82880, -25271, -159892, -70615, -134017, -221588, -26411, -41006, -68404, -126718, -162991, -33839, -141376, -193736, -234282, -202452, -151106, -148261, -179393, -95471, -179451, -165726, -53497, 61838, 33395, 88612, 143646, 37109, -32474, -21551, -49843, 23141]
5400B3141Q595j15871q6211K255K25503K1501j05880m3342k9782J37187M0090
5389G7186j60032J30589K23931N5286j34069j56705n0012P5484r1837Q2703L6317
5378H8841l7020n0513N4402P4851l6370p9946J00265n6121j8203n2898O2633Q4967
5366A34888r4277M9684j0466J7330N1516K22183O9474j47616R2474M125r7983
5355B91332Q416K0964l8428k9430o0548L7000Q6001p4248r1593k1947N3082M1659
5343B22260l3157p9323J4094k5422J05116J30176M4900J1203J7747r7222k2404
5332B87968J7963J18059R8427j04456o4872k3278N2222Q0454N2547Q7967P0452
5321F73453o0658L0369n6595K9491Q9429J10514j39180M1132m3805P4505J0636
$$ y = [23141, 31736, -84135, -170346, -168091, 57412, 78913, -26967, -70309, -100091, 37096, 77186, -82846, 47743, 271674, 326960, 192891, 36186, -13826, 61658, -30179, 52524, 88841, 51821, 1308, 55710, 130561, 94191, 14245, 114510, 58389, 40186, -12712, 49921, 134888, 40611, 90295, 79829, 97159, 148675, 370858, 440332, 292716, 385190, 389315, 291332, 299748, 320712, 282284, 252854, 192306, 229306, 315307, 241059, 149466, 127519, 180601, 222260, 189103, 109780, 123874, 98452, 203568, 333744, 378644, 389847, 407594, 310372, 287968, 305931, 423990, 522417, 417961, 353089, 329811, 382033, 462487, 515034, 603001, 673453, 612795, 643164, 586569, 616060, 705489, 816003, 676823, 717955, 674150, 748655, 759291]
5310G59291P2250j5898J5530M0495p1639N6810J5221m2332j2143N3141J22902
5299I93628o7183j32617n0010P0849m4696R6280P4073N2242R3191l8410m1119
5288A006228k3060R3614Q4287O8042m9443j6060R9081Q3747j1425M6307J2716
5277A394034m340k4848J41345P9230J86300o8910p77n8522j0753l8667R9321Q0461
5265A773874Q2833P4886J47329R5681K3931O9915J1508q0420o1030R7433L1993
5254B267933n7959J10177j1052J56250J50551J15568K07920N6581r451M9918J0531
5243C046967J83895J34826K7934P4119J45797R6720L5675K56692K9117P9854J73713
5232D285309J999P9822L02222J01945K57677J59879j4123K10990J73374O2209
$$ y = [759291, 831541, 815643, 831173, 871668, 800029, 856839, 872060, 829728, 817585, 870726, 993628, 926445, 793828, 743818, 814667, 769971, 866251, 940324, 992566, 1085757, 1047347, 1006228, 983168, 1076782, 1161069, 1229111, 1179668, 1163608, 1262689, 1346436, 1335011, 1381318, 1394034, 1389694, 1364846, 1506191, 1585421, 1771721, 1702811, 1702034, 1643512, 1632759, 1594092, 1693413, 1773874, 1856707, 1931593, 2078922, 2174603, 2198534, 2268449, 2279957, 2199537, 2138507, 2235940, 2267933, 2209974, 2320151, 2309099, 2465349, 2615900, 2731468, 2939388, 2995969, 2986518, 3036436, 3046967, 3230862, 3365688, 3393622, 3467741, 3613538, 3710258, 3745933, 4002625, 4031742, 4111596, 4285309, 4287308, 4367130, 4669352, 4771297, 5028974, 5188853, 5174730, 5385720, 5559094, 5621303]
5222E621303Q6293K09385K34875K04550L05321J73953K36340L76660K43309K23137
5212G915126L01502L97114L43951M07197M27232K45654M11609N35528L64360L74184
5202A1723457N13042O50647O09736N39122O90968P13130P49416Q98539P97498
5193A7885555R40111J075566R86131J218800J241327J268718J401038J637591
5185B7654837J725247J683081J876132J988070K031674K147739K224284K290354
5177D3621418K324880K313828K315839K313102K206039J948284J637842J562460
5169F0243692J260212Q03543M07469n141l18651o63782q84464j274333j564806
5160E8003739j784854j858666k039318k063729k119885k126659k075185j993776
$$ y = [5621303, 5707596, 5916981, 6151856, 6356406, 6661727, 6835680, 7072020, 7448680, 7691989, 7915126, 8216628, 8613742, 8957693, 9364890, 9792122, 10037776, 10449385, 10984913, 11349273, 11723457, 12236499, 12887146, 13496882, 14036004, 14726972, 15440102, 16189518, 17088057, 17885555, 18825666, 19901232, 20887363, 22106163, 23347490, 24616208, 26017246, 27654837, 29380084, 31063165, 32939297, 34927367, 36959041, 39106780, 41331064, 43621418, 45946298, 48260126, 50575965, 52889067, 55095106, 57043390, 58681232, 60243692, 61503904, 62307447, 62714916, 62709775, 62391124, 61727342, 60842878, 59568545, 58003739, 56218885, 54360219, 52320901, 50257172, 48137287, 46010628, 43935443, 41941667]
5152D1941667j904579k077992j923421j782725j467186j433662j393957j481879
5144B8476266j288013j133949j180230j111512j022691j002929q83667q75869
5136A9977406q26960n97821o56514p10314p33645o32301m89795n95029n34881
5127A4200146n10284m74769m93286k96191n17173l70162l70455l82087l67057
5118A0418682l31080l04364k79699p8882k53332l08487l85968k77166j54846k46585
5108G798273j23748n6888m35156k93285j53388j03345k63902k73312j16443r5416
5098E883390n3430j92310r9716j32084j27266K9799j92838p2973M425n8281k83048
5087D705668j72379q5425N1520o5460j18940o7988p0729j16161j88763r0557k8885
$$ y = [41941667, 40037088, 37959096, 36035675, 34252950, 32785764, 31352102, 29958145, 28476266, 27188253, 26054304, 24874074, 23762562, 22739871, 21736942, 20853275, 19977406, 19150446, 18552625, 17896111, 17185797, 16452152, 15819851, 15330056, 14735027, 14200146, 13689862, 13215093, 12721807, 12425616, 11908443, 11538281, 11167826, 10785739, 10418682, 10087602, 9783238, 9503539, 9424657, 9171325, 8862838, 8476870, 8199704, 8044858, 7798273, 7674525, 7617637, 7182481, 6889196, 6735808, 6632463, 6368561, 6095249, 5978806, 5883390, 5829960, 5637650, 5537934, 5405850, 5278584, 5308383, 5115545, 5042572, 5046997, 4988716, 4705668, 4533289, 4447864, 4499384, 4433924, 4314984, 4246996, 4176267, 4060106, 3871343, 3780786, 3751901]
5076C751901p334j34367l8246j8733j18537L5974m1960r9984j37433R5531r1366
5065C195446k00590J2698o6743j23247j04772j75669m2410O8320K323j91898j6831
5054B356627Q1367q4377J7031j03699l8261O8116j02757j20585k3912j5862r8252
5043A935436j2228j16882q576r8568J01977N2090j50497Q290J9624l0251o6738
5032A633677K16824r1516j24993k093m7246j57106p2769K5829M6045n5589M9158
5021A420221m5556p4576j26461J18307J80757m3786k66616o4846L8019O4069K6056
5010A225588N9490j77631R0213q38q1255L7855J9925Q472k4595o479m806J56002
4998A301941N7105o3539j73398J64369M2357k2105Q0010J64725j35920J80580
$$ y = [3751901, 3744567, 3610200, 3571954, 3553221, 3434684, 3470658, 3428698, 3328714, 3191281, 3286812, 3195446, 2994856, 3007554, 2940811, 2817564, 2712792, 2537123, 2494713, 2563033, 2565356, 2373458, 2356627, 2437994, 2353617, 2370648, 2266949, 2228688, 2296804, 2194047, 2073462, 2049550, 2033688, 1935436, 1923208, 1806326, 1797750, 1699182, 1801159, 1853249, 1702752, 1711042, 1730666, 1700415, 1633677, 1850501, 1758985, 1633992, 1631899, 1584653, 1427547, 1354778, 1380607, 1426652, 1371063, 1420221, 1374665, 1300089, 1173628, 1291935, 1472692, 1428906, 1162290, 1097444, 1135463, 1199532, 1225588, 1285078, 1107447, 1197660, 1196822, 1115567, 1153422, 1173347, 1181819, 1157224, 1150745, 1145939, 1301941, 1359046, 1295507, 1122109, 1286478, 1328835, 1306730, 1386740, 1551465, 1415545, 1596125]
4988A596125K25401L90033K76069N9832j28268l22989j98428j54063k47918j28555
4978A367239m6469p8575M7793j33046K02705r0009j11082O94n729R1850j76396
4967A068975J268L7761j713O4121O791O4589K0081p6435N6615L0498o8605j42486
4955A061460K5335O8337l5888J29258j8878J7587m8526N4985Q3866P6267N461
4944A419264p2020n0545l6881R2534m0179J11814J15125Q7608k94j70457L0639
4933A486608J78780L0574k4197m4923P090K0232O8825Q8095O169k6422L1943K2989
4921A845763N2202J61892J20269n64N232Q8031n0938K3275L99N3757J51680J83065
4909B634063M6787k8569J60795K9879k7432N0034P1990J06609J50694J95137M3863
$$ y = [1596125, 1821526, 2211559, 2487628, 2547460, 2419192, 2096203, 1897775, 1743712, 1495794, 1367239, 1320770, 1242195, 1289988, 1156942, 1359647, 1269638, 1158556, 1159250, 1153521, 1245371, 1068975, 1070243, 1108004, 1106291, 1170412, 1177203, 1241792, 1261873, 1185438, 1242053, 1272551, 1203946, 1061460, 1086795, 1155132, 1119244, 1248502, 1229624, 1247211, 1198685, 1253670, 1337536, 1413803, 1419264, 1347244, 1296699, 1259818, 1352352, 1312173, 1423987, 1539112, 1626720, 1626426, 1455969, 1486608, 1665388, 1695962, 1671765, 1626842, 1633932, 1654164, 1722989, 1811084, 1817253, 1790831, 1822774, 1845763, 1897965, 2059857, 2180126, 2179562, 2184794, 2272825, 2221887, 2245162, 2245561, 2299318, 2450998, 2634063, 2680850, 2652281, 2813076, 2842955, 2815523, 2865557, 2937547, 3044156, 3194850, 3389987, 3433850]
4898C433850K07176Q8519j3702J74470J09823R6776K50113J44916J46864K81627
4888D920432K97720L13362M05014L76418N92586O05956N28002O52046P74236J097748
4878A0563520J157051J291857J123439J424721J324814J228328J164776J044562
4870B0323068P15579M40525L02583K28929J11673p5791j92526l8032J5110J27465
4860B1958583K54483N53381N34260N07835P82422J004534J257385J676882J972396
4851C0502161K340605K586864K552013K379988K328737K399829K058893J711733
4843D8860823J475645Q68298M58844L36167M41703M87485N99572J496147L979325
4834E9004009O672066O960827M043012j173363n053927o629395m497545k432302
$$ y = [3433850, 3641026, 3729545, 3715843, 3890313, 4000136, 4096912, 4347025, 4491941, 4638805, 4920432, 5218152, 5531514, 5936528, 6312946, 6905532, 7511488, 8039490, 8691536, 9465772, 10563520, 11720571, 13012428, 14135867, 15560588, 16885402, 18113730, 19278506, 20323068, 21038647, 21479172, 21781755, 22010684, 22122357, 22046566, 21854040, 21816008, 21831118, 21958583, 22213066, 22766447, 23300707, 23808542, 24590964, 25595498, 26852883, 28529765, 30502161, 32842766, 35429630, 37981643, 40361631, 42690368, 45090197, 47149090, 48860823, 50336468, 51204766, 51663610, 51999777, 52441480, 52928965, 53528537, 55024684, 59004009, 65676075, 72636902, 76679914, 75506551, 70452624, 63823229, 59325684, 56893382]
4826E6893382j147095n52725R4327L04781L93196K68146j10306k18607j95436
4817E5729663p16719q27309n81941l87481J0954L71487J055622J774027K656333
4808E9084636L205294L533915L362085K556419J636828R92397R3630m07818q58885
4799G3198501j297116j519041j750546k137604k078040j979462j684553j317930
4791E9434209p31240m16481J63667O63056J019101J153056R65828J200810R08488
4782F4360494O32390K40993p12316j299502j911425k489258k913959l324325l701273
4773D8881819l860469l715085l635007l263109k980305k718163k373440k343611
4765B3992630j922923j691197j625683j421622j308453r73614r54244p15958o79811
$$ y = [56893382, 55746287, 55193562, 55287889, 55592670, 55985866, 56254012, 56143706, 55925099, 55729663, 55012944, 54185635, 53603694, 53216213, 53227167, 53598654, 54654276, 56428303, 59084636, 62289930, 65823845, 69185930, 71742349, 73379177, 74371574, 74465204, 74057386, 73198501, 71901385, 70382344, 68631798, 66494194, 64416154, 62436692, 60752139, 59434209, 58702969, 58286488, 58450155, 59113211, 60132312, 61285368, 62251196, 63452006, 64360494, 64992884, 65233877, 64521561, 63222059, 61310634, 58821376, 55907417, 52583092, 48881819, 45021350, 41306265, 37671258, 34408149, 31427844, 28709681, 26336241, 23992630, 22069707, 20378510, 18752827, 17331205, 16022752, 15049138, 14094894, 13378936, 12699125]
4756A2699125n80394m65025m85275m28802m18303l63454l28570k23417k86515
4747I119370l48262k15384k38326k96731k84303l10861k83196k35093k96688l34738
4737F275788j30562j99698k59813k63148j26303m9974p3777r585k5452j42887
4727D994589Q326l2831j11838n2223j65378n0382j71948j81396K0999n5473n0661
4716D151784k3965M4211j15348p2111j57457j41822O6315r0730j52038q7610J8206
4705C439435M9826r0975l2989l4144Q724j60477m5237l0166Q6554m6265K52r2515
4693C052023j92090p1230o1997k1338q4898O8594j155o0085N8738L8340j00930
4682B623972j47645r9394O817P6738j70465l7929j06297q792R6779j88114Q2461
$$ y = [12699125, 12118731, 11653706, 11168431, 10739629, 10321326, 9957872, 9629302, 9405885, 9119370, 8771108, 8555724, 8317398, 8020667, 7736364, 7425503, 7142307, 6907214, 6610526, 6275788, 6145226, 5945528, 5685715, 5422567, 5296264, 5246290, 5172513, 5162928, 5137476, 4994589, 5002915, 4970084, 4858246, 4806023, 4640645, 4590263, 4418315, 4236919, 4257918, 4202445, 4151784, 4127819, 4172030, 4056682, 3984571, 3827114, 3685292, 3751607, 3660877, 3508839, 3421229, 3439435, 3489261, 3398286, 3365297, 3331153, 3339877, 3179400, 3134163, 3103997, 3190551, 3144286, 3144538, 3052023, 2859933, 2788703, 2726706, 2705368, 2620470, 2689064, 2687909, 2627824, 2686562, 2724902, 2623972, 2476327, 2376933, 2383750, 2460488, 2290023, 2252094, 2145797, 2137005, 2233784, 2045670, 2128131]
4671B128131l2961r6736l7472j0807l0375n2230Q660J29601J0582l9667o6304
4660A910422j56748M1475P8329J35487J26590O9181o2768l6656P2399k5178J04712
4649B257245M4506N6882j30197J02185p3031n792K4030J01255J90538J52569M2396
4638B762586O1935n790J34363K07941J20775K41688K91718K60879O38140Q77890
4628E592125J610379K021296K092930J077184o70002j255591j700553j347509
4620G420259q92249o31497l58345k800K0838L3386L14052K99841N02287Q52437
4610G558209J013440R89607R31602L86647K71436K73390N14283J037821J421738
4601A4398173J683082J433670O55987m9256m47932j76058O03571J211943J696983
$$ y = [2128131, 2095170, 1998434, 1960962, 1950155, 1919780, 1867550, 1876210, 2005811, 2016393, 1976726, 1910422, 1753674, 1795149, 1873478, 2008965, 2135555, 2204736, 2141968, 2105312, 2177711, 2152533, 2257245, 2301751, 2358633, 2228436, 2330621, 2257590, 2251798, 2275828, 2377083, 2567621, 2720190, 2762586, 2824521, 2818731, 2953094, 3161035, 3281810, 3523498, 3815216, 4076095, 4714235, 5592125, 7202504, 9223800, 11316730, 12393914, 11723912, 10468321, 8767768, 7420259, 6528010, 5896513, 5538168, 5535368, 5556206, 5589592, 5903644, 6203485, 6705772, 7558209, 8571649, 9561256, 10492858, 10879505, 11150941, 11424331, 11938614, 12976435, 14398173, 16081255, 17514925, 18170912, 18121656, 17673724, 17497666, 18101237, 19313180, 21010163]
4592B1010163J608534Q96953n02584j353113j557782j327045n08888j8258K99051
4583A8547031J51755n15350j171717j576043j407836j080290n74538k11241r1784
4574A2069987m22876o72822j071263r79734q60587o20689m77865n56263m35892
4565E971996j48408j67315r7965k30599M7328J04772p5320M0066J2459n5278J8284
4554E420020R3614n7748n7992Q9031Q8314O2748J80241K10975M653K450r8282
4543E938024K3552n531K4550J01743J78113J31575P5099K20898L44377K94407
4533G326807J47766J92676J74515K01978J78598K65854L15133L68316J90382K23613
4523I585638L67991M17815L75278K59839K90787L54160L26964K39294J90552M82124
$$ y = [21010163, 22618697, 23515650, 23013066, 21659953, 20102171, 18775126, 18266238, 18247980, 18547031, 18698786, 18183436, 17011719, 15435676, 14027840, 12947550, 12373012, 12161771, 12069987, 11647111, 10974289, 9903026, 8923292, 8062705, 7442016, 6964151, 6407888, 5971996, 5823588, 5656273, 5558308, 5327709, 5375037, 5479809, 5404489, 5444555, 5457014, 5401736, 5420020, 5513634, 5455886, 5397894, 5486925, 5575239, 5637987, 5818228, 6029203, 6033856, 6036306, 5938024, 5961576, 5956045, 5980595, 6082338, 6260451, 6392026, 6467125, 6688023, 7032400, 7326807, 7474573, 7667249, 7841764, 8043742, 8222340, 8488194, 8803327, 9171643, 9362025, 9585638, 9953629, 10371444, 10746722, 11006561, 11297348, 11651508, 11978472, 12217766, 12408318, 12890442]
4513A2890442O76633M84099P58090Q76404J058556J278046J518393J933886K018297
4504B3492846K215956K615651K729049K847237L251026L790406M258442M874380
4496E0074993N671282P222892R144839J2849908J8516610K6120806L4611529M1687783
4488B05900642M4865718M0243347K8681988J3619192l780435k0484606l1787541
4481B77258305l8670970m0524425l7158551l0174434k3141442j7186582j2671572
4474G7730329r468887p121544n677970m783691m113536l734787l350288l260871
4466C6218755k846883k485097k227307j834280j579241j420364j343919j171562
4458B1310102q53487q45587q81988q63458q75146p84620r01025q83784q01065
$$ y = [12890442, 13567075, 14051174, 14809264, 15685668, 16744224, 18022270, 19540663, 21474549, 23492846, 25708802, 28324453, 31053502, 33900739, 37151765, 40942171, 45200613, 50074993, 55746275, 62969167, 72114006, 84963914, 103480524, 129601330, 164212859, 205900642, 250766360, 291009707, 319691695, 333310887, 329530452, 309045846, 277258305, 238587335, 198062910, 160904359, 130729925, 107588483, 90401901, 77730329, 68261442, 61139898, 55461928, 50678237, 46564701, 42829914, 39479626, 36218755, 33371872, 30886775, 28659468, 26825188, 25245947, 23825583, 22481664, 21310102, 20456615, 19611028, 18729040, 17865582, 16990436, 16205816, 15304791, 14421007, 13619942]
4449A3619942p13754n16737m94498k79320l39683n10451l06595j42012j94037
4440A0122855k84424k47062j59915l45454k40392k28144J509k5053k72367k38726
4430H082827j58171q6148k02707k83047k88527k32159k05165j73032j79730j28320
4420F145821j94530o9293P4749q4314l7815k3088j06956o5897j33271j47006j8945
4409E339455Q5557k010n0250o3837J31829k2827Q5764J08686L074r1735J81713
4398E705419J98864J99788L6479J64502J57169K23830L39112L66852K08252L77267
4388G977534M16983M99672N56959N98463R29384O93447O16784O24895P19840N50160
4378A4184121N66306O76167P95553R72673J004824P89304K06736l06273o99581
$$ y = [13619942, 12906188, 12389451, 11894953, 11615633, 11275950, 10765499, 10458904, 10316892, 10122855, 9838431, 9591369, 9431454, 9086000, 8845608, 8617464, 8618973, 8593920, 8321553, 8082827, 7924656, 7838508, 7635801, 7352754, 7064227, 6832068, 6626903, 6453871, 6274141, 6145821, 5951291, 5881998, 5956747, 5872433, 5834618, 5811530, 5704574, 5638677, 5505406, 5358400, 5339455, 5425012, 5423002, 5372752, 5308915, 5440744, 5417917, 5503681, 5612367, 5615441, 5523706, 5705419, 5904283, 6104071, 6140550, 6305052, 6462221, 6686051, 7025163, 7392015, 7600267, 7977534, 8394517, 8894189, 9451148, 10049611, 10978995, 11672442, 12289226, 12914121, 13633961, 14184121, 14750427, 15426594, 16222147, 17194820, 18199644, 18988948, 19195684, 18889411, 18189830]
4369A8189830o87034p03050o03620m17932k99647m59806m76900n99184r12327
4360A3030330q10300q91977p05856n52046m59422k53361j84817j47718K10p430
4350I017613J57529K05632J05931L58229N65945O51411P42090P34821Q26805Q64672
4340A4230678Q57431P57160O19556O88834Q07672O49183J048834J196904J324736
4331B2180988J195845N29864j437n24036r56919j048169n80968m27598m15402
4322A9952168m56752n82049o73879p59088r69794o29679l34820l61162j85249
4313A4999696m3310J57718R4895m4110J24495p3384K63376M23366L41653J07088
4303A6351483j50912l94898o03424o85391p31699o58637m77352n87859n58037
$$ y = [18189830, 17502796, 16799746, 16196126, 15778194, 15478547, 15018741, 14541841, 13942657, 13030330, 12220030, 11328053, 10622197, 10070151, 9610729, 9357368, 9172551, 9024833, 9025043, 9017613, 9175142, 9380774, 9486705, 9844934, 10410879, 11062290, 11804380, 12539201, 13366006, 14230678, 15088109, 15845269, 16464825, 17153659, 17961331, 18610514, 19659348, 20856252, 22180988, 23376833, 23906697, 23905260, 23381224, 22424305, 21376136, 20795168, 20367570, 19952168, 19495416, 18913367, 18239488, 17480400, 16510606, 15880927, 15546107, 15184945, 14999696, 14956386, 15114104, 15208999, 15164889, 15289384, 15216000, 15479376, 15902742, 16244395, 16351483, 16200571, 15805673, 15202249, 14516858, 13785159, 13126522, 12649170, 12061311, 11503274]
4294A1503274m35596n09360n46550o17677l32216l26809m03597o5770j52542k94194
4284G818963l2798l1235Q4784Q5107M9464J7792L66392M63086N29439M45544O08529
4273A0405067J017435Q37066Q36935Q17928O95587O19806M33288N13718P87140
4264A6963970R72206J082266P90142M97116k03291q69828j114006r21577r28139
4255A6268859q60853n06839n52013n79405r30965q10375r41729q20378r71741
4246I294561q42370p49328n45327m42799m70688m67253l16253j47059k02491j58991
4236D952002j17596k76576j69361K4478k35140j50744r4057j47069N9208j51206
4226C693939M4334P1223r8387j22889o7936L5357N3656r3937Q7455j4067q4194
$$ y = [11503274, 11067678, 10558318, 10011768, 9394091, 9061875, 8735066, 8331469, 8265699, 8113157, 7818963, 7786165, 7754930, 7839714, 7924821, 7974285, 7992077, 8358469, 8821555, 9350994, 9796538, 10405067, 11422502, 12259568, 13096503, 13914431, 14610018, 15229824, 15663112, 16176830, 16963970, 17936176, 19018442, 19808584, 20305700, 20102409, 19232581, 18118575, 17196998, 16268859, 15408006, 14901167, 14349154, 13769749, 12838784, 12028409, 11086680, 10266302, 9294561, 8452191, 7702863, 7157536, 6714737, 6244049, 5776796, 5460543, 5313484, 5110993, 4952002, 4834406, 4557830, 4388469, 4412947, 4177807, 4027063, 3933006, 3785937, 3845145, 3693939, 3738273, 3809496, 3711109, 3588220, 3520284, 3555641, 3609297, 3515360, 3602815, 3588748, 3504554]
4215C504554J15316K8648m0098j81968J4186k8671J8700J62434K06604P3986K04829
4204D078520j9349J98937K24440K39845J86190J526k3986l07543k10984l9761
4194D327835k97223j76101l7684k5790j59604j79457l2022m2055q9671M6256q626
4183C325858k8176j2387j21L687O7891N8567P7236M4173L244J9124J65750K19838
4171C944684K6704J56280R0994l990r4090J8004J23450L1876q0092M8479L69586
4160D631885J74721J03132o5885R8662J27875J22348N5439K7940R7242J85469
4150E558828M23380K70931L21849N10221M02814M70354P23422O60268P34840P30292
4140A0807199O65498L98534K67223K95962K88313K43981K38848L62634N45841
$$ y = [3504554, 3619870, 3648518, 3608420, 3426452, 3440638, 3411967, 3430667, 3593101, 3799705, 3873691, 4078520, 4059171, 4258108, 4482548, 4722393, 4908583, 4910109, 4886123, 4578580, 4367596, 4327835, 4030612, 3854511, 3816827, 3791037, 3631433, 3451976, 3419954, 3377899, 3288228, 3334484, 3325858, 3297682, 3285295, 3285174, 3288861, 3356752, 3415319, 3492555, 3536728, 3539972, 3559096, 3724846, 3944684, 3971388, 4127668, 4218662, 4214672, 4120582, 4138586, 4262036, 4293912, 4213820, 4262299, 4631885, 4806606, 4909738, 4843853, 4942515, 5070390, 5192738, 5248177, 5276117, 5373359, 5558828, 5982208, 6253139, 6574988, 7085209, 7488023, 7958377, 8681799, 9342067, 10076907, 10807199, 11472697, 11871231, 12138454, 12434416, 12722729, 12966710, 13205558, 13568192, 14114033]
4131A4114033Q19726P12912O94940N43612N95763N68320M18828M47648M92926
4122A9408708P24964O65465O32839L63514K63784L24109M37838K31975J39968
4113B3193164M49437L64337M96040P12012P26979O77701J61183K46147J50210
4104B7177210J2830j0900n3960J25m30209n90900o97419o12983l62261k31733
4094B4199800j52682J72762L72024N56929N66136N37072L90953Q2094L6446J24372
4084B6885906L0789K04292N19273L97642N80898O47886L68409J85781l7444l3566
4074B9749866Q9939L38650Q66981J414020J829490J704247J181885L50832n40094
4065C6985816n07855r1257K62401O77805O34838N86074L54671J46073j588k27068
$$ y = [14114033, 14933759, 15646671, 16341611, 16885223, 17480986, 18049306, 18468134, 18915782, 19408708, 20133672, 20799137, 21431976, 21795490, 22059274, 22383383, 22821221, 23053196, 23193164, 23642601, 24006938, 24502978, 25214990, 25941969, 26619670, 26780853, 27027000, 27177210, 27190040, 27179140, 27125180, 27125305, 26695096, 26104196, 25406777, 24793794, 24431533, 24199800, 24047118, 24219880, 24591904, 25148833, 25714969, 26252041, 26642994, 26725088, 26761534, 26885906, 26916695, 27120987, 27640260, 28037902, 28618800, 29266686, 29635095, 29820876, 29783432, 29749866, 29839805, 30178455, 31045436, 32459456, 34288946, 35993193, 37175078, 37525910, 36985816, 36477961, 36386704, 36649105, 37326910, 37961748, 38547822, 38902493, 39048566, 39046978, 38819910]
4055C8819910k51429m47560o58505n65554o20517n38405m18922l55233o40418
4046C4323367p00697n91943m62933l19585j06343r1299l32385l39527m48388o22033
4036C0308234q40223j087430j055960j052080r47042r49747r01245n79384n68307
4027B2326816k86713m93099n62164m64809p16328p46844n58624n59702n79705
4018A7358828n24675n34615m58695n74338n15198m92845m18660k94966m32852
4009A3111984n81541j82322l25211l26073j69666m53107l97870n47313k37568
4000I891313j34732k95430N6809n8814l3099n8157k75618j99948k58870k66076
3990H367378r9167k03125k48449j23486r4374r5875j57716j34896o3663k44113
$$ y = [38819910, 38568481, 38120921, 37462416, 36896862, 36276345, 35737940, 35319018, 34963785, 34323367, 33622670, 33030727, 32567794, 32248209, 32141866, 32050567, 31718182, 31378655, 30930267, 30308234, 29468011, 28380581, 27324621, 26272541, 25325499, 24375752, 23474507, 22895123, 22326816, 22040103, 21547004, 20984840, 20520031, 19803703, 19056859, 18498235, 17938533, 17358828, 16834153, 16299538, 15840843, 15266505, 14751307, 14258462, 13839802, 13544836, 13111984, 12530443, 12348121, 12022910, 11696837, 11527171, 11074064, 10676194, 10128881, 9891313, 9756581, 9461151, 9517960, 9459146, 9426047, 9367890, 9092272, 8892324, 8633454, 8367378, 8268211, 8065086, 7816637, 7693151, 7598777, 7502902, 7345186, 7210290, 7146627, 6902514]
3980F902514l39754k86231l11917k09802p2652j94017j87028k43407j38612q2777
3970D836317k22918p5105r0803k9686j04030J52218K632K0798M6562j20256K14027
3959D629756L73950R02043J276613J012231J56692n54743j064490j049438p27482
3950D955132o56681l11353k56166l18687k94721k45241j76040L76r1893l4016
3940B570710r4971m4520N3468J1938m7504K4086N9370r5479j9334R156O4343L40732
3928B831995M06861R36828J087947J025880L89167l06844r84989j113255o52575
3919C621015n03368m68937k73780j39274j53946j48394q4193M8206j9758q5491
3909A792080j3433J4106j76011l7915J1123l4841J4028Q5864l7297j4794j37969
$$ y = [6902514, 6562760, 6276529, 5964612, 5754810, 5682158, 5488141, 5301113, 5057706, 4919094, 4836317, 4613399, 4538294, 4447491, 4417805, 4313775, 4465993, 4468625, 4489423, 4535985, 4415729, 4629756, 5003706, 5905749, 7182362, 8194593, 8351285, 7796542, 6732052, 5682614, 4955132, 4298451, 3987098, 3730932, 3412245, 3117524, 2872283, 2696243, 2696619, 2604726, 2570710, 2475739, 2431219, 2484687, 2496625, 2449121, 2473207, 2532577, 2437098, 2417764, 2426920, 2491263, 2831995, 3238856, 4175684, 5263631, 6289511, 6678678, 6371834, 5386845, 4273590, 3621015, 3117647, 2648710, 2374930, 2235656, 2081710, 1933316, 1849123, 1897329, 1877571, 1792080, 1778647, 1792753, 1616742, 1578827, 1589950, 1555109, 1569137, 1655001, 1617704, 1602910, 1464941]
3898A464941q2577K10678L408j51843m7636o2467p6973N3757M4065n0652J7720
3887A322421m0979O8000R2434j30736P2424J28349q1894p7388j23814O337J0767
3876A245921L7026o5250R2709q582o6057J8739j7644n9001r4604Q731J36636N2570
3864A281194K654m684Q4612l2744O1820j4470o3044R2621L0689M4827m6640O7133
3852A503968j79434j70915K25500O8783O8930j15958q4303O1355N1743J55510
3842A585179m4048M3159J12723j03504m2059J4017j12687O2029J18446J2820q560
3831A637515K52812o3682j5706L7600o4663J75949j37727L4291M5641l811J41816
3820B040035P0363L7342j19923L8133J99746K06507J5802J47571K60866J56430
$$ y = [1464941, 1382364, 1593042, 1596450, 1444607, 1396971, 1334504, 1257531, 1311288, 1355353, 1304701, 1322421, 1281442, 1349442, 1441876, 1311140, 1383564, 1511913, 1430019, 1352631, 1228817, 1235154, 1245921, 1282947, 1217697, 1310406, 1301824, 1235767, 1254506, 1236862, 1177861, 1083257, 1091988, 1228624, 1281194, 1283848, 1279164, 1363776, 1331032, 1392852, 1378382, 1315338, 1407959, 1438648, 1483475, 1436835, 1503968, 1324534, 1153619, 1379119, 1447902, 1516832, 1400874, 1316571, 1377926, 1429669, 1585179, 1541131, 1584290, 1697013, 1593509, 1551450, 1565467, 1452780, 1514809, 1633255, 1646075, 1637515, 1890327, 1826645, 1810939, 1848539, 1783876, 1959825, 1822098, 1856389, 1902030, 1898219, 2040035, 2110398, 2147740, 2027817, 2065950, 2265696, 2472203, 2488005, 2635576, 2896442, 3052872]
3810C052872K39612O8084J91907M39703M21815L53700L35260K82713O38800N12830
3800F537296O41650L22582M1030J03031K7745j59202k77741j81461k44565l69042
3790F441323n35995k11583j23551r9231j83745j17644m93j7623r1813j3431J02785
3779E148999L4907P2191L63022R9684J33986K43665K28170L39077M20619N11532
3769G595852O53010O51857Q70503R77772J077852R96607R92006R78403O13129
3760A5406991K13784k42478n21500p03674o50115n55743m64186k24191J10386
3751A2369274m9512L27402N17449M40963J87442j43650m6911j23541j26126p8293
3741A3274497r968J06536N010j08313m11596m01072n35500n68060m54858l58617
$$ y = [3052872, 3292484, 3360568, 3552475, 3992178, 4413993, 4767693, 5102953, 5385666, 6024466, 6537296, 7178946, 7501528, 7542558, 7645589, 7673334, 7514132, 7236391, 7054930, 6810365, 6441323, 5905328, 5693745, 5570194, 5470963, 5287218, 5169574, 5169081, 5151458, 5059645, 5046214, 5148999, 5183906, 5256097, 5619119, 5718803, 5852789, 6096454, 6324624, 6663701, 7084320, 7595852, 8248862, 8900719, 9771222, 10748994, 11826846, 12823453, 13815459, 14793862, 15406991, 15620775, 15378297, 14856797, 14153123, 13503008, 12947265, 12483079, 12258888, 12369274, 12319762, 12647164, 13164613, 13605576, 13793018, 13649368, 13602457, 13478916, 13352790, 13274497, 13264529, 13371065, 13376075, 13267762, 12856166, 12455094, 11919594, 11351534, 10896676, 10538059]
3731A0538059J7366J54466J37122J74365L40202M62437K44441J61151J19731j17726
3721A2231614k63055j52213Q9134J30489L20166N22639J037720J172591J408593
3712A6497678J292621J230119P17114K36890p3768m04489j69211O8728K59444
3703A9655126P3714k14537q10574j115171j228227j426533j129766r90942q23708
3694A1989382o85761m96985k87248k69347k73508j86134j53448L9017k29111k58364
3684I188493p0097j86006k08638N3039J23361J59563L46506N52955N14142M74762
3674A0948080M30632J78093j02718k34374j38645k68174J8556K26069K9363k2667
3664A1064215j66567k93802k97498m74324k16318l07612L4452L7598J21203K70026
$$ y = [10538059, 10555425, 10709891, 10847013, 11021378, 11361580, 11824017, 12068458, 12229609, 12349340, 12231614, 11968559, 11816346, 11905480, 12035969, 12356135, 12878774, 13916494, 15089085, 16497678, 17790299, 19020418, 19737532, 19974422, 19900654, 19496165, 19326954, 19395682, 19655126, 19728840, 19514303, 18703729, 17588558, 16360331, 14933798, 13804032, 12813090, 11989382, 11303621, 10806636, 10519388, 10250041, 9976533, 9790399, 9636951, 9675968, 9446857, 9188493, 9118396, 8932390, 8723752, 8776791, 8900152, 9059715, 9406221, 9959176, 10473318, 10948080, 11378712, 11556805, 11454087, 11219713, 11081068, 10812894, 10831450, 11057519, 11086882, 11064215, 10897648, 10603846, 10306348, 9832024, 9615706, 9308094, 9342546, 9380144, 9501347, 9771373]
3654I771373L46095K79947K44018O5200j00092l94065o84112p47819p31678q32649
3644G216218p31530n39921n52996l61989k01640k60307k36186j84733j8474m2486
3634D085956j18487j24410n6873o7473K6018K4372R7856J85065m0772j3853m4074
3623C953325J5315j41364J97688J49078P4899L81622J60060K49511R7556p4078
3613E063612O048j67094j44602m12992m24493l52502k23620l20920j94019k45344
3603B584074j39663q9222q5077r5822j15579j0688j56660k2517k8138o3267j43954
3592A633487j00866M5679Q9594l5954L3226k4044j29351j57221n2178J21115m9775
3581A373712p927R3054K6755n3415l5585J7680L342j6632J3371l1747j00213m7432
$$ y = [9771373, 10117468, 10397415, 10641433, 10706633, 10606541, 10212476, 9528364, 8780545, 8048867, 7216218, 6484688, 5944767, 5391771, 5029782, 4828142, 4567835, 4331649, 4146916, 4128442, 4085956, 3967469, 3843059, 3786186, 3718713, 3744731, 3769103, 3866959, 4052024, 4011252, 3997399, 3953325, 3968640, 3827276, 4024964, 4174042, 4248941, 4630563, 4790623, 5040134, 5137690, 5063612, 5069660, 4902566, 4757964, 4344972, 3920479, 3567977, 3344357, 3023437, 2829418, 2584074, 2444411, 2355189, 2270112, 2174290, 2058711, 2048023, 1891363, 1868846, 1840708, 1777441, 1633487, 1532621, 1578300, 1667894, 1631940, 1665166, 1641122, 1511771, 1354550, 1302372, 1423487, 1373712, 1365785, 1458839, 1485594, 1432179, 1396594, 1414274, 1417616, 1400984, 1414355, 1382608, 1282395, 1234963]
3569A234963K8711j4154k5666n2858n8493L3416M092j10570P2494R5765L1122
3558A238822j1651j19832k0839K024J647M0754j5291J340O3315j17438k5878R1207
3546A128180J76221p6454j9293p7467P8588J08101k6554l4893O8506j43960O7087
3535A248062O186j28731R870n8766P8010M7497J39678j5296o1743Q1098J3955
3524A359820O089l8660K5354O5164q996M9773o2151N8904k6053l0252l5192J02226
3512A466026n194j1194N6822J04760J80595o1625j26333J62583k1824N8823J40848
3501A944287J9038l0194r8000r6117J43849j8925M8597R1390J07861j49458k4637
3490A937691J77762O3468M3230J99090K35362J35866L7508k45112r0147l701j241
$$ y = [1234963, 1263674, 1249520, 1223854, 1170996, 1112503, 1145919, 1150011, 1039441, 1111935, 1207700, 1238822, 1227171, 1107339, 1086500, 1088524, 1090171, 1130925, 1115634, 1116974, 1180289, 1062851, 1036973, 1128180, 1304401, 1227947, 1208654, 1131187, 1209775, 1317876, 1291322, 1256429, 1324935, 1180975, 1248062, 1254248, 1125517, 1135387, 1076621, 1154631, 1202128, 1341806, 1326510, 1264767, 1345865, 1359820, 1365909, 1327249, 1352603, 1417767, 1408771, 1458544, 1396393, 1455297, 1429244, 1398992, 1363800, 1466026, 1460832, 1449638, 1506460, 1611220, 1791815, 1730190, 1603857, 1766440, 1744616, 1803439, 1944287, 1963325, 1933131, 1835131, 1739014, 1882863, 1863938, 1912535, 2003925, 2111786, 1962328, 1937691, 2115453, 2178921, 2222151, 2421241, 2656603, 2792469, 2829977, 2584865, 2494718, 2491017, 2489776]
3479B489776R6614J313k4136l2010J10834J05158j65922q6726Q9965J11173R688
3468B705727j216l6285J4522L782j72470J17485L1047K8055O8628N2694k0840
3457B791129m4507K48624N0814J4080j5590K9982J63541J34237n0789j32116K6097
3446C215502J38544j5176L89r7415J05545R6682K1452M2268J91839l3242R5807
3435C762195J94929o0788m2005K057Q6508J35156P4088J91974Q5909l568Q6443
3424D512898K06269J90790J86397K56400K62852P1793n7671J96555L02131K24285
3414F352699J78274K22610L20044J69545K56581J60682J68861K81206M33158L64876
3404H908536K55739L35414M88974M24260N54295O57487O76568P86894R27069J140806
$$ y = [2489776, 2586390, 2587703, 2563567, 2531557, 2642391, 2747549, 2581627, 2494901, 2584866, 2696039, 2705727, 2704511, 2668226, 2682748, 2686530, 2514060, 2631545, 2662592, 2690647, 2759275, 2811969, 2791129, 2746622, 2995246, 3046060, 3060140, 3044550, 3074532, 3238073, 3372310, 3321521, 3189405, 3215502, 3354046, 3338870, 3339259, 3241844, 3347389, 3444071, 3465523, 3507791, 3699630, 3666388, 3762195, 3957124, 3896336, 3854331, 3856388, 3942896, 4078052, 4152140, 4344114, 4430023, 4426455, 4512898, 4719167, 4909957, 5096354, 5352754, 5615606, 5687399, 5629728, 5826283, 6128414, 6352699, 6530973, 6753583, 7073627, 7243172, 7499753, 7660435, 7829296, 8110502, 8543660, 8908536, 9164275, 9499689, 9988663, 10412923, 10967218, 11624705, 12301273, 13088167, 14015236, 15156042]
3394A5156042J266728J336692J424446J629777J898352K364279K486114K816431
3386C0378861L487479M031550M792468N764813P227843R385162J1981517J5499015
3378I2548708J8646340J9747406J7445643J0899578J365624p615891j3763094
3371A39274314j6029656j5624381j3909307j1551024r139060p090875n398732
3364F0531279m012784k943490j801844j102778p23314J278N13076J215203J833823
3355E3510449K492714L590185M991066O874904R244490J2411688J5514650J7248426
3347A25878572J5900393J0391171J801251p610260j4455318j7425877j6764325
3340I7715607j4506478j2131844r592165p885734o458732n082747m232259l522325
$$ y = [15156042, 16422770, 17759462, 19183908, 20813685, 22712037, 25076316, 27562430, 30378861, 33866340, 37897890, 42690358, 48455171, 55683014, 65068176, 77049693, 92548708, 111195048, 130942454, 148388097, 159287675, 160653299, 153037408, 139274314, 123244658, 107620277, 93710970, 82159946, 73020886, 65930011, 60531279, 56518495, 53575005, 51773161, 50670383, 49947069, 49948347, 50461423, 51676626, 53510449, 56003163, 59593348, 64584414, 71459318, 80703808, 93115496, 108630146, 125878572, 141778965, 152170136, 153971387, 146361127, 131905809, 114479932, 97715607, 83209129, 71077285, 61485120, 53599386, 47140654, 42057907, 37825648, 34303323]
3332C4303323k881493k543189k220898k060021j725981j473441j240439j127561
3324A9030300j059662j010133q49297q38069p10531m19429n78845o35865o09713
3315A2318756n24573o53350m28069n16848l89144m79805l20442k98735j43825
3306H563965j61846l37662k30814k67525k23433r5511j31114k04497j74610j92368
3296F544585j24965j20411j33699l15535r1122m3735k28561p3613n8478k12785
3286E141681j89829k19847P3179q5317j1219l17j13628l0925k17386l6275j4541
3275D295576k21054j12085j23615j00886N3633o5523j51927k20260n4613j071
3265C298175m4570J15816J04522R2224j05105j87350p3120o9263K9713k00728
$$ y = [34303323, 31421830, 28878641, 26657743, 24597722, 22871741, 21398300, 20157861, 19030300, 17970638, 16960505, 16111208, 15273139, 14562608, 14143179, 13564334, 12928469, 12318756, 11794183, 11140833, 10712764, 10195916, 9806772, 9326967, 9006525, 8707790, 8563965, 8402119, 8064457, 7833643, 7566118, 7342685, 7247174, 7116060, 6911563, 6736953, 6544585, 6419620, 6299209, 6165510, 5849975, 5758853, 5715118, 5486557, 5412944, 5354466, 5141681, 4951852, 4732005, 4805184, 4719867, 4708648, 4708331, 4594703, 4563778, 4346392, 4310117, 4295576, 4074522, 3962437, 3838822, 3737936, 3791569, 3726046, 3574119, 3353859, 3299246, 3298175, 3253605, 3369421, 3473943, 3566167, 3461062, 3273712, 3200592, 3131329, 3161042, 2960314]
3255B960314q8532J7448P0060J43296j00364j8526r30j19096k45j76639j78962
3244B507824J02799N2341p3977R2383J27710j36233k9432N1492l6812j27458P6826
3233B607463N4965Q2323J62846Q4919j26674K27003J957J1408K413j57248p0640
3222B880735j62600j37638J8455R611n6679n4799j57135k8168p2934J43174J6779
3211B398801P206N2313J15358P4219R1404J02893M7054O5854J15891J62195J72233
3200C405421K46966J77972L36081K76553L11770L23956N87410M74198M33130K71757
3190F845214J44340j01248m16516m21477n04198n17689m70424k30103k85464j17649
3180C924786q4103k78695O2545J28980M2755K07497J54138Q5122J56204L68058
$$ y = [2960314, 2871782, 2889230, 2959290, 3102586, 3002222, 2983696, 2982766, 2863670, 2863425, 2686786, 2507824, 2610623, 2662964, 2588987, 2681370, 2809080, 2672847, 2643415, 2694907, 2658095, 2530637, 2607463, 2662428, 2744751, 2907597, 2992516, 2865842, 3092845, 3094802, 3106210, 3108623, 2951375, 2880735, 2718135, 2580497, 2598952, 2608563, 2551884, 2497085, 2339950, 2311782, 2238848, 2382022, 2398801, 2406007, 2458320, 2573678, 2647897, 2739301, 2842194, 2889248, 2955102, 3070993, 3233188, 3405421, 3652387, 3830359, 4166440, 4442993, 4754763, 5078719, 5666129, 6140327, 6573457, 6845214, 6989554, 6888306, 6471790, 6050313, 5546115, 5028426, 4558002, 4327899, 4042435, 3924786, 3840683, 3561988, 3624533, 3753513, 3796268, 4003765, 4157903, 4243025, 4399229, 4767287]
3170D767287L94676J32871J77319L38305K49118L05719M78672L75826K42939J13580
3160G576312j19573l41844q27874p26457m98921l34180l89109k98179l41562k83757
3150C414856j02407k45662k44966o5363k0238J05341j7627Q7967q6577j27520
3140B697804n204j82805k2678n8357q3589r3763l5111p2278r6057p9978L1282
3129A999266p917l1652j484m432j5016q9453J19242n0407p4108l572j5676K3730
3117A848521j07937Q7284R1987j8896l0275Q8999R9823m1559L8987J74266J01445
3106B332645q468M3254r3889j17961j07868n0240j18907k964J32727l5498L6965
3095B009796O9551J56346J90142o2447m3613k01841j81267o4887p0581n4610j66182
$$ y = [4767287, 5161963, 5294834, 5472153, 5810458, 6059576, 6365295, 6843967, 7219793, 7462732, 7576312, 7456739, 7114895, 6287021, 5560564, 5061643, 4727463, 4338354, 4040175, 3698613, 3414856, 3312449, 3066787, 2821821, 2756458, 2736220, 2841561, 2823934, 2911901, 2825324, 2697804, 2692600, 2509795, 2487117, 2428760, 2345171, 2251408, 2216297, 2144019, 2047962, 1967984, 1999266, 1991349, 1959697, 1958213, 1953781, 1938765, 1849312, 1968554, 1918147, 1844039, 1840467, 1824791, 1848521, 1740584, 1827868, 1919855, 1900959, 1870684, 1959683, 2059506, 2017947, 2056934, 2231200, 2332645, 2324177, 2367431, 2273542, 2155581, 2047713, 1997473, 1878566, 1875602, 2008329, 1972831, 2009796, 2079347, 2235693, 2425835, 2363388, 2319775, 2117934, 1936667, 1871780, 1801199, 1746589, 1580407]
3084A580407j12192R9996l1949k02990l435R9253O5868l8385r8032k3524P4541
3073A409558j7897O2363j54245Q0392N2985J831J02387L9194J47817P0657P029
3062A802071q8861K17157n8020j56785K4105m4529L9082j53964m5870r9416m2229
3051A392741Q1937j332l4834j48247k00485n6182M6089P3039K8684n9334j25822
3040I96254m8598j2854J42083n0885p1534j18742R022Q5884j01823K1144R1519
3029I41470Q2598l8452Q2369o1614L5681n4460P2625K6427j59969p762l5668M8513
3017I31758r6228K6696N3998j09524q3584m3860J55680J8055k9383J4817j9253
3006H19172q0565N2978J37303k3020J9171n0693O4417Q9228k9502l8322P5896
$$ y = [1580407, 1468215, 1568211, 1536262, 1333272, 1329837, 1429090, 1494958, 1456573, 1358541, 1335017, 1409558, 1391661, 1454024, 1299779, 1380171, 1433156, 1434987, 1537374, 1576568, 1724385, 1795042, 1802071, 1713210, 1930367, 1872347, 1715562, 1739667, 1695138, 1734220, 1580256, 1534386, 1434970, 1392741, 1474678, 1473346, 1438512, 1290265, 1089780, 1033598, 1079687, 1152726, 1181410, 1122076, 996254, 947656, 934802, 1076885, 1026000, 954466, 835724, 844746, 930630, 828807, 849951, 941470, 1024068, 985616, 1067985, 1006371, 1042052, 987592, 1060217, 1086644, 926675, 918913, 883245, 931758, 835530, 862226, 916224, 806700, 723116, 679256, 834936, 852991, 823608, 838425, 819172, 738607, 791585, 928888, 905868, 925039, 874346, 938763, 1027991, 998489, 960167, 1036063]
2995A036063K8086k70429L4747K6856k4750q8235n6929P6607M26R1866K1030l0444
2983H44894k0696Q3186n1582j818l6561q0973l6387K0635M3255m6417J6557R984
2971G44077j04416J2289P9271j80680Q6918L8929P7808o8408k32596J72775k6648
2960E99319K1541K8477K8978K5865p821q9302j16016Q2480R6167N2980k7094J1613
2948G07187Q84P170j03990p5076k3133O8819j9033j51107J43042j8557N5805P5304
2936F67315p3952p38J20595j5646r6275l1748N3295N2039n645J21972p2686l526
2924G15000k1441m9637j05368q0656J73362L5561j3916n0261l4127m4384J3787
2913E37920j4783O1532J4129P85M522r3771k216J6005Q1516J0701M0517j25410
$$ y = [1036063, 1064149, 793720, 828467, 855323, 830573, 742338, 685409, 762016, 762442, 854308, 875338, 844894, 824198, 907384, 855802, 853984, 817423, 736450, 700063, 720698, 763953, 717536, 734093, 744077, 639661, 651950, 731221, 550541, 637459, 676388, 754196, 685788, 453192, 625967, 599319, 620860, 649337, 678315, 704180, 696359, 607057, 491041, 573521, 669688, 722668, 695574, 707187, 708071, 715241, 611251, 536175, 513042, 581861, 562828, 411721, 554763, 536206, 592011, 667315, 593363, 592625, 713220, 697574, 601299, 569551, 622846, 674885, 669240, 791212, 718526, 715000, 693559, 643922, 538554, 457898, 631260, 666821, 652905, 602644, 568517, 524133, 537920, 523137, 584669, 598798, 599583, 604105, 510334, 508118, 524123, 605639, 616340, 656857, 531447]
2901E31447Q0162J6581p9677o8506J22534Q4683j61809n3257k9549L6932J6310
2890D95851O5604J9279q8164n2068M7220P7612Q9675n6494r771j54128o63J33678
2878E67631o4714n4250k6533J2303R3806R2723N5181m0609r1726o9584R013J09973
2866E93214k7647o3381Q78J2411k6536k2152j6080j8721L23q294q7123n335N9476
2853C91033J42956J6504r5432M0230M0176J9212j45302O0579J44800N560j73584
2842D46732m2258M2136R1477O0995r8329j93985R4885L085j5630O5543r4107J26061
2830D86605P3141N053j70120J75325p5169n9503l838Q8521k9657j53755N6359
2819C92962J63243j8683p7939J1466p4938J85247M5634q9198q4934r5847M5691
$$ y = [531447, 611609, 628190, 548513, 480007, 602541, 687224, 525415, 472158, 442609, 479541, 495851, 561455, 580734, 492570, 440502, 487722, 565334, 655009, 598515, 588744, 434616, 433953, 567631, 502917, 448667, 422134, 434437, 528243, 620966, 676147, 635538, 543812, 474228, 483241, 593214, 565567, 502186, 503064, 515475, 488939, 466787, 450707, 431986, 432309, 424015, 336892, 331557, 391033, 533989, 550493, 455061, 495291, 535467, 554679, 409377, 469956, 614756, 620316, 446732, 404474, 446610, 538087, 599082, 500753, 306768, 401653, 404738, 389108, 454651, 360544, 486605, 559746, 564799, 394679, 570004, 494835, 435332, 431494, 520015, 490358, 336603, 392962, 556205, 537522, 459583, 471049, 396111, 581358, 626992, 537794, 452860, 357013, 402704]
2808D02704N6652j27313K964P3046l1518L4629n9742J50228Q8473j9459o4148
2797E06516Q0138J221r1530N7629n3470j7058L1076r2095M0086M1320M1553r0019
2785D55367j04145O8936m4457o5634r3675P3248p601O6772R6623M1407L9935P9475
2773F06251j40833j3238Q4947k8558l4902K3096O2350n9826r810K8628K8843o7460
2761D79488L6028K2752k9420J0962j25238Q3216k96j50090K0335O1763M8746j5721
2749D42525k653J7749K1101j50291p2651J47004J24276M0708q4498o2516k8972
2738C91782k86N964N3297J4645J83959l9510p1982K9540j15331k06285P1791P2096
2726C89680O679l5656Q1752N401j20443Q6525Q2775p102l5664n0004L0703q4287
$$ y = [402704, 459356, 332043, 335007, 408053, 376535, 411164, 351422, 501650, 590123, 570664, 506516, 586654, 587875, 496345, 553974, 500504, 483446, 514522, 422427, 462513, 503833, 545386, 455367, 351222, 420158, 375701, 310067, 216392, 289640, 282039, 348811, 445434, 486841, 526776, 606251, 465418, 452180, 537127, 508569, 473667, 496763, 559113, 499287, 489477, 518105, 546948, 479488, 515516, 538268, 508848, 519810, 394572, 477788, 477492, 327402, 347737, 409500, 458246, 442525, 439872, 457621, 478722, 328431, 255780, 402784, 527060, 567768, 483270, 420754, 391782, 391496, 397460, 450757, 465402, 649361, 609851, 537869, 567409, 452078, 245793, 317584, 389680, 396359, 360703, 442455, 447856, 327413, 413938, 496713, 489611, 453947, 403943, 434646, 350359]
2714C50359M9728N0658q9294J09156p050K2937j25982j3003J47475k4494O7883
2703E38373M3633m170j67311r1008Q9191O0187q6521K9844m3082O4013J0224O3455
2691E06828q7333J196M7367k12062M9780o7775O979j8087M213J61140N3933K0261
2679D66440r3482k6355R3980o9606p7004K5694J90423J9036m7982j14472m7646
2668C19026r7922L9899n8180M9415O5442j123j49070J39038J16949p1918N7230
2657D08786O697l9180j10321J24227J5949j04359M7571L834Q0713p3294j12048
2646B48575o6942J11707M9797l5179l8936k4498Q4690m4587L4570P4942O2219
2635D56358K8574J2187n8875p8347N9412j25909j33708J743K5629L460O4055N5198
$$ y = [350359, 400087, 450745, 361451, 470607, 463557, 486494, 360512, 347509, 494984, 470490, 538373, 582006, 577836, 410525, 319517, 408708, 468895, 382374, 412218, 369136, 433149, 443373, 506828, 419495, 420691, 468058, 255996, 305776, 238001, 244980, 226893, 231106, 392246, 446179, 466440, 372958, 346603, 440583, 370977, 293973, 319667, 510090, 529126, 481144, 366672, 319026, 221104, 261003, 202823, 252238, 317680, 316557, 167487, 306525, 423474, 351556, 408786, 415483, 376303, 265982, 390209, 406158, 301799, 349370, 353204, 433917, 360623, 248575, 181633, 293340, 343137, 307958, 269022, 244524, 329214, 284627, 319197, 394139, 456358, 484932, 497119, 438244, 359897, 419309, 293400, 159692, 161435, 187064, 190524, 254579, 309777]
2623C09777J03766m1677L0049J5299k9791O1329o1581J02464l5907l7842l3852
2612C82034L2177J52814J13256N7323J85734J57185L12334K16338j14433l11232
2602A183530j93887k8465j56627j78760j2483r722q3742l9088o0275J06956L9944
2591E67381m4812o5333k8945J6546o3392O4611J29799j25180j04329Q7522Q3789
2580E17657l8683L8606j58914k8534P9382M9915j42413p1493P3916J48840o4375
2569D03904L0360r4821p9353J51646L1614M4052O1372L9803q1865l9219j43692
2558C23801J5886m3866R1470K8616k1675L4402K658j27248k469n427k7668o726
2546B61754j4501K25242J14263j96509n1976O8564M3016J9419Q8706n213K2149
$$ y = [309777, 413543, 371866, 401915, 417214, 387423, 448752, 387171, 489635, 453728, 415886, 382034, 414211, 567025, 680281, 737604, 923338, 1080523, 1392857, 1609195, 1494762, 1183530, 989643, 961178, 804551, 625791, 613308, 603586, 519844, 480756, 420481, 527437, 567381, 522569, 457236, 428291, 444837, 381445, 446056, 575855, 450675, 346346, 433868, 517657, 478974, 517580, 358666, 330132, 409514, 459429, 317016, 245523, 319439, 468279, 403904, 434264, 339443, 260090, 411736, 443350, 487402, 548774, 588577, 506712, 467493, 323801, 339687, 295821, 387291, 415907, 394232, 428634, 431292, 304044, 301575, 296148, 268480, 261754, 247253, 472495, 586758, 390249, 338273, 406837, 449853, 469272, 557978, 552765, 574914]
2535E74914j48223j06225L8183N4679r8743l195j69M8450P6141j3195K3636r4031
2523C52222L0593J8778q9593l8722K031o8204L7309K40241J05694o4384j14663
2512D11302o8267l1872L60J17911L0250R3674N633J3987P1085M4772l6359j66806
2500D85670M1824o3458R2555n6607m6405j46253R0514K39451O060j51904o5071
2489D26376J01163J01035o875n8564K6366j46501J078K62576L9053j32628n8144
2478E54935P0819p933o5021Q6883N534j85786L7272L4604K7683l3267M4242K3548
2466E93513k4866m358J19553j00835K135O2748n1399L2424p1498p305J2642k4651
2454E38103P5951J39638R9261j23421l0653J4331M755l5814K61037l310j68177
$$ y = [574914, 426691, 320466, 358649, 413328, 314585, 311390, 311221, 359671, 435812, 422617, 446253, 352222, 382815, 401593, 312000, 273278, 275309, 207105, 244414, 484655, 590349, 525965, 411302, 343035, 311163, 311523, 429434, 459684, 553358, 558991, 572978, 644063, 688835, 652476, 485670, 527494, 464036, 556591, 499984, 453579, 307326, 397840, 637291, 643351, 491447, 426376, 527539, 628574, 621699, 563135, 589501, 443000, 444078, 706654, 745707, 613079, 554935, 625754, 617821, 552800, 639683, 645217, 459431, 496703, 531307, 558990, 525723, 569965, 593513, 568647, 564289, 683842, 583007, 585142, 647890, 596491, 628915, 557417, 550112, 562754, 538103, 614054, 753692, 852953, 729532, 698879, 713210, 717965, 682151, 943188, 939878, 771701]
2443G71701R7984P811Q6651L5501r0232j82155J31680j20750K4251P2057M0677
2432H75176O5888L4334k6425M0965M382n5013n2832J39535j5796q0944P6309K55520
2420A261099m1579o4943j00405J65016K2694M4081K8386p6585k8495K38388j9875
2409A427782J29505n2321r8636j1048O2345p3727J62444m04L0066K1329J44900
2398A742235K4932O5153o2439M4537L5027J79160j29966n6112R8501J97419L1465
2387B169912P4555J51133Q0638Q1988J82008r8793M7615j9910K30780K65228K09231
2376C374385J12620J86636L4694O424J59645K44820k1222L2779O4022K47352K27557
2365D669712J69261K91768L20129M37006N71241M66196O63275P64505J464264
$$ y = [771701, 869685, 877496, 964147, 999648, 909416, 727261, 858941, 738191, 762442, 834499, 875176, 941064, 975398, 948973, 989938, 994320, 939307, 886475, 1026010, 1010214, 929270, 1005579, 1261099, 1219520, 1154577, 1054172, 1219188, 1241882, 1285963, 1314349, 1237764, 1209269, 1447657, 1427782, 1557287, 1504966, 1406330, 1395282, 1457627, 1383900, 1546344, 1545940, 1576006, 1597335, 1742235, 1767167, 1832320, 1769881, 1814418, 1849445, 2028605, 1898639, 1842527, 1941028, 2138447, 2169912, 2244467, 2395600, 2476238, 2558226, 2740234, 2641441, 2689056, 2669146, 2899926, 3165154, 3374385, 3487005, 3673641, 3708335, 3714759, 3874404, 4119224, 4098002, 4130781, 4194803, 4442155, 4669712, 4838973, 5130741, 5450870, 5887876, 6459117, 6925313, 7588588, 8353093, 9817357]
2356I817357J725648J953732J846695J570266N48420N74695J228780J580049K378843
2347B3224485L032696M092694N069797P851700J3648249K7578041M0218183M6741916
2339A71457761L8586598J7334107l2310529m5988940l6894900k9309877j7746825
2332F5127395j3910525r554696p868241n038487l801905j700841j132071j94500
2324B1926129o29109p32591k045083j873116j634335j126436j120714q14759j044389
2315A0905597n09138n30254m84525n08539l13569o01649k97803l88013l08654
2306F963453m03761j98009k97636j76470n08126j19067j04555j89043p1034j5483
2296D880269j60886k514k96770j02591k63385k2826q9549j8771r7576p0315n3169
$$ y = [9817357, 11543005, 13496737, 15343432, 16913698, 17462118, 18036813, 19265593, 20845642, 23224485, 26257181, 30349875, 35419672, 43271372, 56919621, 84497662, 124715845, 171457761, 210044359, 227378466, 195067937, 149078997, 112184097, 82874220, 65127395, 51216870, 41662174, 33793933, 28755446, 24953541, 23252700, 22120629, 21926129, 21297020, 20564429, 18519346, 16646230, 15011895, 13885459, 12764745, 11949986, 10905597, 10396459, 9866205, 9381680, 8873141, 8559572, 7957923, 7660120, 7272107, 6963453, 6559692, 6361683, 6064047, 5887577, 5379451, 5260384, 5155829, 4966786, 4895752, 4880269, 4719383, 4716869, 4420099, 4317508, 4054123, 4031297, 3941748, 3922977, 3825401, 3755086, 3701917]
2285C701917m7256m7326j1951j11456j85559j26543p8154k02060j45945k47522
2275B498145J46360O8315M1184o2148m2098k61800j85335o5497R6031p4195K5518
2264B184480M9320j17038j45490n3073j3705j2562O705r3402o0752m6439j5563
2253A682481J17151q7126Q7915j29346m9889r2642N4721O1074o2746J09512m1925
2242A649180R660N0459j67329O8144j66k38689M4920j91084Q5745n2565K9869
2231A288144M9182O5103j10463p3718Q996J07165o4438l2262J0373M7173l8472
2220A256783J1197m4296j15202j69031J7922l867K06376J07367l5392J87j04942
2209A127102J6481l4654q8304p5229p5611J03120m6893J82056J2661j17415J1367
$$ y = [3701917, 3654661, 3607335, 3595384, 3483928, 3298369, 3171826, 3093672, 2891612, 2745667, 2498145, 2644505, 2712820, 2754004, 2691856, 2649758, 2387958, 2202623, 2137126, 2233157, 2158962, 2184480, 2233800, 2116762, 1971272, 1918199, 1904494, 1891932, 1898637, 1805235, 1744483, 1698044, 1682481, 1799632, 1712506, 1800421, 1671075, 1621186, 1528544, 1583265, 1644339, 1581593, 1691105, 1649180, 1658840, 1709299, 1541970, 1610114, 1609948, 1371259, 1416179, 1225095, 1310840, 1258275, 1288144, 1337326, 1402429, 1291966, 1218248, 1227244, 1334409, 1269971, 1237709, 1248082, 1295255, 1256783, 1267980, 1223684, 1108482, 939451, 957373, 953506, 1159882, 1267249, 1231857, 1232044, 1127102, 1143583, 1108929, 1020625, 945396, 869785, 972905, 926012, 1108068, 1120729, 1003314, 1014681]
2198A014681p7510j07089j1890O5272k3253j6074L1448O385r1267n6268l9440
2187F94995O1920K42j39858M9524m6246k8708J36142J57725M2114m3243r5294
2176G89313p3683j65785p7930M1925R7447M9991j2924O0668J13674j57578J030
2165F66148R8438O3280j52999j69475J44114J6804N8433J3132K0442O1787j09116
2154G10988J3328j4209j16164j44015o14L0244M2566p7196K75230k1509l4465
2143F64184K50n2157L2311Q0757j9727l0280o2370j58286M3958J33238r564p7938
2131E44376m6752o528K0366J1918O0511q77k9032k1815m9119k9030R4144J02141
2119F50303r666n9204Q0052M7551p153p0234l2116J02794R5520j67961O9899j01002
$$ y = [1014681, 937171, 830082, 818192, 883464, 860211, 844137, 875585, 881970, 790703, 734435, 694995, 756915, 757157, 617299, 666823, 620577, 591869, 728011, 885736, 927850, 884607, 789313, 715630, 549845, 471915, 513840, 611287, 661278, 648354, 709022, 822696, 665118, 666148, 764586, 827866, 674867, 505392, 649506, 666310, 724743, 737875, 758317, 820104, 710988, 724316, 710107, 593943, 449928, 449314, 479558, 522124, 444928, 720158, 698649, 664184, 664434, 612277, 644588, 725345, 705618, 675338, 612968, 454682, 498640, 631878, 622314, 544376, 497624, 491096, 511462, 523380, 583891, 583014, 553982, 532167, 483048, 454018, 548162, 650303, 640637, 581433, 661485, 709036, 701883, 631649, 599533, 702327, 797847, 629886, 699785, 598783]
2107E98783O3946O9092j15253j58839N2618Q9508m0299P4253j32477l0893n5215
2096D15224O0314q8282k5954J79665p2826J1826K7731k30J38517m7802r0060O3507
2084E71630Q6035L4257K6537r4656O896J801j00003J77448m3069N1273J26147
2073H44296P6595Q5559J37953K67890J13018o8107m0720k36249j69100j28588
2063H82547m2204p4783J205j49044n9831p7312o9559O6925R8587Q0786j07042
2052E50275n6122M394j13333J675J17285J5508m7827M7365J2515J26594j55348
2041E02981j75539K0970R4002K16653m1694k33073R7037J40446p7137q4440K1314
2030D81520m4752l5199m3041K9379q2726N2864R9567R377j2957k1207j5160N2519
$$ y = [598783, 662729, 731821, 616568, 457729, 510347, 599855, 559556, 633809, 501332, 470439, 415224, 475538, 387256, 361302, 540967, 468141, 479967, 507698, 507468, 645985, 598183, 508123, 571630, 657665, 691922, 718459, 623803, 630699, 632500, 532497, 709945, 666876, 718149, 844296, 920891, 1006450, 1144403, 1412293, 1525311, 1457204, 1416484, 1180235, 1011135, 882547, 840343, 765560, 766765, 617721, 557890, 480578, 411019, 477944, 576531, 657317, 550275, 494153, 498547, 385214, 386889, 504174, 519682, 471855, 519220, 531735, 658329, 502981, 327442, 348412, 442414, 659067, 617373, 384300, 481337, 621783, 544646, 460206, 481520, 436768, 401569, 358528, 387907, 305181, 358045, 457612, 466989, 454032, 432825, 417665, 470184]
2018D70184N8606j34087o2460M9343J7560O7558N6364o3337J3620o897r3660J00895
2006D73689M4083n5224O9821j75510n6918R6365j14483J33713R5747n518R0572
1995E96337q0163k8141n24J3648j3336J7572r3699m1340P2346M4144L5422m1870
1983D80396m9263K2596m1592p1904J895k3628M643Q2038q0931R2365J02112j1966
1971E06761k5211K8053q5174k1986k7823J0238J65557l0688k54288P3731J44902
1960D84072O5833J2403N8755j18241n391K2634m5971k4325m0559l4447P0318N3
1948D45134L3625j1635r3553m6442N2994J05046n4048j53317l4330K6492J15102
1937C85068J53035L4038k28067j61337J88721O9393j09480J04337j12402M0120
$$ y = [470184, 528790, 394703, 332243, 381586, 399146, 466704, 523068, 459731, 473351, 466454, 372794, 473689, 517772, 462548, 532369, 356859, 299941, 396306, 281823, 415536, 511283, 505765, 596337, 516174, 488033, 487509, 501157, 487821, 505393, 411694, 370354, 442700, 486844, 522266, 480396, 431133, 453729, 412137, 340233, 342128, 318500, 323143, 405181, 324250, 416615, 518727, 506761, 481550, 509603, 424429, 402443, 374620, 384858, 550415, 519727, 265439, 339170, 484072, 549905, 562308, 621063, 502822, 497431, 520065, 474094, 449769, 409210, 374763, 445081, 445134, 478759, 467124, 373571, 327129, 380123, 485169, 431121, 277804, 243474, 269966, 385068, 538103, 572141, 344074, 182737, 371458, 440851, 331371, 435708, 323306, 363426]
1927C63426n7666R5554K2095j10932P8852j4026j30044k5708J22900M3529j9660
1916C68320r0448q3760J24789K8250k9778J0482n586J03518l5356m5371M4306
1905C89366R2966N7238r9249o9761K9703j38630M97m3510O5274O557P1492p9901
1893B82042j07372L2842J121Q7056N7658k5091J9920O5586k3656o0427N4542m9678
1881C34543r723j32933k5796J90827r861O5649J5739k04570J01305K7596j2488
1870C40288n5165M608j18267M9287J23684J572L0131o511J3381l590N2523K2090
1858D54031j98741P630Q9033J8653M6826r6828K1173J01808n9530q499M718j12073
1846B68201M0752J24385m8860M7813L1276k5826l1616l1027P7794J19371q1781
$$ y = [363426, 305760, 401314, 423409, 312477, 391329, 377303, 247259, 221551, 344451, 387980, 368320, 277872, 194112, 318901, 347151, 317373, 327855, 322269, 425787, 390431, 345060, 389366, 482332, 539570, 440321, 370560, 400263, 261633, 262130, 218620, 283894, 290451, 361943, 282042, 174670, 207512, 208633, 295689, 353347, 328256, 348176, 413762, 390106, 329679, 384221, 334543, 324820, 191887, 166091, 356918, 347057, 412706, 428445, 223875, 325180, 352776, 340288, 285123, 289731, 171464, 220751, 344435, 346007, 376138, 369627, 383008, 379418, 431941, 454031, 255290, 262920, 351953, 370606, 417432, 320604, 341777, 443585, 384055, 375556, 380274, 268201, 308953, 433338, 384478, 432291, 463567, 437741, 406125, 375098, 452892, 572263, 490482]
1835D90482m5160n4095m581J47398j20909m1469j1609K5520p4469M8601P9379
1824D39088M0472q5821o3876O5566o373m9771L5069p711l6604R9183M746o8734
1812C65234J6462q6272l9911J60832J1355k0381j73493P9329j46589j0339R9998
1801B56225J05484p423j10550J051n8309j886k3257L1009Q829R6807N567j0019
1789B93528M0578K2852M5861q8695J05589q6526K0562j5581n2971J12947j12593
1778B85551J76844q0973j39619J15295k1027l7003J36095n5276l126j15574j0337
1767B50850J4455l7835J05935J43199L956m2523p4289O1059j50356K1986J74642
1756D71079o4069j22358J12813M3800j60160n816n6138M7524q6997Q8947M8001
$$ y = [490482, 445322, 391227, 386646, 534044, 413135, 371666, 360057, 385577, 311108, 359709, 439088, 479560, 393739, 329863, 395429, 389056, 339285, 374354, 366643, 330039, 429222, 433968, 365234, 381696, 295424, 255513, 416345, 427700, 407319, 233826, 313155, 166566, 156227, 256225, 361709, 354286, 243736, 244787, 186478, 184592, 161335, 192344, 201173, 297980, 303547, 293528, 334106, 356958, 402819, 314124, 419713, 333187, 353749, 338168, 285197, 398144, 285551, 462395, 381422, 241803, 357098, 336071, 299068, 435163, 379887, 376761, 261187, 250850, 265305, 227470, 333405, 476604, 480560, 438037, 363748, 424807, 274451, 296437, 471079, 407010, 284652, 397465, 441265, 281105, 275289, 219151, 266675, 179678, 268625, 316626]
1745C16626l6077q8373N6645o4482p5724R6236M4430N5733R6177o4265p389P7227
1733D06764q9842M4723P9269J0885j55347L7035q5894P7508M4915m341N1042O037
1721D22754N6364q1981l5260n6308q0594J48659k1518Q180J2509j01071k901J75916
1709D44749M497q1321p704k0354J6208k7660J3025N1698K4656R9766m1468j36096
1697C39996j22071J38416J931j18258J3377o9596l0382J50997n4675k7312L9013
1686B61436l74Q5528n7014P1472k4902r482m9939j5618n2991j46849R1239n6118
1674I6388k1110J21412L1190j05256J06914M7390r1779M9323j49873Q8490l7597
1663A35492J05891J55048J2106n4885M8234q8859k4385k135J45873j124j79234
$$ y = [316626, 280549, 192176, 248821, 184339, 108615, 204851, 249281, 305014, 401191, 336926, 329537, 406764, 316922, 361645, 440914, 451799, 296452, 333487, 247593, 325101, 370016, 365675, 416717, 422754, 479118, 397137, 361877, 305569, 224975, 373634, 352116, 360296, 372805, 271734, 268833, 444749, 449246, 367925, 360221, 339867, 356075, 328415, 341440, 393138, 417794, 517560, 476092, 339996, 217925, 356341, 358272, 240014, 253391, 183795, 153413, 304410, 249735, 222423, 261436, 261062, 346590, 289576, 361048, 336146, 326664, 276725, 261107, 208116, 61267, 152506, 96388, 75278, 196690, 227880, 122624, 229538, 276928, 185149, 234472, 84599, 173089, 135492, 241383, 396431, 408537, 353652, 401886, 313027, 288642, 286507, 432380, 431256, 252022]
1652B52022M9379o1916J41644K958l3112K5992l1300j6126r4351R202r7396K1745
1640A68741J18596N0089m3677J3478M162r012O5537o2844J2908L73j4820r868
1628B93663Q1890L3140q5284j04530k8928J03790n9401j9419J72066m4884O0566
1617D02669m9368o7824P8188o6892l1563q8349J50369K5153k4185N0535m9365
1606C29368J8134m7573j1347k2408m2261O3297L7812J17883p6860l401j36179
1595B26465n589L9655K231N2567P8717m6804q2242n0528N7691J167j4004N8244
1583C17570o7970m2033l6968P3672o5586J04495J0324J13782N8315j37919p7896
1572B49786O208K7869j4719J5189j8091O6752m0561k1681L0767q4311r6772Q2669
$$ y = [252022, 301401, 239485, 381129, 384087, 350975, 376967, 345667, 329541, 235190, 244392, 146996, 168741, 287337, 337426, 293749, 307227, 311389, 302377, 367914, 305070, 317978, 318351, 303531, 293663, 375553, 408693, 323409, 218879, 189951, 293741, 234340, 214921, 386987, 342103, 402669, 353301, 285477, 363665, 296773, 265210, 176861, 327230, 352383, 328198, 378733, 329368, 347502, 299929, 288582, 266174, 223913, 287210, 325022, 442905, 366045, 362644, 226465, 220876, 260531, 262762, 315329, 394046, 347242, 265000, 214472, 272163, 273330, 259326, 317570, 249600, 207567, 170599, 244271, 178685, 283180, 293504, 407286, 465601, 327682, 249786, 255994, 283863, 269144, 284333, 266242, 332994, 292433, 270752, 301519, 217208, 120436, 203105]
1560B03105N4291m6374K9634L1954m0141j8855o3761O6705R1029j37007k9287
1549A41293J53472J6113J65894p9738j61883K6344l9218L8073k222R3506O3356
1538D14990q5817o8626l1368j23160M6453J9530L426Q4495j1042k1255n0863j3788
1526A62975Q8284q5942l7140M1869Q3385j4764O557K0979J5415k1302K0577p3106
1514B07787N7740J939j9669p7195j618L8768k7489N3812M9698k0546Q654q8580
1502A83301n0172r1462N4358J04195N3615N9185J4371m6921J2432P4664K7091
1491C94657n9555q157M2908J5903m7679J3000q5149P851j73555l9355J66695J41636
1479C69200J03496o7141m4309k31481Q8971J70097j6953j01317n6910K6092Q8730
$$ y = [203105, 257396, 211022, 240656, 272610, 232469, 213614, 149853, 216558, 307587, 170580, 141293, 294765, 310878, 476772, 397034, 235151, 261495, 222277, 260350, 258128, 351634, 414990, 329173, 260547, 229179, 106019, 152472, 172002, 175428, 259923, 248881, 227626, 176763, 162975, 251259, 165317, 128177, 170046, 253431, 238667, 245224, 266203, 281618, 260316, 280893, 207787, 265527, 267466, 247797, 170602, 168984, 207752, 180263, 234075, 283773, 263227, 271881, 183301, 133129, 41667, 96025, 200220, 253835, 313020, 327391, 280470, 292902, 367566, 394657, 335102, 326945, 369853, 385756, 338077, 351077, 265928, 273779, 100224, 60869, 227564, 369200, 472696, 405555, 361246, 129765, 218736, 388833, 371880, 270563, 213653, 239745, 328475]
1468C28475j38044o9845R5562P7805j87832J8540J65988J00932m347p4221J1893
1457C24906m0773j09501M0807o8764K5147J34062r3229K321J01385o2973l1213
$$ y = [328475, 190431, 120586, 216148, 293953, 106121, 124661, 290649, 391581, 387234, 313013, 324906, 284133, 174632, 215439, 146675, 171822, 305884, 212655, 214976, 316361, 253388, 222175]
$$ [...]
##END NTUPLES=NMR SPECTRUM
##END=
