##TITLE=1H_DE-80H_X3
 200.13MHz, d2o
 8 sc
 
 19ns.26.2.2025
##JCAMPDX= 6.0         $$ Bruker NMR JCAMP-DX V2.0
##DATA TYPE= NMR SPECTRUM
##DATA CLASS= NTUPLES
##ORIGIN= UXNMR, Bruker Analytische Messtechnik GmbH
##OWNER= pz
$$ XWIN-NMR		Version 3.5
$$ Thu Jul  9 11:13:08 2026 Russian Standard Time (UT+4h)  Yarkov@DPX200
##.OBSERVE FREQUENCY= 200.1313
##.OBSERVE NUCLEUS= ^1H
##.ACQUISITION MODE= SIMULTANEOUS
##.ACQUISITION SCHEME= undefined
##.AVERAGES= 8
##.DIGITISER RES= 18
##SPECTROMETER/DATA SYSTEM= spect
##.PULSE SEQUENCE= zg30
##.SOLVENT NAME= DMSO
##.SHIFT REFERENCE= (INTERNAL, DMSO, 0, 15.5023)
##AUDIT TRAIL= $$ (NUMBER, WHEN, WHO, WHERE, WHAT)
$$ ##TITLE= Audit trail, XWIN-NMR		Version 3.5
$$ ##JCAMPDX= 5.01
$$ ##ORIGIN= Bruker BioSpin GmbH
$$ ##OWNER= Yarkov
$$ C:/Bruker/XWIN-NMR/data/yarkov2/nmr/H-C/1/pdata/1/auditp.txt
$$ ##AUDIT TRAIL=  $$ (NUMBER, WHEN, WHO, WHERE, WHAT)
(   1,<2026-07-09 11:12:27.09 +0400>,<Yarkov>,<DPX200>,
      <created by zg, POWCHK disabled, PULCHK disabled
       configuration hash MD5:
       00 E9 B6 7A A2 85 ED C7 34 08 36 98 17 FE 4E 26
       data hash MD5: 16K
       4A 74 80 FD C7 F8 C1 EF E8 0A 7B 95 3F 15 83 22>)
(   2,<2026-07-09 11:12:30.67 +0400>,<Yarkov>,<DPX200>,
      <Start of raw data processing
       efp BC_mod = 2 LB = 0.25 FT_mod = 6 PKNL = 1 PHC0 = -7253.948 PHC1 = 6.42196 SI = 16K 
       data hash MD5: 16K
       DF 1E BC 7B BE 50 27 79 22 19 3E DE B9 0B D2 DE>)
$$ ##END=
$$ 
$$ hash MD5
$$ 91 72 45 3E 52 E1 01 6D 8D 39 5B DC 2D B5 E2 E7
##$RELAX= 
##$RELAX= 
##$RELAX= 
##$RELAX= 
##$RELAX= 
##$RELAX= 
$$ Bruker specific parameters
$$ --------------------------
##$DU= <C:/Bruker/XWIN-NMR>
##$EXPNO= 1
##$NAME= <H-C>
##$PROCNO= 1
##$TYPE= <nmr>
##$USER= <yarkov2>
##$AMP= (0..31)
100 100 100 100 100 100 100 100 100 100 100 100 100 100 100 100 100 100 
100 100 100 100 100 100 100 100 100 100 100 100 100 100 
##$AQSEQ= 0
##$AQ_mod= 1
##$AUNM= <au_zg>
##$AUTOPOS= <>
##$BF1= 200.13
##$BF2= 200.13
##$BF3= 200.13
##$BF4= 200.13
##$BF5= 200.13
##$BF6= 200.13
##$BF7= 200.13
##$BF8= 200.13
##$BYTORDA= 1
##$CFDGTYP= 0
##$CFRGTYP= 5
##$CHEMSTR= <none>
##$CNST= (0..31)
1 1 145 1 1 1 1 1 1 1 1 1 1 1 1 1 1 1 1 1 1 1 1 1 1 1 1 1 1 1 1 1 
##$CPDPRG= <>
##$CPDPRG1= <>
##$CPDPRG2= <>
##$CPDPRG3= <>
##$CPDPRG4= <mlev>
##$CPDPRG5= <mlev>
##$CPDPRG6= <mlev>
##$CPDPRG7= <mlev>
##$CPDPRG8= <mlev>
##$CPDPRGB= <>
##$CPDPRGT= <>
##$D= (0..31)
0 0.7 0 0 0 0 0 0 0 0 0 0.03 0 0 0 0 0 0 0 0 0 0 0 0 0 0 0 0 0 0 0 0 
##$DATE= 1783581146
##$DBL= (0..7)
120 120 120 120 120 120 120 120 
##$DBP= (0..7)
150 150 150 150 150 150 150 150 
##$DBP07= 0
##$DBPNAM0= <>
##$DBPNAM1= <>
##$DBPNAM2= <>
##$DBPNAM3= <>
##$DBPNAM4= <>
##$DBPNAM5= <>
##$DBPNAM6= <>
##$DBPNAM7= <>
##$DBPOAL= (0..7)
0.5 0.5 0.5 0.5 0.5 0.5 0.5 0.5 
##$DBPOFFS= (0..7)
0 0 0 0 0 0 0 0 
##$DE= 6
##$DECBNUC= <off>
##$DECIM= 32
##$DECNUC= <off>
##$DECSTAT= 4
##$DIGMOD= 1
##$DIGTYP= 9
##$DL= (0..7)
0 120 120 120 120 120 120 120 
##$DP= (0..7)
$$ [...]
##$SUBNAM2= <"">
##$SUBNAM3= <"">
##$SUBNAM4= <"">
##$SUBNAM5= <"">
##$SUBNAM6= <"">
##$SUBNAM7= <"">
##$SUBNAM8= <"">
##$SUBNAM9= <"">
##$SW= 18.0517328524113
##$SWIBOX= (0..15)
0 0 2 0 0 0 0 0 0 0 0 0 0 0 0 0 
##$SW_h= 3612.71676300578
##$TD= 16384
##$TD0= 1
##$TE= 0
##$TE2= 300
##$TE3= 300
##$TEG= 300
##$TL= (0..7)
0 120 120 120 120 120 120 120 
##$TP= (0..7)
150 150 150 150 150 150 150 150 
##$TP07= 0
##$TPNAME0= <>
##$TPNAME1= <>
##$TPNAME2= <>
##$TPNAME3= <>
##$TPNAME4= <>
##$TPNAME5= <>
##$TPNAME6= <>
##$TPNAME7= <>
##$TPOAL= (0..7)
0.5 0.5 0.5 0.5 0.5 0.5 0.5 0.5 
##$TPOFFS= (0..7)
0 0 0 0 0 0 0 0 
##$TUNHIN= 0
##$TUNHOUT= 0
##$TUNXOUT= 0
##$USERA1= <user>
##$USERA2= <user>
##$USERA3= <user>
##$USERA4= <user>
##$USERA5= <user>
##$V9= 5
##$VALIST= <valist>
##$VCLIST= <CCCCCCCCCCCCCCC>
##$VD= 0
##$VDLIST= <DDDDDDDDDDDDDDD>
##$VPLIST= <PPPPPPPPPPPPPPP>
##$VTLIST= <TTTTTTTTTTTTTTT>
##$WBST= 1024
##$WBSW= 4
##$XGAIN= (0..3)
0 0 0 0 
##$XL= 0
##$YL= 0
##$YMAX_a= 251881
##$YMIN_a= -212469
##$ZGOPTNS= <>
##$ZL1= 120
##$ZL2= 120
##$ZL3= 120
##$ZL4= 120
##$ABSF1= 0
##$ABSF2= 0
##$ABSG= 0
##$ABSL= 0
##$ALPHA= 0
##$AQORDER= 0
##$ASSFAC= 0
##$ASSFACI= 0
##$ASSFACX= 0
##$ASSWID= 0
##$AUNMP= <proc_1d>
##$AZFE= 0.1
##$AZFW= 0.1
##$BCFW= 0
##$BC_mod= 2
##$BYTORDP= 0
##$COROFFS= 0
##$CY= -3
##$DATMOD= 1
##$DC= 0
##$DFILT= <>
##$DTYPP= 0
##$F1P= 0
##$F2P= 0
##$FCOR= 1
##$FTSIZE= 16384
##$FT_mod= 6
##$GAMMA= 0
##$GB= 0
##$INTBC= 1
##$INTSCL= 3.241238e-09
##$ISEN= 128
##$LB= 0.25
##$LEV0= 0
##$LPBIN= 0
##$MAXI= 10000
##$MC2= 0
##$MEAN= 0
##$ME_mod= 0
##$MI= 1.114404
##$NCOEF= 0
##$NC_proc= -6
##$NLEV= 6
##$NOISF1= 3.799351
##$NOISF2= 2.8
##$NSP= 0
##$NTH_PI= 0
##$NZP= 0
##$OFFSET= 15.50229
##$PC= 1
##$PHC0= -7253.948
##$PHC1= 6.42196
##$PH_mod= 1
##$PKNL= yes
##$PPARMOD= 0
##$PSCAL= 0
##$PSIGN= 0
##$REVERSE= no
##$SF= 200.130003884246
##$SI= 16384
##$SIGF1= 3
##$SIGF2= 2
##$SINO= 0.751879
##$SIOLD= 32768
##$SREGLST= <19F.Aceton>
##$SSB= 0
##$STSI= 16384
##$STSR= 0
##$SW_p= 3612.71676300578
##$SYMM= 0
##$S_DEV= 0
##$TDeff= 16384
##$TDoff= 0
##$TI= <>
##$TILT= no
##$TM1= 0
##$TM2= 0
##$TOPLEV= 0
##$USERP1= <user>
##$USERP2= <user>
##$USERP3= <user>
##$USERP4= <user>
##$USERP5= <user>
##$WDW= 1
##$XDIM= 16384
##$YMAX_p= 480165932
##$YMIN_p= -803030
$$ End of Bruker specific parameters
$$ ---------------------------------
##NTUPLES= NMR SPECTRUM
##VAR_NAME=  FREQUENCY,     SPECTRUM/REAL,   SPECTRUM/IMAG
##SYMBOL=    X,             R,               I
##VAR_TYPE=  INDEPENDENT,   DEPENDENT,       DEPENDENT
##VAR_FORM=  AFFN,          ASDF,            ASDF
##VAR_DIM=   16384,         16384,           16384
##UNITS=     HZ,            ARBITRARY UNITS, ARBITRARY UNITS
##FACTOR=    0.220516191357247, 1,           1
##FIRST=     3102.47331229181, 0,            0
##LAST=      -510.243450713971, 0,           0
##MIN=       -510.243450713971, -803030,     0
##MAX=       3102.47331229181, 480165932,    0
$$ Real data points
##PAGE= N=1
##DATA TABLE= (X++(R..R)), XYDATA
$$ [...]
6133a11468k3627l2184N0925Q9511j6324j5819j06738p1424L5253J7832P5994
6122a08069O443l3385k3112J1280O0574k3334l9541l5324N3441m2881p7603R8812
6110a52699J8259L8284R8004n5901l3586L2598M6392k2369m4398n8163M1237k6320
6098a18662N9750l5844j7026l1661n6005J8749M8779L8306o9909o52O967R0259
6086f6949m3615m8142j8708K8858J0126M4494N465l5732q536m5068O4793k936
6074a15950Q2116R438L2004m0274l851j6935n1245k997N435p1628n0846Q0382
6062a44351n742j9754L2071N4275l33r8267J3859R7497l7418k9273k0660M9690
6050a08406N6911m7898l9014o7347N2784P3730J8117q4340l1690K8812l5468k899
$$ plain form
6133 -111468 -135095 -167279 -116354 -26843 -43167 -58986 -165724 -237148 -201895 -184063 -108069
6122 -108069 -101626 -135011 -158123 -146843 -86269 -109603 -149144 -184468 -131027 -173908 -251511 -152699
6110 -152699 -134440 -96156 1848 -54053 -87639 -55041 -8649 -31018 -75416 -133579 -92342 -118662
6098 -118662 -58912 -94756 -111782 -143443 -199448 -180699 -131920 -93614 -163523 -164175 -157208 -66949
6086 -66949 -110564 -158706 -177414 -148556 -138430 -93936 -88471 -124203 -132739 -177807 -113014 -115950
6074 -115950 -33834 -24396 7608 -32666 -36517 -53452 -104697 -107694 -102259 -173887 -224733 -144351
6062 -144351 -150093 -169847 -137776 -83501 -83834 -182101 -168242 -70745 -108163 -137436 -158096 -108406
6050 -108406 -51495 -99393 -138407 -205754 -152970 -79240 -61123 -145463 -177153 -148341 -183809 -186708
6038a86708Q0109M9348J555j5006L7942r872p9500n0654J00598j4086o1827Q768
6026a39333L2014L4078p4485n3757P6096J2666m6747N345j6578K0298K4761N3473
6014g2169L7350j11708r2109R4590L8506o7651j3311R2137l0979j9773M1304P430
6002i6383p8984O23R8665j3269l9237l916N7734j8809j6034P02k0561O7875o7103
5989a28697N538M078O254L989J5715n3080J4804O041P273j8123K2124k2313M0219
5976i6178r235l7917M9475Q7459K634r3916j4844k5836k4657K3495K9757N1827
5964e7936P707n4816j9154n777R8162K0323l2874j1788N9331l5714l9134L6840
5952c4830p9803M602l3152K5878N1789L088L4286N2302m8808p3270l1375n735
$$ plain form
6038 -186708 -106599 -57251 -55696 -70702 -32760 -42632 -122132 -172786 -72188 -86274 -148101 -139333
6026 -139333 -107319 -73241 -147726 -201483 -125387 -112721 -159468 -154123 -170701 -150403 -125642 -72169
6014 -72169 -34819 -146527 -238636 -144046 -105540 -173191 -186502 -94365 -125344 -145117 -103813 -96383
6002 -96383 -175367 -174744 -76079 -89348 -128585 -132501 -74767 -93576 -109610 -108908 -129469 -61594 -128697
5989 -128697 -123159 -119081 -112827 -108838 -93123 -146203 -131399 -125358 -118085 -136208 -114084 -136397 -96178
5976 -96178 -105413 -143330 -93855 -6396 -3762 -97678 -112522 -138358 -163015 -139520 -109763 -57936
5964 -57936 -50229 -105045 -124199 -129976 -31814 -11491 -44365 -56153 3178 -32536 -71670 -34830
5952 -34830 -114633 -110031 -143183 -117305 -65516 -62428 -28142 24160 -24648 -97918 -129293 -135028
5940a35028M4343q4150J6155J06455K8749n4734m1885q010P8027o5595J0908L9076
5928f5689L6325m0121n8086K2324p0034M0511K6537k7758o8132K7402N2638J4832
5916a09251j2127R5567k6140q5367N2582J8k841p2647J5059Q1582m1724j6651
5904a21940k3603M3137Q4320p0457l6650l7103n598M6813Q2232m5160l5326P988
5892a11347N6166j1066j9183K6111K0503L0587l5447j9628l1429M8536J0690L4671
5880h36J5850q3910J0642N2637n7573l2692j1864J3724m811j0587K2392q837P4458
5867b1407M179n4494m9779l4554O1156M0934m052l9402Q4217N0897o3875l4679
5855f0859r110r797q559J943N0711K8742q427L3894k4745P4452k8953M2004j0631
$$ plain form
5940 -135028 -90685 -174835 -158680 -52225 -23476 -78210 -120095 -128105 -50078 -115673 -104765 -65689
5928 -65689 -29364 -69485 -127571 -105247 -175281 -134770 -108233 -135991 -204123 -176721 -124083 -109251
5916 -109251 -121378 -25811 -51951 -137318 -84736 -84718 -87559 -160206 -145147 -63565 -105289 -121940
5904 -121940 -145543 -102406 -18086 -88543 -125193 -162296 -167894 -121081 -38849 -84009 -119335 -111347
5892 -111347 -55181 -66247 -85430 -59319 -38816 -8229 -43676 -63304 -94733 -46197 -35507 -836
5880 -836 15014 -68896 -58254 -5617 -63190 -95882 -107746 -94022 -98833 -109420 -87028 -95865 -21407
5867 -21407 -17228 -71722 -121501 -156055 -94899 -53965 -58017 -97419 -13202 37695 -26180 -60859
5855 -60859 -69969 -79766 -88325 -86382 -35671 -6929 -15356 18538 -6207 68245 39292 81296 70665
5842G0665l3041k9729J1837Q9691r699o55m8947j8598K8968k6784J4636K1560
5830F9904l8466L8959J6942m3839o7556J9146q432q031O1881m3222p795J3974
5818C465O2763j1013o3278Q3863O1859o2119K0843J3088M6015K5747j5884m2364
5806A22985n7890K2894N0511Q1156K493J6568k1336j0669J4932m3811M2630L2871
5794B53334K9910L8998K9115k6115K3978L6934K3470j3376k6647M3423L4428k4427
5782D23025k2906R5783P2439j2539k7089P1948J22288M7684J37088J54495L4412
5771A096628M3644J48254K67910K84660L35361L65830M11800N51270J014281J718109
5761F237747K579274L673128L868361K340982L33453p92017j868257k523091k292436
$$ plain form
5842 70665 37624 7895 19732 109423 99724 99069 50122 31524 60492 33708 48344 69904
5830 69904 31438 70397 87339 43500 -24056 -4910 -13342 -21373 40508 -2714 -10509 3465
5818 3465 66228 55215 -8063 75800 137659 75540 96383 109471 155486 181233 165349 122985
5806 122985 65095 87989 138500 219656 222149 238717 217381 206712 221644 177833 220463 253334
5794 253334 283244 322242 351357 325242 349220 386154 409624 396248 369601 413024 447452 423025
5782 423025 400119 495902 568341 555802 528713 600661 722949 770633 907721 1062216 1096628
5771 1096628 1140272 1288526 1556436 1841096 2176457 2542287 2954087 3505357 4519638 6237747
5761 6237747 8817021 12490149 16358510 18699492 19032945 18240928 16372671 13849580 11557144
5752A1557144k041480j874292j801554j362458r85628p07195n08484k81654k80640
5743A713759k22359k36924j04590j01137r2544j07301j3591J9577l1803q2834
5733G40253J4578k5257p8541m6935R177j4225r4494P58M9588m3115m9897p4746
5721C87144J3183m8349o7137K8057L6034Q3239l7264K4716j04609l2032J27849
5710D10831l4160p476j463m7559k7367m2509Q4731L5827J7729p5382M6728j0473
5698C49457q4521l5158R217O2480j8801l2727k9596N3283L6128r405p6002J4227
5686B38582n722l7749R4972J8245n3750n1823M1025N7865n1786n0711R4222L0885
5674C24255l6124p4221k1333p1958R481N7588M2044m6081o965J6119N1989l4520
$$ plain form
5752 11557144 9515664 7641372 5839818 4477360 3491732 2784537 2276053 1994399 1713759
5743 1713759 1491400 1254476 1149886 1048749 956205 848904 835313 854890 823087 740253
5733 740253 754831 729574 651033 604098 613275 599050 504556 505314 554902 511787 461890 387144
5721 387144 400327 351978 284841 312898 348932 432171 394907 419623 315014 282982 410831
5710 410831 376671 369195 367732 320173 292806 250297 335028 370855 388584 313202 359930 349457
5698 349457 264936 229778 238995 301475 282674 249947 220351 273634 309762 300357 224355 238582
5686 238582 232860 195111 290083 308328 254578 202755 243780 301645 249859 199148 293370 324255
5674 324255 288131 213910 192577 120619 130100 187688 229732 183651 176686 192805 244794 210274
5662B10274j9898n0596o104J3597K1265J779k0164L3022m4607J7891L4521m666
5650A86314J2962n7624O0722K7487l1865j8803L4080l3615L696K9312N3232Q168
5638B74066j02167M3101J8404J3354r658p211P9858J0742l0518m6246j3297L5215
5626B65643M0882J6704p6253K6466K1041J1538l1821J3372P5508J9116n4966Q4091
5614D11321j3934k298N5518M0495M5056P1248j5093Q2124O7710m803L3342l6032
5602G34654J1713j7176K8455L1622j6989L2958J23216R5426k3493p5168K448m1664
5590H86002j02382N891J9289K8165l2178l2195K7150Q5431p7857k3788Q6341L6053
5578I05922m8314k729J03600k0465K3537K3193M4896J4186K6263N9477M9003J7249
$$ plain form
5662 210274 190376 139780 133676 147273 168538 170317 150153 183175 138568 156459 190980 186314
5650 186314 199276 141652 202374 229861 197996 179193 213273 179658 183354 212666 265898 274066
5638 274066 171899 215000 233404 246758 237100 229889 309747 320489 289971 243725 230428 265643
5626 265643 306525 323229 246976 273442 294483 306021 274200 287572 363080 382196 327230 411321
5614 411321 397387 395089 450607 491102 536158 607406 592313 674437 742147 737344 770686 734654
5602 734654 746367 729191 757646 789268 772279 805237 928453 1023879 1000386 925218 927666 886002
5590 886002 783620 789511 808800 836965 804787 772592 799742 885173 807316 783528 869869 905922
5578 905922 857608 854879 958479 938014 961551 984744 1029640 1043826 1070089 1129566 1178569 1195818
5566A195818K3273N3868R3393R3584r615M7344M1269Q2869P1865R2939M9906J15426
5554A951939J68778J32869J69828P9650J89745J67344K60299L30794M28392M49496
5544D329134M55658N68299P25668J008350J316144J550095J866103K165478K313749
5535A6298678K060063J419940Q73976L23564j34061l70006k81228n6732K96423
5526B0430617M78112O02750L49305k06457p39720j229979j657738j980559k019391
5517A4026940j896640j818927j588583j284872j033954r20405o72782n54291n01047
5508C755439l82968k47411k22121k73396k10038j45296j53727j26161j96462r0421
5498A707438l5997j09181l7690j20173j19210j00389j9506J1832n0263K5948J6171
$$ plain form
5566 1195818 1219091 1272959 1366352 1459936 1450321 1497665 1538934 1621803 1693668 1786607 1836513 1951939
5554 1951939 2120717 2253586 2423414 2503064 2692809 2860153 3120452 3451246 3879638 4329134
5544 4329134 4784792 5353091 6078759 7087109 8403253 9953348 11819451 13984929 16298678
5535 16298678 18358741 19778681 20652657 20976221 20842160 20472154 20190926 20134194 20430617
5526 20430617 20908729 21511479 21860784 21654327 20914607 19684628 18026890 16046331 14026940
5517 14026940 12130300 10311373 8722790 7437918 6403964 5483559 4810777 4256486 3755439
5508 3755439 3372471 3125060 2902939 2629543 2419505 2274209 2120482 1994321 1797859 1707438
5498 1707438 1671441 1562260 1524570 1404397 1285187 1184798 1165292 1177124 1126861 1152809 1168980
5487A168980m9797j6851n7761J4794L6428l8126m0590J8587n6459o4525j8611
5476H96069K4213l4951k2033M9543M714l5786l4557J5967j9150l5046l359M2437
5464H48061o7498n5112N8181m6210J3569M6336N8778n7312p4294K7206M9197M3245
5452H44147j3610n8199m8489n9602J827K585K2368l7687M4353K4920j05986o4186
5440E52441M4065L7646M1769K9488R159k7496m7565K2294M83j2276P640Q6967
5428G44615k0487k5402k3543p3531O4027j0562J7718M1447l123l222P2277j0004
5416G70210k6590k8764M5143N0205K8402M4984l2283N376k0744n6492p4972K8022
5404G32497R1471P6551M8049p24q0918J0700J7285k9067K3678J9608J2521l9753
$$ plain form
5487 1168980 1119183 1102332 1044571 1059365 1095793 1057667 1017077 1035664 979205 914680 896069
5476 896069 920282 885331 863298 912841 917555 881769 847212 863179 844029 808983 805624 848061
5464 848061 780563 725451 783632 737422 750991 797327 856105 798793 724499 751705 800902 844147
5452 844147 830537 772338 723849 664247 666074 668659 691027 653340 697693 722613 616627 552441
5440 552441 596506 634152 675921 705409 714568 687072 639507 661801 662284 650008 657648 744615
5428 744615 724128 698726 675183 601652 665679 655117 672835 714282 711159 707937 780214 770210
5416 770210 743620 714856 759999 810204 838606 883590 851307 856683 835939 779447 704475 732497
5404 732497 823968 900519 948568 947844 866926 877626 894911 865844 889522 909130 921651 881898
5392H81898o557p43M6613J7636K5379P6453m8484r605N7800K0475k0140N6339
5380A097064N580n4251L2117N6032J2399j5572k0026R7835k5657j6298J1870j259
5368A179834L0812M3168k694N5908P65k3939N3717J2130R9335l098K3348J30957
5356A600243m3625Q4542O8077M5361M789N541O8348M0651N0727O5598N4406J40931
5344B185589J46484J01381J4825Q0478R5871O0349J11396J05937J96579J27959
5334C226848Q6138J09289R5147J32206J88710J46252J64442J49180K04480K54446
5324D757138J70057K19136J87116K48568K35322K63777L82221M84382M30869M66428
5314G845014M36589M30487N99674P44523Q57660R51893J279355J491413J766586
$$ plain form
5392 881898 875341 874598 921211 938847 964226 1040679 992195 982590 1040390 1060865 1040725 1097064
5380 1097064 1102644 1048393 1080510 1136542 1148941 1133369 1113343 1211178 1185521 1169223 1181093 1179834
5368 1179834 1210646 1253814 1251120 1307028 1307793 1283854 1337571 1349701 1449036 1445938 1469286 1600243
5356 1600243 1556618 1641160 1709237 1754598 1759387 1764928 1833276 1873927 1924654 1990252 2044658 2185589
5344 2185589 2332073 2433454 2448279 2528757 2624628 2684977 2796373 2902310 3098889 3226848
5334 3226848 3312986 3422275 3517422 3649628 3838338 3984590 4149032 4298212 4502692 4757138
5324 4757138 4927195 5146331 5333447 5582015 5817337 6081114 6463335 6947717 7378586 7845014
5314 7845014 8281603 8712090 9311764 10056287 10913947 11865840 13145195 14636608 16403194
5305A6403194K047066K585934L329608M533864O612030R463348J2496741J4075324
5297G1547109J2545582P786573K256283k019336n200609o225562n450430l293685
5289G1945925l3392L998767P585605Q345177N359190L50297m152475p791918j0152456
5280G5454720j0474735j0049603r262065q159471o946597n570685m177765l068732
5272A7745067k284462j793707j538782j223483j034538p58952o25515m97547n34855
5263G453226m43009l32503m18540m02391l82522l32590l07483k41433j86013j51977
5253D254765j78191m0043j34762j29927p7715j38140j23677m4194j5744p8532
5243C293840j32489j23857j37267o6570q6752p0981l8037p846J1053r541J7172
$$ plain form
5305 16403194 18450260 21036194 24365802 28899666 35511696 44975044 57471785 71547109
5297 71547109 84092691 91879264 94135547 92116211 86915602 80690040 75239610 71945925
5289 71945925 71912533 75911300 83496905 91842082 97201272 97551569 93399094 85607176 75454720
5280 75454720 64979985 54930382 45668317 37508846 30562249 24991564 20813799 17745067
5272 17745067 15460605 13666898 12128116 10904633 9870095 9111143 8485628 7988081 7453226
5263 7453226 7010217 6677714 6259174 5856783 5474261 5141671 4834188 4592755 4406742 4254765
5253 4254765 4076574 4036531 3901769 3771842 3694127 3555987 3432310 3388116 3372372 3293840
5243 3293840 3161351 3037494 2900227 2833657 2746905 2675924 2637887 2630041 2641094 2631553 2648725
5232B648725j23896m7072m7161q5963m555l1313r1668o4505k130o1320M1620R922
5220B140684q2608N811n3761l8185j4568l0781q4169j0320m3933q5625j09039
5209A593506L0524L5164n9798o769p5692r8498m3185j9612j3559j12839N8317
5198A287559q3236n0252M8574Q837o2923l0914P487m4325m6241O559k1920O637
5186A025842o7145n8807K0878j4618K1287J6911l167q0645l34L0084k2553J256
5174H68989J4398l7020k989k4803m0460m9372n7730O268M9243j0258N5292k7332
5162G44226q5740K7545j5130k0309L9724l4707o1708P401j3954L2029j445R343
5150F27275M5093k0154k9832K1680O1669j05997m2571M1816j892O7518k7056L562
$$ plain form
5232 2648725 2524829 2477757 2430596 2344633 2340078 2308765 2217097 2152592 2150462 2089142 2130762 2140684
5220 2140684 2058076 2063887 2010126 1971941 1957373 1926592 1842423 1832103 1788170 1702545 1593506
5209 1593506 1624030 1659194 1599396 1592627 1516935 1418437 1375252 1355640 1342081 1229242 1287559
5198 1287559 1204323 1154071 1202645 1211482 1148559 1117645 1125132 1080807 1034566 1041125 1019205 1025842
5186 1025842 958697 899890 920768 906150 927437 944348 941181 860536 860202 890286 867733 868989
5174 868989 883387 846367 843378 818575 778115 728743 671013 677281 726524 716266 771558 744226
5162 744226 658486 686031 670901 650592 690316 655609 593901 601302 587348 619377 617932 627275
5150 627275 672368 652214 622382 644062 705731 599734 557163 598979 597087 664605 637549 641111
5138F41111p3971q5544P6997j32807k4444L7024P778o0795K6874j5255o9673l3148
5126B94147J31068O1172O447p0510o6471O5146Q3087j394J1181J4682j09606n7613
5114C61336L6857P4157J0631k3467r012r130M3051k3129l1868R35J1278O3337
5102E04976o9175R2901L0551n8468k4038l0287m4839o951J04231k8217p6048k1512
5090C73124K4068l0759n669J30967q6987q770K5577j8076m7050J0843P4083r7406
5078C43945m6644M6266L6111Q9210k8412n812L0885O282K4381K2505j7927J8276
5066E19066O6423m0899j2244L5653L3453K1336n301j8142O2573M6219r8175j4692
5054E95270N4732P400l7900m3545k6209k2294l7446K3972M6204l7538q3770k5256
$$ plain form
5138 641111 567140 481596 558593 425786 401342 438366 446144 385349 412223 396968 327295 294147
5126 294147 425215 486387 492834 422324 355853 420999 504086 502692 513873 528555 418949 361336
5114 361336 398193 472350 482981 459514 450502 441372 484423 461294 429426 430361 441639 504976
5102 504976 435801 528702 559253 500785 476747 446460 401621 394670 498901 470684 394636 373124
5090 373124 397192 366433 360764 491731 404744 395974 421551 403475 356425 367268 441351 343945
5078 343945 297301 343567 379678 468888 440476 434664 465549 471831 496212 518717 500790 519066
5066 519066 585489 544590 532346 567999 601452 622788 617487 599345 661918 708137 609962 595270
5054 595270 650002 657402 619502 575957 549748 527454 490008 513980 560184 522646 438876 413620
5042D13620n678K2027K890P0315k4886r7394k3140m2181M7752l6395k2361M9169
5030C53738J2492N6988m4451k6611p425k3132L6427n4727M775K9180J6390N9811
5018D13455j0999k9410N9258o713J4725K162p0661m6433K1012L2770L9194o3088
5006C55272O4134j2810J8979L4363Q2014l567r3739M7711J20683P9683L624P9203
4994G75550O1781J14175J48348J57171J4990q3127l1132P9701r1151n8283n5810
4983A032213R7920K146n3968j08208k5072j5094o3531P0293Q1262J2796j0785
4972A019972K5865l0946o7024L6443L5770j11580q7678r398m2910n2784P375m5560
4960F77545R778O1073M1790o2827m6502m0235J2713j7791m8178J2550K2484o2485
$$ plain form
5042 413620 407942 429969 432859 503174 478288 380894 357754 315573 363325 326930 304569 353738
5030 353738 366230 423218 378767 352156 344731 321599 358026 303299 308074 337254 353644 413455
5018 413455 402456 373046 432304 425591 440316 442478 371817 325384 346396 379166 418360 355272
5006 355272 419406 406596 425575 459938 541952 538385 444646 492357 613040 692723 696347 775550
4994 775550 837331 951506 1099854 1257025 1272015 1188888 1157756 1237457 1146306 1088023 1032213
4983 1032213 1130133 1132279 1078311 970103 945031 929937 866406 936699 1017961 1030757 1019972
4972 1019972 1045837 1014891 947867 984310 1020080 908500 820822 811424 768514 715730 723105 677545
4960 677545 687323 748396 790186 727359 680857 640622 653335 635544 587366 599916 622400 559915
4948E59915K3089J7632M1346k4254l1931Q7979o1325j4320J03909k3666l7675
4937F40699k5252L1676m9357Q204Q9975l2872k5055k398l0923m0498J9629m9916
4925E33912J4742K9290j0731M6134L6791R9798o2390O7696j5867o8317N4204J2465
4913G37727o8099K4573L124R319J8738K4351K7738K7103L5218k8114L2284M2880
4901H86842m6343m7455M2168L2380k6604J1144j0140j6025j4661o5992O9870K1517
4889H36701N1266N8173L8761k3750P094k3107O844m339l1308j200K6263L2827
4877I74225l581J5048j1571j01590P5839L9295N2137K0584P833K1280L1251K7336
4865A148086l1868N8909j8542k4541N4053R6684O8426k6639j697M4339O1445P3548
$$ plain form
4948 559915 583004 600636 641982 617728 585797 673776 612451 598131 702040 678374 640699
4937 640699 615447 647123 597766 605970 695945 663073 638018 635620 604697 564199 583828 533912
4925 533912 548654 577944 567213 613347 650138 749936 687546 755242 739375 671058 725262 737727
4913 737727 669628 694201 697325 706644 725382 749733 777471 804574 839792 811678 843962 886842
4901 886842 840499 793044 835212 867592 840988 852132 841992 825967 811306 745314 815184 836701
4889 836701 887967 946140 984901 961151 968245 945138 951982 947643 916335 915135 941398 974225
4877 974225 970644 985692 974121 872531 948370 987665 1039802 1060386 1068219 1089499 1120750 1148086
4865 1148086 1116218 1175127 1156585 1132044 1186097 1282781 1351207 1324568 1322871 1367210 1428655 1502203
4853A502203K15229R1857P2069N2372P9188o487n3929k5349l8389N0460q7445
4842A851779p951j9889n2339P1738Q7809L0311J02410J19327J11647J26589K55825
4831B677256K38414K55686L72422N70546R98214J519746K242893K711996K343195
4822A3930368Q61743k22856q46181j666233j739209j551410j415820j278601j077584
4813D994217q06449o34940l92088j66492o7586j34913k15378j15820k9074j05645
4803B325832o8431p4841n7919J2992j1625O560m2116o1667l9029L8997J66k2206
4791B006713o518j0800k3682K8839n041J0506M3816m1585P918O1646q7096L5461
4779B020177O7762k9705J4877P8553N0448o961L9390m3530J1203l486l401L9446
$$ plain form
4853 1502203 1717432 1809289 1881358 1933730 2012918 2006431 1952502 1927153 1888764 1939224 1851779
4842 1851779 1843828 1823939 1771600 1843338 1931147 1961458 2063868 2183195 2294842 2421431 2677256
4831 2677256 2915670 3171356 3543778 4114324 5112538 6632284 8875177 11587173 13930368
4822 13930368 14792111 14569255 13723074 12056841 10317632 8766222 7350402 6071801 4994217
4813 4994217 4187768 3552828 3160740 2994248 2926662 2791749 2576371 2460551 2431477 2325832
4803 2325832 2257401 2182560 2124641 2137633 2126008 2132568 2090452 2028785 1989756 2028753 2028919 2006713
4791 2006713 2000195 1989395 1965713 1994552 1989511 2000017 2043833 2002248 2010166 2071812 1984716 2020177
4779 2020177 2087939 2058234 2073111 2151664 2202112 2195151 2234541 2191011 2202214 2198728 2195327 2234773
4767B234773m3670M6173J9708J1109r295P7325P5075j6803L6404L7045o7012m1226
4755B359606M4151K1392P0983k9372K1349P8818J3496p6780M5390K9979m5920
4744B533092O8494q39O4354N5615P7663M4134J0957J9328R281J6608l7539o620
4732B854528R9541J6918j8745O3381M9477N3100j0039Q2872J2392J4808j5794
4721C202439n6139R2647O7079O0183J5102K2184j4616j5355K4265R4998N9614
4710C552401K1384Q6110L2843M6432O2397L9641P605N2200J44254M1190Q652m1692
4698D053417N7246Q6547M1333Q8991J13018R0852m0281j4042O0544O5808O5205
4687D668638N3091P459K8539N2659J14892O6773L3278L9530P5309M7075Q8857
$$ plain form
4767 2234773 2191103 2237276 2256984 2268093 2258798 2336123 2411198 2394395 2430799 2467844 2400832 2359606
4755 2359606 2403757 2425149 2496132 2466760 2488109 2566927 2580423 2503643 2549033 2579012 2533092
4744 2533092 2601586 2600747 2665101 2720716 2798379 2842513 2853470 2872798 2882079 2898687 2861148 2854528
4732 2854528 2954069 2970987 2952242 3015623 3065100 3118200 3108161 3191033 3203425 3218233 3202439
4721 3202439 3146300 3238947 3306026 3366209 3381311 3403495 3388879 3373524 3397789 3492787 3552401
4710 3552401 3573785 3659895 3692738 3739170 3801567 3841208 3848813 3901013 4045267 4086457 4095109 4053417
4698 4053417 4110663 4197210 4238543 4327534 4440552 4531404 4491123 4477081 4537625 4603433 4668638
4687 4668638 4721729 4729188 4757727 4810386 4925278 4992051 5025329 5064859 5140168 5187243 5276100
4676E276100M6678K2652P1992Q7438L7866k5605Q9583J69300O4240L5591J01944
4665E977779O3626J49051R7519J3361R8986Q8273N8131O3347R5460P3437Q2619
4654F861589M2441P8153L7537J00103J21924P8351J1814J50006J57819M4810P0506
4643G755053M7807R7744J50205Q0809J23100M9581P5495J94289J64123J64239
4633H902445J66703K38549K16558K47790L77201O71620R28169Q80211O56184K59592
4623A3545022k828k98072m48826l08435l46532j56487k34668j41834L30J58483
4613A1766153K29893J95316K96688M62161N38872M73954M25791L94273L07502
4604A5090603K82990M81500N25643O20629P36273O58213L51788J84026J84213
$$ plain form
4676 5276100 5322778 5345430 5417422 5504860 5542726 5517121 5606704 5776004 5840244 5875835 5977779
4665 5977779 6041405 6190456 6287975 6301336 6400322 6488595 6546726 6610073 6705533 6778970 6861589
4654 6861589 6904030 6982183 7019720 7119823 7241747 7320098 7331912 7481918 7639737 7684547 7755053
4643 7755053 7802860 7900604 8050809 8131618 8254718 8304299 8379794 8574083 8738206 8902445
4633 8902445 9069148 9307697 9524255 9772045 10149246 10820866 11749035 12629246 13285430 13545022
4623 13545022 13542194 13244122 12795296 12486861 12140329 11983842 11749174 11607340 11607670 11766153
4613 11766153 11996046 12191362 12488050 12950211 13489083 13963037 14388828 14783101 15090603
4604 15090603 15373593 15855093 16380736 17001365 17737638 18395851 18747639 18931665 19115878
4595A9115878J87394L98564O03654O73107N02970K35365o2669k64464l84983l50645
4585B0654171k14909j0740l0142j27454l55676m25055m66029n12562m84292l54144
4575A7673168j74414k90782l12430l51603m60075l11535k63249k96468j17573
4566A5095039k55149j43858K6494J14341K46491K46990L80907M73840M87880O01615
4556A7274590N98771M61747M60452M59019M01773L40822L99272N56409O87861
4547B1640716Q17310P39484N02575M2300j12152l94168m76074n39930n14329m62489
4537B1243243l76592l28304l01120l60336m81143n08582n53074n03572n53091
4528A7277429m34823l55848l50894k61168j61683n7504j13287o1174J92027J25391
$$ plain form
4595 19115878 19303272 19701836 20305490 20978597 21481567 21716932 21654263 21389799 21004816 20654171
4585 20654171 20439262 20428522 20398380 20270926 19915250 19490195 19024166 18511604 18027312 17673168
4575 17673168 17498754 17207972 16895542 16543939 16083864 15772329 15509080 15212612 15095039
4566 15095039 14839890 14696032 14722526 14836867 15083358 15330348 15711255 16185095 16672975 17274590
4556 17274590 17873361 18335108 18795560 19254579 19656352 19997174 20396446 20952855 21640716
4547 21640716 22458026 23197510 23700085 23742385 23630233 23236065 22759991 22220061 21705732 21243243
4537 21243243 20866651 20538347 20237227 19876891 19395748 18887166 18334092 17830520 17277429
4528 17277429 16842606 16486758 16135864 15874696 15713013 15655509 15542222 15481048 15673075 15798466
4518A5798466K07412L05292L67891L65877M24073O70760J058991J497381K043374
4509B2739517K820224L657806L792682K700543J256631J89159l87926o04533m28329
4500C5735774L75618J382572K847877M704617N788376M588674J616461j152932
4492E5887037k472965l487181l924344l623922k982646k136171j157610p289L81260
4483C6476169j61798j304452j983777k347176k628515k675439k575214k264294
4475B0535504k103266j785123j405747j026814o98932o09128n16709m26445m04146
4466A1559194k74558k45469k42460j88034j90190j56945j83530r9427j08599k10775
4456I659207j31002p8566K1067j12625k35493q0963o0463p9005j3008l3284j06756
$$ plain form
4518 15798466 16005878 16311170 16679061 17044938 17469011 18139771 19198762 20696143 22739517
4509 22739517 25559741 29217547 33010229 35710772 36967403 37156562 36768636 36164103 35735774
4500 35735774 36111392 37493964 40341841 45046458 50834834 55423508 57039969 55887037
4492 55887037 53414072 49926891 46002547 42378625 39395979 37259808 36102198 36094909 36476169
4483 36476169 36314371 35009919 33026142 30678966 28050451 25375012 22799798 20535504
4475 20535504 18432238 16647115 15241368 14214554 13515622 12906494 12389785 11963340 11559194
4466 11559194 11284636 11039167 10796707 10608673 10418483 10261538 10078008 9978581 9869982 9659207
4456 9659207 9528205 9449639 9470706 9358081 9122588 9041625 8981162 8902157 8889149 8855865 8749109
4445H749109n8259M9467J10473J42931O1168n824L9961n7758n6997k76271j93506
4434H504494k04796k43423p2323k15059k75514k18216j53526r9218j45133n2939
4424F824347j19946r8600q7229o0625r8174q0434o1858m1158j24034j22370j19717
4413E810202p7553r6622p2006k5519p1118m7314r7991j16341n6840m1361J9428
4402E126965m8716m4423J6825J2169o7677j46958k030Q787j9020n276q6835j06727
4390D637084k9549j12767o1274n228n3077L7984N7836n8941j0924r5613n0948
4379D254583k0237q2054o9613k9352r8366p1585r1412k5083n7389k3780J9687
4368C705399J2429l5041l6607q6112m9183r885l172p8535l6767n7084k3551k1817
$$ plain form
4445 8749109 8690850 8740317 8850790 8993721 9054889 9049065 9089026 9031268 8974271 8698000 8504494
4434 8504494 8299698 8056275 7983952 7768893 7493379 7275163 7121637 7022419 6877286 6824347
4424 6824347 6704401 6605801 6518572 6457947 6359773 6279339 6217481 6176323 6052289 5929919 5810202
4413 5810202 5732649 5636027 5564021 5538502 5467384 5420070 5322079 5205738 5148898 5107537 5126965
4402 5126965 5078249 5033826 5050651 5062820 4995143 4848185 4846155 4854942 4835922 4830646 4743811 4637084
4390 4637084 4607535 4494768 4433494 4428266 4375189 4413173 4471009 4412068 4401144 4305531 4254583
4379 4254583 4234346 4152292 4082679 4053327 3954961 3883376 3791964 3766881 3709492 3685712 3705399
4368 3705399 3717828 3682787 3646180 3560068 3510885 3501000 3497828 3419293 3382526 3325442 3301891 3280074
4356C280074m2413J1988m3245R926o9918k0537m739k3915K6421J4366m7024k0273
4344C070711j6121p8522k9701m0629l8255L7737M0609N8375q6335n0531o6735
4333B800603k4571J0092m75n6193k7294k8035J6731k0313r284j4388L0164K6317
4321B703354j8139P859j4690M244j06139N0326l921q0963L4213L5762n7832m095
4309B549979K4463n242K3155L8428K1258L5740m7848n9022J8509L3130k412k8054
4297B602084O162l8471R0478L0946q110M8860J06470L4406m298J10677O8314Q3425
4285C130943J0605N2110J43281Q7507K6341N5414J06124J12169J36758K02089
4275D063341J52641K40097K46929K41353Q0713K20976K10681J49433K15787K54734
$$ plain form
4356 3280074 3237661 3249649 3206404 3216330 3146412 3125875 3121136 3097221 3123642 3138008 3090984 3070711
4344 3070711 3054590 2976068 2946367 2905738 2867483 2905220 2945829 3004204 2917869 2867338 2800603
4333 2800603 2776032 2786124 2785649 2729456 2702162 2674127 2690858 2670545 2661261 2646873 2677037 2703354
4321 2703354 2685215 2693074 2678384 2682628 2576489 2626815 2622894 2541931 2576144 2611906 2554074 2549979
4309 2549979 2574442 2569200 2592355 2630783 2652041 2687781 2639933 2580911 2599420 2632550 2630138 2602084
4297 2602084 2608246 2569775 2660253 2691199 2683089 2731949 2838419 2872825 2868527 2979204 3047518 3130943
4285 3130943 3141548 3193658 3336939 3424446 3450787 3506201 3612325 3724494 3861252 4063341
4275 4063341 4215982 4456079 4703008 4944361 5025074 5246050 5456731 5606164 5821951 6076685
4265F076685K85512K33030L21500M11752N06043N43864N70670O22347O80154O84446
4255A0936003O11515N15983M72475L55077L21208L29614L77827M82187N59780
4246A4961669P34629R71800J109852J233735J270884J178287Q61360N54790K88844
4237B3165850m3726l43933k46930j78984q9934J75548M52658Q35237J130842J297117
4227B6153745J194496Q89187M66647j71467n36097r61737j211255j354308j225640
4218B3243571q09282n35635j91354J38350L91914N41250M59693J68267l17558
4209B3089216p78982j084558j403005j471014j426017j305437j112703q42332
4201A3665168n69736l71519j70160j32459k07279l06830m28388o10245q38179
$$ plain form
4265 6076685 6362197 6595227 6916727 7328479 7834522 8378386 8949056 9571403 10251557 10936003
4255 10936003 11547518 12063501 12535976 12891053 13212261 13541875 13919702 14401889 14961669
4246 14961669 15696298 16668098 17777950 19011685 20282569 21460856 22322216 22877006 23165850
4237 23165850 23122124 22778191 22531261 22352277 22262343 22437891 22890549 23725786 24856628 26153745
4227 26153745 27348241 28237428 28704075 28532608 27996511 27034774 25823519 24469211 23243571
4218 23243571 22434289 21898654 21707300 21845650 22237564 22778814 23238507 23406774 23089216
4209 23089216 22310234 21225676 19822671 18351657 16925640 15620203 14507500 13665168
4201 13665168 13095432 12723913 12553753 12421294 12214015 11907185 11478797 10868552 10030373
4192A0030373p52658q13325q39611p06051n54789m35221l45472k96289k68886
4183E018071j39623j82518k77275k68932j29970k37607k36466j94137j63988k25740
4173B961815j74167j32106j70667j35860N742m4828j03305o4619j20408l7760
4163A983837o9943P43j2268O743n6266n9614K1726J5085O424l3826p6762j11203
4151A614676r030P119m6391n7075J920J1123j419p2510l0679o1851m053j1582
4139A340248k2975M8468K626m0594m7308J5449m496l7285m6804k7968o8978j5398
4127A094985n9691j9893O9350j5582l3274k3779r251m0717r5789N402Q1016L4143
4115I86920o0326r118J7930j4372r267K3843l0815n9954l8944N4435m2108K0472
$$ plain form
4192 10030373 9277715 8464390 7624779 6918728 6363939 5928718 5583246 5286957 5018071
4183 5018071 4878448 4695930 4418655 4149723 4019753 3782146 3545680 3351543 3187555 2961815
4173 2961815 2787648 2655542 2484875 2349015 2354757 2309929 2206624 2142005 2021597 1983837
4163 1983837 1913894 1914637 1902369 1909112 1852846 1793232 1814958 1830043 1836467 1802641 1725879 1614676
4151 1614676 1605646 1612765 1566374 1509299 1511219 1522342 1520923 1448413 1417734 1355883 1351830 1340248
4139 1340248 1317273 1365741 1368367 1327773 1280465 1295914 1291418 1254133 1207329 1179361 1110383 1094985
4127 1094985 1035294 1015401 1084751 1069169 1035895 1012116 1002865 962148 866359 871761 952777 986920
4115 986920 926594 917476 935406 921034 911767 935610 904795 844841 805897 860332 818224 838696
4103H38696K8545K759k7867r531J2274n14L3571n7473O621J6336m3115L6325K6427
4090H63054K7114k6171p3648l8776K1932L4093J00276o1457m3231J5935M8787
4079H67908k7222l8729o09J3381O0785J6474K1477n5340k269q007L9234N3988
4067I41071k9901o3882l3893N6869N5466l4210J8908M825M2305M6338m3690P3577
4055A033783q486p8487N0276k2439j4414J5357m8764j4927K5439P9175N4378K7902
4043A098793j792L3198o10m7629K304j4575j2144n2546N5536n3465k5655J5995
4031I97410Q994l0013n8982J0979J0584k5020M0348j2690K137o9103k7360l9662
4019H07622j533J5646O8922o7399m0999O661J602M1638m4434L230k3507l9550
$$ plain form
4103 838696 867241 870000 842133 832602 844876 844362 877933 820460 827081 843417 800302 836627 863054
4090 863054 890168 863997 790349 751573 773505 807598 907874 846417 803186 819121 867908
4079 867908 840686 801957 801348 814729 875514 891988 913465 858125 855856 847849 887083 941071
4067 941071 911170 847288 813395 870264 925730 891520 910428 915253 957558 1003896 960206 1033783
4055 1033783 1025297 946810 997086 974647 960233 975590 926826 911899 937338 1016513 1070891 1098793
4043 1098793 1097001 1130199 1129589 1081960 1084264 1069689 1057545 1004999 1060535 1007070 981415 997410
4031 997410 1006404 976391 917409 928388 938972 913952 954300 941610 943747 874644 847284 807622
4019 807622 806089 821735 890657 823258 782259 788920 790522 832160 787726 790956 767449 727899
4007G27899o263J7519m7791k9591j6589n9022K4833m0423j3346L5724L414J9510
3995F15874M2992j8947k8180p022J1562j4346L1361J4520k4222k6652l3348J3277
3983E76869l241R529M8212R5742j4460p1049n9509k7449O2883L5715n9100L576
3971E97718n8191Q666j9273R3198K5672p8520K5053N0448R1731k0941N4358J6556
3959G86475m9269J3366K6523R306n4665j4784O0580J30426N4817J62557K06072
3948A331404M26781M31138L93122K11390l7412k08388j92484j83727k93441k16550
3938A661833j27845k19043j81899r8169m6777J4685O7798O1903J7630N442M7045
3927A202603j1038M028k1056P5596q22l9545J2811M0201K08515K70072K91819
$$ plain form
4007 727899 721636 739155 691364 661773 645184 586162 610995 570572 557226 592950 596364 615874
3995 615874 658866 639919 611739 604717 616279 601933 633294 647814 623592 596940 563592 576869
3983 576869 573628 583157 631369 727111 712651 641602 582093 554644 617527 653242 594142 597718
3971 597718 539527 548193 528920 622118 647790 569270 594323 644771 736502 715561 769919 786475
3959 786475 737206 750572 777095 786401 731736 716952 777532 907958 962775 1125332 1331404
3948 1331404 1758185 2189323 2582445 2793835 2756423 2548035 2355551 2171824 1878383 1661833
3938 1661833 1533988 1314945 1133046 1034877 988100 1002785 1070583 1132486 1150116 1155558 1202603
3927 1202603 1191565 1195593 1174537 1250133 1249311 1209766 1222577 1262778 1471293 1741365 2033184
3916B033184L80219M07010J63219L5863o9779j76569l22283j42265k54612k53059
3906A800928j34536j76477r4758r3794r6779m1027j0987K5002j7942j8529L9561
3895A180662j6039n7424n478j987N9812k651n9929k8552l6807p6017K3860r1711
3883H87739p2452L0778m395j0181J122l4352k0538l0742J8769M4384L6718K1394
3871H68244r5274k1906M57K590O44O3933l3176j3117J9906m907k8678k8587l7285
3858F92844N8609N8209n8824J5894M8267n6928M7672L1386n8960O4018J3633l3125
3846H22695K756M2607j4995N4781o356k3588J7618l563O9778J3806L7843R5410
3834A108792o0208j4673p6020Q6858K9136j5335J00897k6610P22k2234k5853N2657
$$ plain form
3916 2033184 2413403 2820413 2983632 3019495 2949716 2773147 2450864 2308599 2053987 1800928
3906 1800928 1666392 1489915 1395157 1301363 1204584 1163557 1152570 1177572 1159630 1141101 1180662
3895 1180662 1164623 1107199 1101721 1099734 1159546 1156895 1096966 1068414 1031607 955590 979450 887739
3883 887739 815287 846065 841670 831489 832611 798259 777721 746979 765748 810132 846850 868244
3871 868244 772970 751064 751521 754111 754755 818688 785512 772395 792301 787394 758716 730129 692844
3858 692844 751453 809662 750838 766732 814999 758071 805743 837129 778169 842187 855820 822695
3846 822695 825451 868058 853063 907844 901488 877900 895518 891955 961733 975539 1013382 1108792
3834 1108792 1048584 1033911 957891 1044749 1073885 1058550 1159447 1132837 1133559 1111325 1085472 1138129
3822A138129m4086O1581P1663Q4845N4249p5432J0346L8375N9798J7308L1851
3811A448627L4313J63283N2024J5975J30266Q1075J40165K13679O5252J44910
3801B489569J74370K88128K85899L65323M10820M56017N93822N46211N61151N77830
3791F749140N68286M39891M22067K54996K25247K30340N8243p292L1649p2606
3781H899961q8926p605n5181l0401K3634O7740R7638p1137j06383j16285k23062
3770H389993k67682l94018l47638m96069n49668m24417m46249m51647m38751l12177
3760D261677l00638k59345k46126j81309j02375p6576j6010j21493j6626j15688
3750B825491k1084j2950k765k2778p6592K8293n663m8940K7943n7708J2451L5303
$$ plain form
3822 1138129 1094043 1155624 1227287 1312132 1366381 1290949 1301295 1339670 1399468 1416776 1448627
3811 1448627 1482940 1646223 1698247 1714222 1844488 1925563 2065728 2279407 2344659 2489569
3801 2489569 2663939 2952067 3237966 3603289 4014109 4470126 5063948 5610159 6171310 6749140
3791 6749140 7317426 7757317 8179384 8434380 8659627 8889967 8948210 8940918 8972567 8899961
3781 8899961 8811035 8803430 8748249 8717848 8741482 8809222 8906860 8835723 8729340 8613055 8389993
3770 8389993 8122311 7728293 7380655 6884586 6334918 5910501 5464252 5012605 4573854 4261677
3760 4261677 3961039 3701694 3455568 3274259 3171884 3095308 3079298 2957805 2941179 2825491
3750 2825491 2804407 2791457 2788692 2765914 2689322 2717615 2711952 2663012 2690955 2633247 2645698 2681001
3738B681001m6485n7121j17945l3482l9446l4067q564n9n6444p06l0230P2088
3726B328540m4607l1118P6729L2679N2731J1159j4830J7580N8002K0640O2617
3715B570122k7429n0780K2883J11095k2846L4262j3025m9890O0604j4209N5563
3704B676350j5990N7391j842J09284N0295N8607L1877K4463N110j3236J4093L3407
3692C029809l8886q5627J2726N0988K8986l7976K5558j8079Q2044J16351P7542
3681C243436j2147k1312J23215M6674L0131L2965P1369K2549K5919Q6373J12753
3670C761925J54389J27043P4124Q3710J10954J02805J46406J53922J39542J59105
3660E013925Q4125J63455K03823J12960K94949K19951K51862K94264L29783K85926
$$ plain form
3738 2681001 2634516 2577395 2459450 2425968 2386522 2352455 2343891 2343832 2287388 2286682 2256452 2328540
3726 2328540 2283933 2252815 2329544 2362223 2414954 2426113 2411283 2428863 2486865 2507505 2570122
3715 2570122 2542693 2491913 2514796 2625891 2603045 2637307 2624282 2574392 2634996 2620787 2676350
3704 2676350 2660360 2717751 2715909 2825193 2875488 2934095 2965972 2990435 2995545 2982309 2996402 3029809
3692 3029809 2990923 2905296 2918022 2969010 2997996 2960020 2985578 2967499 3049543 3165894 3243436
3681 3243436 3231289 3209977 3333192 3379866 3409997 3442962 3514331 3536880 3562799 3649172 3761925
3670 3761925 3916314 4043357 4117481 4201191 4312145 4414950 4561356 4715278 4854820 5013925
3660 5013925 5098050 5261505 5465328 5578288 5873237 6093188 6345050 6639314 6969097 7255023
3650G255023L59377M61757M23392N34454N84065N45705N35488M72984N24556N90944
3640A2287745O13139O94361P12175P82538R63399J192888J384448J698678K150965
3631B2480336K754536L280949L945370M591932N075145N486931N409385N138605
3623E8163189M658269L871548K847034J783063P72978j67894p69906j060192j189857
3614F8908232q03115l48986K25970P20691R53899R81515P68666J71678n33350
3605G1045200j331924k287011l206239l907370m357457m611230m489808m345294
3597D2508867l985076l391156k742803k360215j933899j485812j149561r41962
3589B4518383q42072p62416q00338q69319r72474r42814r32820r04199r59475
$$ plain form
3650 7255023 7614400 8076157 8499549 9034003 9618068 10163773 10699261 11172245 11696801 12287745
3640 12287745 12900884 13595245 14307420 15089958 16053357 17246245 18630693 20329371 22480336
3631 22480336 25234872 28515821 32461191 37053123 42128268 47615199 53024584 58163189
3623 58163189 62821458 66693006 69540040 71323103 72096081 71928187 71158281 70098089 68908232
3614 68908232 68105117 67756131 67982101 68702792 69656691 70638206 71406872 71578550 71045200
3605 71045200 69713276 67426265 64220026 60312656 55955199 51343969 46854161 42508867
3597 42508867 38523791 35132635 32389832 30029617 28095718 26609906 25460345 24518383
3589 24518383 23676311 22913895 22113557 21244238 20271764 19328950 18396130 17491931 16532456
3580A6532456j015926q57953q00793q27835o42124m98288m80169l80642k76527
3571A0752199j46493j90125j08202R4951J06137O4169J73164K08287K59506K81059
3561A1494652L97033M57608M79622M56164N23750N92604L25292M06247M71401
3552A5604373L29977K64455P9375N6720j26726k12088k83244l04117m22477l65226
3542A4621022l92583l49847k43854k46200j07126m9120J5074R2589K06276J62084
3532A3708315J18906J40111J17704Q2972Q0705J5436K9452l1527K8473J14804
3522A4405351R8238J21371J67522J61815K49302J93200J44501J06811j4782K5942
3512A5659271R9437l9752O9461R3483Q7141J10354K98567L42160L71992M54292
$$ plain form
3580 16532456 15516530 14658577 13857784 13029949 12387825 11889537 11409368 11028726 10752199
3571 10752199 10605706 10415581 10307379 10402330 10508467 10572636 10745800 10954087 11213593 11494652
3561 11494652 11891685 12349293 12828915 13285079 13808829 14401433 14726725 15132972 15604373
3552 15604373 15934350 16198805 16278180 16334900 16208174 15996086 15712842 15408725 14986248 14621022
3542 14621022 14228439 13878592 13634738 13388538 13281412 13232292 13247366 13339955 13546231 13708315
3532 13708315 13827221 13967332 14085036 14168008 14248713 14264149 14293601 14262074 14290547 14405351
3522 14405351 14503589 14624960 14792482 14954297 15203599 15396799 15541300 15648111 15633329 15659271
3512 15659271 15758708 15718956 15788417 15881900 15969041 16079395 16377962 16720122 17092114 17546406
3502A7546406N70213O75326P12915P56985R17081R88514J166719J299617J407468
3493B6041244J631555J850412K133974K288148K569640K874418L293678L576098
3485D6259167L886420M233628M674756N053770N433026N827345O324992O638607
3477H8331711O706211O814806O769765O521578O039220N509730M888086M238387
3469A35819494L637953L149869K782298K320271K212766K031094J802794J236561
3461A54993100P58217J14844p92805j648997k615468l462300m319425n016748
3453A38010418n533382n993143o210249o332019o256677o203925n874328n590107
3445I0016588n192761m477746l712682k564105j425327k62782J079583K390854
$$ plain form
3502 17546406 18116619 18791945 19504860 20261845 21178926 22167440 23334159 24633776 26041244
3493 26041244 27672799 29523211 31657185 33945333 36514973 39389391 42683069 46259167
3485 46259167 50145587 54379215 59053971 64107741 69540767 75368112 81693104 88331711
3477 88331711 95037922 101852728 108622493 115144071 121183291 126693021 131581107 135819494
3469 135819494 139457447 142607316 145389614 147709885 149922651 151953745 153756539 154993100
3461 154993100 155751317 155866161 155073356 153424359 150808891 147346591 143027166 138010418
3453 138010418 132477036 126483893 120273644 113941625 107684948 101481023 95606695 90016588
3445 90016588 84823827 80346081 76633399 74069294 72643967 72381185 73460768 75851622
3437G5851622L729213M733759N687141O385903O471467O252812N661103M832381
3429A19605401L595649K355125J253289J95945p34197j348264j842121j957401
3421A21123426j958212j634248j257633q61197n04663j68049m1225j32040m30709
3412A14135450r51475j679492k513285l360430m291512n092033n617923o046732
3404H4582568o183516o170231n989891n665032n315438m928546m398212m121372
3396D1810330l663536l322888k935746k488680k323434j994290j718617j558033
3388B1805106j382749j078345j026404q59119o64516n22175n07487m81569l23290
3379A4959452k62488k27378j19136q795J81397R6820J27067K41962L36674N07856
$$ plain form
3437 75851622 79580835 84314594 90001735 96387638 102859105 109111917 114773020 119605401
3429 119605401 123201050 125556175 126809464 127005409 126271212 124922948 123080827 121123426
3421 121123426 119165214 117530966 116273333 115412136 114907473 114739424 114698199 114566159 114135450
3412 114135450 113183975 111504483 108991198 105630768 101339256 96247223 90629300 84582568
3404 84582568 78399052 72228821 66238930 60573898 55258460 50329914 45931702 41810330
3396 41810330 38146794 34823906 31888160 29399480 27076046 25081756 23363139 21805106
3388 21805106 20422357 19344012 18317608 17458489 16793973 16271798 15764311 15282742 14959452
3379 14959452 14696964 14469586 14350450 14341655 14523052 14619872 14746939 14988901 15325575 15833431
3369A5833431N98947O78953Q44507Q56613Q72741R42431R63156P99037O92884
3360B3082700O59658M64424K36304Q9983j47887m25557l92701m64750o89596o48071
3350B1764507p32014p76055q69275q57364r99069j002697q44366q37539o84951
3341A4161177n53815n41192m08520k42923j44284j05701j68529k0187J8021Q3879
3331A2077926J36188J85650K53645K94043L20336L69487M33439N90331O39320
3322A5300365P34280Q95136J076306J296247J505809J835506K278122K700131
3314B7621902L222346L936767M745663N559657O260106O925224P330754P539541
3306G3141960P621390P592222P255729O505202N460650L981529K198598K98328
$$ plain form
3369 15833431 16432378 17111331 17955838 18812451 19685192 20627623 21590779 22389816 23082700
3360 23082700 23742358 24206782 24443086 24533069 24385182 23959625 23566924 23102174 22412578 21764507
3350 21764507 21032493 20256438 19387163 18529799 17530730 16528033 15683667 14846128 14161177
3341 14161177 13607362 13066170 12657650 12414727 12270443 12164742 11996213 11976026 11994047 12077926
3331 12077926 12214114 12399764 12653409 12947452 13267788 13637275 14070714 14661045 15300365
3322 15300365 16034645 16929781 18006087 19302334 20808143 22643649 24921771 27621902
3314 27621902 30844248 34781015 39526678 45086335 51346441 58271665 65602419 73141960
3306 73141960 80763350 88355572 95611301 102116503 107577153 111558682 113757280 114055608
3298A14055608j593110l454428m983033o431070p347627p977669q222424q157567
3290F5888680p777242p164933o494926n726674n069878m227192l638959l039004
3282B2749872k519733k145762j766719j495577j220816j059520r22658p39946
3274A0879141o70933n83469n48004l84189l86237l75727k76988k54092k83464
3265G116038j00695j58540j95996p9567j39596j11228j24688p7914p0660r5685
3255E961469m4271m5709k8891j6595l3685M6966P3520J0659N9219Q9458K3138
3244F095278k637k0669J19513Q7483m2749j00917q2402j05910k11117k09716j68829
3233E357328j18929j45296j85999j41706r8682j36938m7933r1724j09540j43802
$$ plain form
3298 114055608 112462498 109008070 104025037 97593967 90246340 82268671 74046247 65888680
3290 65888680 58111438 50946505 44451579 38724905 33655027 29427835 25788876 22749872
3282 22749872 20230139 18084377 16317658 14822081 13601265 12541745 11619087 10879141
3274 10879141 10208208 9624739 9076735 8692546 8306309 7930582 7653594 7399502 7116038
3265 7116038 7015343 6856803 6660807 6581240 6441644 6330416 6205728 6127814 6057154 5961469
3255 5961469 5917198 5871489 5842598 5826003 5792318 5839284 5912804 5923463 5982682 6072140 6095278
3244 6095278 6092641 6071972 6191485 6278968 6236219 6135302 6052900 5946990 5735873 5526157 5357328
3233 5357328 5238399 5093103 4907104 4765398 4666716 4529778 4481845 4390121 4280581 4136779
3223D136779n6773m8355j25568q7758m7185j01548j37090L1018n9757j52129n8144
3212C293490J1520N29n3332N6941M0345l672L559R1712J8377M2607L0642R527
3200C542245J58889j3858J4552J9656O4994k8461L7104O6075L3165J463O5877
3189C961701N2861J35782K9879J6188Q7617K073l5268M11L377k4607L7873j2313
3177D255574O7932R4728L2221j899M3178P3602R3883Q7048N2479J10763J17366
3166E026875J19414n5970K1849J2230o8391L8858j4692K2764j2471K6576K6619
3155E143661R266l8857Q6537M2986J8400R7081J21333O7702Q7484R6530J23742
3144E855865K24193R9088Q2219Q5156K5016L6506J93766J50062K10816J30758
$$ plain form
3223 4136779 4080006 4031651 3906083 3818325 3771140 3669592 3532502 3563520 3503763 3351634 3293490
3212 3293490 3305010 3305539 3252207 3309148 3349493 3345821 3349380 3441092 3459469 3502076 3532718 3542245
3200 3542245 3701134 3687276 3701828 3721484 3786478 3758017 3795121 3861196 3894361 3895824 3961701
3189 3961701 4014562 4150344 4180223 4196411 4284028 4286101 4250833 4251244 4254621 4230014 4267887 4255574
3177 4255574 4323506 4418234 4450455 4448556 4491734 4565336 4659219 4746267 4798746 4909509 5026875
3166 5026875 5146289 5090319 5112168 5124398 5056007 5094865 5080173 5102937 5090466 5117042 5143661
3155 5143661 5152927 5114070 5200607 5243593 5261993 5359074 5480407 5548109 5635593 5732123 5855865
3144 5855865 6080058 6179146 6261365 6346521 6371537 6408043 6601809 6751871 6962687 7093445
3134G093445N6431J93299K05758K54090L35646L69988K55223K08029J89815K36289
3124I398013J90609K54051K92463J58486J89719L14211L91228L71358L75781M42508
3114A2378427L57636M93045M93983M38187N21310M95887N54219M92412M71866
3105A6696972N04737N59710O70843O85325Q28808Q79860J039638J106137J142178
3096B4114208J262019J314272J406301J562462J828891K160044K562323K891159
3088C9101679L376465M031388M934413O110343P852204J0040866J2226809J4080633
3080A01754800J4745692J4113580J2931480J2438569J3796016J8447314K7251491
3073B15478942L9727395N3285602O1502428N7394937L9297331J3479297j1508798
$$ plain form
3134 7093445 7149876 7343175 7548933 7803023 8138669 8508657 8763880 8971909 9161724 9398013
3124 9398013 9588622 9842673 10135136 10293622 10483341 10797552 11188780 11560138 11935919 12378427
3114 12378427 12736063 13229108 13723091 14161278 14682588 15178475 15732694 16225106 16696972
3105 16696972 17201709 17761419 18432262 19117587 19946395 20826255 21865893 22972030 24114208
3096 24114208 25376227 26690499 28096800 29659262 31488153 33648197 36210520 39101679
3088 39101679 42478144 46509532 51443945 57554288 65406492 75447358 87674167 101754800
3080 101754800 116500492 130614072 143545552 155984121 169780137 188227451 215478942
3073 215478942 255206337 308491939 369994367 427389304 466686635 480165932 468657134
3066D68657134l1841458m5163913n0486995n0420448m7332897m2432965l6228374
3059A64750084k9323511k2877027j7424009j3269129j0628143q788185p330169
3052E5109911o209773n188470m295482l561969l045616k528767k231331j947891
3044B6100612j820797j624035j371890j213492j050972q94162q68525p27786o38131
3035A5890822o10255m67591m39638m67924n21489m45702m88793l35120l09755
3026A1804555l39696k53457j92311j23706j67434j20647n1025j26042n7465j65313
3016A0207459k33670l03962k87078j72158k90113k34624k42826l23658j65116
3007G954254k21957j65340j48604j85087k13156j34954j11988j15368j72808j90993
$$ plain form
3066 468657134 436815676 391651763 341164768 290744320 243411423 200978458 164750084
3059 164750084 135426573 112549546 95125537 81856408 71228265 62440080 55109911
3052 55109911 48900138 43711668 39416186 35854217 32808601 30279834 28048503 26100612
3044 26100612 24279815 22655780 21283890 20070398 19019426 18125264 17256739 16528953 15890822
3035 15890822 15280567 14812976 14373338 13905414 13383925 12938223 12449430 12114310 11804555
3026 11804555 11464859 11211402 11019091 10895385 10727951 10607304 10556279 10430237 10372772 10207459
3016 10207459 9973789 9669827 9382749 9210591 8920478 8685854 8443028 8119370 7954254
3007 7954254 7732297 7566957 7418353 7233266 7020110 6885156 6773168 6657800 6484992 6293999
2997F293999k28905q0714j51082j72041j30545r4993o6974j23549m4623j80095
2987E020478j95775p7009l1850p4472j06766o4870j34301j32766j18339j12621
2977C971709P969j14927j45213j10890j35598j43835j05600n7532l7755o4329
2967C063999j0789j5071o1922o1164N1354K6940j4645m327j3870q3124j22233
2956B755148o1468p6154o2291j69253q1189j05694n7579k9917n2570R7137O43
2945B156813M0438j14330q3286J4030K1037R0090q4307j2268n8106j00305O9939
2934A939745o4576o52m5244P5111M6649m4633O998m697J4834J6320l9866n3215
2922A846774k4123r2508q8474o2893n7260J4483j78444j330k4696q9419l6737
$$ plain form
2997 6293999 6065094 5984380 5833298 5661257 5530712 5435719 5368745 5245196 5200573 5020478
2987 5020478 4824703 4747694 4715844 4641372 4534606 4469736 4335435 4202669 4084330 3971709
2977 3971709 3979678 3864751 3719538 3608648 3473050 3329215 3223615 3166083 3128328 3063999
2967 3063999 3053210 3038139 2976217 2915053 2966407 2993347 2978702 2974375 2960505 2877381 2755148
2956 2755148 2693680 2617526 2555235 2385982 2304793 2199099 2141520 2111603 2059033 2156170 2156813
2945 2156813 2197251 2082921 1999635 2013665 2034702 2124792 2040485 2028217 1970111 1869806 1939745
2934 1939745 1875169 1874517 1829273 1904384 1951033 1906400 1913398 1908701 1923535 1939855 1899989 1846774
2922 1846774 1822651 1730143 1641669 1578776 1521516 1535999 1357555 1356225 1331529 1242110 1205373
2911A205373j8448k5376j23446L8193Q1998j3178m5009q1258M4607q277n1344
2900A003835j3129m0791k823K2843P9346K1942n0238q7723N779K0281N7902j1317
2888A005907q0794r530k6918n2419J03270J1076o6317o3902p7166r2487m0916
2877F09804l0795N2493M57J3811m0568M5380K1598Q7209O7152o0418m7274M346
2865G23195j9618K8114q883k6669j8003L8188O3610j11425k7969m1980q3853J8056
2853E32763M2802L9771P3793l859r6557L8475O879k6260k3789M373P1205l9459
2841F20137R8705R6586j7133j18359O4599O7727l3241o1881L4855m8907j7878
2830F85210n0261k2957j2335l963r775n9272k8847n3098P342J3433k025l2145
$$ plain form
2911 1205373 1186925 1161549 1038103 1076296 1158294 1145116 1100107 1018849 1063456 1055179 1003835
2900 1003835 990706 949915 947092 969935 1049281 1071223 1020985 933262 939041 959322 1017224 1005907
2888 1005907 925113 915583 888665 836246 939516 950592 884275 820373 743207 650720 609804
2877 609804 579009 631502 631959 645770 605202 650582 672180 759389 826541 766123 718849 723195
2865 723195 703577 731691 722808 696139 678136 716324 779934 668509 640540 598560 514707 532763
2853 532763 575565 615336 689129 685270 588713 627188 634067 607807 584018 588391 659596 620137
2841 620137 718842 815428 798295 679936 744535 812262 779021 717140 751995 703088 685210
2830 685210 634949 611992 599657 595694 585919 526647 497800 444702 452044 465477 463452 431307
2818D31307L4075J4862q949j6287M4166J4458l8240l3977j3705m6843O7445Q1057
2806E29369L4561l5836k6221L1394Q1735M4749M4345n1384J03618J30817N9658
2795I46805P1129O6427P0995J01721J28146K04116L41327K13632K34059K10449
2785B588806Q7439r2813j59326k68243k27703k52157k60322j46505j47517j25832
2775I95827j01838j08463p5333o4294j9192j4477N1854o3282k9085o317m0135
2764E25265K7357l6810m4114l9928K4444P3885o2014o0736k9840O9621J21761
2753E68891m2505l0710q3170M6229P9364R440k7827k8335j0808r816N0283L1464
2741E52500k6658q176M607j01002j0231N3125n6502K903P1021P263J461p974K402
$$ plain form
2818 431307 465382 480244 471295 455008 499174 513632 475392 441415 427710 380867 448312 529369
2806 529369 563930 528094 501873 533267 615002 659751 704096 652712 756330 887147 946805
2795 946805 1017934 1084361 1155356 1257077 1385223 1589339 1930666 2144298 2378357 2588806
2785 2588806 2676245 2583432 2424106 2155863 1928160 1676003 1415681 1269176 1121659 995827
2775 995827 893989 785526 710193 645899 626707 612230 664084 600802 571717 565400 525265
2764 525265 552622 515812 471698 431770 456214 530099 468085 407349 377509 447130 568891
2753 568891 526386 495676 412506 458735 538099 547539 519712 491377 480569 470753 521036 552500
2741 552500 525842 517666 522273 421271 411040 464165 407663 410566 481587 488850 490311 482337 484739
2728D84739k0982L6560j4325j9650k5049n2847n889m3108L6656M1457O5438m121
2716D78879o1645o4725j5725Q404l6683p6006R2466K627L4561O1266m4013n520
2704C73886k7877O3178k7586m7037m4392Q3898q7845l6149N7114K7479p5559n5210
2692B03900O1752j9183j4437P900J6939J7374l5295N9952Q0247J1082k3090J9314
2680C86455k665q2336J596j1235P5663L4537l7659n8568K9241k9622j113L2097
2668C36391o7885J0079R625m5019L1572l6821j8825R404R8136L433l9354q2207
2656B08529Q865M2676J34345L7122o6774j05496l1118M0219k1931j1834m7109
2645A87494J8263n2250O508N571K7392Q1655m0792K2691J0024O6140N648n9858
$$ plain form
2728 484739 463757 500317 485992 466342 441293 388446 382557 339449 376105 417562 483000 478879
2716 478879 417234 352509 336784 345188 308505 232499 324965 327592 362153 423419 379406 373886
2704 373886 346009 409187 381601 334564 290172 374070 286225 250076 307190 334669 259110 203900
2692 203900 265652 246469 232032 239932 256871 274245 238950 298902 379149 390231 367141 386455
2680 386455 383790 301454 303050 291815 367478 402015 364356 305788 335029 305407 304294 336391
2668 336391 268506 278585 288210 243191 274763 237942 219117 228521 326657 330090 290736 208529
2656 208529 217394 260070 394415 431537 364763 259267 228149 268368 246437 234603 187494
2645 187494 205757 153507 160015 165586 192978 274633 233841 256532 266556 332696 338344 278486
2633B78486K3705j09437K4178J0186l0742K3432p0K8729L2219n0463J1510K4456
2621B66189N3773K6606j3847q2048n3595R553m3553L3498N2427k0691j1234J2772
2609B29850K5365n2821N8290m5009l5611O6291M7129j2200N8q8988L4419M4120
2597B70893L0590j894J3865j7455J0577K7390P321O0327N3021L0359k9222Q9522
2585E45294J6624O2239N6612P8236o9067m9372n9668L033n9344j8230j6536p3262
2573D16559R457n6491r1441n7916J2382K1068Q1627L1094M8048l3343o5955K4951
2561C40040j1318P3736o2168l7122r782k8336P3946o8134n6258J248K9110J00858
2549C45820J1546o7215l9274l2705J11662k8908M0975j0573j1319J5322l8854
$$ plain form
2633 278486 302191 192754 216932 227118 196376 219808 219738 248467 280686 230223 241733 266189
2621 266189 319962 346568 332721 250673 197078 206631 163078 196576 249003 228312 217078 229850
2609 229850 255215 202394 260684 215675 180064 246355 293484 281284 281342 192354 226773 270893
2597 270893 301483 299589 313454 295999 306576 333966 341287 401614 454635 484994 455772 545294
2585 545294 561918 624157 680769 759005 689938 640566 580898 583931 524587 506357 489821 416559
2573 416559 426016 369525 278084 220168 232550 253618 335245 366339 414387 381044 315089 340040
2561 340040 328722 402458 340290 303168 293386 265050 338996 270862 214604 215852 244962 345820
2549 345820 357366 290151 250877 218172 329834 300926 341901 331328 320009 335331 296477
2538B96477l8810n4188M7966k4944L8871L0462R519l775k5913p2534N6603K0314
2526B80048O4879m6724m9797j998L0602K4635k5475j4617J357J00756K3516l0980
2514C56202n641l6704o569N7650K4701m425j8997k0113j7436o2774j7870O1834
2502C09858Q9081l3249r8162k9334l0578Q0834r3547n303J4196n3891L5232O321
2490A91458J8609M6330j8900L3112M5208J5590J8523k3473k7728k1106n5076k254
2478B20293M9963j4254M0674r994j0850N5641P6723R534j45310J9409j0599L9620
2466C20850N0768j2220m9104j1649K3048L778M5045p8791o7945j8198O1825J7515
2454B84922K5811M3553l6211l5717R9433j2362k7784n5807K7580P8275q2290m3164
$$ plain form
2538 296477 257667 203479 251445 226501 265372 295834 305353 301578 275665 203131 259734 280048
2526 280048 344927 298203 248406 246408 277010 301645 276170 261553 262910 363666 387182 356202
2514 356202 350561 313857 307288 364938 389639 385214 366217 346104 328668 265894 248024 309858
2502 309858 398939 365690 267528 238194 207616 288450 194903 189600 203796 149905 185137 191458
2490 191458 210067 256397 237497 270609 315817 331407 349930 326457 298729 277623 222547 220293
2478 220293 270256 256002 296676 286682 275832 331473 408196 417730 272420 291829 281230 320850
2466 320850 371618 359398 310294 298645 321693 325471 370516 291725 223780 205582 267407 284922
2454 284922 310733 354286 318075 282358 381791 369429 341645 285838 313418 391693 309403 266239
2442B66239M3867P9545J0877k501k5807m0062L4614o538N0638O571J3119m6956
2430C83606j694J09050m0654k7061k3736k0007P0641q9306K3217L83j6153P1544
2418D39830K9502K8235o1334Q5347j3744O0608j1313n5250j460j2209n4181L0402
2406D64433j5368k8178M4502r576K4722J7434k022m0006J8115N4477O276n949
2394E28860K6032o4378j1286L9547J4093O5034j691p8551P065K39Q9560L8454
2382F52978p9359L0575j416L4611l431M4457O364P9519L4385O2376N7258k8862
2370H89455r7347J537J02874k573J4770n690P8264N6540P9034O8607N3136M8558
2358A287165P8656J55121M3761j2769P2905j0392J10823N4895J9350P0222J32696
$$ plain form
2442 266239 310106 389651 400528 398027 372220 332158 366772 360234 410872 417443 430562 383606
2430 383606 381912 490962 450308 423247 399511 379504 450145 360839 384056 384439 368286 439830
2418 439830 469332 497567 436233 521580 507836 568444 557131 501881 500421 488212 434031 464433
2406 464433 449065 420887 465389 455813 480535 497969 495947 455941 474056 528533 534809 528860
2394 528860 554892 490514 479228 518775 532868 597902 596211 517660 524725 524964 614524 652978
2382 652978 573619 604194 602778 637389 633958 678415 684779 764298 798683 861059 918317 889455
2370 889455 792108 793645 896519 893946 908716 903026 981290 1037830 1116864 1185471 1238607 1287165
2358 1287165 1365821 1520942 1564703 1551934 1624839 1614447 1725270 1780165 1799515 1869737 2002433
2347B002433R9669R1492P6692N9463J48723J28000J17583J61538R7186J24932
2337C107711K56213K59458L25586N41857O16420P41716O95400O37948O00007O38016
2327H420332O26363Q06207J002114J383005J813720K591468L878890O598320J0656078
2318C7776497J5120067J7050719J2564707L797799k279282o944290j1054165j0560758
2310E5471294r641464q669113p835705o765352n078879l491244k220007j149297
2302A0620233p17736o19229p11946p52193o93689o75006n43237n45214n35116
2293D826867l93275k93221l19096l80269k82139k27759j53703m3727r7883p7815
2283B557980n0150q3625r2403R468k6429j71078j31519p0376n0165n9077k7565
$$ plain form
2347 2002433 2102102 2193594 2270286 2329749 2478472 2606472 2724055 2885593 2982779 3107711
2337 3107711 3363924 3623382 3948968 4490825 5107245 5848961 6544361 7182309 7782316 8420332
2327 8420332 9046695 9852902 10855016 12238021 14051741 16643209 20522099 27120419 37776497
2318 37776497 52896564 69947283 82511990 86309789 84030507 77086217 66032052 55471294
2310 55471294 45829830 37160717 29325012 22559660 17480781 13989537 11769530 10620233
2302 10620233 9902497 9283268 8571322 7819129 7125440 6450434 5907197 5361983 4826867
2293 4826867 4433592 4140371 3821275 3441006 3158867 2931108 2777405 2733678 2635795 2557980
2283 2557980 2507830 2424205 2331802 2341270 2314841 2143763 2012244 1941868 1891703 1832626 1805061
2272A805061n3064l9742o164j00943l5830j2P7286L921n0191k339o7661p9822
2260A450500l9390k5165k1120r2068n4390L6043j4953N4213k5806m1886R169j16201
2248A118946l8594M8392o857o9707q1912q5770L9882P6481M2780p9484l0031n3153
2236H80973j6905n7454J0200j7394R1045l3446n7777l0124K6920l4895m6287M960
2224G19816l7689r6294L2985Q79n8141n0419J0193R899m0866j815O5065m0966
2212E12647j9381M3892j02469J46751K3088k9980m2610J3937m3273o556M784p8064
2200D22766l096M1101M9346r926p9588p2388j4194M0355j320N8582J9296r551
2188D41383k2931N648L7013m6341l1784N6073k0088R61l9898j9343K1389m0175
$$ plain form
2272 1805061 1751997 1712255 1706091 1605148 1569318 1569306 1646592 1650513 1600322 1597983 1530322 1450500
2260 1450500 1411110 1385945 1364825 1272757 1218367 1254410 1239457 1293670 1267864 1225978 1235147 1118946
2248 1118946 1080352 1128744 1121887 1052180 970268 884498 924380 1000861 1043641 964157 934126 880973
2236 880973 864068 806614 816814 799420 890465 857019 799242 769118 796038 761143 714856 719816
2224 719816 682127 585833 618818 619697 561556 511137 521330 531229 490363 488548 553613 512647
2212 512647 493266 537158 434689 581440 604528 574548 531938 545875 502602 496046 500830 422766
2200 422766 419670 460771 510117 500191 420603 348215 334021 374376 373056 431638 450934 441383
2188 441383 418452 424100 461113 414772 382988 439061 418973 419934 380036 360693 382082 341907
2176C41907K6514N9781l7128j580m5838K774L3874J6424O0004J645k0460j26168
2164C11749K9891K4729m7850k1658J5432p502l3664K9267k5151p5042L2207N7309
2152B89717p061j6073k2432q4044o025K2668L4318M3443m1705K504J4847k1081
2140B09076j0860j1690L6888j8032k1678L3363N5730m853q1075j7158m6271L0049
2128A53489l008Q3514K0493k6359n1551J11k2765l5744N1644P0337o1972m4256
2116A33933J7681k5015M3984p128k2425L5091N6552l7568J9407n4608j0301K688
2104A52291L7241N1137j24718q17J2985r568Q1965M0727p1231m9363K1785P5415
2092B17849k8537M3246L5652l7479j9304l3303p5384k6790k561L7585N1771p89
$$ plain form
2176 341907 368421 428202 391074 389494 343656 346430 380304 396728 456732 458377 437917 311749
2164 311749 341640 366369 318519 296861 312293 304791 271127 300394 275243 200201 232408 289717
2152 289717 282656 266583 244151 160107 154082 176750 211068 254511 212806 215310 230157 209076
2140 209076 198216 186526 223414 205382 183704 217067 272797 267944 186869 169711 123440 153489
2128 153489 150481 233995 254488 228129 176578 176689 153924 118180 169824 240161 178189 133933
2116 133933 151614 126599 170583 163455 141030 176121 232673 195105 214512 159904 149603 152291
2104 152291 189532 240669 115951 115134 128119 118551 200516 241243 170012 120649 142434 217849
2092 217849 189312 232558 268210 230731 211427 178124 102740 75950 73389 110974 162745 161956
2080A61956J3797m2761L4200L3869O06o7135L5379j3911l4564O1263j2193n5840
2068A14666L6478m1875m0277k1621K5437J1344m0024j6308M9499N0737l8094L0809
2056A20771p750N6173M7874m7948K4387j548l907J52380R9162J3120k6854K0127
2044D45987L6824P077j3507m4735q7904r0419p3747q9868N8046K9531r746k5067
2032A42472L2968l5849n3228k3245k064L9760O306o5778r979P0680O207K2208
2020A30458K0516J8879j3625l5244J1763J12878m5204j42252j8413L3819N3673
2009A27248J1472L158o0371j2075k6854P21N2611M1321k8131N9931j2136m2194
1997A14701l1304P2324k3311n9880O4443l0330J3272m6156J0960M017m6479l1112
$$ plain form
2080 161956 175753 132992 167192 201061 201667 134532 169911 156000 121436 182699 170506 114666
2068 114666 151144 109269 68992 47371 72808 84152 44128 27820 77319 128056 89962 120771
2056 120771 113021 169194 217068 169120 193507 191959 188052 340432 439594 452714 425860 445987
2044 445987 482811 489888 476381 431646 343742 253323 179576 89708 147754 177285 167539 142472
2032 142472 175440 139591 86363 63118 61054 100814 107120 41342 31363 102043 108250 130458
2020 130458 150974 169853 156228 120984 132747 245625 200421 58169 39756 73575 127248
2009 127248 138720 141878 81507 69432 42578 43299 95910 137231 109100 169031 156895 114701
1997 114701 83397 155721 132410 72530 136973 106643 119915 73759 84719 88736 42257 11145
1985A1145K4531N0633J00786j5159n9136m6756J6351O992M6469O2423n4852o5807
1973G7620n067M996k198K349m4927R789Q654M6588M9105l7384R861K6223p65m7174
1959I7670q211n7833K1139O8873j9756l6078j1698O6248N4336p6832k1100j7106
1947E9652k3419P2583L2481k4950p396o8520K3727N9138N4902K1493q6622p6390
1935C6679j4720K4327L8837M2327m0489j2581o941M7952R682m3741l2149k1596
1923B7587n6575L6377J79482n5195m3335K9415m79n9153j3017L0804m1516M3080
1911G7475J3390k4246p3092L2900K0425R4104l9139m2304L3750Q176q917m8604
1899D3918K1258q536j0115Q7771l5679j15274L949L198L6511J1619P2856L298
$$ plain form
1985 11145 35676 86309 187095 171936 112800 66044 82395 89387 135856 198279 143427 77620
1973 77620 72553 77549 75351 77700 32773 42562 51216 97804 146909 109525 119386 145609 144844 97670
1959 97670 89459 31626 52765 121638 101882 65804 54106 120354 174690 97858 76758 59652
1947 59652 36233 108816 141297 116347 108951 40431 64158 123296 178198 199691 113069 36679
1935 36679 21959 46286 85123 127450 86961 74380 67439 115391 125073 81332 49183 27587
1923 27587 -28988 7389 186871 131676 88341 117756 117277 58124 45107 75911 34395 77475
1911 77475 90865 66619 -6473 26427 46852 140956 101817 59513 93263 101439 92522 43918
1899 43918 65176 56640 46525 134296 98617 -16657 -12708 -9510 27001 38620 111476 114774
1887A14774j01028r806L5837J7591P7005L1114r5652j8758q2812Q4726L211k6241
1875B9961N446O3181O6681l6330m1094n6349m0958Q554J21572m8016k0373J2235
1863F4510J4551l7221l4588m9697o657l683J30262M5383k4065o1661l2603R7625
1851A02156j424k8962j9116l7328M4720K626N7894J3746o5824n5089j2814L8116
1839C8701R6899o4193o5532k0150Q3194j876J2693N683k2872n3755j3507Q8256
1827H3541j3192L0550J4503k419m1744J8757m3161L1802n0009K5326K3483j4333
1815F3104p1982M534P3140q884Q0463O2316j07063q759J6678L5404k5586n5398
1803E7967K8066J1972K7313k2847q389r210l6847N9803N9653m822o2478m1778
$$ plain form
1887 114774 13746 3940 39777 57368 134373 165487 69835 51077 -31735 52991 56202 29961
1875 29961 35407 98588 165269 128939 87845 31496 -9462 -908 120664 72648 52275 64510
1863 64510 79061 41840 7252 -42445 -49102 -52785 77477 122860 98795 37134 4531 102156
1851 102156 100732 71770 52654 15326 60046 62672 120566 134312 68488 13399 585 38701
1839 38701 135600 71407 5875 -14275 68919 67043 79736 85419 62547 8792 -4715 83541
1827 83541 70349 100899 115402 112983 71239 89996 46835 78637 28628 53954 77437 63104
1815 63104 -8878 -4344 68796 59912 140375 202691 95628 86869 103547 138951 113365 57967
1803 57967 86033 98005 125318 102471 94082 84872 48025 107828 167481 162659 100181 58403
1791E8403k182m2116L8460M5476m303N2754K5749r28q5789n4586k8100M0806L4932
1778G8576M639J2080M4885n3722m1296J5586K8865n3137K8685O7134r4680k2857
1766A4758l5610o215K8797N8211K1098j0291m412q6518J5103J09938K078j4173
1754I2764j9144l701M9879J0401p8931j0658O1278N4598k2007j1686L0120n4677
1742I8236m7810m9760R2288P7675k2626K580l3603m7461m699P3250n654n6686
1730G5730j64900N8511K2934k0155k5119R5466K4427l2500K8146J4260k2001o2719
1718g920K4537K8483K5087o1979O2477J3345p3584m5273o064L7693J04779j2019
1706H9562q8039j6712K9187l9869m715J9772J9272L0926j8056K7775J8581M6122
$$ plain form
1791 58403 56221 14105 52565 98041 93738 146492 172241 171313 85524 30938 2838 43644 78576
1778 78576 83215 95295 140180 86458 45162 60748 89613 36476 65161 132295 37615 14758
1766 14758 -20852 -27067 1730 59941 81039 70748 66336 -20182 -5079 104859 106937 92764
1754 92764 73620 69919 119798 130199 51268 40610 101888 156486 134479 122793 152913 98236
1742 98236 50426 666 92954 170629 148003 150583 116980 69519 64820 138070 132416 75730
1730 75730 -89170 -30659 -7725 -27880 -52999 42467 66894 34394 62540 76800 54799 -7920
1718 -7920 16617 45100 70187 8208 70685 84030 10446 -34827 -40891 -3198 101581 89562
1706 89562 1523 -15189 13998 -25871 -30586 -10814 8458 39384 21328 49103 67684 113806
1694A13806L7159o1750N2972m4024K8700J4265r8029o0975K4455L2271K6860M1007
1682A06717k0543K3678N245j00399n8979L9528L5615P9510L5524m9727p3265l9604
1670a6700j0571K2813J1824M2106p4350N9230L0009n9482L5962Q1207N7785J6766
1658A96599j03636K3843n5469l8661q96K1069J1340Q2082l6270o7000M7081j9675
1646F0407J04539j4984l6888J0696l0178o374L7853R35k0920L4630L6216r1255
1634H4677L2549J690o5797q021q0342R082M2257j0195M5389K240r2668o3185O8866
1621c3458L2338M1343K4194J8957m8592m1930m727K6230P161k0958J7735R30K26
1608A9449l3007O5462j0745J7190L9911R3129m4081p0963m1597K0813l78N0485
$$ plain form
1694 113806 150965 89215 142187 98163 126863 141128 43099 -17876 6579 38850 65710 106717
1682 106717 86174 109852 115097 14698 -44281 -4753 30862 110372 145896 96169 22904 -16700
1670 -16700 -27271 -4458 7366 49472 -24878 34352 64361 4879 40841 122048 179833 196599
1658 196599 92963 116806 61337 22676 21780 42849 54189 136271 100001 33001 80082 60407
1646 60407 164946 149962 113074 123770 93592 87218 125071 126006 105086 139716 175932 84677
1634 84677 117226 118916 53119 45098 -35244 -26162 16095 5900 51289 53529 -39139 -102324 -33458
1621 -33458 -1120 40223 64417 83374 34782 -7148 -11875 14355 21516 558 18293 19223 19449
1608 19449 -13558 51904 41159 58349 98260 191389 147308 76345 34748 55561 55183 105668
1596A05668M073n2684j827p8591M6465L4013K5859l9210L9201J3058o5708o3926
1584c3609N3127j5090k0891J16970M0791q1621q2543j7501P4971J7030r3906L2508
1572i764N2P0501Q3653L2015q6541k6388L0257L117M7838m4733O2237m4135o054
1559A12055o7428R954N6844K1657O81q0363o1789L5858l7642N1101m3841O0491
1547E7578Q6060n6909j07812l0705O4592Q981L0453k4214L7471m8494o9241L5642
1535a6598M6912K7005q367J6167k1307k0140m1062Q3213r583M0354J9618l3000
1523H3212l9660m3688K4484k5688K6516k5577J3842j0552l8825J9168L7026M9799
1511G0057n954m2767k313q154K2385k3895K8642m9856J9522O4292k8202n5356
$$ plain form
1596 105668 109741 57057 55230 -23361 23104 57117 82976 43766 82967 96025 30317 -33609
1584 -33609 19518 4428 -16463 100507 141298 59677 -22866 -40367 34604 51634 -42272 -9764
1572 -9764 -9712 60789 144442 176457 89916 63528 93785 96902 144740 100007 162244 118109 112055
1559 112055 44627 54581 111425 133082 133763 53400 -8389 27469 -10173 40928 -2913 57578
1547 57578 143638 86729 -21083 -51788 12804 21785 52238 28024 65495 17001 -52240 -16598
1535 -16598 30314 57319 48952 65119 43812 23672 -17390 65823 56240 96594 116212 83212
1523 83212 43552 -136 24348 -1340 25176 -401 13441 2889 -35936 -16768 20258 70057
1511 70057 64103 21336 19023 10869 33254 9359 38001 -11855 7667 71959 43757 -11599
1499a1599L1338J5430q1268K561J25654N605m0351N6733M0690j15209p1781P9833
1487C7636j1811J0223O6799L2007n5019j1999o4167J4362Q261m9082Q1562K6493
1475H5265j2160n3572k0238l3134K8603K8753P5316K3599j57075n9588R0895l2833
1463c6169L6833O6109J1634n4655m2584l3117P3190l9156j9378O2923K8886m6893
1451G623k1710M5609q276J1336M0130k3387o719P5676O8376r4996q6031m999Q061
1438A0693k2439L6008J8641j4768m2487L1997M3247K6803l3341K9064L0138n0708
1426F2848O804k4420l3157l8595Q601R5991J6275j8432n555k7074j9199M091K5334
1413E3512M2442J4828M2618j6164l6843n0034J740K9872O2655r1192j29818M2007
$$ plain form
1499 -11599 19739 35169 -46099 -43538 82116 87721 47370 104103 144793 29584 -42197 37636
1487 37636 25825 36048 102847 134854 79835 67836 3669 18031 26292 -22790 58772 85265
1475 85265 73105 19533 -705 -33839 -5236 23517 98833 122432 -34643 -94231 -3336 -36169
1463 -36169 664 66773 78407 23752 -18832 -51949 21241 -17915 -37293 25630 54516 7623
1451 7623 -14087 31522 23246 34582 74712 51325 44606 120282 188658 93662 7631 2632 10693
1438 10693 -11746 24262 42903 28135 -14352 17645 60892 87695 54354 83418 113556 62848
1426 62848 69652 45232 12075 -26520 -17919 78072 94347 75915 70360 43286 24087 28178 53512
1413 53512 95954 110782 153400 137236 100393 50359 52099 81971 144626 53434 -76384 -34377
1401c4377m4681M2118N2662K9620o685L9170J8532o234j08255O0164l993N322
1389D3363m5456K2102J5550l5597l4794N8188Q0213L9042l1125R711p3609K5319
1377G2907J6642O1828N8941m919o4327l3906K6460q6135j3785l7167j1918N6248
1365D0869k0782l0259j7648J2953J8411N9304r570L0378j6788m8419j1551K5973
1353C2871j8173m6456J595R407N023o466j0391P3611N0882k9064k7621p7155L7842
1340d095K4235L1080J5898m7783N2256j1240J6578N0721o2142p5355m5480M6686
1328h641N9510k7486J7960M548L180j5805o6647P6102L3892Q480o2313M4452j1375
1315E5857M6272r073r571r4391J6564K506k5706J5731j10165N4187N5194j9988
$$ plain form
1401 -34377 -79058 -36940 15722 45342 38657 77827 96359 90125 -18130 42034 38041 43363
1389 43363 -2093 20009 35559 -38 -34832 23356 103569 142611 111486 121197 47588 72907
1377 72907 89549 151377 210318 205399 141072 107166 133626 47491 33706 -3461 -15379 40869
1365 40869 20087 -10172 -27820 -14867 3544 62848 53278 83656 66868 18449 6898 32871
1353 32871 14698 -31758 -30163 -20756 -15733 -22199 -32590 41021 91903 62839 35218 -41937 -4095
1340 -4095 20140 51220 67118 19335 71591 60351 76929 127650 65508 -9847 -55327 -8641
1328 -8641 50869 23383 41343 45891 49071 33266 -33381 42721 76613 85093 22780 67232 55857
1315 55857 102129 93056 83485 -10906 5658 8164 -17542 -1811 -111976 -57789 -2595 -22583
1303b2583O816L0441L8682k0662k2976m3301r521J16036L2961m4285k7483L535
1291C7660K163j1860M371L467K3707n9581j7489O9783q493l736j5182o8706M8246
1278D350O6475M9277K8453m59p8784p0223k7505j2993J1233J2590L389M60L1587
1265A7850j9825N6483k9232N7215K00q4109k239j2008k785O6198j0956k9864K8215
1252C5143p6132O1740p932J8793K9079K4017k1166l4263k8998j8475K9556L0987
1240D2349l003k9063K0298K741l512L810j22276J6852Q0211J589l3211N1618L6306
1227F4709k5279j8464K7260N5852n278k6638K4027j6806l4047j3868n1274R000
1215a0806N0032k3781M4244j6883n6630K635J1437l8145J4715M4110M1433m0137
$$ plain form
1303 -22583 -15767 14674 53356 32694 9718 -33583 -43104 72932 105893 61608 34125 37660
1291 37660 39823 27963 32334 35801 59508 -73 -17562 52221 43728 39992 24810 -43896 4350
1278 4350 70825 120102 148555 148096 69312 -911 -28416 -41409 -30176 -17586 -14197 -13737 17850
1265 17850 -1975 54508 25276 82491 82691 -1418 -3657 -15665 -18450 47748 36792 6928 35143
1252 35143 -40989 20751 12819 31612 60691 84708 63542 29279 281 -18194 11362 42349
1240 42349 39346 10283 30581 33322 29810 33620 -88656 -71804 8407 9996 -23215 28403 64709
1227 64709 39430 20966 48226 104078 98800 72162 96189 79383 45336 31468 -19806 -10806
1215 -10806 39226 15445 59689 42806 -13824 -11189 248 -37897 -23182 20928 62361 22224
1203B2224m1753L5888L1869Q1191j28520n5632o023L9375P0607j0915j34975l1274
1191a27938R9666Q0914l293K3472m287m8073k5378N1359L034P789J2758m4894
1179B5129j3357Q330m5918j0768J7009J731K267J160o3664N0307Q6433J5142n4055
1166A9746q327l5287J1672K6080N487k2253M678k0027N5708p479m41Q664q357
1153B9864L834j9076M3356J2726N1694p5739K3470M4336m4733m6509m036L050
1141B2237m3177p967l531K8117J0644M364J9042O4151j6473n1293r873k1303L5583
1128C0521K6687J5422l1724k2005m0610K5472n0713k0965Q2518N3039N4699n2455
1116F9886l4074k834J2614R8180q7818o2750R7001l4398r179r188o513L2470j991
$$ plain form
1203 22224 -19529 16359 48228 129419 899 -54733 -60756 -21381 49226 38311 -96664 -127938
1191 -127938 -28272 52642 49349 72821 68534 20461 -4917 46442 49476 57265 70023 25129
1179 25129 11772 20102 -25816 -36584 -19575 -17844 -15577 -14417 -78081 -27774 58659 73801 19746
1166 19746 11419 -23868 -12196 13884 19371 -2882 1796 -18231 37477 29998 29557 38221 29864
1153 29864 33698 14622 57978 70704 122398 46659 70129 114465 69732 23223 19187 22237
1141 22237 -20940 -28907 -32438 -4321 6323 10687 29729 93880 77407 26114 16241 -5062 30521
1128 30521 57208 72630 40906 18901 -21709 3763 -46950 -67915 14603 67642 122341 69886
1116 69886 35812 32978 45592 143772 55954 -6796 90205 55807 46628 37440 30927 63397 61406
1103F1406j2711m5847j9087M0241R038l2115M7246j7613m377l1998j839K7846
1091B0190k168N2765Q588L1709J4447n6809n3351R170j1748k7858M194P0112n0593
1078H648r0925O5560K6304N1069L7123p684m2675M4386L620O202k1334r3175k4424
1065c7305J0651P6076k1478O591l6365N573N963l8334M6625J0389m9607R703L1244
1052A9726o5461K8048K4695L4719l3169R295J2251j2883m9793l8069K5669m0215
1040h5187N4256M5529m011o9054k5272P1097k4113N6945O0642l0763j21364j4427
1028h5722J428L3939M6419M2994L8431m6809l1312j0130N2404K3447p2925L4183
1016B6347r965q110K6011k2276m8411m6596K4777N8412M8567J1280m2344k7404
$$ plain form
1103 61406 48695 2848 -16239 24002 33040 925 48171 30558 26181 -5817 -7656 20190
1091 20190 18022 70787 79375 111084 125531 68722 15371 24541 12793 -15065 -10871 59241 8648
1078 8648 -82277 -16717 9587 60656 97779 90095 47420 91806 95426 101628 80294 -12881 -37305
1065 -37305 -26654 49422 27944 34535 -1830 3743 9706 -28628 17997 28386 -21221 -11518 19726
1052 19726 -45735 -17687 7008 41727 8558 17853 30104 17221 -32572 -70641 -44972 -85187
1040 -85187 -30931 14598 10587 -58467 -83739 -12642 -36755 20190 80832 50069 -71295 -85722
1028 -85722 -84294 -50355 -3936 39058 77489 30680 -632 -10762 41642 65089 -7836 26347
1016 26347 16382 8272 34283 12007 -36404 -83000 -58223 189 48756 60036 17692 -9712
1004i712K2842O4733J5514o4391q0413k4864L7689K8835l363Q0252N79p0945O5444
991F2200L9396k6610n4141l1074P948L4272n02L6879l166l618q4768M8106j2819
978A2103N775n028L5327J2016m7941J3578M2277m4835n9221Q4447l1267j5363
966A868j3679m588M6259j6750m4412J13491m4629m0889Q4655n3802p69K5806L5378
953H7939j2821k64j8257j00281K5137N6335m548N9035k3329p1606P4393L2921
941A04654j15105k5459M6263J4225m9985Q2337m0693n6813K4816q630O0043k0765
929A4888o9101N1115O6054k1941K6775n5980l9185L6427L465M669K080l7401r605
916b7740R023l1350M4612K6460p078j1084j9500l5360j9746k4020L0626R9424
$$ plain form
1004 -9712 13130 77863 93377 28986 -51427 -76291 -38602 -9767 -13130 67122 67701 -3244 62200
991 62200 101596 74986 20845 -10229 -2281 31991 31489 68368 65202 61584 -23184 24922 12103
978 12103 17878 12850 48177 60193 12252 25830 68107 23272 -35949 48498 17231 1868
966 1868 -11811 -16399 29860 13110 -31302 82189 37560 -3329 81326 27524 26755 52561 87939
953 87939 75118 74854 56597 -43684 -18547 37788 33240 92275 68946 -2660 71733 104654
941 104654 -10451 -35910 10353 24578 -25407 56930 16237 -40576 -15760 -24390 35653 14888
929 14888 -54213 -3098 62956 41015 67790 11810 -27375 9052 12517 17186 19266 -18135 -27740
916 -27740 -18717 -50067 -5455 21005 13927 2843 -16657 -52017 -71763 -95783 -65157 34267
904C4267L5197J4550j0895m5850l0773j3403R028P2560p7900j2137q613n3489
892h7458Q8731M2322j0934J3140L5371j6720o1508p6125L9703M3616P1614q329
880G3423l9785p0696N627j4430K1278N152m9846L6699o284j6075l249J3506N3381
867H701N8692m9853m0543m7185O9228m7090j7383o877j3052M407O4379P6626J0868
854G0918l3243r780p233k0781L8895l4774N3389L2160k2948l2875K5350j2163
842D6915K6444l387k5293K0304o6804n635j4755J8703j9802L1948L7181l8563
830G256n6721k0912O9762R9982Q883m2262r1617P314n4065j0318L5952K1837M4256
817A9347j3581J2830k897o97n9744o824j8275L2408P5595m8383M6302J8434L0539
$$ plain form
904 34267 69464 84014 73119 27269 -3504 -16907 -7879 64681 -13219 -25356 -33969 -87458
892 -87458 1273 43595 32661 45801 81172 64452 2944 -73181 -33478 10138 81752 73423
880 73423 33638 -37058 -31431 -45861 -24583 -19431 -69277 -32578 -38862 -54937 -58186 -44680 8701
867 8701 67393 17540 -23003 -70188 -960 -48050 -65433 -72310 -85362 -80955 -16576 60050 70918
854 70918 37675 27895 20662 -119 38776 4002 57391 89551 66603 33728 59078 46915
842 46915 73359 69972 44679 64983 -1821 -7456 -22211 -3508 -23310 8638 45819 7256
830 7256 -49465 -70377 -615 99367 108250 65988 -25629 -18315 -72380 -82698 -46746 -24909 19347
817 19347 5766 18596 15699 15002 -44742 -51566 -69841 -37433 38162 -10221 36081 54515 85054
804H5054l4204m6182J8000j07335J183L9176j6381J6962n477M3721L5820j7067
792A3270k5212M3289L0761K5965o0751k4291K7778q6074J2658K0783J4034j0746
780a8536k6358P7241L7887r0156o547O6398K5593k9757j4105J0791j4586O7684
768H5549j4590n0906j07239J7117L1747k3880K7784M932k8709m0762M8649M3390
756f918L5534O08J5610j8999p89l0733r146j3841j890q2186N9137R1846J5212
743E3445L4159m0124m9438L4249P1604N8181j0861j43815m1587O5291L4892q468
731E7528l8828l261m6669J4171J8637k8358o5258k4563L6936O7943n8063L5674
719c4111J6252N7109K9846k8734n7181L873N0166k8670j8495M796K3649n8416
$$ plain form
804 85054 50850 4668 22668 -84667 -83484 -44308 -60689 -43727 -49204 -5483 30337 13270
792 13270 -11942 31347 62108 88073 27322 3031 30809 -55265 -42607 -21824 -7790 -18536
780 -18536 -44894 32347 70234 -19922 -26469 39929 65522 35765 21660 32451 17865 85549
768 85549 70959 20053 -87186 -70069 -38322 -62202 -34418 -29486 -58195 -98957 -50308 -6918
756 -6918 28616 29224 44834 25835 25046 -5687 -14833 -28674 -30564 -112750 -53613 38233 53445
743 53445 87604 47480 -1958 32291 103895 162076 151215 7400 -34187 31104 65996 57528
731 57528 18700 15439 -31230 -17059 1578 -26780 -92038 -116601 -79665 -11722 -69785 -34111
719 -34111 -17859 39250 69096 40362 -16819 -12946 37220 8550 -9945 -5149 18500 -39916
707c9916N5691L8193j7899m0077m3357n4837M055Q4447O3930M0787k6504o1198
695C315k4626M9538o578k6783M3449J9594m3183o1534k2490k1757j6681L3828
683g3908J8830K7446P3482n1352K5333l489K1890m1656L3599L3504n4920l5745
671b6986l5735N140Q31P6596j8138n1044R0073j9669M7875M7694o2226j8809m8969
658a3367K1684J7787j1296n7704M1381P9280l9168L8652n6165k1800j7619l0606
646d8941J5145Q601J23001l6568r616K0719k1255L0304N689j06613j4863N8233
634B3836j0832l9154n8255n116J2073K9864O6218J9749r648l7620o6118J220n9562
621a33345Q6182P8431L1567O1856j60016k3547J0238n7572J35006R429o0037m329
$$ plain form
707 -39916 15775 53968 36069 -4008 -47365 -102202 -98147 -13700 50230 91017 64513 3315
695 3315 -21311 28227 21649 -5134 38315 57909 14726 -46808 -69298 -91055 -107736 -73908
683 -73908 -55078 -27632 45850 -5502 19831 16342 38232 -3424 30175 63679 8759 -26986
671 -26986 -62721 -57581 -56750 19846 1708 -49336 40737 21068 68943 116637 54411 35602 -13367
658 -13367 8317 26104 14808 -42896 -1515 77765 38597 77249 21084 -716 -18335 -48941
646 -48941 -33796 -25195 97806 61238 51622 72341 51086 81390 87079 -19534 -34397 23836
634 23836 13004 -26150 -84405 -89521 -77448 -47584 18634 38383 28735 -8885 -75003 -73783 -133345
621 -133345 -47163 31268 62835 124691 -35325 -58872 -48634 -106206 28800 38229 -21808 -26137
609b6137M2623m7175l2100J0661N6872l7608J1653P6636k3596o3667j8236N2985
597B911m4564N2650L2965J105k2950q1287l906N6336L08O102j8107K8565m5119
584c4991M2430k0140m4821N075N4947N0009l8105k2359J3660q587m9452L1400
572b0934Q318j1252k0638L3131M7668K3461l4237j2585o5341P1946L0811r3409
560d3061L7430l8101L7706P2552M4716n8999k9696o9723n7282M9028N0626N2644
548D7840r454p525K6429m621n9035m3229J1521M7312j696p395j3129n58j1382
535b4922J6767k4120J03535K5162L832p8438l1901r172l9011P2806M2978K3580
523H1096j6042j1402p955j3261l5511k1508L7292k4669Q161k2756L1010N5787
$$ plain form
609 -26137 16486 -30689 -62789 -52128 4744 -32864 -21211 55425 31829 -31838 -50074 2911
597 2911 -41653 10997 43962 45067 22117 -59170 -63076 -6740 -6432 -330 -18437 10128 -34991
584 -34991 7439 -12701 -57522 -52447 2500 52509 14404 -7955 5705 -2882 -52334 -20934
572 -20934 -12616 -23868 -44506 -11375 36293 59754 25517 12932 -52409 19537 50348 -43061
560 -43061 -5631 -43732 -6026 66526 111242 52243 22547 -47176 -104458 -55430 -4804 47840
548 47840 38386 30861 57290 52669 -6366 -49595 -38074 9238 7542 147 -12982 -13540 -24922
535 -24922 -8155 -32275 71260 96422 100254 21816 -10085 -19257 -58268 14538 57516 81096
523 81096 65054 53652 45697 32436 -3075 -24583 12709 -11960 -3799 -26555 4455 60242
511F0242o3087L230m318j9436J9032o8656L1850P1687m3592Q216k3332j7001R2298
498D7133q172q2035P357J1601L9983J5147L8482L5706n3568k1131M2230K9564
486A02297k1281p2563j9432N1571L8669p0384J151P460j2557k0784J7656O9620
474G1423p8746r2505L4849J14453K7055l5574L6976j8085j13376J8636N4179k6032
462f747N8020q453q790j54112M5102M7479M1030p6704j8713L7663M3181J588K1625
449B2169O820p0025K6934J253L169p4799J8554K0097m219L6701N8556j7451k8928
436a169m8463j0193J8083l804N9786J9071K7155L9222L944k4557j15853O713m531
423c4596J9177M628N660J2535n6866j3829K949N882P521N3922Q5031m1992Q140
$$ plain form
511 60242 -2845 385 -3933 -23369 -4337 -72993 -41143 30544 -13048 -4832 -28164 -45165 47133
498 47133 38961 -43074 -35717 -24116 15867 31014 69496 105202 51634 30503 72733 102297
486 102297 81016 8453 -10979 40592 79261 8877 10028 17488 4931 -15853 1803 71423
474 71423 -7323 -99828 -64979 49474 76529 40955 77931 59846 -53530 -34894 19285 -6747
462 -6747 51273 42820 34030 -120082 -74980 -27501 13529 -63175 -81888 -44225 -1044 544 22169
449 22169 28989 -41036 -14102 -12849 -9680 -84479 -65925 -45828 -50047 -13346 45210 27759 -1169
436 -1169 -49632 -59825 -41742 -45546 14240 33311 60466 99688 103632 79075 -36778 -30065 -34596
423 -34596 -15419 -10791 -5131 7404 -49462 -63291 -60342 -54460 -46939 6983 92014 50022 58162
410E8162m7743J7807o7916l349M6320M0566j3250l3873k8664j7900K6880n029
398b7989J09446K883l5704m7536m1847j8945M151L2296Q4496p0561M9772o623
386C3839n9600L3841j4728j6250k3884M569N5426o1536r512M7720k3070J17298
374H4113o7566l6593j2897K4403O029m8682J4392O365k9768m0701N9893Q2936
362D1924r5848n5023N1221L9891L4716k6319N9744o0736O35P0633k3381j2542
350B4915O183N302l2938O0466o2445m1112m6466N0285L9328N3348K3624m1995
338C8495l2085j9996J954J0537j206m3442O0725J8462r185j24876M8853N4999
326C235n515m5985K6280j1585j5390K3661K3307J01235q0749J8881n4389n6242
$$ plain form
410 58162 10419 28226 -39690 -43039 3281 43847 30597 -3276 -31940 -49840 -22960 -27989
398 -27989 81457 84340 48636 1100 -40747 -59692 -55541 -23245 61251 -9310 40462 33839
386 33839 -25761 8080 -6648 -22898 -46782 -42213 13213 -48323 -57835 -10115 -33185 84113
374 84113 16547 -20046 -32943 -8540 -2511 -51193 -36801 -30436 -60204 -100905 -41012 41924
362 41924 -53924 -108947 -57726 -17835 16881 -9438 50306 -10430 -9795 60838 37457 24915
350 24915 31098 36400 3462 63928 1483 -39629 -86095 -35810 3518 56866 80490 38495
338 38495 6410 -13586 -11632 -1095 -2301 -45743 14982 33444 24259 -100617 -51764 3235
326 3235 -2280 -48265 -21985 -33570 -48960 -25299 -1992 99243 18494 37375 -17014 -73256
314g3256m797M5480J8659l3437j429O000K1106j05089M8257L7651J1203J5750
302a3902O6927l9365K8954n3718o808J11l6436K2361L4473L2361j37124R31j0328
289a11563J2432j3859J07470J1221N813k1556n8343L1024j1588m0279k0330N2737
277e6821L7447J0590K5062l7037m2406j7779Q0590M3847m9597J4807l5986k7956
265e5239j9359M7480O0945K6145l3554k4536k1949l3114P582O0380J2669l484
253B3966L3869l8867k606p635j8965J6134j1313k6173K4512L2192o0797p369R7152
240E4100p3677l5042O6560j4325j6109l7806R6380n1598n3139P7315m1474p9654
228a08469j8988K9663L5789N3890L8951j5947l8038J1905o1694N4241J6881o1028
$$ plain form
314 -73256 -78053 -32573 -13914 -47351 -48780 -42780 -21674 -126763 -78506 -40855 -29652 -13902
302 -13902 53025 13660 42614 -11104 -17912 -17801 -54237 -31876 2597 34958 -102166 -101235 -111563
289 -111563 -99131 -112990 -5520 5701 11514 -10042 -68385 -37361 -48949 -89228 -109558 -56821
277 -56821 -19374 -8784 16278 -20759 -63165 -80944 -354 43493 -6104 8703 -27283 -55239
265 -55239 -74598 -27118 33827 59972 26418 1882 -20067 -53181 -45599 14781 27450 23966
253 23966 57835 18968 16362 8727 -10238 5896 -5417 -31590 -7078 25114 -35683 -43052 54100
240 54100 -19577 -54619 11941 -2384 -18493 -56299 40081 -11517 -64656 12659 -28815 -108469
228 -108469 -127457 -97794 -62005 -8115 30836 14889 -23149 -11244 -72938 -18697 -1816 -62844
216f2844N736j869K7565m918k1603k7113k5036J1480P680p192P3037n4877M4391
203c5563J9024k1690n1395k668N2282J6971n2203k9979L1296N8741N3066k0305
191A7577J9263N395o787n8703j4930M0189J7429j783K0267J7258m7439m5058m4534
178h1856J8044K00k1561O4375Q1750k8533m1304n611J7037k5828O6427r846k4449
165H845k1884q7374k0828K3092K4734J0166K8279k5745O5332j5648J1471n5882
153e5442j7408J3539K4232j6132J8410k5701j273L660Q7485n9858m2951J5796
141e5643k8188P221j4815M188M6450M806m0701K179J9113K3266k9906M328O980
128e0722R118q951o716R418m6730o9743P6777j6833m3456N6923j7104m3186N5807
$$ plain form
216 -62844 -57108 -58977 -31412 -36330 -57933 -85046 -110082 -98602 -90922 -98114 -25077 -79954 -35563
203 -35563 -16539 -38229 -89624 -92292 -40010 -23039 -75242 -105221 -73925 -15184 37882 17577
191 17577 36840 42235 35448 -23255 -38185 2004 19433 17650 37917 55175 7736 -37322 -81856
178 -81856 -63812 -63612 -85173 -20798 60952 32419 -8885 -14496 2541 -23287 43140 33294 8845
165 8845 -13039 -100413 -121241 -98149 -73415 -63249 -34970 -60715 4617 -11031 440 -55442
153 -55442 -72850 -59311 -35079 -51211 -32801 -58502 -59775 -56115 31370 -28488 -71439 -55643
141 -55643 -83831 -76610 -91425 -87237 -40787 -35981 -76682 -74503 -55390 -32124 -62030 -57702 -50722
128 -50722 -41604 -50555 -57271 -47853 -94583 -164326 -87549 -104382 -147838 -90915 -108019 -151205 -95398
115i5398M3279j7370j7680P5246N084j07951l790l3092j4218O7744K9235J3266
103e5645j6690j9904n2208q144N9583m0181o958K7900j4988J7270M2710j6279
91h3534Q844l6341K1500J835L2368L0882o7133q0392j2867Q466O0033J7667m0125
78a38797K8163j40N5897k5125O630K5199k5971K5270j9628p1046M3665J6467n3016
65a32432J952j974o359N1502j5604m9542n2258L5843N1060J8990K5247L229l6668
52a07014J7162q903m6441R222O553p3177J237J7096M6285J2650k5717Q0338J9625
39e1084o5072n344J1662J0384m5137J5507m707n7510O7685k2944m2704l0884L7650
26a82498K1694j6135j6549O8361L954J144k2454l479J7120J1454O484n8923K331
$$ plain form
115 -95398 -52119 -69489 -87169 -11923 -6839 -114790 -118580 -151672 -165890 -98146 -68911 -55645
103 -55645 -72335 -92239 -144447 -152591 -93008 -133189 -140147 -112247 -127235 -109965 -67255 -83534
91 -83534 -74690 -111031 -89531 -87696 -55328 -24446 -91579 -171971 -184838 -176372 -116339 -98672 -138797
78 -138797 -110634 -110774 -54877 -80002 -73372 -48173 -74144 -48874 -68502 -139548 -95883 -79416 -132432
65 -132432 -130480 -132454 -138813 -87311 -102915 -152457 -204715 -168872 -117812 -98822 -73575 -70346 -107014
52 -107014 -89852 -98755 -145196 -135974 -129421 -202598 -201361 -184265 -137980 -125330 -151047 -70709 -51084
39 -51084 -116156 -121500 -109838 -99454 -144591 -129084 -133791 -191301 -123616 -146560 -189264 -220148 -182498
26 -182498 -160804 -176939 -193488 -125127 -121173 -120029 -142483 -145962 -128842 -117388 -110904 -169827 -167496
13a67496J7998K1953n0728p093k7912K7332M3708k7513k5363P094k5611N2465
1a61166j8461
0a79627
$$ plain form
13 -167496 -149498 -127545 -178273 -185366 -213278 -185946 -142238 -169751 -195114 -188020 -213631 -161166
1 -161166 -179627
0 -179627
$$ Imaginary data points
##PAGE= N=2
##DATA TABLE= (X++(I..I)), XYDATA
16383a216016M4831m7556J3897q125M2904l6193l142N6870M9560K6116P456P5009
16371i94389J1773K3000j1534p620P053J3299N450L0002N6319M0913k5393j8569
16359h69696J2226K3010J4648L8431k1815J2998N0712k7047M023M1395O3078L7455
16347f20582P806l9442L518n6187m080O8165K7198j4654k7048Q0964N9130j3745
16335e28957j7706N3576K6801K7365j7729N2061l5241J722j4084j6642K5965J7718
16323d25151r344K0767K3304O7915N8006Q119l1491M1459M8698j9682L56L3083
16311a83961L7313k5175P529L6689l6294j4672q295J4957M9049K2955j7680K838
16299a14747r018K2832P1873M9248K7839l0663n1719J7815O6094Q0L8000M172
$$ plain form
16383 -1216016 -1171185 -1218741 -1204844 -1212969 -1170065 -1206258 -1209400 -1152530 -1102970 -1076854 -1069398 -994389
16371 -994389 -982616 -959616 -971150 -978770 -971717 -958418 -952968 -922966 -866647 -825734 -851127 -869696
16359 -869696 -857470 -834460 -819812 -781381 -803196 -790198 -739486 -766533 -762510 -721115 -658037 -620582
16347 -620582 -612776 -652218 -648700 -704887 -708967 -640802 -613604 -628258 -655306 -574342 -515212 -528957
16335 -528957 -546663 -493087 -466286 -438921 -456650 -404589 -439830 -438108 -452192 -468834 -442869 -425151
16323 -425151 -434495 -413728 -390424 -322509 -264503 -256384 -287875 -246416 -197718 -217400 -217044 -183961
16311 -183961 -146648 -171823 -164294 -127605 -163899 -178571 -186866 -171909 -122860 -99905 -117585 -114747
16299 -114747 -123765 -100933 -29060 20188 48027 17364 -34355 -16540 49554 49634 87634 91806
16287I1806n931J4577j2185k271L7607M0718K2795j5611J0971l2837J9024O0498
16275B29161K8928N085k6206m913J2779J7905M1266l6535M7640k6076L7717J0347
16263C37098m072j4658m9285M7714L2781J4082L8780J3807J9492l6956M8985k4572
16251D23196j0591j7369K5607P3075K3425o0944k2724K5623l2331N4759K3204
16240E04930J5426p610M5179J5610k4662J5284l0287L2596j9866O0804M6517m5669
16228F08252p374K2592l6501K7685O296m0861J16391J2614j7980P1680M498m215
16216G63077j8380n4999R897N2497L0344K5562p7747n0898k0280P461N7186L5587
16204G59307K0976l9297N0672N6864J6864l6672J622k3131J0599l0908L0539M144
$$ plain form
16287 91806 85875 100452 88267 85996 123603 164321 187116 171505 182476 149639 168663 229161
16275 229161 258089 263174 236968 232055 244834 262739 304005 267470 315110 289034 326751 337098
16263 337098 333026 318368 269083 316797 349578 363660 402440 416247 435739 398783 447768 423196
16251 423196 412605 395236 420843 493918 517343 456399 433675 459298 426967 481726 504930
16240 504930 520356 512746 557925 573535 548873 564157 533870 566466 546600 607404 653921 608252
16228 608252 600878 623470 586969 614654 620950 580089 696480 709094 691114 762794 767292 763077
16216 763077 744697 689698 699595 752092 782436 807998 730251 679353 659073 666534 723720 759307
16204 759307 780283 740986 791658 848522 865386 828714 830336 807205 817804 786896 817435 821579
16192H21579L1963k7046j8157L2852n5077L5174K0023O8247J3808r2339L0749
16181H61776L1016k9708p5306J7156O4409j7741J7272J45060j03425o3405l1916
16170H15188Q870J6810N8421k9692L3446J1132L8501M5688K7942k5845k2982L4013
16158A011492k6057r645m6931L499M1661N8271j09854j6009L9187J2226O9454
16147A027294m4301l135M7017M103n1055n3702N5817N9007j7760m0837P8308p8567
16135I82189j376M0165n394m7701J8905L582J7339n6540L4828O8292L9864m1561
16123A052592k0447k8360N290M2988N4089J2048r8163j7130O2627j6430L0830
16112A079934j2118j0189r594l8201P4193j1379k966j1820n4837K8638Q7070k4081
$$ plain form
16192 821579 853542 826496 808339 841191 786114 821288 841311 909558 923366 831027 861776
16181 861776 892792 863084 787778 804934 869343 851602 868874 1013934 910509 847104 815188
16170 815188 824058 840868 899289 869597 903043 914175 952676 998364 1026306 1000461 977479 1011492
16158 1011492 985435 975790 928859 932358 974019 1032290 922436 906427 945614 957840 1027294
16147 1027294 982993 979858 1026875 1030978 979923 926221 982038 1041045 1023285 982448 1060756 982189
16135 982189 980813 1020978 1015584 967883 986788 990370 1007709 951169 985997 1054289 1094153 1052592
16123 1052592 1032145 1003785 1009075 1052063 1106152 1118200 1020037 1002907 1065534 1049104 1079934
16112 1079934 1067816 1057627 1048033 1009832 1084025 1072646 1069680 1057860 1003023 1031661 1118731 1094650
16100A094650P535N542o8705P6284O055n4287j8089m1425N2863q823l9613L1798
16088A043785J7851p395j4928j5069J7104M454P9819R396k4503j00089L0973J612
16076A043010l4668P5349K1947k4313j5047q188j9175J2734J1151L2179j0042
$$ plain form
16100 1094650 1102185 1107727 1039022 1115306 1121361 1067074 1048985 1007560 1060423 1051600 1011987 1043785
16088 1043785 1061636 1054241 1039313 1024244 1041348 1045802 1125621 1135017 1110514 1010425 1041398 1043010
16076 1043010 1008342 1083691 1105638 1081325 1066278 1058090 1038915 1051649 1062800 1094979 1084937
$$ [...]
##END NTUPLES=NMR SPECTRUM
##END=
