##TITLE=1H_DE-80H_X3
 200.13MHz, d2o
 8 sc
 
 19ns.26.2.2025
##JCAMPDX= 6.0         $$ Bruker NMR JCAMP-DX V2.0
##DATA TYPE= NMR SPECTRUM
##DATA CLASS= NTUPLES
##ORIGIN= UXNMR, Bruker Analytische Messtechnik GmbH
##OWNER= pz
$$ XWIN-NMR		Version 3.5
$$ Thu Jul 16 11:07:18 2026 Russian Standard Time (UT+4h)  Yarkov@DPX200
##.OBSERVE FREQUENCY= 200.1313
##.OBSERVE NUCLEUS= ^1H
##.ACQUISITION MODE= SIMULTANEOUS
##.ACQUISITION SCHEME= undefined
##.AVERAGES= 8
##.DIGITISER RES= 18
##SPECTROMETER/DATA SYSTEM= spect
##.PULSE SEQUENCE= zg30
##.SOLVENT NAME= DMSO
##.SHIFT REFERENCE= (INTERNAL, DMSO, 0, 15.4979)
##AUDIT TRAIL= $$ (NUMBER, WHEN, WHO, WHERE, WHAT)
$$ ##TITLE= Audit trail, XWIN-NMR		Version 3.5
$$ ##JCAMPDX= 5.01
$$ ##ORIGIN= Bruker BioSpin GmbH
$$ ##OWNER= Yarkov
$$ C:/Bruker/XWIN-NMR/data/yarkov2/nmr/H-C/1/pdata/1/auditp.txt
$$ ##AUDIT TRAIL=  $$ (NUMBER, WHEN, WHO, WHERE, WHAT)
(   1,<2026-07-16 11:06:33.59 +0400>,<Yarkov>,<DPX200>,
      <created by zg, POWCHK disabled, PULCHK disabled
       configuration hash MD5:
       00 E9 B6 7A A2 85 ED C7 34 08 36 98 17 FE 4E 26
       data hash MD5: 16K
       EA 22 79 06 42 CC AB E4 82 03 BB ED A9 9F 52 A4>)
(   2,<2026-07-16 11:06:39.34 +0400>,<Yarkov>,<DPX200>,
      <Start of raw data processing
       efp BC_mod = 2 LB = 0.25 FT_mod = 6 PKNL = 1 PHC0 = -7255.922 PHC1 = 7.421964 SI = 16K 
       data hash MD5: 16K
       F3 45 FE 15 70 37 33 2A 7B 27 97 A6 37 83 87 D6>)
$$ ##END=
$$ 
$$ hash MD5
$$ CF 7A 6F 37 7B B4 DB FA 41 30 CA F7 8B AC 56 FD
##$RELAX= 
##$RELAX= 
##$RELAX= 
##$RELAX= 
##$RELAX= 
##$RELAX= 
$$ Bruker specific parameters
$$ --------------------------
##$DU= <C:/Bruker/XWIN-NMR>
##$EXPNO= 1
##$NAME= <H-C>
##$PROCNO= 1
##$TYPE= <nmr>
##$USER= <yarkov2>
##$AMP= (0..31)
100 100 100 100 100 100 100 100 100 100 100 100 100 100 100 100 100 100 
100 100 100 100 100 100 100 100 100 100 100 100 100 100 
##$AQSEQ= 0
##$AQ_mod= 1
##$AUNM= <au_zg>
##$AUTOPOS= <>
##$BF1= 200.13
##$BF2= 200.13
##$BF3= 200.13
##$BF4= 200.13
##$BF5= 200.13
##$BF6= 200.13
##$BF7= 200.13
##$BF8= 200.13
##$BYTORDA= 1
##$CFDGTYP= 0
##$CFRGTYP= 5
##$CHEMSTR= <none>
##$CNST= (0..31)
1 1 145 1 1 1 1 1 1 1 1 1 1 1 1 1 1 1 1 1 1 1 1 1 1 1 1 1 1 1 1 1 
##$CPDPRG= <>
##$CPDPRG1= <>
##$CPDPRG2= <>
##$CPDPRG3= <>
##$CPDPRG4= <mlev>
##$CPDPRG5= <mlev>
##$CPDPRG6= <mlev>
##$CPDPRG7= <mlev>
##$CPDPRG8= <mlev>
##$CPDPRGB= <>
##$CPDPRGT= <>
##$D= (0..31)
0 0.7 0 0 0 0 0 0 0 0 0 0.03 0 0 0 0 0 0 0 0 0 0 0 0 0 0 0 0 0 0 0 0 
##$DATE= 1784185593
##$DBL= (0..7)
120 120 120 120 120 120 120 120 
##$DBP= (0..7)
150 150 150 150 150 150 150 150 
##$DBP07= 0
##$DBPNAM0= <>
##$DBPNAM1= <>
##$DBPNAM2= <>
##$DBPNAM3= <>
##$DBPNAM4= <>
##$DBPNAM5= <>
##$DBPNAM6= <>
##$DBPNAM7= <>
##$DBPOAL= (0..7)
0.5 0.5 0.5 0.5 0.5 0.5 0.5 0.5 
##$DBPOFFS= (0..7)
0 0 0 0 0 0 0 0 
##$DE= 6
##$DECBNUC= <off>
##$DECIM= 32
##$DECNUC= <off>
##$DECSTAT= 4
##$DIGMOD= 1
##$DIGTYP= 9
##$DL= (0..7)
0 120 120 120 120 120 120 120 
##$DP= (0..7)
$$ [...]
##$SUBNAM2= <"">
##$SUBNAM3= <"">
##$SUBNAM4= <"">
##$SUBNAM5= <"">
##$SUBNAM6= <"">
##$SUBNAM7= <"">
##$SUBNAM8= <"">
##$SUBNAM9= <"">
##$SW= 18.0517328524113
##$SWIBOX= (0..15)
0 0 2 0 0 0 0 0 0 0 0 0 0 0 0 0 
##$SW_h= 3612.71676300578
##$TD= 16384
##$TD0= 1
##$TE= 0
##$TE2= 300
##$TE3= 300
##$TEG= 300
##$TL= (0..7)
0 120 120 120 120 120 120 120 
##$TP= (0..7)
150 150 150 150 150 150 150 150 
##$TP07= 0
##$TPNAME0= <>
##$TPNAME1= <>
##$TPNAME2= <>
##$TPNAME3= <>
##$TPNAME4= <>
##$TPNAME5= <>
##$TPNAME6= <>
##$TPNAME7= <>
##$TPOAL= (0..7)
0.5 0.5 0.5 0.5 0.5 0.5 0.5 0.5 
##$TPOFFS= (0..7)
0 0 0 0 0 0 0 0 
##$TUNHIN= 0
##$TUNHOUT= 0
##$TUNXOUT= 0
##$USERA1= <user>
##$USERA2= <user>
##$USERA3= <user>
##$USERA4= <user>
##$USERA5= <user>
##$V9= 5
##$VALIST= <valist>
##$VCLIST= <CCCCCCCCCCCCCCC>
##$VD= 0
##$VDLIST= <DDDDDDDDDDDDDDD>
##$VPLIST= <PPPPPPPPPPPPPPP>
##$VTLIST= <TTTTTTTTTTTTTTT>
##$WBST= 1024
##$WBSW= 4
##$XGAIN= (0..3)
0 0 0 0 
##$XL= 0
##$YL= 0
##$YMAX_a= 86998
##$YMIN_a= -129573
##$ZGOPTNS= <>
##$ZL1= 120
##$ZL2= 120
##$ZL3= 120
##$ZL4= 120
##$ABSF1= 0
##$ABSF2= 0
##$ABSG= 0
##$ABSL= 0
##$ALPHA= 0
##$AQORDER= 0
##$ASSFAC= 0
##$ASSFACI= 0
##$ASSFACX= 0
##$ASSWID= 0
##$AUNMP= <proc_1d>
##$AZFE= 0.1
##$AZFW= 0.1
##$BCFW= 0
##$BC_mod= 2
##$BYTORDP= 0
##$COROFFS= 0
##$CY= -3
##$DATMOD= 1
##$DC= 0
##$DFILT= <>
##$DTYPP= 0
##$F1P= 0
##$F2P= 0
##$FCOR= 1
##$FTSIZE= 16384
##$FT_mod= 6
##$GAMMA= 0
##$GB= 0
##$INTBC= 1
##$INTSCL= 3.241238e-09
##$ISEN= 128
##$LB= 0.25
##$LEV0= 0
##$LPBIN= 0
##$MAXI= 10000
##$MC2= 0
##$MEAN= 0
##$ME_mod= 0
##$MI= 1.114404
##$NCOEF= 0
##$NC_proc= -8
##$NLEV= 6
##$NOISF1= 3.799351
##$NOISF2= 2.8
##$NSP= 0
##$NTH_PI= 0
##$NZP= 0
##$OFFSET= 15.4979
##$PC= 1
##$PHC0= -7255.922
##$PHC1= 7.421964
##$PH_mod= 1
##$PKNL= yes
##$PPARMOD= 0
##$PSCAL= 0
##$PSIGN= 0
##$REVERSE= no
##$SF= 200.130004762784
##$SI= 16384
##$SIGF1= 3
##$SIGF2= 2
##$SINO= 0.751879
##$SIOLD= 32768
##$SREGLST= <19F.Aceton>
##$SSB= 0
##$STSI= 16384
##$STSR= 0
##$SW_p= 3612.71676300578
##$SYMM= 0
##$S_DEV= 0
##$TDeff= 16384
##$TDoff= 0
##$TI= <>
##$TILT= no
##$TM1= 0
##$TM2= 0
##$TOPLEV= 0
##$USERP1= <user>
##$USERP2= <user>
##$USERP3= <user>
##$USERP4= <user>
##$USERP5= <user>
##$WDW= 1
##$XDIM= 16384
##$YMAX_p= 299618745
##$YMIN_p= -1509020
$$ End of Bruker specific parameters
$$ ---------------------------------
##NTUPLES= NMR SPECTRUM
##VAR_NAME=  FREQUENCY,     SPECTRUM/REAL,   SPECTRUM/IMAG
##SYMBOL=    X,             R,               I
##VAR_TYPE=  INDEPENDENT,   DEPENDENT,       DEPENDENT
##VAR_FORM=  AFFN,          ASDF,            ASDF
##VAR_DIM=   16384,         16384,           16384
##UNITS=     HZ,            ARBITRARY UNITS, ARBITRARY UNITS
##FACTOR=    0.220516191357247, 1,           1
##FIRST=     3101.5948026454, 0,             0
##LAST=      -511.121960360385, 0,           0
##MIN=       -511.121960360385, -1509020,    0
##MAX=       3101.5948026454, 299618745,     0
$$ Real data points
##PAGE= N=1
##DATA TABLE= (X++(R..R)), XYDATA
$$ [...]
5110A5677593l91291k42260J28902K04371j95889m7455k24377r7347m28255j74160
5100A4209832o3873j30938K06835j93190j40682m39929N3788j03896J28940j63213
5090A3363674K21205J5813M322p8845j93935l36065j23616k11647k77169J82500
5080A2566237J22850O0259N4896L7853P511l87747j49203l8617n64115J18080
5070A1828004L50444l54582k60756j44592J17569L36952j10132J499j79817k46482
5060A1338107J36205n0954j66539l04106P3472k33415n3689j5125N65344k12355
5050A1076945m22891O4155o19441K0425j36940M16499j11011o8865K02371j37120
5040A0284127n31028k10714N92107j54880k08896Q0710r1105q3756k56594l05748
$$ y = [15677593, 15286302, 15044042, 15172944, 15377315, 15181426, 15133971, 14909594, 14812247, 14383992, 14209832, 14145959, 14015021, 14221856, 14028666, 13887984, 13448055, 13501843, 13397947, 13526887, 13363674, 13584879, 13600692, 13605014, 13526169, 13332234, 12996169, 12872553, 12660906, 12383737, 12566237, 12689087, 12749346, 12804242, 12842095, 12849606, 12461859, 12312656, 12274039, 11709924, 11828004, 12178448, 11823866, 11563110, 11418518, 11536087, 11873039, 11762907, 11764406, 11584589, 11338107, 11474312, 11423358, 11256819, 10952713, 11026185, 10792770, 10739081, 10723956, 11289300, 11076945, 10654054, 10718209, 10098768, 10119193, 9982253, 10398752, 10287741, 10218876, 10421247, 10284127, 9753099, 9542385, 10134492, 9979612, 9770716, 9851426, 9760321, 9676565, 9419971, 9114223]
5030I114223k61789R5823N1177l89678j51027O49374j5375j94433k52264K11344
5020H857375L39176Q157p624j22517J01550M4564k24274l93919K44411j31229
5010H715670j59850K3974J82756j53259m32752K34872R4569k40136l01683L30246
5000H294407K66426j37578M90889Q3132l05181J16495J28201K69988K2735L81215
4990I610729L15135O27730m3408q316K4580l75803K9876l15945m53383n17521
4980H893674m42697o99931k4682K54115q6359p6500K2296J13281P3292j66645
4970G859844k2564r2006j96895j51205L5210m3635J40623N1745q6539k33208J15740
4959G377110r9451l89122k80176R8455M9664P2725m2469O8851J88367j67075L33205
$$ y = [9114223, 8852434, 8948257, 8999434, 8609756, 8458729, 9108103, 9092728, 8898295, 8646031, 8857375, 9196551, 9204708, 9197084, 9074567, 9176117, 9220681, 8996407, 8602488, 8846899, 8715670, 8555820, 8579794, 8762550, 8609291, 8176539, 8411411, 8505980, 8265844, 7964161, 8294407, 8560833, 8423255, 8914144, 8997276, 8692095, 8808590, 8936791, 9206779, 9229514, 9610729, 9925864, 10553594, 10510186, 10501870, 10526450, 10150647, 10180523, 9864578, 9411195, 8893674, 8450977, 7751046, 7726364, 7980479, 7894120, 7817620, 7839916, 7953197, 8026489, 7859844, 7837280, 7745274, 7548379, 7397174, 7432384, 7388749, 7529372, 7581117, 7494578, 7261370, 7377110, 7277659, 6888537, 6608361, 6706816, 6756480, 6829205, 6786736, 6855587, 7043954, 6876879, 7210084]
4948G210084N8428M4732O5761r1958j51524j92847J3314n1643m04245J82209K23314
4937F905625J26734k01997O6279k39563K1379K3693l07472L10653M48346k98075
4927F855602l92355L40381J99235k00261k59900l9481j88167j48472J35437J61045
4917F463064j12951l52705K14998L31347L35075j16208q8434O2251j59928J23478
4907F699987l37131R8878L60931M85039J25410j95056j27503n75028l555J6649
4897F548621N8753J55835j54155N09010L18370K64614j44933m5607k71158k63216
4887F976134n727l818J43015Q0296K20244n35982J83582l0618j07894K26409M02804
4876G548445L37685l82530j2383p6647K03491j32275J48987n7258M26733Q849
$$ y = [7210084, 7268512, 7313244, 7379005, 7287047, 7135523, 6942676, 6955990, 6904347, 6500102, 6682311, 6905625, 7032359, 6830362, 6896641, 6657078, 6678457, 6702150, 6394678, 6705331, 7153677, 6855602, 6463247, 6803628, 7002863, 6802602, 6542702, 6503221, 6315054, 6166582, 6302019, 6463064, 6350113, 5997408, 6212406, 6543753, 6878828, 6762620, 6674186, 6736437, 6576509, 6699987, 6362856, 6461734, 6822665, 7307704, 7433114, 7238058, 7110555, 6535527, 6531972, 6548621, 6607374, 6763209, 6609054, 7118064, 7436434, 7701048, 7556115, 7510508, 7239350, 6976134, 6970407, 6966589, 7109604, 7189900, 7410144, 6874162, 7057744, 7027126, 6919232, 7145641, 7548445, 7886130, 7503600, 7491217, 7414570, 7618061, 7485786, 7634773, 7577515, 8004248, 8013097]
4866H013097K3822M9699j22288L63649n0943n6328J56495K10233Q0254K11606
4856H879296L87128J46308L73137M80518N12235L70021J85376O32063L38088L85266
4846A2689436K81554K44944k95419K40671j19839k2935j48745J93651M32617J974
4836A3497909N54547K57926P14626P12479N17458P09805J087644J102229J427567
4827B0582190K317480L513469O564071Q400422J1088614R949172N383383O55810
4819F8454611p46398j867589n632058o005386o067853m686238m616790l622544
4811C5209755k927589j443896o24968p14774J19165m55952l869j75642l6244n1218
4801B8894768J50297N78565M56602R01535M64699M37743M31980J006533O73992
$$ y = [8013097, 8036919, 8086618, 7964330, 8327979, 8277036, 8220708, 8377203, 8587436, 8667690, 8879296, 9266424, 9412732, 9785869, 10266387, 10778622, 11148643, 11334019, 11966082, 12304170, 12689436, 12970990, 13215934, 12920515, 13161186, 13041347, 13018412, 12869667, 13063318, 13495935, 13497909, 14052456, 14310382, 15025008, 15737487, 16254945, 16964750, 18052394, 19154623, 20582190, 22899670, 26413139, 32977210, 41377632, 52466246, 62415418, 67798801, 68454611, 67708213, 65840624, 60208566, 54203180, 48135327, 43449089, 38832299, 35209755, 32282166, 30838270, 30213302, 29498528, 29617693, 29161741, 29157872, 28982230, 28945986, 28894768, 29045065, 29623630, 30080232, 30981767, 31446466, 31884209, 32316189, 33322722, 33996714]
4792C3996714L99189O95932N92049J164926L10404J033412P71588P03899M47109
4783D0115222L38839O50437K03175Q7664k03538J49582r467J94746j66726K25366
4773D1585300K63835l72274k42173j83720k11701o00969k90838k71468k68670
4764C9407322n3267j65096k17186l99544J42636l75437k85372o26747j95604o53918
4754C6577787p75821j48020m79126k89001o54431J6942k07182o00794l36245j40733
4744C2963376l17572p42699m48740n07934r8412l49752j24343K51923m78830J88643
4734C0335660n15473L20900P5249k2951Q9533K56369k16781k80337M48249L39386
4724C0829804Q71312J09414N68172j76704J82718L69883O09420P73466j10386
$$ y = [33996714, 34395903, 35091835, 35683884, 36848810, 37159214, 38192626, 38964214, 39668113, 40115222, 40454061, 41104498, 41307673, 41395337, 41191799, 41341381, 41331914, 41526660, 41359934, 41585300, 41849135, 41476861, 41234688, 41050968, 40839267, 40238298, 39947460, 39675992, 39407322, 39354055, 39188959, 38971773, 38572229, 38714865, 38339428, 38054056, 37427309, 37231705, 36577787, 35801966, 35653946, 35174820, 34885819, 34231388, 34248330, 34041148, 33440354, 33104109, 32963376, 32645804, 31903105, 31454365, 30946431, 30848019, 30498267, 30373924, 30625847, 30147017, 30335660, 29820187, 30141087, 30216336, 30193385, 30282918, 30539287, 30322506, 30042169, 30490418, 30829804, 31701116, 31810530, 32378702, 32201998, 32384716, 32754599, 33364019, 34137485, 34027099]
4715C4027099P13971L81443L75658N39341Q66280m6847N03586R51655M45254J072876
4705C9830316L42601J030458Q03373L59039M30614O47380O37600N51174O45853
4696D5278408P92601P04240R3371O6604J30681M56238K20368l21022q5174K39
4686D7336554n03118p95219n35447k41951n39009l97401m88549n05187m25183
4677D2905490n18579j041681n70969m02570q39025m79164l4166L07727o94175
4668C8632888n67184p61381q00332j118415q95790o47737r08286q22886q82920
4659C1227957n33571r51774n39555r66672n23804m88010p87605o16485j009471
4650B4811010k04501r66335j326917m28412J6517l43812n70653K92346j33990
$$ y = [34027099, 34741070, 35122513, 35498171, 36037512, 36903792, 36856945, 37360531, 38312186, 38757440, 39830316, 40172917, 41203375, 42006748, 42365787, 42796401, 43443781, 44081381, 44632555, 45278408, 46071009, 46775249, 46868620, 46935224, 47065905, 47522143, 47742511, 47421489, 47336315, 47336554, 46833436, 46038217, 45502770, 45260819, 44721810, 44324409, 43835860, 43330673, 42905490, 42386911, 41345230, 40774261, 40371691, 39532666, 39053502, 39019336, 39327063, 38632888, 38065704, 37304323, 36503991, 35385576, 34489786, 33842049, 32933763, 32110877, 31227957, 30694386, 29742612, 29203057, 28236385, 27712581, 27224571, 26436966, 25820481, 24811010, 24606509, 23640174, 22313257, 21884845, 21901362, 21557550, 20986897, 21279243, 21145253]
4641B1145253o74466o69890m81665o2896m81068k87284K23559K72836M65334L67762
4631A9817475N89428J167995J645935K378133L485300L195698K133536K53102
4623C4666602m245l13940j156727j570946j132388n37779p86219l31957n18625
4614B8313776J81799O1702P23387M49562J222161J674969Q69860J453982J451077
4605C6402275J025868M46931J682492J687752K137110K045965J309059J295045
4597D8032497M54468N13099O71951J074600J615254J985441J672223m6521m92937
4588E5480075j363347j343419j358163j060417k72156j352555j703425k051765
4580D4974828j732616k753569k213087k213301j691782j903376j986974j467438
$$ y = [21145253, 20470787, 19800897, 19319232, 19256336, 18775268, 18487984, 18711543, 18984379, 19449713, 19817475, 20406903, 21574898, 23220833, 25598966, 29084266, 32279964, 34413500, 34666602, 34662357, 34348417, 33191690, 31620744, 30488356, 29950577, 29164358, 28832401, 28313776, 28495575, 28557277, 29280664, 29730226, 30952387, 32627356, 33497216, 34951198, 36402275, 37428143, 37875074, 39557566, 41245318, 43382428, 45428393, 46737452, 48032497, 48486965, 49000064, 49672015, 50746615, 52361869, 54347310, 56019533, 55973012, 55480075, 54116728, 52773309, 51415146, 50354729, 50082573, 48730018, 47026593, 44974828, 43242212, 40488643, 38275556, 36062255, 34370473, 32467097, 30480123, 29012685]
4572B9012685k160832j819189k277621j991555j777171j356574j500562o32995
4564A5496186q27981m94183n76083j276304J7045o60473m79105j88801K28690
4555A1238991P2447k54293Q1283q8361K45994m5324k3468R2307J11839l61748
4545A1069667m03955P3184m6079l13127l52616J99906M59878l31405j80562j67475
4535A0007416m78053p20795k60937K26790J89492k46153k35510P73285J06085
4526I361620p0159m66957j60422l19596k93043o01028l183M58497n09232l32363
4516G064134J6120L15692m71883l9329L4233N8851m32324m58811j34517j37139
4506E815027N31056j58626L16985K66898M07011m35940o03050J18695j78758o8672
$$ y = [29012685, 26851853, 25032664, 22755043, 20763488, 18986317, 17629743, 16129181, 15496186, 14668205, 14174022, 13597939, 12321635, 12338680, 11678207, 11199102, 11010301, 11238991, 11311438, 11057145, 11138428, 11050067, 11296061, 11250737, 11227269, 11319576, 11431415, 11069667, 10665712, 10738896, 10692817, 10379690, 10027074, 10226980, 10686858, 10355453, 10174891, 10007416, 9529363, 8808568, 8547631, 8774421, 8963913, 8717760, 8482250, 9255535, 9361620, 9291461, 8824504, 8664082, 8344486, 8051443, 7450415, 7447232, 7905729, 7396497, 7064134, 7080254, 7395946, 6924063, 6884734, 6918967, 6977818, 6545494, 6086683, 5952166, 5815027, 6346083, 6187457, 6504442, 6771340, 7178351, 6742411, 6139361, 6258056, 6079298, 6010626]
4496F010626m73103L08545n9172j97772K07322j83621j18397l08762j42979J77492
4486E220179J95784k23815m60993J34854N9783j73149n04754K30850J97818K07608
4476D884165k46120J40297L12775k39352k58220k43090K75370j94670J64116k2508
4466D572763L58075J03902m65935m47699l01350L92693K00733M59059j15300M5726
4456D802667j12574j93760r0930j27286k4024J12526L25494O8900K45955m56753
4446D550215j56791J4590n48016o9958J7576K35636J43071K0757N43102L9203
4436D789385L7239l41567J08154K27960o1750l18676K4015K51603J09107j36313
4426D689157j93328N49635k80953L43081k34237J42564N6660k05033l24689j89040
$$ y = [6010626, 5537523, 5846068, 5786896, 5589124, 5796446, 5612825, 5494428, 5185666, 5042687, 5220179, 5415963, 5192148, 4731155, 4866009, 4925792, 4752643, 4247889, 4478739, 4676557, 4884165, 4638045, 4778342, 5091117, 4851765, 4593545, 4350455, 4625825, 4431155, 4595271, 4572763, 4930838, 5034740, 4568805, 4121106, 3819756, 4212449, 4413182, 4872241, 4756941, 4802667, 4690093, 4496333, 4405403, 4278117, 4254093, 4366619, 4692113, 4761013, 5006968, 4550215, 4393424, 4408014, 3859998, 3790040, 3807616, 4043252, 4186323, 4207080, 4750182, 4789385, 4826624, 4485057, 4593211, 4821171, 4759421, 4440745, 4464760, 4716363, 4825470, 4689157, 4495829, 5045464, 4764511, 5107592, 4873355, 5015919, 5072579, 4867546, 4542857, 4353817]
4416D353817L85573o21760J46786K95359P49066l38742j35718J75853j3678j19581
4406D876975k53182L06221k1677K42901o51975l2810N3579J31788L48858K77141
4396E277819J23938r6785o09436k33154L52899Q2634k41360J01675M75174P6375
4386E309779M17571J53655M47519l42272k36491l82617N89345N5325k89208k41730
4376E480876Q2908L32224l39894o1307K36715O23199j98947K01673J14162M294
4366F475903k23256J32001K47614j76433j19328M37179P07881q448N6138n9347
4356G469904J27318L47836P9798K67300P82249M61705M34984N66944P71196R70852
4346A2280086M33635j69434L12397j51167o14455m2035o44430K08188l0755P2300
$$ y = [4353817, 4739390, 4117630, 4264416, 4559775, 5308841, 4970099, 4834381, 5010234, 4996556, 4876975, 4623793, 4930014, 4908337, 5151238, 4499263, 4466453, 4520032, 4651820, 5000678, 5277819, 5401757, 5304972, 4695536, 4462382, 4815281, 4897915, 4656555, 4758230, 5233404, 5309779, 5727350, 5881005, 6328524, 5986252, 5749761, 5367144, 5956489, 6011814, 5722606, 5480876, 5563784, 5896008, 5556114, 5494807, 5731522, 6354721, 6155774, 6357447, 6471609, 6475903, 6252647, 6384648, 6632262, 6455829, 6336501, 6773680, 7481561, 7473113, 7529251, 7469904, 7597222, 7945058, 8024856, 8292156, 9074405, 9536110, 9971094, 10538038, 11309234, 12280086, 12713721, 12544287, 12856684, 12705517, 12091062, 12049027, 11404597, 11612785, 11582030, 11654330]
4336A1654330k9491M37449K23513l23712J05736k406l9597j96799J96508P2494
4326A2098025k61345k69534M22795J91733m8408P0512M46869L26298k55815m27368
4316A2293762j71859k19238k87519j75617K63707J14360L0980J28266m0003Q6932
4306A2023771J13153l09301m55202k23622k35416P8732J09143k67165j65504J49013
4296A0817602k14626k58588r3732J32917n245l71769R9236o7380l43120m24957
4286I270338k37658P04074q4704o2772j7198K67509L2077J23843p5270P8145J03938
4275A0102322N4199J23366j67331K16981j1491O29276J23981N15754m10507M10745
4265A1587295O84477k44301j03975J0299N04383Q3442N00248L93505L25756M44514
$$ y = [11654330, 11624839, 12062288, 12285801, 11962089, 12067825, 12065419, 12025822, 11829023, 12025531, 12098025, 11836680, 11567146, 11989941, 12181674, 12133266, 12203778, 12650647, 12976945, 12721130, 12293762, 12121903, 11902665, 11615146, 11439529, 11703236, 11817596, 11848576, 11976842, 11936839, 12023771, 12136924, 11827623, 11372421, 11148799, 10913383, 10992115, 11101258, 10834093, 10668589, 10817602, 10602976, 10344388, 10250656, 10383573, 10378328, 10006559, 10105795, 10038415, 9695295, 9270338, 9032680, 9736754, 9652050, 9589278, 9572080, 9839589, 9871666, 9995509, 9920239, 9998384, 10102322, 10156521, 10279887, 10112556, 10329537, 10318046, 10947322, 11071303, 11587057, 11176550, 11587295, 12271772, 12027471, 11923496, 11933795, 12438178, 12521620, 13021868, 13415373, 13741129, 14185643]
4255A4185643M95958J62152M69849N89968J09380J27067O55273Q79937J65258
4246A7840485J01918N83736p134l06790L1585n2944K60730k06882j71447m11510
4236A7661747J95964n69088r1515J5063O7402L28624k5384m924m52365R1841n09101
4225A6708264l27388k38203j84998o55541M12146O1933n47137l92401j66969j3408
4215A4656298l70030m17348m19167P2541l78708m77933m38927O1556j2872l77162
4205A1898248M855J29529k03268j078850r40236m33698j98202n03974q5394K8023
4195H617033J54054q9654j34063j78193m12279n59883m5877k46233k22135k29507
4185F653263j60610K60535m33108J09768n75255J4275K01873K89022L07523j01094
$$ y = [14185643, 14681601, 14843753, 15313602, 15903570, 16012950, 16140017, 16795290, 17675227, 17840485, 17942403, 18526139, 18519005, 18212215, 18243800, 18190856, 18451586, 18244704, 18073257, 17661747, 17857711, 17288623, 17197108, 17212171, 17279573, 17608197, 17582813, 17577889, 17125524, 17217365, 16708264, 16380876, 16142673, 15957675, 15302134, 15714280, 15776213, 15229076, 14836675, 14669706, 14656298, 14286268, 13868920, 13449753, 13522294, 13143586, 12665653, 12226726, 12288282, 12275410, 11898248, 11903103, 12032632, 11829364, 10750514, 9810278, 9376580, 9178378, 8674404, 8589010, 8617033, 8771087, 8681433, 8547370, 8369177, 7956898, 7397015, 7351138, 7104905, 6882770, 6653263, 6492653, 6753188, 6320080, 6429848, 5854593, 5868868, 6070741, 6359763, 6667286, 6566192]
4175F566192k60313l91790l06531l03202J12106r8045K54012K45833N76521l80132
4165F014651l42847r6349n00685J835J13089j2749Q0819J85845k81947Q5625k25752
4154E021535k85908N06061P65452K07942j53543J29551n6939l54101o6686J86400
4144E899764k49237j46195J38742O00875K33283l26316q1917L5937j394n4490
4134F049052j62914J17175j05017j4927K32948j01809k28252J64192O71620l1226
4124F590842m646k5686j31193l10506m42003m59377r7170L81261J84289L57736
4114F043547N6471N12302J98769m67247n21707o5603l60708q2470N82159L21686
4104F217199L81544l3043K60821o8809N6331j78123K02451l31676J47021m64622
$$ y = [6566192, 6305879, 5914089, 5607558, 5304356, 5416462, 5318417, 5572429, 5818262, 6394783, 6014651, 5671804, 5575455, 5074770, 5076605, 5189694, 5176945, 5257764, 5443609, 5161662, 5247287, 5021535, 4735627, 5241688, 6007140, 6215082, 6061539, 6191090, 6134151, 5780050, 5713364, 5899764, 5650527, 5504332, 5643074, 6243949, 6477232, 6150916, 6068999, 6104936, 6103542, 6049052, 5886138, 6003313, 5898296, 5883369, 6116317, 6014508, 5786256, 5950448, 6622068, 6590842, 6586196, 6560510, 6429317, 6118811, 5676808, 5217431, 5120261, 5501522, 5685811, 6043547, 6100018, 6612320, 6811089, 6343842, 5822135, 5756532, 5395824, 5313354, 5895513, 6217199, 6598743, 6565700, 6826521, 6757712, 6814043, 6635920, 6838371, 6506695, 6653716, 6189094]
4094F189094l0747J18186J19491k88763J92392Q42112L08811j68673L1714n6934
4084G256683m33038k31095j48185L95155K96880L65439N1645K79690K09552J20999
4074H163725m6391j82554P5723p8417n6232L14185L21196M7411L43611L22091
4064I224348n7054K79346Q30311P8303j73165L76629P5128m3414k18169K53428
4054A0625691K71196N78418J49284M35178J66414J96247m7503N4228Q6222r9093
4044A2416282N409l4938k38302n5521O6101K8926O3012k28064K49136j47533k07057
4033A1917451n9435j26697K8020k63001J11296k39190j11316K93319N79640o4733
4023A2065354R3461J80117o7678o6614n0822Q2354j46011k77854J8260L22210
$$ y = [6189094, 6158347, 6276533, 6396024, 6107261, 6299653, 7141765, 7450576, 7281903, 7313617, 7256683, 6823645, 6592550, 6444365, 6839520, 7136400, 7501839, 7553484, 7833174, 8042726, 8163725, 8117334, 7934780, 8010503, 7932086, 7875854, 8190039, 8511235, 8558646, 8902257, 9224348, 9167294, 9446640, 10276951, 10355254, 10182089, 10558718, 10633846, 10590432, 10372263, 10625691, 10896887, 11475305, 11624589, 12059767, 12226181, 12422428, 12374925, 12429153, 12515375, 12416282, 12421691, 12386753, 12148451, 12092930, 12159031, 12187957, 12250969, 12022905, 12272041, 12124508, 11917451, 11858016, 11731319, 11759339, 11496338, 11607634, 11368444, 11257128, 11550447, 12130087, 12065354, 12158815, 12338932, 12271254, 12204640, 12153818, 12236172, 12090161, 11812307, 11830567, 12152777]
4013A2152777L59810J6891J01110N96746J97683P6979m0007R9201j66930P8356
4003A3472616K36492N14489O71291N52833M27527M00017Q04870n0405K5013J63372
3993A7218115J75154J46351N00572M35360N62875M28739O05470Q86563M91209
3984B1450408L23432J76308M63717K41869O49334L32084L03565M62802O56306
3975B5059825J138199O36234O38831P59809R43589P85775N14098P30303Q30490
3966C2037153J220923J312819J112440J718743J842806J639183J733000J936340
3958D4553407J548296J111015J256395J204704J789130J188944J537907J404532
3950E5594330J710260J492020K226619K751075K701946L096083K582551K272354
$$ y = [12152777, 12512587, 12529478, 12630588, 13227334, 13425017, 13501996, 13461989, 13561190, 13394260, 13472616, 13709108, 14223597, 14894888, 15447721, 15875248, 16275265, 17080135, 17029730, 17054743, 17218115, 17393269, 17539620, 18040192, 18475552, 19038427, 19467166, 20072636, 20959199, 21450408, 21773840, 21950148, 22413865, 22655734, 23305068, 23637152, 23940717, 24403519, 25059825, 26198024, 26834258, 27473089, 28232898, 29176487, 29962262, 30476360, 31206663, 32037153, 33258076, 34570895, 35683335, 37402078, 39244884, 40884067, 42617067, 44553407, 46101703, 47212718, 48469113, 49673817, 51462947, 52651891, 54189798, 55594330, 57304590, 58796610, 61023229, 63774304, 66476250, 69572333, 72154884, 74427238]
3942G4427238J230487J139059O09254J032976P07142N79036Q68154Q78986J224671
3933H2697003O00667R37305P85847J259040J142900R27224J106846J455387J156517
3924I2068736R18120Q47407O65946P02419K96410j64111M21812j23633M34916
3915I6068022O00103R06045P98995o6335m59637j162552j250956k274054k008267
3906I1151364k569239k460988k613353k423212k051336k681392k031100j952549
3898G2368195j330362j465376j251598j490793j136933j713147j259021j310361
3890F1410604j488174j225587j451104j035627j176186r20315j202479r42559
3882E1968573r55231p49713q87711j415792j156348p32280j407174j244213r43092
$$ y = [74427238, 75657725, 76796784, 77406038, 78439014, 79146156, 79725192, 80593346, 81472332, 82697003, 83297670, 84234975, 85020822, 86279862, 87422762, 88349986, 89456832, 90912219, 92068736, 92986856, 93834263, 94500209, 95202628, 95499038, 95334927, 95756739, 95633106, 96068022, 96668125, 97574170, 98373165, 98306830, 97847193, 96684641, 95433685, 93159631, 91151364, 88582125, 86121137, 83507784, 81084572, 79033236, 76351844, 74320744, 72368195, 71037833, 69572457, 68320859, 66830066, 65693133, 63979986, 62720965, 61410604, 59922430, 58696843, 57245739, 56210112, 55033926, 54113611, 52911132, 51968573, 51013342, 50263629, 49375918, 47960126, 46803778, 46071498, 44664324, 43420111, 42477019]
3873D2477019o68238o35217l27125o33187m24991p81789o23504r00053r18181
3864C6564734q23748p88536n23946r19069o41013o84454n52675m41066o95570
3855C0494657n74952p29906m61257j197494n43059p72276p92815n84582j50605
3846B4687711K7088j3977k22113m00244j78660l64589m17512o08222o5883o73024
3836B1770575m52491k09304r6523j04734l4854k44379o05240p1697m21288m41024
3826A9089041k56004k0378n57769o80496J20702J92834K13024K41041q3169l63325
3816A7895501k89835Q0273j6958j12205K47806M3825K61567L65438N49112O73495
3806A9698019Q13429M99857M91678K31015J65108r0949K86982J13603K27103K16911
$$ y = [42477019, 41808781, 41173564, 40846439, 40213252, 39788261, 39006472, 38382968, 37482915, 36564734, 35740986, 34952450, 34428504, 33509435, 32868422, 32183968, 31631293, 31190227, 30494657, 29919705, 29189799, 28728542, 27531048, 26987989, 26215713, 25422898, 24838316, 24687711, 24714799, 24700822, 24478709, 24078465, 23899805, 23535216, 23117704, 22509482, 22443599, 21770575, 21318084, 21108780, 21012257, 20907523, 20872669, 20628290, 20023050, 19951353, 19530065, 19089041, 18833037, 18812659, 18254890, 17574394, 17695096, 17887930, 18100954, 18341995, 18258826, 17895501, 17605666, 17685939, 17668981, 17556776, 17804582, 17848407, 18109974, 18475412, 19024524, 19698019, 20511448, 21011305, 21502983, 21733998, 21899106, 21808157, 22095139, 22208742, 22435845, 22652756]
3796B2652756O09438J088745N05758N46071O64340J159902R36304N26865Q78366
3787B9568545R26210M60640L8480M03932M06310N95664J22060J85397K45359k41990
3777C2710607n15714k94362j12209k98984j95308j47957K89914L22191J26451
3768C1884629K35627J84017q2870N6475m09496P4943j54244m21068k85211O04401
3758C1687203m4156l67768Q3963P33794J247295O06620P25988P91963Q19106k37757
3748C6046251J11411L58658L69148k51767l1292l07027n07974m42181j315725
3739C4029502o64998j295467r91928q26648q22416r62169j307215n31488n14331
3730B6112842k60878r55214K5299M2756n9989l15732n58753N2112j65372l47921
$$ y = [22652756, 23262194, 24350939, 24856697, 25402768, 26067108, 27227010, 28163314, 28690179, 29568545, 30494755, 30955395, 30993875, 31397807, 31804117, 32399781, 32521841, 32707238, 32952597, 32710607, 32194893, 31900531, 31788322, 31489338, 31294030, 31146073, 31435987, 31758178, 31884629, 32120256, 32304273, 32221403, 32277878, 31868382, 31943325, 31789081, 31368013, 31082802, 31687203, 31643047, 31275279, 31359242, 32093036, 33340331, 33946951, 34672939, 35464902, 36284008, 36046251, 36157662, 36516320, 36885468, 36633701, 36602409, 36295382, 35787408, 35345227, 34029502, 33364504, 32069037, 31077109, 30250461, 29428045, 28465876, 27158661, 26627173, 26112842, 25851964, 24896750, 24922049, 24964805, 24904816, 24589084, 24030331, 24082443, 23917071, 23569150]
3720B3569150m04848K03786M11068M48376K25048M92816Q99587O9484j65665J04678
3710B5853480l5617J48288j31366M80975J43L46088K40263O15397L37587K05513
3700B8060751R4460l83905Q4799k78189j72334l25615K92430K12056r9692k57451
3690B7227310K47790K94727L21514J12921j47398M7312m40408j9488j69241L29054
3680B7804093J71524M03257L80288O34934O84787M10579M56429K99273N28452
3671C1773616K9550L43521K80181M66112R06299J68100O66584O9644K57883k5528
3661C4935962o62882j34269p74341q6484j02880N22686K11461Q6982k45763J71014
3651C3921486j752p12875m8069l20731k76142m20686n95576q72646o11156m85301
$$ y = [23569150, 23164302, 23368088, 23779156, 24227532, 24452580, 24945396, 25844983, 25914467, 25748802, 25853480, 25817863, 25966151, 25834785, 26315760, 26315903, 26661991, 26902254, 27517651, 27855238, 28060751, 28155211, 27771306, 27856105, 27577916, 27405582, 27079967, 27372397, 27584453, 27484761, 27227310, 27475100, 27769827, 28091341, 28204262, 28056864, 28104176, 27663768, 27644280, 27475039, 27804093, 27975617, 28378874, 28759162, 29394096, 30078883, 30489462, 30945891, 31245164, 31773616, 31803166, 32146687, 32426868, 32892980, 33799279, 33967379, 34633963, 34703607, 34961490, 34935962, 34273080, 34138811, 33364470, 33277986, 33175106, 33697792, 33909253, 33996235, 33750472, 33921486, 33919734, 33206859, 33158790, 32838059, 32561917, 32141231, 31545655, 30673009, 30061853, 29576552]
3641B9576552p20553l59019m49055l53503k76940O1276n10689j80586p6437n297
3631B6705749N6670m07655N84143N49626N33364n8672O09348R72338N95309N08954
3621C0649174M50116N73186K17443K77468m9707L27173P08752K34155J86813M04788
3611C3979361M93874j85238j67116j24988j39467K41155k68226J88708J61306
3602C4179369p8218j49814L75879r3328K25453l6151K16998K82969m10356k67524
3592C4245277k53288J60036o77941j24018l10175M5848m13415l30616m3780j66451
3582C2131477l16979q22177m55103o42543J85168j8068Q9154L76375O62731K44584
3572C1434619n8508P49403J97808L90942M11220P54498N22781J295651J186265
$$ y = [29576552, 28855999, 28496980, 28047925, 27694422, 27417482, 27478758, 26968069, 26787483, 26711046, 26705749, 26762419, 26354764, 26938907, 27488533, 28021897, 27963225, 28572573, 29544911, 30140220, 30649174, 31099290, 31672476, 31889919, 32167387, 32117680, 32444853, 33153605, 33387760, 33574573, 33979361, 34473235, 34287997, 34120881, 33995893, 33856426, 34097581, 33829355, 34018063, 34179369, 34101151, 33951337, 34327216, 34233888, 34459341, 34423190, 34640188, 34923157, 34512801, 34245277, 33991989, 34152025, 33474084, 33350066, 33039891, 33085739, 32672324, 32341708, 32297928, 32131477, 31814498, 30992321, 30537218, 29894675, 30079843, 30061775, 30150929, 30527304, 31190035, 31434619, 31376111, 32125514, 32323322, 32714264, 33125484, 33879982, 34402763, 35698414, 36884679]
3563C6884679J038755J326789J427450J288760R68713Q52529J017077N22911j2012
3554D5315651N85701L98539J45128N30661N83944K98359N09275L98549J85103
3545D8950910m5124O33349J87664L10936K91184K80372M73304R70144N42200M08270
3535E3003209M42194K20339P15907N7386K45867J006372P98871P28009L05577
3526E7523731O40924M05439L44517j71728k88813j73425J80811n12184q16942
3517E7132330l76982o15285l20827p99797n74883l47325n40837p46641o60242
3508E2149511o89378n95267j010277q23631n17205m47922k29738r5805j68553
3499D7571735K33471L93200N93143M63970O56814Q53788J576428J372470J415938
$$ y = [36884679, 37923434, 39250223, 40677673, 41966433, 42935146, 43787675, 44804752, 45327663, 45315651, 45901352, 46299891, 46445019, 46975680, 47559624, 47857983, 48367258, 48765807, 48950910, 48905786, 49539135, 49726799, 50037735, 50328919, 50609291, 51082595, 52052739, 52594939, 53003209, 53445403, 53665742, 54381649, 54439035, 54684902, 55691274, 56490145, 57218154, 57523731, 58164655, 58570094, 58914611, 58742883, 58454070, 58280645, 58461456, 57949272, 57132330, 56755348, 56140063, 55819236, 55019439, 54444556, 54097231, 53556394, 52809753, 52149511, 51460133, 50864866, 49854589, 49030958, 48513753, 48065831, 47836093, 47740288, 47571735, 47805206, 48198406, 48791549, 49255519, 49912333, 50766121, 52342549, 53715019, 55130957]
3490E5130957J429702K159805K367449J830061K100229J952227K417139K556481
3482G1944050K372046K102925K377197K300255J808965K375519K392093K526668
3474I0199718K051877J731246J297075J385090J157415R83375M36104P0803P0202
3465I9382905l75202n99248q64352p47306n82261j84895q88039j186233j096372
3456I2858997p94614r43533k108571j925487j669335j650062j445366q42169m40097
3447H1039763m74708l09243o38126m1847m00396l09639p53120j064212q19416
3438G6229056j963506k840187k648693k942301l016132k711269l033942k766257
3430E4306769k039558j877036j639189j865229j512398j174932j074067r00381
$$ y = [55130957, 56560659, 58720464, 61087913, 62917974, 65018203, 66970430, 69387569, 71944050, 74316096, 76419021, 78796218, 81096473, 82905438, 85280957, 87673050, 90199718, 92251595, 93982841, 95279916, 96665006, 97822421, 98805796, 99241900, 99312703, 99382905, 99007703, 98408455, 97544103, 96796797, 96214536, 96029641, 95141602, 93955369, 92858997, 92064383, 91120850, 89012279, 87086792, 85417457, 83767395, 82322029, 81479860, 81039763, 80565055, 80255812, 79617686, 79575839, 79175443, 78865804, 78112684, 77048472, 76229056, 74265550, 71425363, 68776670, 65834369, 62818237, 60106968, 57073026, 54306769, 52267211, 50390175, 48750986, 46885757, 45373359, 44198427, 43124360, 42223979]
3422D2223979m09448l00043j02067l23129n80389n05434o87321m65245k80201
3413C8570702l72929k8624k07626j97937l55006k0411k72194K30479n2397k10699
3403C7083358j55213j34877k00375o65548j29198j76419J68262K35715J87061
3394C6212766K58069K14726K01927k20144N40904J006399Q34360O98137Q43496
3385D0590640J219169J153840Q82272N27244P95103O27738L61456L44499K58723
3376D6760684j71116m34214j034011j264863j218283j300103r81411q39786j043302
3367C8473595j152788j290584q87242q93421m22301k39809k06099n13586k93778
3358C2573987k88210l0276o05864j031811m85612r4908j03932k09591N3495K17230
$$ y = [42223979, 41814531, 41514488, 41412421, 41089292, 40508903, 40003469, 39316148, 38850903, 38570702, 38197773, 38169149, 37961523, 37763586, 37408580, 37388169, 37115975, 37346454, 37294057, 37083358, 36928145, 36793268, 36592893, 35927345, 35798147, 35621728, 35789990, 36025705, 36212766, 36470835, 36685561, 36887488, 36667344, 37208248, 38214647, 39049007, 39747144, 40590640, 41809809, 42963649, 43845921, 44373165, 45168268, 45796006, 46157462, 46501961, 46760684, 46589568, 46155354, 45121343, 43856480, 42638197, 41338094, 40356683, 39516897, 38473595, 37320807, 36030223, 35142981, 34249560, 33827259, 33587450, 33381351, 32867765, 32573987, 32285777, 32255501, 31649637, 30617826, 30132214, 30037306, 29933374, 29723783, 29777278, 29994508]
3348B9994508J76543j70451j72351k2691k37515k2076p3246p0315m31280l86846
3338B8584280n88384p25836m69494k59850J35223O60680O69371Q9866L21569N10110
3328B8927535j10514K36273N17401P85428O38325N96469O07216O58424R76124
3319C3832681Q82295J383871J862025J985038J680944J700946J844402J467286
3311D6639488O32894k4555K48838l07153n89749j151442j506356j874778j930677
3302D0136510k116656k453881k600967k146893j435711j407441j191735j076299
3294B5706927n36343r86096r22005q89320o58415m63928p05735q22016k69355
3285A9453714o59801j246215q44509k05888j70837N0463k87707N8976j03029l06483
$$ y = [29994508, 30171051, 30000600, 29828249, 29805558, 29568043, 29545967, 29472721, 29402406, 28971126, 28584280, 27995896, 27270060, 26800566, 26540716, 26675939, 27336619, 28005990, 28095856, 28417425, 28927535, 28817021, 29053294, 29570695, 30356123, 30994448, 31590917, 32198133, 32856557, 33832681, 34714976, 36098847, 37960872, 39945910, 41626854, 43327800, 45172202, 46639488, 47272382, 47247827, 47496665, 47189512, 46599763, 45448321, 43941965, 42067187, 40136510, 38019854, 35565973, 32965006, 30818113, 29382402, 27974961, 26783226, 25706927, 25170584, 24184488, 23262483, 22373163, 21714748, 21250820, 20545085, 19723069, 19453714, 18793913, 17547698, 16703189, 16497301, 16326464, 16376927, 16089220, 16148196, 16045167, 15738684]
3275A5738684k55972m23165m28166k26220j60854j68852k23000J5430k4948l08244
3265A3534693l57900J5609m15672J20534M9596l36775m64569o0041K44077q5756
3255A2243796k36364P1735L69400n8702k70141m61349k48127N67k78426n84484
3245A0547905k25385j71208o5577P7377L77552j55867l07791m3328n6606J38606
3235A0115678O6940J06633r6538l93369J76981K91568J05992r390L48172P23454
3225A1436121K91144k49018J4052K43241K78097M8989j58748J64415O69607N56268
3215A3294168o1678L6493L06658k11984m1352k001K02029J18187J74083M99431
3205A4314034J32125k63530J79118K62479M36247Q76067O70174P41349L64077
$$ y = [15738684, 15482712, 15059547, 14631381, 14405161, 14244307, 14075455, 13852455, 13867885, 13842937, 13534693, 13176793, 13192402, 12776730, 12897264, 12946860, 12610085, 12145516, 12085475, 12329552, 12243796, 12007432, 12079167, 12448567, 12389865, 12119724, 11658375, 11410248, 11410815, 11132389, 10547905, 10322520, 10151312, 10085735, 10163112, 10540664, 10384797, 10077006, 10033678, 9977072, 10115678, 10182618, 10289251, 10192713, 9799344, 9976325, 10267893, 10373885, 10364495, 10712667, 11436121, 11727265, 11478247, 11492299, 11735540, 12013637, 12062626, 11903878, 12068293, 12737900, 13294168, 13232490, 13268983, 13575641, 13363657, 13322305, 13320304, 13522333, 13640520, 13814603, 14314034, 14446159, 14182629, 14361747, 14624226, 15060473, 15936540, 16606714, 17348063, 17712140]
3196A7712140L88460J42306M36490K26481n2463l43407p9729J54193j95410J14594
3186A8503655J61188O34000O21772O37274N48603O96946M14152K18454P1577O4849
3176B2572470N47419L93821J4755Q924K35751J74780R561j01206J44710J057019
3166B5058004J450085J193349J161441K081129J930352J259109J244395J492816
3158C6870680J780625J417827J048280J125394R50050O37455N45813Q90684J925764
3149D7192572J538223J948607K104519K491397L105200K759715K512918K781705
3141F6434856L188194L148475K417132K390579J352729R60740O40404j91285p95126
3132G9546698j286508l51308m46768k24959M13248N28845M09198J37939m78707
$$ y = [17712140, 18100600, 18242906, 18679396, 18905877, 18853414, 18510007, 18430278, 18584471, 18389061, 18503655, 18664843, 19298843, 19920615, 20557889, 21106492, 21803438, 22217590, 22436044, 22507621, 22572470, 23119889, 23513710, 23528465, 23537389, 23773140, 23947920, 23957481, 23856275, 24000985, 25058004, 26508089, 27701438, 28862879, 30944008, 32874360, 34133469, 35377864, 36870680, 38651305, 40069132, 41117412, 42242806, 43192856, 43830311, 44376124, 45266808, 47192572, 48730795, 50679402, 52783921, 55275318, 58380518, 61140233, 63653151, 66434856, 69623050, 72771525, 75188657, 77579236, 78931965, 79892705, 80533109, 80341824, 79546698, 78260190, 77908882, 77462114, 77237155, 77650403, 78179248, 78588446, 78726385, 78247678]
3123G8247678j13313Q59341J179622J557038K409263L746161M236935L467561
3115I5590286K396248R74586o03195k169792l233053l886689m440763m602055
3107H0025573m235755l697484l357440k497558j199595p92912n31082M26744J882915
3098F6023406K016365K787412L361931L398126K311618J795209Q44943O12845
3090H3151855J006034J250401J332078K091284L714457N412973P365176J0514024
3082A15838282J4170158J7770177K0020462J8840151J4735698R012492K146507
3075B12533927m445049j0045259j3776490j5607707j6188976j5583504j4045891
3068A22841051j1972760j0268899q375953p533419o615674n686647m937334m812894
$$ y = [78247678, 78134365, 78993706, 80173328, 81730366, 84139629, 87885790, 92122725, 95590286, 97986534, 98961120, 98357925, 96188133, 92955080, 89068391, 84627628, 80025573, 75789818, 72092334, 68734894, 66237336, 65037741, 64244829, 63713747, 64140491, 66023406, 68039771, 70827183, 74189114, 77587240, 79898858, 81694067, 82539010, 83151855, 84157889, 85408290, 86740368, 88831652, 92546109, 97959082, 105324258, 115838282, 130008440, 147778617, 167799079, 186639230, 201374928, 210387420, 212533927, 208088878, 198043619, 184267129, 168659422, 152470446, 136886942, 122841051, 110868291, 100599392, 92223439, 84690020, 78074346, 72387699, 67450365, 62637471]
3060F2637471m097395l415957l392191l367610k622634k485669k284787k518090
3052C8453138k422384k115709j555347j406306j030437j317318j160508j008156
3044B6436973p57718r63953j278571r53884r65427r46116j349479n47852k86015
3035A8387958l81838m03438j061271m54574j46834k67137j070415m12852j33258
3026A4056341l35274n94169n73231J15895l12462n91220n58829q2645n9040j28752
3016A0936614m77112m46838j75521p92666m66566m29268j54647K31861M1775l7797
3006H229835n30310m35432k14504m4005m19959l24940K8530K23166J18579m60519
2996F170441l32758O3753K55858l71447k36649L1935J27758M878q24052N0015
$$ y = [62637471, 58540076, 55124119, 51731928, 48364318, 45741684, 43256015, 40971228, 38453138, 36030754, 33915045, 32359698, 30953392, 29922955, 28605637, 27445129, 26436973, 25679255, 24715302, 23436731, 22482847, 21517420, 20571304, 19221825, 18673973, 18387958, 18006120, 17602682, 16541411, 16086837, 15940003, 15672866, 14602451, 14189599, 14056341, 13721067, 13126898, 12553667, 12669562, 12357100, 11765880, 11207051, 11124406, 11065366, 10936614, 10459502, 10012664, 9837143, 9044477, 8577911, 8148643, 7993996, 8225857, 8267632, 8229835, 7699525, 7264093, 7049589, 7005584, 6585625, 6260685, 6289215, 6512381, 6630960, 6170441, 5837683, 5901436, 6157294, 5785847, 5549198, 5581133, 5708891, 5713769, 4889717, 4939732]
2986D939732P304m0085l90080R2681J44546M99119k40344l37974K93283q1193
2976D886989k14958o09818m4697j6154M46171o9837l0581l38251j99266K61945
2966D071543m10309J69153j16168L0272J65660j96448n00184j30849L26622m43833
2956B965459k89403p9472J35151K27994p0941m155j87322O1172k86694k1010m23819
2945B026960J91153J37697l48229J69105J60238m1755l62822J60747L3179L88418
2935B514691k59414l52217m39416M8792N02025p485K17093k13606L83445j11005
2925B282903o21847J4088l34380K1376j17693R2076J43886L66970R2210j86960
2915A752629k15007k33203l5119k12096K74800K66295M3512j68897l43619k92952
$$ y = [4939732, 4947036, 4906951, 4516871, 4609552, 4754098, 5253217, 5012873, 4674899, 4968182, 4886989, 4672031, 4062213, 4017516, 4001362, 4447533, 4377696, 4347115, 4008864, 3809598, 4071543, 3661234, 3830387, 3714219, 3744491, 3910151, 3713703, 3213519, 3082670, 3409292, 2965459, 2676056, 2596584, 2731735, 2959729, 2888788, 2884633, 2697311, 2758483, 2471789, 2450779, 2026960, 2218113, 2355810, 2007581, 2176686, 2336924, 2295169, 1932347, 2093094, 2126273, 2514691, 2255277, 1903060, 1463644, 1512436, 2014461, 2006976, 2224069, 2010463, 2393908, 2282903, 1661056, 1675144, 1340764, 1362140, 1244447, 1336523, 1480409, 1847379, 1939589, 1752629, 1537622, 1304419, 1269300, 1057204, 1332004, 1598299, 1641811, 1472914, 1129295, 836343]
2905H36343J43161N48370J16599k44256K2149L71381j49415q97045l01347K88855
2895G34795L04081l43287R3914M88250N37507O840l45485o25651J30171j02981
2885H78154m28719P6570L37695L49497l73207R7600K45943k40045o890K04138
2875A140736O1920l06914M28555K85110q2854p29495m7600M69972k28040k54984
2865G36406o075K61532p8317O9274n42692o5572L00222K24672k40489M03315N04843
2854A567119k15957k75325k54024K62972K54750l5678j60746l26935L55884r7988
2844A074072l76150m38358L70241J73690O3640J71284J8699K20401j24370j1034
2834A142115j64284l35243J42982L39836K0839k05348M16480k67562j68591l48996
$$ y = [836343, 979504, 1527874, 1644473, 1400217, 1422366, 1793747, 1644332, 747287, 445940, 734795, 1038876, 695589, 789503, 1277753, 1815260, 1822100, 1476615, 850964, 981135, 878154, 449435, 526005, 863700, 1213197, 839990, 937590, 1183533, 943488, 936598, 1140736, 1202656, 895742, 1324297, 1609407, 1526553, 797058, 749458, 1219430, 991390, 736406, 730331, 991863, 913546, 982820, 440128, 374556, 674778, 899450, 658961, 1062276, 1567119, 1351162, 1075837, 821813, 1084785, 1339535, 1303857, 1143111, 816176, 1172060, 1074072, 697922, 259564, 629805, 803495, 867135, 1038419, 1057118, 1277519, 1153149, 1142115, 977831, 642588, 785570, 1125406, 1146245, 940897, 1357377, 1089815, 921224, 572228]
2824E72228j42584L49898J06669N2982l25716P5965j19473J29444n88490N8753
2814A69676L66971L81896J5200J9507R1467o7480m0214o06439J07328P4203M05401
2803I17516K24606J15016K55463J45830q2657n46859Q7508Q0358K00412J50822
2793A548015k62869N57722o0520k20306n88027p6495J70055J90695J20867l25109
2783A054028R4875k00031J14603j31980m7115j42440K80898M22681k52838J02991
2773A295672p2003J38433k21100k09458K38K93534k52303q73180M66619N09028
2763A075480K7072l53002O2527n4414L98660K0333m36018P8475j8162l97328l31692
2752G1931K17013K24899L35817m9752j2575m0303l55086l61394j02576J44450
$$ y = [572228, 429644, 779542, 886211, 939193, 613477, 689442, 569969, 699413, 110923, 169676, 536647, 918543, 933743, 953250, 1044717, 977237, 937023, 330584, 437912, 512115, 917516, 1142122, 1257138, 1512601, 1658431, 1575774, 1028915, 1116423, 1196781, 1397193, 1548015, 1285146, 1842868, 1782348, 1562042, 974015, 897520, 1067575, 1258270, 1379137, 1054028, 1148903, 948872, 1063475, 931495, 884380, 741940, 1022838, 1445519, 1192681, 1295672, 1223669, 1362102, 1141002, 931544, 931782, 1225316, 973013, 99833, 566452, 1075480, 1102552, 749550, 812077, 757663, 1156323, 1176656, 740638, 819113, 800951, 403623, 71931, 288944, 513843, 849660, 799908, 787333, 747030, 391944, 30550, -72026, 72424]
2742G2424J78737O26296K57637J68824k35940j52070J331k70954o6959J13689
2732F93015P7928P7331j96151j86219n1066J71216o90446j6122N57242N30251
2722I66979k94317K2014J92911m02132j09686m49766j02608P6477L30398M14367
2712F44637j1118k5889K61280j22000m53444k00335k76715M17194J87900K042
2702D23552k49245J40278Q9282k06458K5921l531M10567j25814l13914j36823
2692E3815L7111l8664L21900L9784k15464K80527p7178l3335R0330k21886J92604
2681D29544k72340j25281Q6912K36246j07614m10131j61630J11996N61029K14929
2671E63660q5231p3977K96256n1887m28601j64629J19914J70048n56846J11647
$$ y = [72424, 251161, 877457, 1135094, 1303918, 1067978, 915908, 917239, 646285, 579326, 693015, 770943, 848274, 652123, 465904, 414838, 586054, -104392, -120514, 436728, 966979, 672662, 694676, 887587, 485455, 375769, -73997, -176605, -100128, 230270, 644637, 633519, 607630, 868910, 746910, 293466, 93131, -183584, 233610, 421510, 423552, 174307, 314585, 403867, 197409, 223330, 219799, 630366, 504552, 190638, 53815, 90926, 52262, 374162, 413946, 198482, 479009, 401831, 368496, 458826, 236940, 429544, 157204, 31923, 118835, 355081, 247467, -162664, -324294, -212298, 348731, 563660, 478429, 404452, 700708, 648821, 220220, 55591, 175505, 345553, -211293, -99646]
2661i9646O03402M53109j80707m04279o59313L29931L6514l13072j73287O8247
2651c39101L66113K37923K8968k61740o2895j95606M3935L98819j14886L43073
2641D44603p923j78071k72954j63039k4202j38556q0089L08988M17470K36610
2631E42837p5609k23848m8477j12788k17324n22049p8378N55885K05238j67749
2621a42262K79628J82355K5337J98313k84245n04196P5707l0847j26749o7330
2611c94289N59345j04655o1153j39110J02335P7054m08792m1605P5675K7483K305
2600c05407L13762n68357K23317M64450k0140K5580P5403M36183k16731L14972
2590G43032j52610o45485M2536j23442K5005K77842M61673P60537N41586N2251
$$ y = [-99646, 503756, 956865, 776158, 371879, -287434, 42497, 79011, -234061, -407348, -339101, 27012, 264935, 293903, 32163, -30732, -226338, -182403, 216416, 101530, 444603, 436680, 258609, -14345, -177384, -201586, -340142, -420231, -111243, 306227, 542837, 467228, 243380, 194903, 82115, -135209, -657258, -735636, -179751, 25487, -142262, 137366, 319721, 345058, 543371, 259126, -245070, -169363, -200210, -326959, -394289, 165056, 60401, -752, -139862, -37527, 39527, -369265, -410870, -335195, -307712, -305407, 8355, -560002, -336685, 127765, 107625, 133205, 208608, 644791, 428060, 743032, 590422, -55063, -12527, -135969, -110964, 166878, 628551, 1389088, 1930674, 1982925]
2580A982925j38169k3515k72237o99488p40453J69790K02539O8849l36412J36308
2570C50137M89525K65269m65731n36392P7716j67622K17725n0010J1707K72508
2560D64832o0965j13767j24287l0763J18047l2817n47593K67754L13959J32520
2550C86920M9276m30855J78799k97241J51520K49084j29106L26542K64930J09366
2540H59235j79769J52525j48545O351p77815k21723L222M01292L65023j1390M3920
2529D92326O2175k67494o06853R7045K34393K95795j49615j15962J79530K22038
2519D43378o5305j29689o3098o5833J93875K65366j44421K18919k88847m15467
2509e1122m18641O689j38666O65713N33343P4548N62525k49982J54648k58984
$$ y = [1982925, 1844756, 1821241, 1549004, 849516, 109063, 278853, 481392, 550241, 213829, 350137, 839662, 1104931, 639200, 102808, 180524, 12902, 230627, 180617, 192324, 464832, 403867, 290100, 165813, 135050, 253097, 220280, -327313, -59559, 254400, 386920, 436196, 5341, 184140, -113101, 38419, 287503, 158397, 484939, 749869, 859235, 679466, 831991, 683446, 689797, -88018, -309741, -306519, 94773, 459796, 448406, 492326, 554501, 287007, -319846, -222801, 11592, 307387, 157772, 41810, 221340, 443378, 378073, 248384, 185286, 119453, 313328, 578694, 434273, 653192, 364345, -51122, -469763, -463074, -601740, 63973, 597316, 671864, 1234389, 984407, 1139055, 880071]
2499H80071p51171m64148N49022K61618l97864R5163P3886M26621j45599k26929
2489C00670J00710J16419P3140k84092k79663J86733J57499l46244J88712K33303
2479D47187K62301j71908K31047J49291k78640m90145l01419k51002M21331N99592
2469F17635L00391J85161N4768J95973j65093N1033k30987l10862j95778m398
2459D97843k07835o8216j61783M76102k5241L99518N5802K2314J18263m35506
2449F71261l95388n5959J6005k90043Q8514K93305K65452J85603J90973R6978
2439A066701J42285m4961m87498l10662N8085O70574R7094k92301l4103K15254
2429A080468n68131j27710L81714J29209K72654j15894N121j13414J11041m72808
$$ y = [880071, 128900, -335248, 213774, 475392, 77528, 172691, 246577, 673198, 527599, 300670, 401380, 517799, 590939, 306847, 27184, 213917, 371416, 25172, 213884, 447187, 709488, 537580, 768627, 917918, 639278, 149133, -152286, -403288, 18043, 617635, 918026, 1103187, 1157955, 1353928, 1188835, 1239868, 1008881, 698019, 502241, 497843, 290008, 221792, 60009, 536111, 510870, 910388, 966190, 988504, 1106767, 671261, 275873, 219914, 235919, -54124, 34390, 327695, 593147, 778750, 969723, 1066701, 1208986, 1164025, 676527, 365865, 423950, 1094524, 1191618, 899317, 865214, 1080468, 512337, 384627, 766341, 895550, 1168204, 1052310, 1057431, 944017, 1055058, 582250]
2419E82250j1280J61286J44654K60492L03307K52664k66230J31419k4448J2810
2409A546924m48505j64586K64351L38797J38317q6309L22910N2350K3956k67125
2399A721080j36891M50344p6828l03163l36174J01412K44152J2122N2739M69083
2389B197876N78811J54171J2814r5855K83639n773m45246j38543j01746j78942
2379B261206K43916N9547J94345L00561k31541M04212J7154k55803k4306K70125
2369C239416r8188m00834j3390J04343P63269J11785J72240K90652P2486k79905
2359C961874k5166k17269J89344L92146l46918K55660N46858O11658j37432J8189
2349E248944q1289J36393k933k18285P08562N70868O81884M48110R90807M93852
$$ y = [582250, 570970, 732256, 876910, 1137402, 1440709, 1693373, 1427143, 1558562, 1534114, 1546924, 1098419, 933833, 1198184, 1536981, 1675298, 1588989, 1911899, 1964249, 1988205, 1721080, 1584189, 2034533, 1957705, 1654542, 1318368, 1419780, 1663932, 1676054, 1728793, 2197876, 2776687, 2930858, 2943672, 2847817, 3131456, 3125683, 2680437, 2541894, 2440148, 2261206, 2505122, 2564669, 2759014, 3059575, 2828034, 3232246, 3249400, 2993597, 2969291, 3239416, 3141228, 2740394, 2727004, 2831347, 3594616, 3706401, 3878641, 4169293, 4241779, 3961874, 3936708, 3719439, 3908783, 4300929, 3954011, 4209671, 4756529, 5368187, 5230755, 5248944, 5167655, 5304048, 5301115, 5082830, 5791392, 6362260, 7044144, 7492254, 8483061, 8976913]
2339H976913N31521R09597Q28586R64365Q93411R67288J605958K023166K427372
2330B0128177K158511K108068J635871K720975J452072L050949L240635M483431
2322D0978689O366324J0419954J6516273K8701394M2517852N8772112N6980085
2315B61252683L2227652O138410o455720j2561031l0499171l6927837l6767929
2308A76407057l2058621k7613193k5215949k0279075j3338425q277937n096345
2301D4527512l527069k676000l496489l454088l248562k802405k995792k219724
2293B0107383k168559j959440j251043j685890j033630m58408l24439m74693m897
2284A0746384j29200Q3855k27521q29107k96961m88615m95790p05780k95242j3308
$$ y = [8976913, 9508434, 10418031, 11246617, 12210982, 13104393, 14071681, 15677639, 17700805, 20128177, 22286688, 24394756, 26030627, 28751602, 30203674, 33254623, 36495258, 40978689, 47345013, 57764967, 74281240, 102982634, 145500486, 204272598, 261252683, 293480335, 299618745, 293163025, 280601994, 250102823, 213174986, 176407057, 144348436, 116735243, 91519294, 71240219, 57901794, 49623857, 44527512, 41000443, 38324443, 34827954, 31373866, 28125304, 25322899, 22327107, 20107383, 17938824, 15979384, 14728341, 13042451, 12008821, 11550413, 11225974, 10751281, 10746384, 10617184, 10701039, 10473518, 9644411, 9347450, 8858835, 8363045, 7657265, 7362023, 7348715]
2274G348715k58606n26790k95769N85455l20199o55783j90182M2682j58680m26972
2264E143871j0350k06412j90809m54942j73256J68896L47851o19566l15535m8769
2254C640979Q336j64900r54017K04003J29318J1032o36325L9360K18214j00630
2244B395370L1171m78230J4792n06153j05897k869L85380p2798k39406K57468
2234A678828M6285L20267j32191l66882l75651K42272o07615j37727M78420k74081
2224H71925k70213q737M92257Q0122N8706k55133J09138L82889k22176k64154
2214I74624j32154P7267k63646k3434N9686L25507L4682r4089L27183l93665Q8109
2203I80070k55358o3327M8517j394J52493k62370L00688k83806L7139R4459Q9427
$$ y = [7348715, 7090109, 6563319, 6267550, 6853005, 6532806, 5877023, 5686841, 5729523, 5570843, 5143871, 5133521, 4927109, 4736300, 4281358, 4108102, 4276998, 4624849, 4005283, 3689748, 3640979, 3649315, 3484415, 2530398, 2734401, 2863719, 2874751, 2238426, 2277786, 2496000, 2395370, 2426541, 1948311, 1963103, 1456950, 1351053, 1348184, 1733564, 1660766, 1421360, 1678828, 1725113, 2045380, 1913189, 1546307, 1170656, 1412928, 805313, 667586, 1146006, 871925, 601712, 592975, 1085232, 1165354, 1224060, 968927, 1078065, 1460954, 1238778, 974624, 842470, 919737, 656091, 632657, 692343, 1017850, 1052532, 958443, 1285626, 891961, 980070, 724712, 661385, 709902, 708508, 861001, 598631, 899319, 615513, 652652, 747111, 836538]
2192H36538J19337l18332l99646q099J77918m93860J05112K68969L7124j56061
2182A69000J8901M77684K25510r3019p86300r7343L31596j51507R0837K07049
2172C92408J27541j80353r5266L57637L2847R662n41274J83388P1936L3426k88694
2161A03258K68691j53807k47490J4835K29282J26966j82093r6529J05102Q4334
2151B52549m44125J97307P4538L19064J50445n19073j92082K49080K78610m81665
2141a15352Q0457L01246J94208J2096l09666j66186J80729k5120l08717M4408
2131a11897M3088m8308m14938m7950K75559J23150k49964j33141L95651p0944
2121b39694P2667R5205l1633J92225k17508M61576J18617p6869o89927L58505
$$ y = [836538, 955875, 637543, 237897, 229798, 407716, -86144, 18968, 287937, 325061, 169000, 187901, 665585, 891095, 798076, 11776, -85567, 246029, 94522, 185359, 392408, 519949, 339596, 244330, 601967, 634814, 644476, 103202, 286590, 358526, 391952, 103258, 371949, 218142, -29348, -14513, 214769, 341735, 159642, 63113, 168215, 252549, -191576, 5731, 80269, 399333, 549778, 30705, -161377, 87703, 366313, -115352, -34895, 266351, 460559, 472655, 162989, -3197, 177532, 152412, -156305, -111897, -68809, -117117, -532055, -580005, -304446, -181296, -431260, -564401, -168750, -239694, -167027, -71822, -103455, 88770, -128738, 332838, 451455, 374586, -315341, 43164]
2111D3164n6912K5908O199j84658J67795m3461J84908l17515L34882j89980n41741
2100e71411Q5350M08848K22007l16582l0629P4999M13356o46579m40049O15921
2090a84769N34495J9194m78099Q655k21989J12559M9086l9682J90335J12782j54969
2079e2402r8282L33548j88944j04401m23210J01352j19253o9670M65489M23793
2069B68020K94558o79132J13972q9376K14341k88407k21190N43020J37875j35712
2059A57969l93146K37563l07816J62515k57945K56024M05667l02382J13017o9633
2049A833O94572j80616J78436K41167O63493K53781o01340N4968p3341K4443m74343
2038G83053k23075k4440J52188l143m40800k60755j50136J68444j81090L26462
$$ y = [43164, -13748, 12160, 18359, -166299, 1496, -41965, 142943, -174572, 160310, -29670, -571411, -486061, -77213, 144794, -171788, -202417, -127418, 285938, -360641, -800690, -184769, 349726, 368920, -109179, -100524, -322513, -209954, -160868, -200550, -10215, 102567, -52402, -150684, 182864, -6080, -110481, -533691, -432339, -551592, -621262, -155773, 268020, 562578, -116554, -2582, -91958, 122383, -166024, -387214, 155806, 293681, 157969, -235177, 2386, -305430, -142915, -400860, -144836, 260831, -41551, 71466, 1833, 696405, 515789, 694225, 935392, 1598885, 1852666, 1251326, 1306294, 1232953, 1257396, 783053, 559978, 535538, 687726, 684583, 243783, -16972, -167108, 1336, -179754, 146708]
2028A46708j29610K6778j26225L81338P8458o16067P9423k58213L72062l60642
2018d05990L23582J40908l68K3658n78716M07044m9557L1640o04223N14780M70549
2007B73307k18313l44694l74844R56888o17729k01966n1680O68490J43384Q2451
1997C15294n21271j89023N48705n19009j93596J03949L40762k24809K2185O3510
1987b53303L4813p7223l81288L0443J45805L91031p8509K82176K12357l54843
1977d8541j17494L8997J75835n05381R1624J76131L49541m19762m29775K02128
1967d86697L49078j62999m32192P77316Q8802R4246n06796j47372K75497j95945
1957c47062j68579l19130N25002P441K1853o0618J57346K66453m15323N3949l38757
$$ y = [146708, 17098, 43876, -82349, 298989, 377447, -238620, -159197, -417410, -45348, -405990, -82408, 58500, 58132, 81790, -496926, -89882, -139439, -107799, -712022, -197242, 273307, 54994, -289700, -664544, 292344, -325385, -527351, -579031, 89459, 232843, 315294, -205977, -395000, 153705, -365304, -558900, -454951, -114189, -338998, -316813, -253303, -218490, -295713, -677001, -646558, -500753, -109722, -188231, 93945, 306302, -48541, -166035, -127038, 48797, -456584, -364960, -188829, 160712, -259050, -688825, -486697, -137619, -300618, -732810, 44506, 133308, 227554, -279242, -426614, -151117, -347062, -515641, -834771, -309769, -302328, -280475, -341093, -183747, 82706, -332617, -278668, -617425]
1946f17425K96231r4724M19075j69643l30184j54090k27234P42709Q257r1436
1936b18464k67895M27679J24599l26112l87511J94433K59363k28660J89921K37319
1926D672L52795j22236j32311q5677k09867J17696l26089L64978J09955J6816
1916I0732n97065K10288L53064J94993K9243j63358J67245N7005j93586j88799
1906d0238J44616l76605j53419J38184M0704M37381m8806j57831l41722J2934
1896c44802l84259J56435K56231K77254J78053k02370M41459k86999m84678n27978
1886i21654M83958J60616J26032K43562P0430L96697l47424l98070n72692L66852
1876c91693J07118l35126M96893L99829K98194l58325m06486p5829K05007k77677
$$ y = [-617425, -321194, -415918, 3157, -166486, -496670, -650760, -877994, -135285, -127028, -218464, -486359, -58680, 65919, -260193, -647704, -453271, -193908, -422568, -232647, 4672, 357467, 235231, 102920, 17243, -192624, -74928, -401017, -36039, 73916, 90732, -506333, -296045, 57019, 252012, 281255, 117897, 285142, 342147, 148561, -40238, 104378, -272227, -425646, -287462, -246758, 190623, 141817, -16014, -357736, -344802, -729061, -572626, -316395, -39141, 138912, -63458, 378001, 91002, -393676, -921654, -437696, -277080, -151048, 92514, 162944, 559641, 212217, -185853, -758545, -391693, -284575, -619701, -122808, 277021, 575215, 216890, -189596, -265425, -60418, -338095]
1866c38095Q6279M43867M30849N2368n48739k45262j37972J40604k44811j13994
1856d74906J49730k04004L204K95487K7443l17550j5927K18599K70492L08781
1846B61349r0708n305j6566m64564k83013J55047R9760j8208M33210L0416k8541
1835G2877j67035l94204j84374M44992l1920J49132k77322M72759J36012o15343
1825c94426m9554P3583J39521k63336O6686J93381J08728l3791j02586J8682j19993
1814c63105K14092l4548L14225J09309k14183R1710q1413q8417m22772l8572M85317
1803b8357J79387O1294j79756K19992m6729l49649l80598j14109J50659L70737
1793a17129o4653K37361N9346j05216m78107p8264K12372L924J0283k49547M01878
$$ y = [-338095, -251816, 192051, 622900, 675268, 126529, -118733, -256705, -116101, -360912, -474906, -325176, -529180, -525976, -230489, -203046, -520596, -536523, -317924, -47432, 261349, 170641, 165336, 148770, -315794, -598807, -443760, -344000, -362208, 71002, 101418, 72877, -94158, -488362, -672736, -227744, -259664, -110532, -387854, 84905, 220917, -394426, -443980, -370397, -230876, -494212, -427526, -234145, -125417, -159208, -261794, -243112, -363105, -149013, -183561, 130664, 239973, 25790, 117500, 36087, -52330, -475102, -513674, -28357, 151030, 212324, 32568, 252560, 205831, -143818, -524416, -638525, -487866, -117129, -181782, 55579, 114925, 9709, -468398, -546662, -334290, -330366, -320083, -569630, -167752]
1782a67752J40400o9301o7176K61956M3783m6113j97546j14338K11897J87866
1772A83676l08707l11974J19875r2001K9111R8645j85263J32201k40152K5251
1762e49338K24441l10497O4428N22947R1254Q8529j67809o5669O3361n1244l29945
1751d19542k4064M04409J73498k37574j72500R5845K18659j95482O937P4374j6415
1740i1855K2286j98013J89504J35464k6516m01548J91656L46366j73603J20339
1730A14080m38869L98199j20191j19773n5938J14424j30808L16601J80346o1371
1720A96700K24620k47681J3257k30012l29895J62205J71427j50840p1631K05680
1710e6170M8183N9313m5576k72667k8892J29912O2703j84999J33606k1375K14148
$$ y = [-167752, -27352, -96653, -163829, 98127, 141910, 95797, -101749, -216087, -4190, 183676, -125031, -437005, -317130, -409131, -380020, -281375, -466638, -334437, -574589, -549338, -324897, -635394, -570966, -48019, 43235, 131764, -36045, -101714, -38353, -89597, -419542, -443606, -39197, 134301, -103273, -275773, -179928, 38731, -156751, -149814, -75440, -91855, -69569, -267582, -78078, 57386, 30870, -370678, -179022, 167344, -6259, 114080, -324789, 73410, -46781, -166554, -222492, -108068, -238876, 77725, 258071, 196700, 421320, 173639, 186896, -43116, -373011, -210806, -39379, -190219, -261850, -56170, -7987, 51326, 5750, -266917, -295809, -165897, -103194, -288193, -154587, -175962, 38186]
1699C8186j37615j15190L41727J5443J8628m2563J56038K42941l18877k11040
1689a2322K3722Q1656m03990J43751j82771n5131J32896p159p7004k077K71524
1678h6905k20803M3034J56697k0111o5065J24860M1720J80653j00840O626L9991
1667I9857n62j67263n2959j7557n7354l1528q7278J30823o532r3957j22873J43308
1655b63875Q7756j73563K52151K19467m9908j16648l34231J11239K75121J26460
1645A33969m24935k2471K05254K50627L4614k29200O890j468j49502m74867J81972
1634d89117J88558K01114K57337l5656m9787Q0661K72849j73544o4530n03749
1624c15864J835n9693l79552L32131L04426n3472j44166k16039k98043L97539
$$ y = [38186, -99429, -214619, 127108, 142551, 161179, 118616, 274654, 517595, 198718, -12322, 11400, 93056, -310934, -167183, -349954, -405085, -272189, -279348, -356352, -358429, -86905, -307708, -264674, -107977, -128088, -193153, -68293, -26573, 154080, 53240, 59866, 99857, 99295, -67968, -120927, -138484, -195838, -227366, -314644, -183821, -190353, -284310, -407183, -263875, -176119, -349682, -97531, 121936, 72028, -44620, -378851, -267612, 7509, 133969, -290966, -313437, -108183, 142444, 177058, -52142, -45252, -46720, -196222, -671089, -489117, -300559, -99445, 157892, 122236, 72449, 153110, 425959, 252415, 187885, -315864, -314029, -373722, -753274, -421143, -116717, -170189, -314355, -530394, -828437, -430898]
1614d30898k20473K98061L39169o0638J69361j43285Q432k64030J52302k28639
1604c80638J21927n3689k26520j41363K01098L24928K55150l7691j79056k85576
1594d01430J35441J64851k9484k6847K08371k64969K4861Q7897j61281R1489l35351
1583e06452k7464j61802J30788J10889N78145j90670j84327J13011k29914R2946
1573b74850K07702P8945o48850K20474K79001J45152l16342J68462L51480l09789
1563i8615k3935j70278K42605O2183L50632m52158j76784j32936j6042k09735
1553f25063o6274N75577J96956Q5846k47269j89290j32744M3616P1900r5476K09375
1542a72846q5667K00933J27487n9497J39906J6632k29361R2592L06938k78366
$$ y = [-430898, -651371, -353310, -14141, -74779, 94582, -48703, -40271, -304301, -151999, -380638, -258711, -312400, -538920, -680283, -479185, -154257, 100893, 63202, -115854, -401430, -265989, -101138, -130622, -157469, 50902, -214067, -189206, -101309, -262590, -171101, -506452, -533916, -695718, -564930, -454041, 124104, -66566, -250893, -137882, -367796, -274850, -67148, 11797, -637053, -416579, -137578, 7574, -308768, -140306, 211174, -98615, -122550, -292828, -50223, 11960, 362592, -89566, -266350, -399286, -415328, -625063, -691337, -115760, 81196, 167042, -80227, -269517, -402261, -358645, -286745, -382221, -172846, -258513, -57580, 69907, 10410, 150316, 166948, -62413, 30179, 337117, 58751]
1532E8751m1971J06857L6266l74394M7067K27173n8040P7482j84207j08736j69031
1521c82783O4805P1844o8029k0862L0465Q1888r3277J85635m23570J5345Q8518
1510d50021K94802K49299J12269M3489k04211M3533k43529J26268J55237J34374
1500B61510j15977n343K17791j86221j81862l67662q2144J88433J01504J26818
1490d3153r1785L3492n8985J81414j53127R0204j00443K25360K4722r6645K10826
1479B21880l25535K18788j21428k92841p7512K43150J66780k02545K63965K29190
1469C23892j5910o02752J76317J49361n517m08750l7715N64695R3901j30148k37123
1458a29749r8437p773j1037q3296k32588K93695p2442K064k35325M16740P2651
$$ y = [58751, 16780, 123637, 159903, -214491, -167424, 59749, 1709, 79191, -105016, -213752, -382783, -317978, -246134, -314163, -335025, -304560, -222672, -315949, -130314, -553884, -538539, -450021, -155219, 94080, 206349, 249838, 45627, 89160, -154369, -28101, 127136, 261510, 145533, 140190, 357981, 171760, -10102, -377764, -459908, -271475, -169971, -43153, -134938, -101446, -160431, 20983, -132144, -41940, -142383, 82977, 107699, 11054, 221880, -103655, 115133, -6295, -299136, -376648, -133498, 33282, -169263, 94702, 323892, 307982, -294770, -118453, 30908, 25391, -383359, -421074, 143621, 237522, 107374, -129749, -228186, -235959, -246996, -330292, -562880, -269185, -341627, -339563, -574888, -158148, -85497]
1447h5497l8193J7752l24624J22894J0702k5843l15585L79813l23195K15416K19370
1436a46990J6320l5723J60560P4142k77314n0732Q3561J0875k63743q0159K3301
1425d85902O6545L37978l69198m5356L31474J21665l50577O9503j19476L7478
1415d05866K13769k04022o6776L19954j11519k13646J79824K6397J18594L17781
1405A74490l11630m3452p376k73323m7009L25413k0256k84725j2267k67817M59226
1394c08726M1467j48206M05902K23233j5472J54681N9026o4888k97617m71576
1384d22176j16380J20512M583O685Q623L36232j93618J80010l5403R3610k6126
1373d3448k63326J19218j99174K22144M7071O8926o5344J7803l85402J22734M0098
$$ y = [-85497, -123690, -105938, -430562, -307668, -296966, -322809, -638394, -258581, -581776, -366360, -146990, -130670, -166393, -5833, 68309, -209005, -259737, -176176, -165301, -429044, -509203, -485902, -419357, -81379, -450577, -495933, -164459, -42794, -393371, -323868, -443344, -405866, -192097, -396119, -462895, -142941, -254460, -468106, -288282, -261885, -143291, 174490, -137140, -180592, -187968, -461291, -508300, -182887, -203143, -487868, -500135, -767952, -308726, -267259, -415465, -9563, 213670, 198198, 352879, 411905, 347017, 49400, -422176, -538556, -418044, -413461, -406776, -398153, -61921, -255539, -75529, -110932, -17322, -43448, -306774, -187556, -386730, -164586, -117515, -48589, -113933, -96130, -481532, -358798, -318700]
1362c18700N3602J37760j48188L14915j70359k47481J8292J46207P8784K5296
1352a09872o6521N61347J59506o04772m27644m30099N5826M76199j12427j34853
1342f33310M90002J26607j5090L0487j25066l59186m7705M83634L38983j61219
1332A28137k55721k45343K71716q6740k70066n6975N08967M88689P9578k81908
1322B80334j82900M9662m44888J8180K25039M5423l6195Q365K68309l01937m00792
1311d71400K78430q6410j43606L11282J89057l0392K72805l19669m5570P980m2855
1300h0348o4362J17300L66927J03233j49316l70861n3903k85042m42795J20146
1290g39021L94380K86293L83556k29336j54048J2235k97263K45518J27060j71916
$$ y = [-318700, -265098, -127338, -275526, 39389, -130970, -378451, -360159, -213952, -135168, -109872, -176393, 384954, 544460, -60312, -487956, -918055, -862229, -386030, -498457, -633310, -143308, -16701, -31791, -1304, -126370, -485556, -533261, -49627, 289356, 128137, -127584, -372927, -101211, -187951, -458017, -514992, -6025, 482664, 562242, 280334, 97434, 147096, -297792, -279612, -54573, -9150, -45345, -36980, 231329, -70608, -471400, -192970, -279380, -422986, -111704, 77353, 46961, 319766, 97, -45473, -37493, -80348, -144710, -27410, 339517, 442750, 293434, -77427, -131330, -416372, -859167, -739021, -344641, -58348, 325208, 95872, -58176, -45941, -343204, -97686, 29374, -142542]
1280a42542J70086J44146k55262q3737K54303k52896p1659L04275J28393o2282
1270A32825r8506K34746m30271k61551l32493L09465j37767K66997L95453K39491
1260C18389L51382n48510n88823k03399K55303j92605L0299N53188L11100J87415
1250D73739n41560k09343q8115J93761k9850L17701L18822j41792n00542m60389
1240f67568k2404K66635J49111k7653N24697r2122j96947j67488P9500j50525
1230c04764m12769J9313L08129L05036N7607J87621p9429k23589K14853l61265
1220b89257M16670O6451k69196k19209J9494n1566l82794Q4063q4731M06980J71367
1209a31728N9873K93226l04948J16223k96919n5158m2536K81297l05706K3849
$$ y = [-142542, 27544, 171690, -83572, -167309, 86994, -165902, -237561, 66714, 195107, 132825, 34319, 269065, -161206, -422757, -755250, -445785, -583552, -316555, 78898, 318389, 669771, 121261, -467562, -670961, -415658, -608263, -577964, -24776, 286324, 473739, -67821, -277164, -365279, -171518, -201368, 116333, 435155, 293363, -207179, -667568, -689972, -423337, -274226, -301879, 222818, 130696, -66251, -233739, -154239, -304764, -717533, -698220, -390091, -85055, -27448, 160173, 80744, -142845, 72008, -289257, 127413, 193864, -75332, -294541, -275047, -326613, -709407, -625344, -710075, -303095, -131728, -71855, 221371, -83577, 32646, -264273, -319431, -361967, -80670, -386376, -362527]
1199c62527J95715k27675l3045k12003r396K48609M61642p390J78354M5072l07045
1188b9689k92781N6231j81748O706K96909R7633M67742n5775m2349l95869l81581
1177d54571J12292k97202K11095K1531J08506L64938M13063M3901k87667l88259
1167a52373j80748P5249j68070l8070L08577L41257m42193l97570j77986M10212
1157d21715K51633J36148J40061J958M5591N8726o12843l17851N47661k40903
1147d11534N35131L67393n7991l2574j84292l65937k25051j15734N3171L98041
1137c9377l2567K39405M15083k86885l84103l84698k36015M77237N08246j24292
1127A52034l28909o4874k89325k19287l22129K27621N82552K85531K55510J88319
$$ y = [-362527, -166812, -394487, -427532, -639535, -648931, -400322, 61320, 53930, 232284, 277356, -29689, -322470, -266239, -447987, -441281, -144372, -46739, 421003, 365228, 322879, -72990, -454571, -342279, -639481, -428386, -406855, -298349, 66589, 479652, 523553, 235886, -152373, -333121, -257872, -425942, -464012, -155435, 185822, -256371, -653941, -831927, -421715, -170082, -33934, 106127, 108085, 153676, 212402, -400441, -718292, -170631, -411534, 123597, 490990, 432999, 400425, 216133, -149804, -374855, -490589, -437418, -39377, -71944, 167461, 582544, 295659, -88444, -473142, -709157, -231920, 276326, 152034, -176875, -241749, -531074, -750361, -1072490, -844869, -262317, 23214, 278724, 467043]
1117D67043k73538l42389k67393k3487J78634L65991o3179k66781L01849k26335
1107a49585q6772j81117O5112J92136M7045L07646J00560J35380n75244L7115
1097a07724l33120j34171K74524p3486K09892J16042L68735j71352k50725j4887
1087a16272l24035J88556L40631J78108J1855k62006o0788j20261j69547m09767
1077g43526M02672L28292O6964k21089j26702j75607K08166Q3575j18409K18376
1067g7288L91197J26306k00565j83062o9236r8134l90539J38613K63017R3513
1057f178k4349R7165L28705m62418J361k93292j80313m2744J33992L81006P0856
1046C791k8165m27957J98427Q7288O3523K58728J20643q9359k59117j46140k82498
$$ y = [467043, 193505, -148884, -416277, -439764, -261130, 104861, 41682, -225099, 76750, -149585, -236357, -417474, -352362, -160226, -113181, 194465, 295025, 430405, -144839, -107724, -440844, -575015, -300491, -373977, -164085, -48043, 320692, 149340, -101385, -116272, -440307, -251751, 88880, 266988, 278843, 16837, -43951, -164212, -333759, -743526, -340854, -12562, 54402, -166687, -293389, -468996, -260830, -177255, -295664, -77288, 313909, 440215, 239650, 56588, -12648, -110782, -501321, -362708, -99691, -6178, -30527, 66638, 395343, -67075, -65714, -359006, -539319, -582063, -448071, -67065, 3791, -24374, -452331, -253904, -166616, -103093, 155635, 276278, 186919, -72198, -218338, -500836]
1035e00836O5295j77301Q0955R9799L21597o9068k54402K1965Q9230N0275l07518
1024e80009M35453L3164j18194J42815K92375l53103j06499L4200k00215L89887
1014c0126j29751m6573L2451J95622m87496k27510L34755j69552M05702J9433
1004a03045M93014k84425k40571j21511j50580J81624j92732J63269q0292P1571
994b63678J19843p0536n60909n9208O75855j93656M29880L9038l8800P1752l71517
983b21936l62344K57265p4030J69566J25840k99150L63047J85387j91684k19023
973b67062k9608k95662K93919J60363L7872L35243K28179q6537m41325j08760
963a73378N4749J92238R0418j50540J5951n00948J56468O5208j89161K57425M32669
$$ y = [-500836, -435541, -612842, -531887, -432088, -110491, -179559, -433961, -411996, -322766, -272491, -580009, -144556, -111392, -229586, -86771, 205604, -147499, -253998, -219798, -420013, -30126, -159877, -206450, -173999, 21623, -465873, -693383, -358628, -528180, -122478, -103045, 389969, 105544, -135027, -256538, -407118, -225494, -418226, -254957, -335249, -263678, -143835, -214371, -775280, -834488, -158633, -352289, 77591, 116629, 77829, 149581, -221936, -584280, -327015, -401045, -231479, -105639, -404789, -41742, 143645, -48039, -267062, -296670, -592332, -298413, -138050, -100178, 235065, 463244, 376707, -64618, -173378, -118629, 73609, 164027, 13487, 29438, -471510, -315042, -249834, -438995, -181570, 251099]
952B51099K2482k59005j5737l0858K0198l17462j32708N90984J71046q1930o5284
941A52825J93j68945k13432J24115J32060o0134j8686J89664o9931L7372j56796
930e1695j3257j01677J97105k5954J56186J82000j36425k66835L4950j92710j62121
919c80433J84950J85254N43115K2358l7844n52275l86161n2219M6078J4326L32741
908h0110M52572j49501j40507k6093R1019k48593M7403k38181N0126M22070J13900
897B94105K9627j98698j2276k78465j94676L5797j2790K68791J72728P4010l60376
886a82223r6076J16757K35095q3740m91311K08816L84041K15898m49144k98948
876d40835K0671L03439j1473k46769N12959K45258j83323q39069L0534J51020
$$ y = [251099, 273581, 14576, -1161, -32019, -11821, -329283, -461991, 128993, 300039, 218109, 152825, 153018, -15927, -229359, -105244, 26816, -33318, -52004, 137660, 67729, 105101, -51695, -64952, -166629, 30476, 4522, 160708, 342708, 206283, -60552, -25602, -218312, -380433, -195483, -10229, 532886, 555244, 517400, -34875, -421036, -473255, -427177, -412851, -80110, 372462, 222961, 82454, 56361, 147380, -101213, -53810, -291991, -241865, 180205, 294105, 323732, 125034, 112758, -165707, -360383, -324586, -337376, -68585, 104143, 178153, -182223, -278299, -161542, 73553, -10187, -501498, -292682, 91359, 307257, -141887, -440835, -420164, -116725, -128198, -374967, 137992, 383250, 199927, -639142, -608608, -457588]
866d57588R7435L283M36854M19016l9522O1941m45909k8318o10714J46136L1854
855c85532K20913N6160K97465r6775m24760M27448N2589k68077o6433k7922j06490
844c21414L96084k64570j55583Q1239l61273K33722m8440N26008M69419j46805
834D08387m88533j31081k00795m12396L03533l4705J56762R6512L96105K23174
824C16963k02143M5726j57702M3932p03345r2292J68211J51049J16231j42742
814d56112M55050j1524j8991J90584j00375k54836k40398r7269p1690k67086J31733
803g40914O67775K08885J18644m035N92981l34998o36658m1217l36636K39077
793b67096l49260J10667J84365J83058q501p432m5340r5410J22394M0004J78342
$$ y = [-457588, -360153, -356870, 79984, 499000, 459478, 521419, 75510, 47192, -563522, -417386, -385532, -164619, -108459, 189006, 92231, -332529, 94919, 147508, -120569, -187002, -214924, -321414, 74670, -189900, -345483, -264244, -625517, -391795, -440235, 85773, 555192, 408387, -80146, -211227, -412022, -824418, -520885, -555590, -398828, -302316, 93789, 316963, 114820, 160546, 2844, 46776, -656569, -748861, -580650, -429601, -313370, -456112, -1062, -12586, -31577, 159007, 58632, -196204, -436602, -533871, -605561, -872647, -740914, -73139, 135746, 254390, 250355, 843336, 508338, -128320, -169537, -506173, -267096, -616356, -505689, -321324, -138266, -146767, -154199, -199539, -294949, -172555, -132551, 45791]
782D5791Q643L18772r3833l06315l7185k81580l4300m26585K33219L28972J08760
771a35641K94901k61597r5653m7641M405k12107J51807j0158N4225L10692O0979
760A14212l34723k15588K71991q2373K65461j24006J45790J29345l62601p00058
750h92550L28272K98337k68773M77303L80738M81514r9402l53080j92393n31477
740c71511o6543l06971P0149L9160N15754M64016j48799J74836P6922J19628m38978
729A27663k13706k17402k44006J07316k02137M8003L39060M65880m978L15679
719E21372m9594r1234p7040m66042j21018l72312J20811k45247L90140L54428
709c5736N04908K71211l08711j56379k17940l1209n20162l0312k90136J84253
$$ y = [45791, 54434, 373206, 279373, -26942, -64127, -345707, -380007, -806592, -573373, -244401, -135641, 159260, -102337, -197990, -245631, -241226, -453333, -301526, -311684, -257459, 53233, 114212, -220511, -436099, -164108, -246481, 18980, -105026, 40764, 170109, -192492, -892550, -564278, -265941, -534714, -57411, 323327, 804841, 705439, 352359, 159966, -371511, -438054, -745025, -674876, -635716, -119962, 344054, 195255, 370091, 447013, 566641, 127663, -86043, -303445, -547451, -440135, -642272, -594269, -255209, 210671, 205693, 521372, 471778, 380544, 303504, -162538, -283556, -655868, -535057, -780304, -390164, -35736, 469172, 740383, 431672, 275293, 57353, 26144, -494018, -524330, -814466, -630213]
699f30213M05393O5726j46056J19721N21895l76j39027N6282K74655l36568j57440
688C3992l14439k52186K19108M7206J99642J43715R9527J22173k35958l31896
678b69116p2780L21101j40879K3214k97608N43608J76244k3476K33673l04060
668A89921k14684k61566L12142k42344J16902K43832j10792m68673J47202K73577
658a4483r015K10355l21495L54681R3882j96340l23687J67001J5485l60456j47131
647e31203j23140M44249m770l9808k8976K6932K48774R2431L42132p6158k76985
636G3478l56329m28965n8428o2342p0865K68862N40364J17740J0585j77636Q5377
625e8159j97440l07539k62606J60215L5689n1511N27048M41368R0284n29847R6629
$$ y = [-630213, -224820, -159094, -305150, -185429, 336466, 336090, 197063, 253345, 528000, 191432, 33992, -280447, -532633, -313525, -266319, -66677, 77038, 176565, 298738, 62780, -269116, -341896, -20795, -161674, -138460, -436068, 107540, 283784, 260308, 493981, 189921, -24763, -286329, 25813, -216531, -99629, 144203, 33411, -435262, -288060, -14483, -23498, 186857, -134638, 220043, 313925, 117585, -206102, -39101, -23616, -384072, -531203, -654343, -210094, -214864, -254672, -283648, -256716, -7942, 84489, 426621, 350463, 73478, -282851, -711816, -770244, -832586, -903451, -634589, -94225, 23515, 34100, -143536, -58159, -255599, -563138, -825744, -665529, -629840, -681351, -154303, 287065, 377349, -152498, -55869]
614e5869K35483l27845j97771j17824L32964R7509j53245m24260J18749K27620
604b64489j62043K66925j73056M34537R4264l20734k64192J58169o6553k07580
594e04752K24735J85675L6166J38131J54984l85332k0617J45644m0163n4739o0814
583a81082j20767o9035L80021J276j16352P0288K62293j73995n46461J93334J89071
572a11409k02750n2356j91868P1429K61579L19510P7869k96031L17825j590J1532
561B03740k64863j00838J77948L5870k22511J02677j61850K0389k09136k76903
551f95477K38136L50816J70196m96911K71118L36470N1983l72254k65584J9564
541c91943L60171K33279n48583j07054K79273J92344n7731n29660L93221K78040
$$ y = [-55869, 179614, -148231, -346002, -463826, -130862, -33353, -186598, -610858, -492109, -264489, -426532, -159607, -332663, 101874, 196138, -124596, -388788, -230619, -297172, -504752, -280017, -94342, -58176, 79955, 234939, -150393, -171010, -25366, -65529, -120268, -181082, -301849, -370884, 9137, 10413, -105939, -35651, 226642, 52647, -493814, -300480, -111409, -314159, -366515, -558383, -486954, -225375, 94135, 172004, -124027, 193798, 192208, 203740, -61123, -161961, 15987, 51857, -170654, -67977, -229827, -209438, -418574, -695477, -457341, -106525, 63671, -433240, -162122, 174348, 226331, -145923, -411507, -391943, -31772, 201507, -347076, -454130, -174857, 17487, -40244, -569904, -176683, 101357]
531A01357j28412O0126j30219O8980j65963J03140K9703J61443k0434J92638k18774
520E3585k61299O92338k52658k86629k937J17907k85049M3152n3999j80036K12278
509b03347j351J45896n05555Q9836J12216P2782l55810K24748K23022l4573L24569
498I2433r5075j16484l10477L35620j77267n2034J6271L66178o7814n29116O17295
487G9530j20436k17612j12164o4520K23306O1520K66235o1262K67548o7946j0504
476B43695m6066k55280J8340K25143j21663m10820O19544k26157l04863O5219
466a92908k13063J1857M06989J49375m24882M1530k22478O38235l48854k67232
456d21431J19048P4932L74810k73316K36268n4027K85605n50189p4238l2021K11939
$$ y = [101357, -27055, 33071, -97148, -28168, -194131, -90991, -61288, 100155, 79721, 272359, 53585, -207714, 484624, 231966, -54663, -57600, 60307, -224742, -181590, -235589, -415625, -203347, -204698, -58802, -564357, -474521, -362305, -289523, -645333, -420585, -197563, -232136, 92433, -2642, -119126, -429603, -93983, -271250, -323284, -307013, 59165, -8649, -537765, 79530, -40906, -258518, -370682, -435202, -211896, -150376, 115859, 54597, 322145, 254199, 243695, 197629, -57651, -39311, 185832, 64169, -346651, 272893, 46736, -258127, -192908, -405971, -394114, 12875, 162250, -262632, -221102, -443580, 194655, -154199, -421431, -302383, -227451, 147359, -125957, 110311, 56284, 341889, -208300, -282538, -314559, -102620]
445a02620P9625m53247J99919p946J16801k0710K66871l56488l69520L62313J57326
434a27676j03127j34069J29946q6559K25817J49619R1484J22992j53281j73283
424e8137l47742L78187j81304j25954k06956j1621L99210J6250l9798n0644K86207
413E7698j51740O7350O495M8637r556m75515l5929L5695K67980j6456k06001N5618
401c55724J34569J67513j61423J84620k24512j80026O1135J87291k29574J97479
391b18652O27373O9462m22237o8184L9616l90450k3571j22351K77742q6015L5022
380b82245K02442m58340M48412L66785j47853k38725r679J16833m08482K4369
370c86483K08610J54342k82991M33046k48183j41452J89800k68861L0217n9167
$$ y = [-102620, -22995, -476242, -276323, -284269, -167468, -188178, 78693, -277795, -647315, -285002, -127676, -230803, -364872, -234926, -321485, -95668, 53951, 145435, 268427, 115146, -58137, -405879, -27692, -208996, -334950, -541906, -553527, -154317, -138067, -177865, -228509, 57698, -94042, -26692, -20197, 28440, 18884, -456631, -492560, -456865, -188885, -205341, -411342, -355724, -221155, -53642, -215065, -30445, -254957, -434983, -373848, -186557, -416131, -218652, 408721, 478183, 55946, -12238, 27378, -363072, -386643, -508994, -231252, -317267, -282245, -79803, -538143, -89731, 277054, 129201, -109524, -119203, -2370, -410852, -386483, -177873, -23531, -306522, 126524, -121659, -263111, -73311, -342172, -311955, -371122]
360c71122K40391Q6497K3082k41851K61459j45120k39774L41367l33547o8324
350d46942K00216L14028k10140M39367O8137l41572K8404k18579l0074r6749L90720
339I6816j93011N1565q9741o9425O6091m18818K54204M10982j50355j98843P5775
328a64760J07861j96407k1333j12822j28963J27554J73021q7378M41068K8614
318A66455k83514j12772m68241O74731m12553k80644M42279M79608K1647r2068
308A34928J1929k12884q0154k57998L35548k352p7309J0819R6774k27496L18686
297E0491L49036j60811L16325j43993k65170k45408K2360j90061k20500K73030
287b14701K53777P8363k27416N16450N9273l10479l49801l19832K10868K5536
$$ y = [-371122, -130731, -44234, -21152, -263003, -1544, -146664, -386438, -45071, -378618, -446942, -246726, 67302, -142838, 296529, 364666, 23094, 51498, -167081, -197155, -293904, 96816, -96195, -44630, -134371, -203796, -137705, -556523, -302319, 108663, -41692, -240535, -164760, -56899, -253306, -274639, -387461, -516424, -388870, -215849, -303227, 137841, 166455, -117059, -229831, -698072, -23341, -435894, -716538, -274259, 205349, 226996, 134928, 146857, -66027, -146181, -404179, -68631, -70983, -148292, -137473, -40699, -268195, 50491, 399527, 238716, 555041, 411048, 145878, -99530, -77170, -267231, -487731, -214701, 39076, 117439, -109977, 406473, 465746, 155267, -194534, -514366, -303498, -277962]
277b77962K66367l17395J57820K63601m2495N3947J83722L05554l65728J76540
267D03971k87568q9324k34409K1904K2864j75300L75604J26194K72700n64792
257a28156K26709K25346j12244n09913J2188k23007j45417N24083n7544J2896
247a75059p5560N88382m30932m91134K46873K52665j1843m18498K97856J66108
237e1142J21891p8123j23237n789p1594n8636m26721K99390K04583L0610m44678
226f03446K98943M50330l69375P6776o6343k0085l8183R0732J0164j56002K04630
215a21859q7272P9326l07014J00966J9045j27067l09089J05915K64337O7960N50363
204B35611k45707l4598j3186J93776m54317l59194Q8280J04828n8159K5255M62351
$$ y = [-277962, -11595, -328990, -171170, 92431, 49936, 103883, 287605, 593159, 227431, 403971, 116403, 27079, -207330, -185426, -162562, -337862, 37742, 163936, 436636, -128156, 98553, 323899, 211655, -298258, -286070, -509077, -654494, -130411, -187955, -175059, -250619, 337763, -93169, -584303, -337430, -84765, -96608, -515106, -217250, -51142, 70749, -7374, -130611, -136400, -207994, -266630, -693351, -393961, -189378, -158768, -603446, -304503, 145827, -223548, -146772, -213115, -233200, -271383, -180651, -170487, -326489, -121859, -209131, -129805, -436819, -335853, -316808, -443875, -752964, -647049, -382712, -314752, 235611, -10096, -44694, -57880, 135896, -318421, -677615, -589335, -484507, -542666, -517411, -55060]
193e5060J89815L93520k95083j74918m84923m0933k72516l03786M36945N4451
183e52488J86199K40591J50943j78650j52568l19459K46527K43292L6301J85089
173H5777K0966k12663R0213Q7835k25622o7091N71009j79413r8008k5097j91743
162a43837l29230j03932L36532p163J8870j77209O79730Q914k84780j43544j24163
151b69812J98506P7446k34717n0257O07238m25876k18533O7523L44704P1247m55915
140b88446J66491K81279J7365n37701Q5382o1920J77245K94421J20388M5081n5045
129B44540J43803m82506j33778q7547m0800J56975L16089J12918k96540o9846
119a36692M9083k1077m46835n147M42129k6855R1136K45848J76700m98918k05379
$$ y = [-55060, 134755, 528275, 233192, 58274, -426649, -467582, -740098, -1043884, -606939, -552488, -366289, -125698, 25245, -153405, -305973, -625432, -378905, -135613, -99312, 85777, 106743, -105920, -15707, 72128, -153494, -220585, 350424, 171011, 73003, 47906, -143837, -473067, -576999, -240467, -247630, -228760, -405969, 273761, 282675, -2105, -145649, -269812, -71306, 6140, -228577, -278834, 328404, -97472, -316005, -248482, 96222, 167469, -288446, -121955, 159324, 176689, -361012, -275630, -337550, -160305, 134116, 254504, 299585, 244540, 388343, -94163, -227941, -315488, -356288, -199313, 116776, 229694, -66846, -136692, -87609, -108686, -555521, -560668, -118539, -145394, -54258, 191590, 368290, -130628, -336007]
108c36007k21k67100J54055J01328K04471k15860J19361J75272n6847k23021L06067
97c8502K02483q9395J19939k43952j01274n30530j6363j88797K33111N11245K43600
86A01565p125l0831K7389k63058R3850k40070j53527J24824J24833M0776J91859
75A0485K12212j92284j66630k57279M4820J78278k68627j35983J39110J75208
65b60690j02971l722o8180n8092M48372J89046q8120j37430j837l91365j50680
54f25669j90723L75019L2973k28350K65610R4458R7319m42277o516m0902J26000
43e43058o562K80007J75620j71323Q7318k72130m3528k30703K26514J5086J86247
32b96512J77055k87933p8971j63738J11861r5897J96058j8241M08770l402k04584
$$ y = [-336007, -336228, -603328, -449273, -347945, -143474, -359334, -239973, -64701, -121548, -344569, -38502, 163981, 74586, 194525, -49427, -150701, -681231, -697594, -886391, -653280, -142035, 101565, 94440, 63609, 90998, -172060, -78210, -318280, -471807, -346983, -222150, -181374, 10485, 222697, 30413, -136217, -393496, -348676, -170398, -439025, -575008, -435898, -260690, -363661, -367383, -435563, -493655, -45283, 143763, 55643, -81787, -83624, -474989, -625669, -816392, -441373, -408400, -636750, -371140, -276682, -179363, -621640, -628156, -669058, -543058, -549620, -269613, -93993, -265316, -177998, -450128, -493656, -724359, -497845, -482759, -296512, -119457, -407390, -486361, -650099, -538238, -634135, -438077, -456318, -47548, -50950, -255534]
21b55534k3936r2182J29175k73610J44702L28775j09526j49649o0560r447j52823
10e24615q4441l95629K43504L15807J49375o8470N2606J44263l57817n4723
0e80140
$$ y = [-255534, -279470, -371652, -242477, -516087, -371385, -42610, -152136, -301785, -362345, -371792, -524615, -609056, -1004685, -761181, -445374, -295999, -364469, -311863, -167600, -525417, -580140]
$$ Imaginary data points
##PAGE= N=2
##DATA TABLE= (X++(I..I)), XYDATA
16383b169520M57977m5730o2414n42393K13104M1441K93610p0802R261M80812
16373a394654P2728o4592m57531o7204l6633M29416j2172J97345J71701J24985
16363a036611j44060m45201p8537M5326J12693K07415L26648N0165Q0559p2540
16353i54143l39725j70370J13322L58797P6017K01781n5478k36816k5589l674
16343a035878k329l32117L59684K95216R3784l8874K47788L0827m15944K7216
16333g70627N5918L42128n9546K43859K09786j76527j21574j01210o9271K9955
16323d17109K6914j6869P2895L36446N3767K6522n0654Q4576q1012L2021Q5438
16312A52935J59637K5398j208m43401j36679j098J62139L02075P5155K76780J03012
$$ y = [-2169520, -1711543, -1757273, -1819687, -2362080, -2148976, -2107535, -1813925, -1884727, -1875466, -1394654, -1321926, -1386518, -1844049, -1911253, -1947886, -1518470, -1530642, -1333297, -1161596, -1036611, -1180671, -1625872, -1704409, -1659083, -1546390, -1338975, -1012327, -962162, -881603, -954143, -1293868, -1464238, -1350916, -992119, -916102, -714321, -769799, -1006615, -1032204, -1035878, -1038207, -1370324, -1010640, -715424, -621640, -660514, -412726, -381899, -797843, -770627, -714709, -372581, -432127, -188268, 21518, -155009, -276583, -377793, -447064, -417109, -390195, -407064, -334169, 2277, 56044, 82566, 31912, 116488, 35476, 67497, 152935, 312572, 337970, 336762, -106639, -243318, -244416, -82277, 219798, 294953, 571733, 674745]
16301F74745n7465j33402l8121k58579j01411M60761L5916K3263Q8049K46798
16291I40554k45437m40971Q4046K09462J69592o268O46276k18543K2893k82145
16281H79459q2645r3499j14404M09356j07774J49803N0889J15075o7386q2425
16271A056449p328k02863K53483L67232J95557k45355l7974j92603j44979j98243
16261H43376K37688J69811M37199M0454j31525J3016k18715r0807j40310J30619
16251A290806L00358J06253M6432L9598J52334j78849J02188n4482j60332q860
16241A635446j57888P8285K23678J94181k5811P5132j60197K13131k6547k51753
16231A797657r1810O7833J74683O9427l6541k94776j16043Q3926L34510R1700
$$ y = [674745, 617280, 483878, 445757, 187178, 85767, 546528, 582444, 605707, 693756, 940554, 695117, 254146, 338192, 547654, 717246, 710978, 1357254, 1138711, 1161604, 879459, 796814, 703315, 588911, 998267, 890493, 1040296, 1091185, 1206260, 1138874, 1056449, 1049121, 846258, 1099741, 1466973, 1662530, 1417175, 1379201, 1186598, 1041619, 843376, 1081064, 1250875, 1688074, 1728528, 1597003, 1610019, 1391304, 1300497, 1160187, 1290806, 1591164, 1697417, 1743849, 1783447, 1935781, 1756932, 1859120, 1804638, 1644306, 1635446, 1477558, 1555843, 1779521, 1973702, 1947891, 2023023, 1862826, 2075957, 2049410, 1797657, 1705847, 1773680, 1948363, 2017790, 1981249, 1686473, 1570430, 1654356, 1988866, 2080566]
16221B080566k14899O6825J31942L333K6281J11344j40500r2533J49144R2831
16211B214334n2215M8498M21082k12291o1137p9383k03417m5155M7601J29477
16201B207394O837K77777m3003J94389J4084l41594j13173m0270j4975Q5352Q5748
16190B318566J34433L72513j8106R6949j64364k67064P3345j78862K70672o3982
16180B574100m73427K06205L51802J19882P8580r4362R3961j23458k43471K09792
16170B699604j03283J07286J63898l1663L4060l6605L17935l61001k18745R6340
16160B667826o6262l99633L25873J52874L2736K79695J19631l33692r6974k00026
16150B482048Q1907P0052O7150L10162r8452k49650L56906J0082o50471L3470
$$ y = [2080566, 1865667, 1932492, 2064434, 2067767, 2094048, 2205392, 2064892, 1972359, 2121503, 2214334, 2162119, 2210617, 2631699, 2419408, 2358271, 2278888, 2075471, 2030316, 2077917, 2207394, 2214231, 2492008, 2449005, 2643394, 2657478, 2315884, 2202711, 2162441, 2147466, 2232818, 2318566, 2452999, 2825512, 2807406, 2904355, 2739991, 2472927, 2546272, 2367410, 2638082, 2574100, 2100673, 2306878, 2658680, 2778562, 2857142, 2762780, 2856741, 2733283, 2489812, 2699604, 2596321, 2703607, 2867505, 2835842, 2869902, 2833297, 3151232, 2790231, 2571486, 2667826, 2601564, 2201931, 2527804, 2680678, 2713414, 2993109, 3112740, 2779048, 2682074, 2482048, 2563955, 2634007, 2701157, 3011319, 2912867, 2663217, 3020123, 3030205, 2379734, 2413204]
16140B413204L75134J02366J45919L24965P6505l80761n34278K23852L46554k74458
16130B819002J44029L93628K2909m2630j37317k44669k49817J18727l04194k90301
16120B229367N26907J27148j02278R8738J00821j82668l86840L69518O2065J83380
16110C026158J44826R6573j4052m60268j23127J54889j74769K92711N84509J085
16100C528535k29936k7389k2841p4810j53269L73072k24501p4452l7117j36461
16090B920831l56824k01773k6861M7625L94178K10612J75913J66007J68846k40761
16080C257793o24213N935K91688J06473J2752J85422J93708l23998K0375L2679
16070C158614J91j57707K11720r7445m6630O5281J27868n33901k2946M32910l3642
$$ y = [2413204, 2788338, 2890704, 3036623, 3361588, 3438093, 3057332, 2523054, 2746906, 3093460, 2819002, 2963031, 3356659, 3379568, 3336938, 3199621, 2954952, 2705135, 2823862, 2519668, 2229367, 2756274, 2883422, 2781144, 2879882, 2980703, 2798035, 2411195, 2780713, 2842778, 3026158, 3170984, 3267557, 3253505, 2793237, 2670110, 2824999, 2650230, 2942941, 3527450, 3528535, 3298599, 3271210, 3248369, 3173559, 3020290, 3393362, 3168861, 3094409, 3057292, 2920831, 2564007, 2362234, 2335373, 2382998, 2777176, 2987788, 3163701, 3329708, 3498554, 3257793, 2633580, 2639515, 2931203, 3037676, 3050428, 3235850, 3429558, 3105560, 3125935, 3158614, 3158805, 3001098, 3212818, 3115373, 3068743, 3134024, 3261892, 2727991, 2705045, 3137955, 3104313]
16059C104313J04300J39048K61198k40824k83636Q7394n60326k05827L34592L37001
16049C077233K16415j11462L92410J32440j20645l33618l45639k36082n1760m5023
16039B574269N8072M01129L42145q8159l88208L69079K01270n28666L08584J91414
16029C440929l13258m12995j00489J49172P840L36326J91671K83468O5001N5114
16019C702779p9604q28259O1767J0747m47745o0931N16979M35783N0408O0629
16009C422553k52337m13074q1820J4739L9460Q6179O1574M83283n9351j32046
15999C169160J88409k80334K93471L15161o603l62941j7902R4429j99904m42839
15989B750107J19737J20121k72938K32359K75498L06962q5372R3007o85391O887
$$ y = [3104313, 3208613, 3347661, 3608859, 3368035, 3084399, 3171793, 2611467, 2405640, 2740232, 3077233, 3293648, 3182186, 3574596, 3707036, 3586391, 3252773, 2907134, 2671052, 2619292, 2574269, 2632341, 3033470, 3375615, 3287456, 2899248, 3268327, 3469597, 2940931, 3249515, 3440929, 3127671, 2714676, 2614187, 2763359, 2771199, 3107525, 3299196, 3582664, 3647665, 3702779, 3623175, 2794916, 2856683, 2867430, 2419685, 2358754, 2875733, 3311516, 3361924, 3422553, 3170216, 2757142, 2675322, 2690061, 2729521, 2815700, 2877274, 3360557, 3301206, 3169160, 3357569, 3077235, 3370706, 3685867, 3679264, 3316323, 3298421, 3392850, 3192946, 2750107, 2869844, 2989965, 2717027, 2949386, 3224884, 3531846, 3446474, 3539481, 2854090, 2860977]
15979B860977J79489p4886l61175L321K01145k94247k39689K47133K39056j50788
15969B610336J57869N81384J79931l33308J28291l7594l40520l40524j42550n4953
15959B408362K6541M30957K88874J13447M00561k74810n48737R2188K63588l66455
15949B834516o00460K40536M10868M6574o6776K72496J52057J42235k9733l11942
15939C090371j59489Q0505R0311n15783l2414K17209L41143o6022M29170J67059
15929C642060j03750Q5096j96042m77438l71414O5153j91465J22533K14517N41395
15919C330645L07904r9267r2326j96850K61990N78j62649m52164J90363J9120
15909C107344m80865j09291K08276O21374k41672k17981J95675N47009k72665
$$ y = [2860977, 3040466, 2965580, 2604405, 2607726, 2808871, 2514624, 2274935, 2522068, 2761124, 2610336, 2768205, 3349589, 3529520, 3196212, 3324503, 3286909, 2946389, 2605865, 2463315, 2408362, 2434903, 2865860, 3154734, 3268181, 3668742, 3393932, 2845195, 2937383, 3200971, 2834516, 2234056, 2474592, 2885460, 2932034, 2865258, 3137754, 3289811, 3432046, 3402313, 3090371, 2930882, 3011387, 3101698, 2585915, 2553501, 2770710, 3111853, 3045831, 3475001, 3642060, 3538310, 3623406, 3427364, 2949926, 2578512, 2643665, 2452200, 2574733, 2789250, 3330645, 3638549, 3539282, 3446956, 3250106, 3512096, 3512674, 3350025, 2897861, 3088224, 3107344, 2626479, 2517188, 2725464, 3346838, 3105166, 2887185, 3082860, 3629869, 3357204]
15900C357204n36916j96064J5369K61727j22928K09640L66153K7605K9923K5201
15890C436914K01421k19222J8323q5254k5966j83165m82435K14965J54953L36430
15880C366964j25899r5399j79914N064p9711J51947o8879k74487J53477J647J86843
15869C041653N0793J13798l6644K61240K35035l00068k82409m6091K87699k31492
15859C093514l46305k2424J76707K05204P9828k40993j18899M83070o3838K31277
15849C477141K18252j76509j65616j16206k0984m1237n7433k56246K61267R9424
15839C221853j55870K44266K54809M3094m77321J1020q4143q8488k97675P1636
15829B743181K72176J9920J99189K7179K17516J61362K48245n30291k50485j11552
$$ y = [3357204, 2820288, 2624224, 2639593, 2901320, 2778392, 2988032, 3354185, 3381790, 3411713, 3436914, 3638335, 3419113, 3437436, 3352182, 3326216, 3143051, 2660616, 2875581, 3030534, 3366964, 3241065, 3145666, 2965752, 2970816, 2891105, 3043052, 2974173, 2699686, 2853163, 2854810, 3041653, 3092446, 3206244, 3169600, 3430840, 3665875, 3365807, 3083398, 3037307, 3325006, 3093514, 2747209, 2724785, 2901492, 3106696, 3186524, 2945531, 2826632, 3309702, 3245864, 3477141, 3695393, 3518884, 3353268, 3237062, 3216078, 3174841, 3117408, 2861162, 3122429, 3221853, 3065983, 3310249, 3565058, 3608152, 3130831, 3141851, 3057708, 2969220, 2671545, 2743181, 3015357, 3035277, 3234466, 3261645, 3479161, 3640523, 3888768, 3358477, 3107992, 2996440]
15819B996440n870m58158J61346P34710l0508K99708J30711J11882j49607m41344
15809C349310o48531j93267Q9856j6756J26608K11993L06043J87847q9065j23618
15799C200420J82975m367p20850P164J61210L86829K91575k54151j07900M524
15789C147429J42444k24189L30571k7559k17610O5836l18708k2893l54342L93188
15779B914167L2324K38501N1126K2374M87255k81777l27758q9740r5251k54079
15769B697142j70248J54888O18210m8125j8603j37116K03402K19026N2616k56039
15759C315153k50951J62735k70497k86303K87309K90135L8173J35301O4998k45934
15749C240119L47594n97212O8323K03068j82139K16831j65400K84216M2421n3281
$$ y = [2996440, 2990570, 2532412, 2693758, 3428468, 3397960, 3697668, 3828379, 3940261, 3790654, 3349310, 2700779, 2507512, 2597368, 2580612, 2707220, 2919213, 3225256, 3413103, 3324038, 3200420, 3383395, 3379028, 2658178, 2665342, 2826552, 3213381, 3504956, 3250805, 3142905, 3147429, 3289873, 3065684, 3396255, 3368696, 3151086, 3216922, 2898214, 2875321, 2520979, 2914167, 2946491, 3184992, 3236118, 3258492, 3745747, 3463970, 3136212, 3046472, 2951221, 2697142, 2526894, 2681782, 3299992, 3251867, 3233264, 3096148, 3299550, 3518576, 3571192, 3315153, 3064202, 3226937, 2956440, 2670137, 2957446, 3247581, 3285754, 3421055, 3486053, 3240119, 3587713, 2990501, 3058824, 3261892, 3079753, 3296584, 3131184, 3415400, 3457821, 3404540]
15739C404540m08550K12262J13663n22772K49840l9175J18457N016L29018j10463
15729C351836m30591j69546k23230Q23103j17472q5224j86002M4905J08883j25469
$$ y = [3404540, 2995990, 3208252, 3321915, 2799143, 3048983, 3009808, 3128265, 3133281, 3462299, 3351836, 2921245, 2751699, 2528469, 3351572, 3234100, 3148876, 2962874, 3007779, 3116662, 2991193]
$$ [...]
##END NTUPLES=NMR SPECTRUM
##END=
