##TITLE=1H_DE-80H_X3
 200.13MHz, d2o
 8 sc
 
 19ns.26.2.2025
##JCAMPDX= 6.0         $$ Bruker NMR JCAMP-DX V2.0
##DATA TYPE= NMR SPECTRUM
##DATA CLASS= NTUPLES
##ORIGIN= UXNMR, Bruker Analytische Messtechnik GmbH
##OWNER= pz
$$ XWIN-NMR		Version 3.5
$$ Thu Jul 16 12:26:21 2026 Russian Standard Time (UT+4h)  Yarkov@DPX200
##.OBSERVE FREQUENCY= 200.1313
##.OBSERVE NUCLEUS= ^1H
##.ACQUISITION MODE= SIMULTANEOUS
##.ACQUISITION SCHEME= undefined
##.AVERAGES= 8
##.DIGITISER RES= 18
##SPECTROMETER/DATA SYSTEM= spect
##.PULSE SEQUENCE= zg30
##.SOLVENT NAME= DMSO
##.SHIFT REFERENCE= (INTERNAL, DMSO, 0, 15.5023)
##AUDIT TRAIL= $$ (NUMBER, WHEN, WHO, WHERE, WHAT)
$$ ##TITLE= Audit trail, XWIN-NMR		Version 3.5
$$ ##JCAMPDX= 5.01
$$ ##ORIGIN= Bruker BioSpin GmbH
$$ ##OWNER= Yarkov
$$ C:/Bruker/XWIN-NMR/data/yarkov2/nmr/H-C/1/pdata/1/auditp.txt
$$ ##AUDIT TRAIL=  $$ (NUMBER, WHEN, WHO, WHERE, WHAT)
(   1,<2026-07-16 12:25:34.07 +0400>,<Yarkov>,<DPX200>,
      <created by zg, POWCHK disabled, PULCHK disabled
       configuration hash MD5:
       00 E9 B6 7A A2 85 ED C7 34 08 36 98 17 FE 4E 26
       data hash MD5: 16K
       8B 79 82 2E 60 A3 73 35 A6 AC 5B 7D 31 A1 72 93>)
(   2,<2026-07-16 12:25:40.96 +0400>,<Yarkov>,<DPX200>,
      <Start of raw data processing
       efp BC_mod = 2 LB = 0.25 FT_mod = 6 PKNL = 1 PHC0 = -7255.922 PHC1 = 7.421964 SI = 16K 
       data hash MD5: 16K
       05 A0 78 49 2D 42 52 FA A7 E7 33 4F 13 6C CF FE>)
$$ ##END=
$$ 
$$ hash MD5
$$ 6A 6A 88 6F 05 A1 DC 21 5E BB 41 29 C2 19 B0 2A
##$RELAX= 
##$RELAX= 
##$RELAX= 
##$RELAX= 
##$RELAX= 
##$RELAX= 
$$ Bruker specific parameters
$$ --------------------------
##$DU= <C:/Bruker/XWIN-NMR>
##$EXPNO= 1
##$NAME= <H-C>
##$PROCNO= 1
##$TYPE= <nmr>
##$USER= <yarkov2>
##$AMP= (0..31)
100 100 100 100 100 100 100 100 100 100 100 100 100 100 100 100 100 100 
100 100 100 100 100 100 100 100 100 100 100 100 100 100 
##$AQSEQ= 0
##$AQ_mod= 1
##$AUNM= <au_zg>
##$AUTOPOS= <>
##$BF1= 200.13
##$BF2= 200.13
##$BF3= 200.13
##$BF4= 200.13
##$BF5= 200.13
##$BF6= 200.13
##$BF7= 200.13
##$BF8= 200.13
##$BYTORDA= 1
##$CFDGTYP= 0
##$CFRGTYP= 5
##$CHEMSTR= <none>
##$CNST= (0..31)
1 1 145 1 1 1 1 1 1 1 1 1 1 1 1 1 1 1 1 1 1 1 1 1 1 1 1 1 1 1 1 1 
##$CPDPRG= <>
##$CPDPRG1= <>
##$CPDPRG2= <>
##$CPDPRG3= <>
##$CPDPRG4= <mlev>
##$CPDPRG5= <mlev>
##$CPDPRG6= <mlev>
##$CPDPRG7= <mlev>
##$CPDPRG8= <mlev>
##$CPDPRGB= <>
##$CPDPRGT= <>
##$D= (0..31)
0 0.7 0 0 0 0 0 0 0 0 0 0.03 0 0 0 0 0 0 0 0 0 0 0 0 0 0 0 0 0 0 0 0 
##$DATE= 1784190333
##$DBL= (0..7)
120 120 120 120 120 120 120 120 
##$DBP= (0..7)
150 150 150 150 150 150 150 150 
##$DBP07= 0
##$DBPNAM0= <>
##$DBPNAM1= <>
##$DBPNAM2= <>
##$DBPNAM3= <>
##$DBPNAM4= <>
##$DBPNAM5= <>
##$DBPNAM6= <>
##$DBPNAM7= <>
##$DBPOAL= (0..7)
0.5 0.5 0.5 0.5 0.5 0.5 0.5 0.5 
##$DBPOFFS= (0..7)
0 0 0 0 0 0 0 0 
##$DE= 6
##$DECBNUC= <off>
##$DECIM= 32
##$DECNUC= <off>
##$DECSTAT= 4
##$DIGMOD= 1
##$DIGTYP= 9
##$DL= (0..7)
0 120 120 120 120 120 120 120 
##$DP= (0..7)
$$ [...]
##$SUBNAM2= <"">
##$SUBNAM3= <"">
##$SUBNAM4= <"">
##$SUBNAM5= <"">
##$SUBNAM6= <"">
##$SUBNAM7= <"">
##$SUBNAM8= <"">
##$SUBNAM9= <"">
##$SW= 18.0517328524113
##$SWIBOX= (0..15)
0 0 2 0 0 0 0 0 0 0 0 0 0 0 0 0 
##$SW_h= 3612.71676300578
##$TD= 16384
##$TD0= 1
##$TE= 0
##$TE2= 300
##$TE3= 300
##$TEG= 300
##$TL= (0..7)
0 120 120 120 120 120 120 120 
##$TP= (0..7)
150 150 150 150 150 150 150 150 
##$TP07= 0
##$TPNAME0= <>
##$TPNAME1= <>
##$TPNAME2= <>
##$TPNAME3= <>
##$TPNAME4= <>
##$TPNAME5= <>
##$TPNAME6= <>
##$TPNAME7= <>
##$TPOAL= (0..7)
0.5 0.5 0.5 0.5 0.5 0.5 0.5 0.5 
##$TPOFFS= (0..7)
0 0 0 0 0 0 0 0 
##$TUNHIN= 0
##$TUNHOUT= 0
##$TUNXOUT= 0
##$USERA1= <user>
##$USERA2= <user>
##$USERA3= <user>
##$USERA4= <user>
##$USERA5= <user>
##$V9= 5
##$VALIST= <valist>
##$VCLIST= <CCCCCCCCCCCCCCC>
##$VD= 0
##$VDLIST= <DDDDDDDDDDDDDDD>
##$VPLIST= <PPPPPPPPPPPPPPP>
##$VTLIST= <TTTTTTTTTTTTTTT>
##$WBST= 1024
##$WBSW= 4
##$XGAIN= (0..3)
0 0 0 0 
##$XL= 0
##$YL= 0
##$YMAX_a= 362613
##$YMIN_a= -494162
##$ZGOPTNS= <>
##$ZL1= 120
##$ZL2= 120
##$ZL3= 120
##$ZL4= 120
##$ABSF1= 0
##$ABSF2= 0
##$ABSG= 0
##$ABSL= 0
##$ALPHA= 0
##$AQORDER= 0
##$ASSFAC= 0
##$ASSFACI= 0
##$ASSFACX= 0
##$ASSWID= 0
##$AUNMP= <proc_1d>
##$AZFE= 0.1
##$AZFW= 0.1
##$BCFW= 0
##$BC_mod= 2
##$BYTORDP= 0
##$COROFFS= 0
##$CY= -3
##$DATMOD= 1
##$DC= 0
##$DFILT= <>
##$DTYPP= 0
##$F1P= 0
##$F2P= 0
##$FCOR= 1
##$FTSIZE= 16384
##$FT_mod= 6
##$GAMMA= 0
##$GB= 0
##$INTBC= 1
##$INTSCL= 3.241238e-09
##$ISEN= 128
##$LB= 0.25
##$LEV0= 0
##$LPBIN= 0
##$MAXI= 10000
##$MC2= 0
##$MEAN= 0
##$ME_mod= 0
##$MI= 1.114404
##$NCOEF= 0
##$NC_proc= -6
##$NLEV= 6
##$NOISF1= 3.799351
##$NOISF2= 2.8
##$NSP= 0
##$NTH_PI= 0
##$NZP= 0
##$OFFSET= 15.50229
##$PC= 1
##$PHC0= -7255.922
##$PHC1= 7.421964
##$PH_mod= 1
##$PKNL= yes
##$PPARMOD= 0
##$PSCAL= 0
##$PSIGN= 0
##$REVERSE= no
##$SF= 200.130003884133
##$SI= 16384
##$SIGF1= 3
##$SIGF2= 2
##$SINO= 0.751879
##$SIOLD= 32768
##$SREGLST= <19F.Aceton>
##$SSB= 0
##$STSI= 16384
##$STSR= 0
##$SW_p= 3612.71676300578
##$SYMM= 0
##$S_DEV= 0
##$TDeff= 16384
##$TDoff= 0
##$TI= <>
##$TILT= no
##$TM1= 0
##$TM2= 0
##$TOPLEV= 0
##$USERP1= <user>
##$USERP2= <user>
##$USERP3= <user>
##$USERP4= <user>
##$USERP5= <user>
##$WDW= 1
##$XDIM= 16384
##$YMAX_p= 359773507
##$YMIN_p= -1063421
$$ End of Bruker specific parameters
$$ ---------------------------------
##NTUPLES= NMR SPECTRUM
##VAR_NAME=  FREQUENCY,     SPECTRUM/REAL,   SPECTRUM/IMAG
##SYMBOL=    X,             R,               I
##VAR_TYPE=  INDEPENDENT,   DEPENDENT,       DEPENDENT
##VAR_FORM=  AFFN,          ASDF,            ASDF
##VAR_DIM=   16384,         16384,           16384
##UNITS=     HZ,            ARBITRARY UNITS, ARBITRARY UNITS
##FACTOR=    0.220516191357247, 1,           1
##FIRST=     3102.47331229006, 0,            0
##LAST=      -510.243450715722, 0,           0
##MIN=       -510.243450715722, -1063421,    0
##MAX=       3102.47331229006, 359773507,    0
$$ Real data points
##PAGE= N=1
##DATA TABLE= (X++(R..R)), XYDATA
$$ [...]
5803C8433584L45613L75837M65159M55988O03579N61869P14531Q48969Q06133
5794D3611262R62484R53610J154694J256105J371463J572204J715146J940535
5786E4537503K037778K289135K488246K795845L149143L497899L919121M393869
5778G9108539M882878N440580O004060O701027P365955Q033569Q634603Q862595
5770A35033806Q950359Q589673P790085O581476M906458K893964R18235j263406
5762A74400650l161097m694125o110432p162849p887167q146080p992189p625474
5754A21621237o769308n793741m854768m455050m705122n180308n435728n373035
5746G9054177n217682n001770m765048m509409m164498l859934l464357k958381
$$ y = [38433584, 38779197, 39155034, 39620193, 40076181, 40679760, 41241629, 41956160, 42805129, 43611262, 44573746, 45527356, 46682050, 47938155, 49309618, 50881822, 52596968, 54537503, 56575281, 58864416, 61352662, 64148507, 67297650, 70795549, 74714670, 79108539, 83991417, 89431997, 95436057, 102137084, 109503039, 117536608, 126171211, 135033806, 143984165, 152573838, 160363923, 166945399, 171851857, 174745821, 175664056, 174400650, 171239553, 166545428, 160434996, 153272147, 145384980, 137238900, 129246711, 121621237, 114851929, 109058188, 104203420, 99748370, 95043248, 89862940, 84427212, 79054177, 73836495, 68834725, 64069677, 59560268, 55395770, 51535836, 48071479, 45113098]
5738D5113098k423070k132979j848902j635004j471684j332413j166495j058700
5730C2043851j023178r17358q22150p26341p19306q02364p29328o61716o65600
5721B4976510p37434o61406n69184o50904o34088n68432n50335n77777n44037
5712A9482913n24845n23293n31613m27706m13470m10884m33573l87510l12046
5703A5517973l04662l59450l41979l40027k57354k41528l21107k55655k14945
5694A2881266k05427k06755k40408j55352k55095j46006j67622k69785j08839
5685A1125977j52511k12154k02387j41330j19082j21868j46976j91511r9249r9597
5675I639312r4229j22917j02241j21725j00240p2682j04405j29293l2365o1553
$$ y = [45113098, 42690028, 40557049, 38708147, 37073143, 35601459, 34269046, 33102551, 32043851, 31020673, 30103315, 29281165, 28554824, 27835518, 27033154, 26303826, 25642110, 24976510, 24239076, 23577670, 23008486, 22357582, 21723494, 21155062, 20604727, 20026950, 19482913, 18958068, 18434775, 17903162, 17475456, 17061986, 16651102, 16217529, 15830019, 15517973, 15213311, 14853861, 14511882, 14171855, 13914501, 13672973, 13351866, 13096211, 12881266, 12675839, 12469084, 12228676, 12073324, 11818229, 11672223, 11504601, 11234816, 11125977, 10973466, 10761312, 10558925, 10417595, 10298513, 10176645, 10029669, 9838158, 9738909, 9639312, 9545083, 9422166, 9319925, 9198200, 9097960, 9025278, 8920873, 8791580, 8759215, 8697662]
5665H697662j27394j15160q1352n3325r7550j14078p3788r3103j44616j28289
5655G669007j21280j15970n6086o2277j44962j6522m6929p6460o2170m8287k3190
5644F894874j14576p7014l3535n1022n5529j05744k7032m5648m1850l8064j19006
5633F185854o2553M8282O2229o6718j23285m2926o1501k6982j02103j4408O0996
5622E856885j4161m3016j35419K72Q9778n2872p5259l5744j8787q2684j6095J7495
5610E490393o0628q6915r451J3182q019j9339n7085L3811l3643J9394Q865j9454
5598E271111K1519o2991J6121p0447n1558N5171L5479o2385p710o73M628M8987
5586E197252j5901K0207l4775K0115J4790L1345J5249k4661k6268M8452L2623
$$ y = [8697662, 8570268, 8455108, 8373756, 8320431, 8222881, 8108803, 8035015, 7941912, 7797296, 7669007, 7547727, 7431757, 7375671, 7313394, 7168432, 7151910, 7104981, 7028521, 6966351, 6918064, 6894874, 6780298, 6703284, 6669749, 6618727, 6563198, 6457454, 6430422, 6384774, 6342924, 6304860, 6185854, 6123301, 6171583, 6233812, 6167094, 6043809, 6000883, 5939382, 5912400, 5810297, 5795889, 5856885, 5842724, 5799708, 5664289, 5664561, 5754339, 5701467, 5626208, 5590464, 5571677, 5488993, 5472898, 5490393, 5429765, 5342850, 5333399, 5346581, 5338562, 5319223, 5262138, 5295949, 5262306, 5281700, 5290565, 5271111, 5292630, 5229639, 5245760, 5175313, 5123755, 5178926, 5214405, 5152020, 5144310, 5143637, 5148265, 5197252, 5181351, 5201558, 5166783, 5186898, 5201688, 5233033, 5248282, 5223621, 5197353, 5245805, 5278428]
5575E278428j19278J7527L4140j9560K6905k2902k0579L951j8475K4092R80M74
5563E185703l4714j0625K2360L0928q924o3247k3682p332R3970l5726K1989K2173
5551E192873m9222N9412P7327N936N07n8926J7195L2320K9757N1113j3398K6395
5539E371289L0345N6185N3216o128L1542r702k7047N0729R3225J51032l7938O9769
5527E826517J68999K5015P42L1847J1393J6319J34876P9115j6540J33369N0764
5516F462416Q8347J83599J16907J37606K24114K49167L28539M27431N93281P68991
5506I580398P14918O00765L71286K21315k6526k24930l23172l65859m09786l96893
5496I741516l44639l72059l22412r9159j39350q0225M1384P64R5539R8854J34063
$$ y = [5278428, 5159150, 5176677, 5210817, 5191257, 5218162, 5195260, 5174681, 5178632, 5160157, 5184249, 5185229, 5185703, 5150989, 5140364, 5162724, 5193652, 5184728, 5121481, 5097799, 5090467, 5184437, 5148711, 5170700, 5192873, 5143651, 5203063, 5280390, 5286326, 5286833, 5227907, 5245102, 5277422, 5307179, 5358292, 5344894, 5371289, 5401634, 5457819, 5511035, 5504907, 5536449, 5526747, 5499700, 5550429, 5643654, 5794686, 5756748, 5826517, 5995516, 6020531, 6021273, 6053120, 6064513, 6080832, 6215708, 6294823, 6278283, 6411652, 6462416, 6550763, 6734362, 6851269, 6988875, 7212989, 7462156, 7790695, 8218126, 8811407, 9580398, 10295316, 10896081, 11267367, 11488682, 11462156, 11237226, 10914054, 10548195, 10138409, 9741516, 9396877, 9024818, 8702406, 8603247, 8463897, 8383672, 8425056, 8425820, 8521359, 8620213, 8754276]
5485H754276K79934K95176K64900L45723M20654N40402P80029J143205J442203
5476A4266502J926129K213825K176533J684248R27930J86760m50046r27110j209511
5467B0795260j467258j445092j338280j375890j143825q90795o82823n63188l72371
5458A1515738k33384j35437j00431M5297J42527J43395J21008K97427L96967N12623
5448A2705730O67211Q03588J226832J666427K041701K236102K081654J603693
5440B5032938O93710o8608o72122j045277j377611j554120j563916j561301j167009
5431A6716684j146403q90725o79008n82195m33851l03629j73603j92488j41391
5422A2173391o2817m9330M446J8644K9069J15096K16794K57596M08348O14277
$$ y = [8754276, 9034210, 9329386, 9594286, 9940009, 10360663, 10901065, 11681094, 12824299, 14266502, 16192631, 18406456, 20582989, 22267237, 23195167, 23381927, 22931881, 22004771, 20795260, 19328002, 17882910, 16544630, 15168740, 14024915, 13134120, 12451297, 11888109, 11515738, 11282354, 11146917, 11046486, 11091783, 11234310, 11377705, 11498713, 11796140, 12193107, 12705730, 13372941, 14176529, 15403361, 17069788, 19111489, 21347591, 23429245, 25032938, 25726648, 25658040, 24985918, 23940641, 22563030, 21008910, 19444994, 17883693, 16716684, 15570281, 14679556, 14000548, 13418353, 12984502, 12680873, 12507270, 12314782, 12173391, 12110574, 12061244, 12065690, 12084334, 12113403, 12228499, 12445293, 12702889, 13111237, 13725514]
5412A3725514P79724P96593O17371M04973N5993j47703k45090m16617n01944m50061
5402A4618753m59068n18649m15000l24228k67567j64137k39411j61399n3413P6099
5392A2091980p3004l9772K4043j1437M9793M3872Q422O880P3423O5719L5728P023
5380A2282670J11924J18395K2656J9481J11166J13907J52381P4470l5921Q5299
5370A3056428J37146R9207O908O5798J86372R7503O565R5545J22414j557J71617
5359A4043946J02435P8444J31128K6425J27279J13930N9813J21224J32462J07307
5349A5044393J41097R1665L2778J59693J70370R5797j2628J13746J95328J23555
5339A6155794Q0126Q9024J26016J61615J12648J16832J11000J61117J24863J36818
$$ y = [13725514, 14505238, 15301831, 15919202, 16324175, 16380168, 16232465, 15987375, 15570758, 15068814, 14618753, 14159685, 13641036, 13226036, 12901808, 12634241, 12470104, 12230693, 12069294, 12015881, 12091980, 12018976, 11979204, 12003247, 11991810, 12041603, 12085475, 12093897, 12100777, 12174200, 12239919, 12275647, 12282670, 12394594, 12512989, 12535645, 12555126, 12666292, 12780199, 12932580, 13007050, 12971129, 13056428, 13193574, 13292781, 13299689, 13365487, 13551859, 13649362, 13655927, 13751472, 13873886, 13872329, 14043946, 14146381, 14224825, 14355953, 14382378, 14509657, 14623587, 14683400, 14804624, 14937086, 15044393, 15185490, 15277155, 15309933, 15469626, 15639996, 15735793, 15723165, 15836911, 16032239, 16155794, 16235920, 16324944, 16450960, 16612575, 16725223, 16842055, 16953055, 17114172, 17239035, 17375853]
5329A7375853J33861J40601K06596J14461O5833J10063J78574Q8014J09077L5313
5319A8558246J18228J53791J76749R5448Q7501J24547J97115J39239J12621O4831
5309A9828316J04538Q9495J02932J50449Q2749K07833J05398R0975R6645N4002
5299B0913332J16781R1831Q8719L5603J43874J97337R8853K1490J3976J26012
5289B1847808J04380R1171k9298N8937J60615J48700l5410O20P8107J49563P0019
5278B2645212L3134L6262M2876O0684J30977n3871j00804J61224N4714N0023J7885
5267B3078316j1777O7712P4857m960j10196o5553J12823K2414j7759m5111l6784
5256B3063982q872K3261p5075j24530L3851j0475m9672o0865p5269r052R514l9631
$$ y = [17375853, 17509714, 17650315, 17856911, 17971372, 18037205, 18147268, 18325842, 18413856, 18522933, 18558246, 18676474, 18830265, 19007014, 19102462, 19189963, 19314510, 19511625, 19650864, 19763485, 19828316, 19932854, 20022349, 20125281, 20275730, 20358479, 20566312, 20671710, 20762685, 20859330, 20913332, 21030113, 21121944, 21210663, 21246266, 21390140, 21587477, 21686330, 21707820, 21721796, 21847808, 21952188, 22043359, 22014061, 22072998, 22233613, 22382313, 22346903, 22347523, 22425630, 22575193, 22645212, 22678346, 22714608, 22757484, 22818168, 22949145, 22895274, 22794470, 22955694, 23010408, 23060431, 23078316, 23066539, 23134251, 23209108, 23204148, 23093952, 23028399, 23141222, 23163636, 23145877, 23100766, 23063982, 23055110, 23078371, 23003296, 22878766, 22912617, 22902142, 22852470, 22791605, 22716336, 22707284, 22716798, 22677167]
5244B2677167p0644j5250j3654r8389j39574q7663m3817K2600j09155j08569j34180
5233B1878872n6613N4414j7666j20219o4053k9468K6170k6782k8788J72256K63300
5222B2051423K25921J64462O3919j0472p5273k13301l18580m26811l49830l06662
5212B0804796l67393l81322l03513l08405j38466j81154k51986k18339j47549
5203A8506669j81684k02840j94465j17485n8400j39032k47246j50664n1289r2561
5193A7071003k11372j92174j55425j53173r2514j47551j59394j43952k3578o7789
5183A5724081j71252j69986j41450j26698j10077j80887j50825j81779j20559
5174A4370568k7922r4208j53441p3132j31639j37855j76810r9379o3185p9029
$$ y = [22677167, 22606523, 22591273, 22577619, 22479230, 22339656, 22251993, 22208176, 22230776, 22121621, 22013052, 21878872, 21822259, 21876673, 21859007, 21738788, 21674735, 21645267, 21671437, 21644655, 21615867, 21788123, 22051423, 22277344, 22441806, 22505725, 22495253, 22419980, 22206679, 21888099, 21461288, 21111458, 20804796, 20437403, 20056081, 19752568, 19444163, 19305697, 19124543, 18872557, 18654218, 18506669, 18324985, 18122145, 17927680, 17810195, 17751795, 17612763, 17365517, 17214853, 17163564, 17071003, 16859631, 16667457, 16512032, 16358859, 16266345, 16118794, 15959400, 15815448, 15791870, 15724081, 15552829, 15382843, 15241393, 15114695, 15004618, 14823731, 14672906, 14491127, 14370568, 14342646, 14248438, 14094997, 14021865, 13890226, 13752371, 13575561, 13476182, 13412997, 13333968]
5164A3333968j61402j28022p3164j06554q5602k17321j36087j06410j4877n5595
5154A2248934j25023j16437n4595j18291j05730j53835j48517q3363r2208j22918
5144A1128017j09841r3374j950r5656j69232j09991m2011K4154j52122j39522
5134A0238472l3939j14152r5635p1886j09028j14343n6454k2633j03077q8958
5124I428367r1772m7249q8858j05867q9099m7909n1864l3631m2547j25415o6622
5113H637534q4461o8859p7620j52111o9158P9055n1778j16449j21556m1266l7170
5102G896161j18482n4680j1571p5972l1039l1838o9253j02926j03938k2326L6220
5091G310356r4327q3778n0360p0437n2478n9404j4168l5577k5869j13873j2896
$$ y = [13333968, 13172566, 13044544, 12971380, 12864826, 12779224, 12561903, 12425816, 12319406, 12304529, 12248934, 12123911, 12007474, 11952879, 11834588, 11728858, 11575023, 11426506, 11343143, 11250935, 11128017, 11018176, 10924802, 10922852, 10827196, 10657964, 10547973, 10505962, 10530116, 10377994, 10238472, 10204533, 10090381, 9994746, 9922860, 9813832, 9699489, 9643035, 9620402, 9517325, 9428367, 9336595, 9289346, 9200488, 9094621, 9005522, 8957613, 8905749, 8872118, 8829571, 8704156, 8637534, 8553073, 8484214, 8406594, 8254483, 8185325, 8264380, 8212602, 8096153, 7974597, 7933331, 7896161, 7777679, 7722999, 7711428, 7635456, 7604417, 7572579, 7503326, 7400400, 7296462, 7274136, 7310356, 7216029, 7132251, 7081891, 7011454, 6958976, 6899572, 6885404, 6849827, 6823958, 6710085, 6697189]
5080F697189j16901k0650m795o101q2583K4174j01097k71o8624j02712L5679l2288
5068F221020k7540j17641m7786k5282N746j6396p7959k9735p3468k2376Q969n9611
5056E737941j3054M0421l8188n3804l4806n7994m6597K0494o4385n8707N4756
5045E486077m7517q71R522j7379j3246o1349n674o4081n8628K8151J81p1276l8125
5032E145785K5828j05767o9964o8030L1742k0455R007r7182n5872k8786o276j0405
5020D749625n633j4045j04714j6203J5821q4131o4043J8308K325j3179K100r9488
5008D386743R133O3031q4889j14541K4775O599j4542m3650N9075n6082L3329O4427
4996D333408j01843j691N306j5814k6396r3841M3402L6480J8013M6827m5582n1834
$$ y = [6697189, 6580288, 6559638, 6554843, 6548742, 6466159, 6490333, 6389236, 6388965, 6320341, 6217629, 6253308, 6221020, 6193480, 6075839, 6028053, 6002771, 6008517, 5992121, 5914162, 5884427, 5810959, 5788583, 5797552, 5737941, 5724887, 5765308, 5727120, 5673316, 5638510, 5580516, 5533919, 5554413, 5490028, 5431321, 5486077, 5438560, 5437689, 5447211, 5429832, 5416586, 5355237, 5349563, 5285482, 5226854, 5255005, 5255186, 5183910, 5145785, 5171613, 5065846, 4995882, 4927852, 4959594, 4939139, 4948146, 4850964, 4795092, 4766306, 4760030, 4749625, 4743992, 4729947, 4625233, 4609030, 4624851, 4540720, 4476677, 4494985, 4497310, 4484131, 4486231, 4386743, 4395876, 4458907, 4374018, 4259477, 4284252, 4290851, 4276309, 4232659, 4291734, 4235652, 4268981, 4333408, 4231565, 4229874, 4235180, 4219366, 4192970, 4099129, 4142531, 4179011, 4197024, 4243851, 4198269, 4146435]
4984D146435l0320J4435L6075J29774L7610R8018J23091m9626p089K1025K0654
4973D540082l3004q7348K3253q8733m3922q9389j36369n4310k1054l579K7032
4962D032659l7654j0216R419l222p0290j5659J3149l2484p3802K5439K2008n1664
4950C807683M1640j8618m4558O6966m5141l1761R003j5290l5194K4920m174k9226
4938C726250k299J5241r092J6448m9549J5643k6635j5919l2951n702N0008k8852
4926C652591j0116n6947r205m1393M2372j3886j0314J4746q31k0074M923J6225
4914C568091K2978l0377m568L4142l892M0544k7209q5711O34J4782M4308L5382
4902C609104q699K1482j0214l1811l749p270o820j4303N9568K5282l4007O446
$$ y = [4146435, 4116115, 4130550, 4166625, 4296399, 4334009, 4432027, 4555118, 4505492, 4498403, 4519428, 4540082, 4507078, 4419730, 4442983, 4354250, 4310328, 4220939, 4084570, 4030260, 4009206, 4005627, 4032659, 3995005, 3984789, 3994208, 3990986, 3920696, 3905037, 3918186, 3885702, 3811900, 3837339, 3859347, 3807683, 3849323, 3830705, 3786147, 3853113, 3807972, 3776211, 3785214, 3769924, 3734730, 3759650, 3755476, 3726250, 3723951, 3739192, 3730100, 3746548, 3696999, 3712642, 3686007, 3670088, 3637137, 3631435, 3681443, 3652591, 3642475, 3585528, 3576323, 3534930, 3577302, 3563416, 3553102, 3567848, 3567017, 3546943, 3551866, 3568091, 3591069, 3560692, 3556124, 3590266, 3586374, 3626918, 3599709, 3513998, 3514632, 3529414, 3573722, 3609104, 3600405, 3621887, 3611673, 3579862, 3576113, 3568843, 3562023, 3547720, 3607288, 3632570, 3598563, 3605009]
4890C605009K2817J1376j8372M1758J7558K7864l898R463K8387J24966j3507m0236
4878C813185K5956Q7005N9046k9690k4266M529J15420L8001K3569k3921k0718
4867D068116M6624P3341K6063L6558J2198R9833K6969J1933L6061L9758J36672
4856D614126P187p1260R442R3045J61538L9604j031M2904J11233R0550M0794R5012
4844E233144J46340J00802J08874J11154J11063J03672J09034R5137N006m8682
4834F075544M9345J14922p634l5195J44751J95069J94160J73121J46669K70552
4824G321304K56305K24695J81382K34278M79170O29636Q96534J276089J591928
4815A3091321J903342J917074J263545L33226k23864l72692o01437q15995q09430
$$ y = [3605009, 3627826, 3639202, 3620830, 3662588, 3680146, 3708010, 3704112, 3713575, 3741962, 3866928, 3853421, 3813185, 3839141, 3926146, 3985192, 3955502, 3931236, 3935765, 4051185, 4089186, 4112755, 4088834, 4068116, 4114740, 4188081, 4214144, 4250702, 4262900, 4362733, 4389702, 4401635, 4437696, 4477454, 4614126, 4621313, 4550053, 4559495, 4652540, 4814078, 4853682, 4852651, 4895555, 5006788, 5097338, 5138132, 5233144, 5379484, 5480286, 5589160, 5700314, 5811377, 5915049, 6024083, 6119220, 6124226, 6075544, 6124889, 6239811, 6232177, 6196982, 6341733, 6536802, 6730962, 6904083, 7050752, 7321304, 7577609, 7802304, 7983686, 8217964, 8697134, 9326770, 10223304, 11499393, 13091321, 14994663, 16911737, 18175282, 18508508, 18284644, 17911952, 17310515, 16494520, 15685090]
4806A5685090o76489p44767p41879n78876m25889l7209O538J40237J54088K68641
4796A3049485L09236L28457L71384L95515N31895N50701O20598N97134N93834
4787A7348239O57341P13754P63831P72153P86017Q69631Q72165R53871Q86834
4778B4623836R43670R64357J014014R71134R49789J038059J036994R65903J015757
4769C3523513J018650J015085J028992J032999J061929J067778J144669J154478
4761D2048093J149906J065605J120423J242033J228123J136724J206725J202198
4753E1399830J249006J097809J053981J018379R61897Q89602Q05639N95494M35472
4744E9507109L47678K25445J01637o4647k16328k33297m39334m12090n12854o72130
$$ y = [15685090, 15008601, 14263834, 13521955, 12943079, 12517190, 12479981, 12486519, 12626756, 12780844, 13049485, 13358721, 13687178, 14058562, 14454077, 14985972, 15536673, 16157271, 16754405, 17348239, 18005580, 18719334, 19483165, 20255318, 21041335, 21910966, 22783131, 23737002, 24623836, 25567506, 26531863, 27545877, 28517011, 29466800, 30504859, 31541853, 32507756, 33523513, 34542163, 35557248, 36586240, 37619239, 38681168, 39748946, 40893615, 42048093, 43197999, 44263604, 45384027, 46626060, 47854183, 48990907, 50197632, 51399830, 52648836, 53746645, 54800626, 55819005, 56780902, 57670504, 58476143, 59071637, 59507109, 59854787, 60080232, 60181869, 60117222, 59900894, 59667597, 59228263, 58816173, 58303319, 57631189]
4734E7631189o03118o90810p66345p83026p55113p75760p92351q56158q57458
4725E0751050q58880p98165q46083r54767r93252q48337q23741q62339r59402
4716D2806084q92827q34454p96064q34309p82284o57987p34130o39903n65771
4707C6068355n00115l05970j91380k53033k09008j03303Q946J51405J34765K62417
4697C5063079L72149M55080N15105N22919O04264O94721P28850P55878P27204
4688D0439249Q04362R08889Q99050Q84057Q35577Q81854R49547R50623Q70181
4679D8423389Q06738Q61506R10412Q46663Q77033Q91416Q23995P41967P95287
4670E5978406Q24075O46937P19416O19481O13324M58892K84870K71477J22910
$$ y = [57631189, 57028071, 56337261, 55570916, 54787890, 54032777, 53257017, 52464666, 51608508, 50751050, 49892170, 49094005, 48247922, 47293155, 46299903, 45451566, 44627825, 43765486, 42806084, 41913257, 41078803, 40282739, 39448430, 38666146, 38008159, 37274029, 36634126, 36068355, 35568240, 35262270, 35070890, 34817857, 34608849, 34505546, 34514492, 34665897, 34800662, 35063079, 35435228, 35890308, 36405413, 36928332, 37532596, 38227317, 38956167, 39712045, 40439249, 41243611, 42152500, 43051550, 43935607, 44771184, 45653038, 46602585, 47553208, 48423389, 49230127, 50091633, 51002045, 51848708, 52725741, 53617157, 54441152, 55183119, 55978406, 56802481, 57449418, 58168834, 58788315, 59401639, 59860531, 60145401, 60416878, 60539788]
4661F0539788L45k00969k63112l63608n29030o98181p85052p95344q24403r85539
4651E5094895j089032j138942j045586j073944j193669j164819j185742j058190
4643D6144971r92567j073821j122615j076084j000825r46526r80719r75817j035670
4634C6940327q77231q46818j010027r44342p79529o74665n80089n44268o71435
4625C0011923o36564p22587r29249r60030j033859j110688j005674r64459r70240
4616B1678573r38271p76957o08182n91400n86502l21851k89813k06058k18077
4607A7141462j25498j0828p8027k6408O6756J8655J63510J79259O732j224J08513
4596A7442902N3347M0049J28409K3183J16225J9733j33310k87147k73173k13184
$$ y = [60539788, 60540133, 60339164, 60076052, 59712444, 59183414, 58485233, 57700181, 56904837, 56080434, 55094895, 54005863, 52866921, 51821335, 50747391, 49553722, 48388903, 47203161, 46144971, 45152404, 44078583, 42955968, 41879884, 40879059, 39932533, 38951814, 37975997, 36940327, 36063096, 35216278, 34206251, 33261909, 32482380, 31807715, 31227626, 30683358, 30011923, 29375359, 28652772, 27723523, 26763493, 25729634, 24618946, 23613272, 22648813, 21678573, 20740302, 19963345, 19355163, 18763763, 18177261, 17855410, 17565597, 17359539, 17141462, 17015964, 17005136, 16927109, 16900701, 16967457, 16986112, 17149622, 17328881, 17335613, 17334389, 17442902, 17496249, 17536298, 17664707, 17687890, 17804115, 17823848, 17690538, 17403391, 17130218, 16917034]
4586A6917034l27576l86492k72319m10619m57977n55312n03572n52882n56732
4577A2893553m11752n93994n15485n68549n05455n15359n01876m74926m38563
4568H367594m23058l66917l49700l52035k21575l27302k48336k43120j57835j64008
4558E513708j50786r6060j03207j30498j05756j10378m6331o2519j07733n6308
4548D544132k2124q3239j32295q1719N881p3441p6897n2449o5713j6365n4415
4537C891356l1094o6854j4063p3540r3448o1170J2422l2116p5241j07623n1569
4526C297060J1656p602m9388m418j02484m5733O1178l3493l3432k9616n0176J2574
4514C026126N573q4549l6129o5370j4511P0412r1432p419N5802j32735n1156J3925
$$ y = [16917034, 16589458, 16202966, 15930647, 15520028, 15062051, 14506739, 14003167, 13450285, 12893553, 12481801, 11887807, 11372322, 10803773, 10298318, 9782959, 9281083, 8806157, 8367594, 7944536, 7577619, 7227919, 6875884, 6654309, 6327007, 6078671, 5835551, 5677716, 5513708, 5362922, 5266862, 5163655, 5033157, 4927401, 4817023, 4770692, 4708173, 4600440, 4544132, 4522008, 4438769, 4306474, 4224755, 4230636, 4157195, 4080298, 4027849, 3962136, 3945771, 3891356, 3860262, 3793408, 3779345, 3705805, 3612357, 3551187, 3563609, 3531493, 3456252, 3348629, 3297060, 3308716, 3301114, 3251726, 3247308, 3144824, 3099091, 3160269, 3126776, 3093344, 3063728, 3013552, 3026126, 3031699, 2947150, 2911021, 2845651, 2831140, 2901552, 2810120, 2802701, 2858503, 2725768, 2674612, 2688537]
4502B688537j9340m3293j1681M944J0950n6946q8829l4058J1413m9711P4436M896
4490B491318n6597j2654j069J8778o9151r9418K3648N0536q2511m3973L5845R3509
4478B348261o5252r3326r2260J10345P8763J0058n1610m6424K9879Q5008k5287
4467B288155q8081L7680m0083L897o103J8574m4417O0294r806m2002m8279P3410
4455B203239O1614o7337k5319j5620K6469q141J04509j3686r4004O7066j5782
4444B223008l0316j6882O4675M538m1536l8184M1125P7630k2098q2565j0963J4975
4432B183407L8683P4881l3823m1190k801O2696Rj04298K97L7821O2215M9854r3523
4419B234228j2544Q5386Q4332m5899j22131o7081J30420J01059O689k7210j1007
$$ y = [2688537, 2669197, 2625904, 2614223, 2619167, 2630117, 2573171, 2484342, 2450284, 2461697, 2411986, 2486422, 2491318, 2434721, 2422067, 2420998, 2439776, 2370625, 2271207, 2294855, 2345391, 2262880, 2218907, 2254752, 2348261, 2283009, 2189683, 2097423, 2207768, 2286531, 2296589, 2244979, 2198555, 2228434, 2313442, 2288155, 2200074, 2237754, 2197671, 2201568, 2195465, 2214039, 2169622, 2229916, 2220110, 2178108, 2129829, 2203239, 2264853, 2197516, 2172197, 2156577, 2183046, 2174905, 2279414, 2265728, 2171724, 2238790, 2223008, 2192692, 2175810, 2240485, 2245023, 2203487, 2165303, 2206428, 2284058, 2261960, 2179395, 2168432, 2183407, 2222090, 2296971, 2263148, 2221958, 2219157, 2281853, 2281862, 2177564, 2177861, 2215682, 2277897, 2327751, 2234228, 2221684, 2307070, 2391402, 2345503, 2223372, 2156291, 2286711, 2387770, 2394459, 2367249, 2356242]
4408B356242K0617L5825p320K6706o7469O4694K7217m2211J6678K5521K8126M4862
4396B529488o8138r586J5593N6763N6339l284j7327L6939O8216j6601l9957M8248
4384B656693R0824m856o2536j22992J22727O4577K5055P30j0096J20761N2598
4373B933485p2806j0307Q2355J05874Q2041n6993o3798o796Q0754J12505k8460
4362C157854j7436L3516K3363k9344L63L8954J10144L2828K1693M0208K1354O235
4350C439732J22138J38007O0762N0267J69057J9992M6910P5017M7796J59904J48595
4339D478177R6014Q6800K10364Q7431m6530N7243K3500N6071M846k5459k8848
4328D999609j3620N1659N4865J44165k8040N3184N6424J00772N2345Q3753Q0652
$$ y = [2356242, 2376859, 2412684, 2405364, 2432070, 2364601, 2429295, 2456512, 2414301, 2430979, 2456500, 2484626, 2529488, 2461350, 2451764, 2467357, 2524120, 2580459, 2577175, 2559848, 2596787, 2665003, 2648402, 2608445, 2656693, 2747517, 2742661, 2680125, 2557133, 2679860, 2744437, 2769492, 2770222, 2760126, 2880887, 2933485, 2860679, 2850372, 2932727, 3038601, 3120642, 3063649, 2999851, 2993055, 3073809, 3186314, 3157854, 3140418, 3173934, 3197297, 3167953, 3168316, 3207270, 3317414, 3350242, 3371935, 3412143, 3433497, 3439732, 3561870, 3699877, 3760639, 3810906, 3979963, 3999955, 4046865, 4121882, 4169678, 4329582, 4478177, 4574191, 4660991, 4871355, 4958786, 4912256, 4969499, 4992999, 5049070, 5053916, 5028457, 4999609, 4985989, 5037648, 5092513, 5236678, 5208638, 5261822, 5318246, 5419018, 5471363, 5555116, 5635768]
4317E635768Q6929Q3698O0767P0343O6989J26188J18417J41078J43510J01650
4307F635337J45846J96238J21363J62340J92312K39561J48987K33289K72036K30865
4297H578174K77227K71899K60109L28419L96088L32121L38299M08102M14453M24050
4287A2028941L96764M58320M29128N37416N07064M59359N86185N81476N98783
4278A6583436N57836N95903O74164N90900M99636N75117O46695N74275N20339
4269B1818301O22770N31879N21843M92230M28075M79542L55525M32780L78150
4260B6061095K84832K51519L06037J75646J67252J38768j8959O9250m3462j44717
4250B7247261r0543q1965k27039l06252k54825k58086k93182l84956m29795m88601
$$ y = [5635768, 5722697, 5806395, 5867162, 5937505, 6004494, 6130682, 6249099, 6390177, 6533687, 6635337, 6781183, 6977421, 7098784, 7261124, 7453436, 7692997, 7841984, 8075273, 8347309, 8578174, 8855401, 9127300, 9387409, 9715828, 10111916, 10444037, 10782336, 11190438, 11604891, 12028941, 12425705, 12884025, 13313153, 13850569, 14357633, 14816992, 15403177, 15984653, 16583436, 17141272, 17737175, 18411339, 19002239, 19501875, 20076992, 20723687, 21297962, 21818301, 22441071, 22972950, 23494793, 23987023, 24415098, 24894640, 25250165, 25682945, 26061095, 26345927, 26597446, 26903483, 27079129, 27246381, 27385149, 27366190, 27435440, 27391978, 27247261, 27156718, 27074753, 26847714, 26541462, 26286637, 26028551, 25735369, 25350413, 24920618, 24432017]
4240B4432017m62342l85708n40382n62829n15825m73467n33890n56167n87586
4231A9813821n23986m86331n61628n43226n60677n06661m19665n22145n30384
4222A5159118m94046m07505k55847k75759m94833m54855l30357m03624n38835
4213A1503457m05454l75221l51466k91563m18722l87353k96350k41603k55850
4204H479875k73007k11778k48710j27019j60939k05774j86033r4444j52823j96238
4194F623110j97942j68043j08376l3878k01528j43882j13922k6630K340j77478
4184E453771j34247p4503p8553o3738j47500p5193m0234l2599m4533j50262j11716
4173D500693N019K8159j01699j02638o4395P8152J7688j49374j25959Q4529Q241
$$ y = [24432017, 23969675, 23583967, 23043585, 22480756, 21964931, 21491464, 20957574, 20401407, 19813821, 19289835, 18803504, 18241876, 17698650, 17137973, 16631312, 16211647, 15689502, 15159118, 14665072, 14257567, 14001720, 13725961, 13231128, 12776273, 12445916, 12042292, 11503457, 11098003, 10722782, 10371316, 10079753, 9661031, 9273678, 8977328, 8735725, 8479875, 8206868, 7995090, 7746380, 7619361, 7458422, 7252648, 7066615, 6972171, 6819348, 6623110, 6425168, 6257125, 6148749, 6114871, 5913343, 5769461, 5655539, 5628909, 5631249, 5453771, 5319524, 5245021, 5166468, 5102730, 4955230, 4880037, 4839803, 4807204, 4762671, 4612409, 4500693, 4505712, 4533871, 4432172, 4329534, 4265139, 4343291, 4360979, 4211605, 4085646, 4170175, 4178416]
4162D178416m6048m4853l1104o9275J2480l5p6243m0744P7996J2474o3933o2871
4150C846260L5094J32295J3318p3093k2532O091n539n4272k4390R156P0096l7653
4138C894831l4845p0461K4540O0995J7492p0364p4404l6363P8360N1971n2374
4127C789378p6741N4350M6458j9640n3400l4805J16679M0604q7280m0490L482
4116C738595O7166l9040k6746k2015j6888l2306k7385k2291j8304k8202R2296
4105C664880M7370n5947m9498j6982Q6278m7677p1561J0237r907M0475L0914j17768
4093C510814l3531Q3716Q2872m7107m4273N2423P9645P092p0647l5366Q8363L2007
4081C706008j3282L2841M9167k200N9454n5281k7958M4874J12934M9103n2696
$$ y = [4178416, 4132368, 4087515, 4056411, 3987136, 3999616, 3999581, 3923338, 3882594, 3960590, 3973064, 3909131, 3846260, 3881354, 4013649, 4026967, 3953874, 3931342, 3937433, 3931894, 3877622, 3853232, 3862388, 3932484, 3894831, 3859986, 3789525, 3814065, 3875060, 3892552, 3822188, 3747784, 3711421, 3789781, 3841752, 3789378, 3712637, 3766987, 3813445, 3793805, 3740405, 3705600, 3822279, 3862883, 3775603, 3735113, 3738595, 3805761, 3766721, 3739975, 3717960, 3701072, 3668766, 3641381, 3619090, 3600786, 3572584, 3664880, 3712250, 3656303, 3606805, 3589823, 3676101, 3628424, 3556863, 3567100, 3557193, 3597668, 3628582, 3510814, 3477283, 3560999, 3643871, 3596764, 3552491, 3604914, 3684559, 3691651, 3621004, 3585638, 3674001, 3706008, 3692726, 3725567, 3774734, 3772534, 3831988, 3776707, 3748749, 3793623, 3906557, 3955660, 3902964]
4070C902964N7945P0264Q0897j1002n189K4193m2412L8311m713R266P1435O9149
4058D261108L2807K4848o1658K4989J16785Q0120r4805L137Q8984J06529J512
4047D584356Q728J424K6686J52033O9531K4160O1078Q6760K6721O8085K1145Q1921
4035E212628O8818K5938P3655K026R5438K5453J9130R0095Q7035N2862J56764
4024E909842K2041M5365M9934P8817J10889P7987K7030J11995P3435L9061R6931
4013F643327N0555J46671Q4803J26280Q5339J8333M1916P1470K19220J95542R5907
4002G779363J42436J57026P0615J67029J26302J47345J60580J62270J65628J30363
3992I208957J91029J62246K84226J91816K63458K48616K22851L03214L68482K20979
$$ y = [3902964, 3960909, 4031173, 4112070, 4101068, 4095879, 4120072, 4077660, 4115971, 4111258, 4120524, 4191959, 4261108, 4293915, 4318763, 4257105, 4282094, 4398879, 4478999, 4384194, 4387331, 4476315, 4582844, 4584356, 4593084, 4594508, 4621194, 4773227, 4842758, 4866918, 4927996, 5014756, 5041477, 5109562, 5130707, 5212628, 5281446, 5307384, 5381039, 5383065, 5478503, 5503956, 5523086, 5613181, 5700216, 5753078, 5909842, 5931883, 5977248, 6027182, 6105999, 6216888, 6294875, 6321905, 6433900, 6507335, 6546396, 6643327, 6693882, 6840553, 6925356, 7051636, 7136975, 7155308, 7197224, 7268694, 7487914, 7683456, 7779363, 7921799, 8078825, 8149440, 8316469, 8442771, 8590116, 8750696, 8912966, 9078594, 9208957, 9399986, 9562232, 9846458, 10038274, 10301732, 10550348, 10773199, 11076413, 11444895, 11665874]
3982A1665874L15568L36788L63438L77863L61846L06583L52870M13622L87608
3973A4882060M77627L79268M39408M76394N21377M17005M50504M88301N36941
3964A9068885N44370M73476N66962M91901N36594N42410M93871N77001O51840
3955B3947310O21014P33488O73324P07839P89070Q62938Q91759Q81309R17411
3946C1025462J103546J125494J149544J244315J367975J412582J514320J559791
3938D1503029J572542J745184J805921J788479J924278J858441J759367J706629
3930E5663870J700610J668522J736875J724059J799080J817775J962527J958883
3922G0032201K109921K125002K122405K303067K270289K307516K251384K208493
$$ y = [11665874, 11981442, 12318230, 12681668, 13059531, 13421377, 13727960, 14080830, 14494452, 14882060, 15359687, 15738955, 16178363, 16654757, 17176134, 17593139, 18043643, 18531944, 19068885, 19613255, 20086731, 20653693, 21145594, 21682188, 22224598, 22718469, 23295470, 23947310, 24568324, 25301812, 25975136, 26682975, 27472045, 28334983, 29226742, 30108051, 31025462, 32129008, 33254502, 34404046, 35648361, 37016336, 38428918, 39943238, 41503029, 43075571, 44820755, 46626676, 48415155, 50339433, 52197874, 53957241, 55663870, 57364480, 59033002, 60769877, 62493936, 64293016, 66110791, 68073318, 70032201, 72142122, 74267124, 76389529, 78692596, 80962885, 83270401, 85521785, 87730278]
3914H7730278K189029K171211K160631J946383J795221J831974J714854J582589
3906A03122170J359909J365059J198503Q96258P23312M51322P9883q8199k90008
3897A08818209m69192p43005q55395j027991j264627j379043j487094j632646
3889I9959216j728267j846867j942655k054560k063276k186352k195944k342971
3881H3598324k379924k150856k277496k311627k230719k172470k056954k039713
3873F5978565j989720j941955j803805j774351j760381j802057j672664j667766
3865E1565866j586437j604014j558964j449211j390209j411027j507363j368520
3857C9690121j237191j193515j109778j067299j047199j007165r16778q49700
$$ y = [87730278, 89919307, 92090518, 94251149, 96197532, 97992753, 99824727, 101539581, 103122170, 104482079, 105847138, 107045641, 107941899, 108665211, 109116533, 109196416, 109108217, 108818209, 108349017, 107606012, 106750617, 105722626, 104457999, 103078956, 101591862, 99959216, 98230949, 96384082, 94441427, 92386867, 90323591, 88137239, 85941295, 83598324, 81218400, 79067544, 76790048, 74478421, 72247702, 70075232, 68018278, 65978565, 63988845, 62046890, 60243085, 58468734, 56708353, 54906296, 53233632, 51565866, 49979429, 48375415, 46816451, 45367240, 43977031, 42566004, 41058641, 39690121, 38452930, 37259415, 36149637, 35082338, 34035139, 33027974, 32111196, 31261496]
3849C1261496q21232q07210o92280p03975o86427o19366n67754m76982n92942
3840B5293328n06896m35843m86970m69040m60375m95823l94111m10580m61451
3831B1172239m61522l75366l92158l25673k89337l96427l53932k37233l33574
3822A8007017l80511k68312k88483k28893k38980l04598k08122k22673k59280
3813A5607165j57307j69721j76123k21908j36875j34451j20485j21975j40946
3804A4227374j18917o5456q1619j00056n2251q1130j17l48n158k8441Q7882M0778
3792A3822541M13K3564J03909R3016J08942N4313J02107J08876J38521J92656
3782A4748858O3218J47890J83865K20450K47647K22469K74702J90898K85762K45818
$$ y = [31261496, 30440264, 29633054, 28940774, 28236799, 27550372, 26931006, 26363252, 25886270, 25293328, 24786432, 24350589, 23863619, 23394579, 22934204, 22438381, 22044270, 21633690, 21172239, 20710717, 20335351, 19943193, 19617520, 19328183, 18931756, 18577824, 18340591, 18007017, 17626506, 17358194, 17069711, 16840818, 16601838, 16297240, 16089118, 15866445, 15607165, 15449858, 15280137, 15104014, 14882106, 14745231, 14610780, 14490295, 14368320, 14227374, 14108457, 14043001, 13961382, 13861326, 13809075, 13727945, 13727828, 13727480, 13722322, 13693881, 13781763, 13822541, 13822954, 13846518, 13950427, 14043443, 14152385, 14206698, 14308805, 14417681, 14556202, 14748858, 14812076, 14959966, 15143831, 15364281, 15611928, 15834397, 16109099, 16299997, 16585759, 16831577]
3772A6831577K45749K53051K45095L10733K99746K69290K39925L39800L14568
3763A9349534K93945K16746K98789K90858L10574L53854L01813L31201K78268
3754B2025582M14171L95499L65822L70180M48957M33174L44684M04605L95899
3745B5598573M67888N01655M96823O25901N28190O51366O16502O37171O50824
3736C0774893P33204P41122Q14681P48755P45086Q31034Q36819Q67059P59179
3727C7851832Q88685Q51008P86757P64234P20619O74315P67805N97637N34953
3718D4437845N05891M91944M48651M42344K24776K32917K07116M5413M0179l7273
3708D7039803o3655j19136k64164l38427l95152m22616n49891n21477n39735o43746
$$ y = [16831577, 17077326, 17330377, 17575472, 17886205, 18185951, 18455241, 18695166, 19034966, 19349534, 19643479, 19860225, 20159014, 20449872, 20760446, 21114300, 21416113, 21747314, 22025582, 22439753, 22835252, 23201074, 23571254, 24020211, 24453385, 24798069, 25202674, 25598573, 26066461, 26568116, 27064939, 27690840, 28219030, 28870396, 29486898, 30124069, 30774893, 31508097, 32249219, 33063900, 33812655, 34557741, 35388775, 36225594, 37092653, 37851832, 38740517, 39591525, 40378282, 41142516, 41863135, 42537450, 43305255, 43902892, 44437845, 44943736, 45435680, 45884331, 46326675, 46551451, 46784368, 46991484, 47036897, 47077076, 47039803, 46976148, 46857012, 46592848, 46254421, 45859269, 45436653, 44886762, 44365285, 43825550, 43181804]
3698D3181804o60464o15846p63290q69284p34036p03432p61190p57350q79727
3689C6437185q29947p82348o77468p12879p92231o69420o50048p75106p43669
3680B9804069o14861n57245n70833o27486n43211n92714m30555m24167n06784
3671B4936213m43251m31309l54142l21601m19325l46683l26742k66573k78800
3662B1747787l09424k80493k26986k05636k54781j40254j78485j83048j50540
3653A9818140k09933j47008m5313q3304o9255p2651r0068l7786j1302L3413r3821
3642A8991112k1640J7893P8917P9031k2055J884J01618N8768O9324J51277P0000
3631A9576129M2354R3243R7551P5659J27621K65938J70889J75647J06117J81217
$$ y = [43181804, 42521340, 41905494, 41142204, 40272920, 39538884, 38835452, 38074262, 37316912, 36437185, 35607238, 34824890, 34147422, 33434543, 32642312, 31972892, 31322844, 30547738, 29804069, 29189208, 28631963, 28061130, 27433644, 26890433, 26297719, 25867164, 25442997, 24936213, 24492962, 24061653, 23707511, 23385910, 22966585, 22619902, 22293160, 22026587, 21747787, 21438363, 21157870, 20930884, 20725248, 20470467, 20330213, 20151728, 19968680, 19818140, 19608207, 19461199, 19415886, 19332582, 19263327, 19190676, 19100608, 19062822, 19051520, 19084933, 18991112, 18969472, 18987365, 19066282, 19145313, 19123258, 19125142, 19226760, 19285528, 19354852, 19506129, 19576129, 19618483, 19711726, 19809277, 19884936, 20012557, 20278495, 20449384, 20625031, 20731148, 20912365]
3621B0912365K30159J58163J94541K16244L17508L10700K94311K26065L50107
3612B3210163K89319K86022L35326L23471L34864L77176M01122L56883L61473
3603B6275819M31361M44936M34153M54726M47017N40682M72625M71227N86923
3594C0559469M81405N67210N91844N90938O07071N93618O50799O85568O73214
3585C6001136P28226P91751P93028P53960P13654P75309P81846Q88141R41808
3576D3168859R03019R02265J020064J101747J132085J181491J221646J275665
3568E1906841J384566J358671J403291J456000J509279J473164J436837J409877
3560F3338526J404773J424985J428273J411444J444546J404679J415596J516243
$$ y = [20912365, 21142524, 21300687, 21495228, 21711472, 22028980, 22339680, 22633991, 22860056, 23210163, 23499482, 23785504, 24120830, 24444301, 24779165, 25156341, 25557463, 25914346, 26275819, 26707180, 27152116, 27586269, 28040995, 28488012, 29028694, 29501319, 29972546, 30559469, 31040874, 31608084, 32199928, 32790866, 33397937, 33991555, 34642354, 35327922, 36001136, 36729362, 37521113, 38314141, 39068101, 39781755, 40557064, 41338910, 42227051, 43168859, 44071878, 44974143, 45994207, 47095954, 48228039, 49409530, 50631176, 51906841, 53291407, 54650078, 56053369, 57509369, 59018648, 60491812, 61928649, 63338526, 64743299, 66168284, 67596557, 69008001, 70452547, 71857226, 73272822, 74789065]
3552G4789065J535009J489017J486243J521233J541654J530210J474687J603282
3544H6970400J482207J522431J502320J506193J503757J406525J381853J414665
3536I8690351J500167J361758J243113J161363J034485R82829Q31775P73466O97266
3527A08276573N91225P27243O17646N74832P36022P76382Q41243J011267J134487
3518A15286920J253121J369750J503795J750555J839251K010230K203474K362990
3510A29580086K515248K668256K679943K738193K712344K747833K740230K530853
3502A50912986K525047K479650K251667K077709J838357J574102J337880J135319
3494A66132717P33023L51632l1812m72742q95665j311725j712715k028190k370147
$$ y = [74789065, 76324074, 77813091, 79299334, 80820567, 82362221, 83892431, 85367118, 86970400, 88452607, 89975038, 91477358, 92983551, 94487308, 95893833, 97275686, 98690351, 100190518, 101552276, 102795389, 103956752, 104991237, 105974066, 106805841, 107579307, 108276573, 108867798, 109595041, 110212687, 110787519, 111523541, 112299923, 113141166, 114152433, 115286920, 116540041, 117909791, 119413586, 121164141, 123003392, 125013622, 127217096, 129580086, 132095334, 134763590, 137443533, 140181726, 142894070, 145641903, 148382133, 150912986, 153438033, 155917683, 158169350, 160247059, 162085416, 163659518, 164997398, 166132717, 166865740, 167217372, 167185560, 166712818, 165817153, 164505428, 162792713, 160764523, 158394376]
3485A58394376k672695k910544l070967l359136l515822l663205l870044l925194
3477A31406769m124418m232456m395446m459138m525766m392323m457399m335190
3469I6484633m158316m109111l803371l678718l458607l207773k994939k742682
3461F8331116k648284k468594k256537j967384j879159j653856j605682j395731
3453E2455889j331448j184447j063529r52767p34641o61382o04175m92251m68132
3444D4963117l47837l88835m30165l85890m36869n49586o37807n60406o03361
3435D0622361o12772p94904p25510p46571p60437p44585p39857p35264o49257
3426C4113204o83592o30983n99951o06719p71310p22567n99325o92780p65465
$$ y = [158394376, 155721681, 152811137, 149740170, 146381034, 142865212, 139202007, 135331963, 131406769, 127282351, 123049895, 118654449, 114195311, 109669545, 105277222, 100819823, 96484633, 92326317, 88217206, 84413835, 80735117, 77276510, 74068737, 71073798, 68331116, 65682832, 63214238, 60957701, 58990317, 57111158, 55457302, 53851620, 52455889, 51124441, 49939994, 48876465, 47923698, 47189057, 46527675, 45923500, 45431249, 44963117, 44615280, 44226445, 43796280, 43410390, 42973521, 42423935, 41786128, 41225722, 40622361, 40009589, 39214685, 38489175, 37742604, 36982167, 36237582, 35497725, 34762461, 34113204, 33429612, 32798629, 32198678, 31591959, 30820649, 30098082, 29498757, 28805977, 28040512]
3417B8040512p01168o60936o76614p06244p28060o78255n77757n43795m98329
3408B2269354m90645m26231m55320l73124k23423l03734k05399k98729j57905
3399A9334844j53974j30785q4207J0964M0622p6790k7691J04599M1856J12505
3389A9171943J54759J15462J89335J24326J24600J48815J29959J37986O3123j1018
3379B0349290K5423o1885o563K2158k7142k3249P3322J40629J15787R1001J16118
3368B0814889J90984K42117K30434K04367K46514L51544L29187L74477M10936
3359B3395449M36067O23743P18790O87401Q24211J003664J019529J248541J312122
3350C1269517J388247J629731J905303K127342K289130K535994K781445L183854
$$ y = [28040512, 27339344, 26678408, 26001794, 25295550, 24567490, 23889235, 23311478, 22767683, 22269354, 21778709, 21352478, 20897158, 20524034, 20300611, 19996877, 19791478, 19492749, 19334844, 19180870, 19050085, 18965878, 18976842, 19017464, 18940674, 18912983, 19017582, 19059438, 19171943, 19326702, 19442164, 19631499, 19755825, 19880425, 20029240, 20159199, 20297185, 20360308, 20349290, 20374713, 20312828, 20306265, 20328423, 20301281, 20278032, 20351354, 20491983, 20607770, 20698771, 20814889, 21005873, 21247990, 21478424, 21682791, 21929305, 22280849, 22610036, 22984513, 23395449, 23831516, 24455259, 25174049, 25861450, 26685661, 27689325, 28708854, 29957395, 31269517, 32657764, 34287495, 36192798, 38320140, 40609270, 43145264, 45926709, 49110563]
3342D9110563L400629L715632M268231M706858N345899O025324O767386P321730
3334I0662252P257220O535439N114857L699932K382925J101444k98853j394109
3326A15061107k341548l177656l883809m550890m817900m990576m987533m889712
3318H1421483m866101m635969m407167m057267l716027l361909k988967k638713
3310E0749363k328450j809510j336402n93562M60227J806826L176973M042429
3302E4167894L711696K081349J34053j390254k566225l517128l748822l917895
3294D4954668m030117l885362l430330k823298k297812j892934j504625j208042
3286B3882148j009114r29242p62629o28816n53954m79818m56834l44450j38770
$$ y = [49110563, 52511192, 56226824, 60495055, 65201913, 70547812, 76573136, 83340522, 90662252, 97919472, 104454911, 109569768, 113269700, 115652625, 116754069, 116455216, 115061107, 112719559, 109541903, 105658094, 101107204, 96289304, 91298728, 86311195, 81421483, 76555382, 71919413, 67512246, 63454979, 59738952, 56377043, 53388076, 50749363, 48420913, 46611403, 45275001, 44681439, 45141666, 46948492, 50125465, 54167894, 57879590, 59960939, 60094992, 58704738, 56138513, 52621385, 48872563, 44954668, 40924551, 37039189, 33608859, 30785561, 28487749, 26594815, 25090190, 23882148, 22873034, 21943792, 21181163, 20552347, 19998393, 19518575, 19061741, 18717291, 18578521]
3277A8578521M197K21463N86793R71615J393188K049483K308761J856238R51762
3268B8922021J44618o12921j154805j524998j649010j611316j642101j621779
3260A9249709j621632j410913j163980r60696q01504o39879n94014m99824l65302
3251A1191965m60111l74971k14723k07156j78581k28471j95368j33897j43325
3242I055362j03116j73175j56655j00199m2716o2760j37681o8487k8481p2478
3232H109614r7890l4942n3208J8405O7398J2246k2640l2649r883P7814L7659M4576
3220H116500O1813P102M2152o6320M7404J08902J46057L0687L6906L424k255k301
3208H530071M0810J1215o159L2583J0159O1141K0597M7409Q7799J12294Q8049
$$ y = [18578521, 18582718, 18804181, 19390974, 20362589, 21755777, 23805260, 26114021, 27970259, 28922021, 29066639, 28453718, 27298913, 25773915, 24124905, 22513589, 20871488, 19249709, 17628077, 16217164, 15053184, 14092488, 13290984, 12651105, 12057091, 11557267, 11191965, 10731854, 10356883, 10142160, 9935004, 9756423, 9527952, 9332584, 9198687, 9055362, 8952246, 8779071, 8622416, 8522217, 8479501, 8416741, 8279060, 8210573, 8182092, 8109614, 8011724, 7976782, 7923574, 7941979, 8009377, 8021623, 7998983, 7966334, 7956451, 8034265, 8071924, 8116500, 8178313, 8185415, 8227567, 8161247, 8208651, 8317553, 8463610, 8494297, 8531203, 8534627, 8532372, 8530071, 8570881, 8582096, 8575937, 8608520, 8618679, 8679820, 8700417, 8747826, 8835625, 8947919, 9035968]
3197I035968Q6204P9933K05522J92147J21746P0198J30930J05967J47526L8605
3187A0214746J0961P7304J68402J01561m7640n783J52203R7815M7809M0219Q2210
3176A0939807R8334J24218J04290Q7829K31494K25544K44054L42428K40416K97574
3166A2935988L32756K81157K47090J65965K47199J79508J67852J14927J36494
3157A4808936J92131K36465J82513J80478L01055K70562K83740K99424K88960
3148A7044264L83972M40672L96570L06141L15878L60840M03109L58656L48959
3139B0359061M31702N90837N73625N59837O53344P21324Q14054Q81266R57406
3130B6542456J027362J133378J304748J576333J685299J794569K102442K163607
$$ y = [9035968, 9122172, 9202105, 9407627, 9599774, 9721520, 9791718, 9922648, 10028615, 10176141, 10214746, 10225707, 10303011, 10471413, 10572974, 10525334, 10519551, 10671754, 10769569, 10817378, 10857597, 10939807, 11038141, 11162359, 11266649, 11354478, 11585972, 11811516, 12055570, 12397998, 12638414, 12935988, 13268744, 13549901, 13796991, 13962956, 14210155, 14389663, 14557515, 14672442, 14808936, 15001067, 15237532, 15420045, 15600523, 15901578, 16172140, 16455880, 16755304, 17044264, 17428236, 17868908, 18265478, 18571619, 18887497, 19248337, 19651446, 20010102, 20359061, 20790763, 21381600, 21955225, 22515062, 23168406, 23889730, 24703784, 25585050, 26542456, 27569818, 28703196, 30007944, 31584277, 33269576, 35064145, 37166587, 39330194]
3122C9330194K080925J944803J723979J666939J640730J480076J410979J530604
3114E2809229J635156J846165K038545K414389K828301L313534L752039M224717
3106G4862075M956608N696507O408738P126462Q039097R076583J0225662J1474523
3098A37866255J2912449J4524966J6479788J8567007K0612817K2157545K3330490
3091B66451317K3403689K2241739J9405686J4903878R621679L745519k183860
3084C57589647p703307j2439945j6346108j8949936k0714892k1556970k1647885
3077B38230604k0992981j9697693j8107343j6440213j4788239j3159396j1644844
3070A23399895j0312120r123538q072003p234664o274183n455737m978045m431096
$$ y = [39330194, 41411119, 43355922, 45079901, 46746840, 48387570, 49867646, 51278625, 52809229, 54444385, 56290550, 58329095, 60743484, 63571785, 66885319, 70637358, 74862075, 79818683, 85515190, 91923928, 99050390, 107089487, 116166070, 126391732, 137866255, 150778704, 165303670, 181783458, 200350465, 220963282, 243120827, 266451317, 289855006, 312096745, 331502431, 346406309, 356027988, 359773507, 357589647, 349886340, 337446395, 321100287, 302150351, 281435459, 259878489, 238230604, 217237623, 197539930, 179432587, 162992374, 148204135, 135044739, 123399895, 113087775, 103964237, 95892234, 88657570, 82383387, 76927650, 71949605, 67518509]
3062F7518509l842298l374758l119613k772962k520986k269058k038294j894731
3054D5685809j749044j687158j532248j422655j396123j374044j290743j183365
3046C4050429j133573j141359j089322j014412j037960j077704r78401q95423
3038B5682275q21578q10554q11697q38855p48536p37354p29155o30285p03200
3029A8851061o17004n88309n95245n42488m89912n06043m51919m52033m07771
3020A4200337m44180m18184k88511l70123l29806l17113k73365l19024l22065
3011A1117966l55670k66895k71504l22625k88560l65786k63771j68441j56755
3002H657959k07227k98389j56737j05506l49880k13199j83860j09690r7411k48013
$$ y = [67518509, 63676211, 60301453, 57181840, 54408878, 51887892, 49618834, 47580540, 45685809, 43936765, 42249607, 40717359, 39294704, 37898581, 36524537, 35233794, 34050429, 32916856, 31775497, 30686175, 29671763, 28633803, 27556099, 26577698, 25682275, 24860697, 24050143, 23238446, 22399591, 21651055, 20913701, 20184546, 19554261, 18851061, 18234057, 17645748, 17050503, 16508015, 16018103, 15512060, 15060141, 14608108, 14200337, 13756157, 13337973, 13049462, 12679339, 12349533, 12032420, 11759055, 11440031, 11117966, 10762296, 10495401, 10223897, 9901272, 9612712, 9246926, 8983155, 8814714, 8657959, 8450732, 8152343, 7995606, 7890100, 7540220, 7327021, 7143161, 7033471, 6936060, 6688047]
2992F688047k01410k30702j52984j58600j11185j74345j17485j03912q0685j42253
2982E214486j67325m9258P69j0274j21528r7530j7149O733k8188j69702n2982
2971D508052M9506n1692j05658j02399j18705r79K0854j11282j60514p6691m5901
2960C804591p6326p1105j31172j09318m8344l8001n6518m2964q6435o8821k3235
2949C052352o9470q0053m0965L80j1701r8094L1946Q325Q560l132p5014m353k552
2936B716229n1043j26832n2913m563m1446o4205j32701j28270k2096J8275n440
2925B104995j15026k6809N880n1024m8548r1928O07P787p9958k4491J3206j3960
2913A680731L0905q8462l8059p1059n187J8610N968m2084n0598j5094J8083L8321
$$ y = [6688047, 6486637, 6255935, 6102951, 5944351, 5833166, 5658821, 5541336, 5437424, 5356739, 5214486, 5047161, 4997903, 4998672, 4988398, 4866870, 4769340, 4752191, 4758924, 4730736, 4561034, 4508052, 4557558, 4505866, 4400208, 4297809, 4179104, 4178125, 4198979, 4087697, 3927183, 3850492, 3804591, 3728265, 3657160, 3525988, 3416670, 3368326, 3330325, 3273807, 3230843, 3144408, 3075587, 3052352, 2982882, 2902829, 2861864, 2862244, 2850543, 2752449, 2784395, 2792720, 2801280, 2798148, 2723134, 2718781, 2716229, 2665186, 2538354, 2485441, 2480878, 2439432, 2375227, 2242526, 2114256, 2092160, 2110435, 2104995, 1989969, 1963160, 1969040, 1918016, 1869468, 1777540, 1778147, 1785934, 1705976, 1681485, 1694691, 1680731, 1711636, 1623174, 1585115, 1514056, 1508869, 1527479, 1533447, 1491363, 1440765, 1425671, 1443754, 1482075]
2901A482075j06904q055J1378l1537k7094j6681r836L0850p0581p9249j2551Q723
2889A170538k7454m7905m4314m0593K8717N7380K5580n5065o8358K4478o876l1638
2877I84490J4469m224M5498m8120m4237P894M6596J1996n0848P0031k0358n6476
2865I56711J4010k1251o0269j6102L0718l4506j4772p473o9778q5625J23166Q497
2853H23326j7046J46k517j1874j6302q1589O3212R5799K5428m4406l3595J8619
2841H19201K4081L4117M337J220O1560n4028p2250K3867O1237J419l9879J11859
2829I76741j3456k2649l2787K1548Q5402l5631J5496L1153l1997M858K6517M4900
2817A070095J18787O7155P157O3276J36703N1473k4967O2229J06032J34928K3560
$$ y = [1482075, 1375171, 1367116, 1378494, 1346957, 1319863, 1303182, 1293346, 1324196, 1253615, 1174366, 1161815, 1170538, 1143084, 1095179, 1050865, 1010272, 1038989, 1096369, 1121949, 1066884, 998526, 1023004, 1016128, 984490, 998959, 994735, 1040233, 992113, 947876, 955770, 1002366, 1014362, 963514, 1033545, 1013187, 956711, 970721, 949470, 889201, 873099, 903817, 869311, 854539, 847066, 777288, 691663, 814829, 823326, 806280, 806426, 803909, 792035, 775733, 694144, 757356, 853155, 878583, 834177, 800582, 819201, 843282, 877399, 881736, 882956, 944516, 890488, 818238, 842105, 903342, 904761, 864882, 976741, 963285, 940636, 907849, 929397, 1014799, 979168, 994664, 1025817, 993820, 998678, 1025195, 1070095, 1188882, 1256037, 1263194, 1326470, 1463173, 1514646, 1489679, 1551908, 1657940, 1792868, 1816428]
2806A816428J08563O8844k3974Q4896m3191o7225J7191n2063m4726j61973k4321
2795A678449r0483r7674r9424r9996j22627k4711j20831m8330p7913j16917N4818
2784H34361j0267P685m3156j18729L946k6599m2916K5819l937k6644k5309j0111
2772E64143R107j1196M4538j7111j4362n4881K5327M3865l2736j6377m6810l8035
2760D55472O8765N4452m8591k6262P018j0839o8806l3206Q4521K5294L2619m2929
2748D97508r4190N0396k4880j3825j668n8264j8852K7304j7579l6854J02l458
2736C05740N8206J4362m8954K4076K9395K4780n5347r906j5526J6368m0192l3010
2724B69992l4317k764K3100J7853L4832J6304J9072n403l2535l9454m1552K0058
$$ y = [1816428, 1924991, 1993835, 1969861, 2054757, 2011566, 1944341, 1961532, 1909469, 1864743, 1702770, 1678449, 1587966, 1490292, 1390868, 1290872, 1168245, 1143534, 1022703, 974373, 896460, 779543, 834361, 824094, 831779, 788623, 669894, 673840, 647241, 604325, 630144, 626207, 599563, 574254, 564143, 573250, 562054, 606592, 589481, 575119, 520238, 545565, 589430, 556694, 540317, 493507, 455472, 524237, 578689, 530098, 503836, 510854, 500015, 431209, 398003, 482524, 507818, 540437, 497508, 403318, 453714, 428834, 415009, 413341, 355077, 336225, 363529, 345950, 309096, 309198, 305740, 363946, 378308, 329354, 353430, 382825, 407605, 352258, 342352, 326826, 343194, 303002, 269992, 235675, 232911, 256011, 273864, 308696, 325000, 344072, 338669, 306134, 266680, 225128, 245186]
2712B45186J7977L4767n429m3245p5448J11351m7803o1099M2869L4349l6312o50
2700B16513l3246K9757j3853Q525R433m2131O2583k7145n9050n5513l9410N6109
2688A12572P030k5805p528M0041J2672J336n4241o6208J7340Q3445q709n5046
2676E6899k6622r6156j4279Q0233m9806n2699M4279P5206N0125n7864n6206q8706
2664a35596j9293P5879L7754N5484N5434n3057j7512N7415m220n9298K0939O6805
2652H0734K4931q1078j364l0267J674P957r714j735K9833K076J0906O4464j3691
2639H4726p8987J2875o668Q4464j706j06683n6028Q4257O3698m7049k2523K7363
2627C7739m7616k6207O5044l2288K135L940m4042J1722M5448L4217m7135q5993
$$ y = [245186, 263163, 297930, 292501, 249256, 173808, 285159, 237356, 176257, 219126, 253475, 217163, 216513, 183267, 213024, 199171, 207696, 217129, 174998, 237581, 210436, 151386, 95873, 56463, 112572, 119602, 93797, 86269, 126310, 138982, 140318, 86077, 19869, 37209, 120654, 111945, 56899, 30277, -65879, -80158, 75, -49731, -102430, -58151, 17055, 67180, 9316, -46890, -135596, -154889, -79010, -41256, 14228, 69662, 16605, -907, 56508, 52288, -7010, 13929, 80734, 105665, 24587, 23223, -7044, -5370, 2587, -7127, -8862, 20971, 23047, 33953, 98417, 84726, 5739, 18614, 11946, 96410, 94704, -11979, -68007, 16250, 79948, 32899, 10376, 37739, -9877, -36084, 28960, -3328, -1193, 2747, -41295, -29573, 15875, 50092, 2957, -83036]
2615h3036j5957L5086N6994Q26l1029M0163K8171J8005k3295o2527j00593L1886
2603a05306J02182j7701n1073j9954M4087P9994k9326P90L9665J6150l9474M1848
2591F1882J4776q1984O5476N3622J2685k0520M7556N5974K6278J0467q1286O7803
2579B32729M2276l1166m9931j9281m4179k7082m359m1871l4022n546O4982j5134
2567F7416K333k3363o2634L2085K4493n4258O8805K4140l4954k3313l6270J9755
2555D235R0062O032m4028n9657k294M1818n6841L8353N8079k4004j5980j646q2550
2542d8421O8083k5445l1845K1015m1451M1509P6823j808j07017K8327l2536J8876
2530c3890K5800M0772l2138M997o654l4285J9023J3825J8873K1581o1328J3295
$$ y = [-83036, -98993, -63907, -6913, -6087, -37116, 3047, 31218, 49223, 25928, -36599, -137192, -105306, -3124, -20825, -71898, -91852, -47765, 32229, 2903, 3693, 43358, 59508, 20034, 61882, 76658, -5326, 60150, 113772, 126457, 105937, 153493, 209467, 235745, 246212, 164926, 232729, 275005, 243839, 193908, 174627, 130448, 103366, 99007, 57136, 23114, 17568, 82550, 67416, 69749, 46386, -16248, 15837, 40330, -13928, 54877, 79017, 44063, 20750, -15520, 4235, 94297, 100329, 56301, -3356, -5650, 36168, -20673, 17680, 75759, 51755, 35775, 34129, -48421, 19662, -5783, -37628, -16613, -58064, -16555, 60268, 58460, -48557, -20230, -52766, -33890, -8090, 32682, 544, 5541, -1113, -35398, -16375, -2550, 16323, 37904, -23424, -10129]
2518a0129P165l0106j7259k204M0162M5738l8098p0446M8771P220J023q5359K1753
2505h1769O3847o6155J7977L6378k5333j8520O9887j2304j6307J6452L582R890
2493b375m4420J105J6173M8262p5459j9843j5422J6554L0595j186M4581j05173
2481a06608P2993N5520n7585n6309N8049J1240j2906k294n8438J665K6753k6380
2469i4300J5039P2263m564K8847j2189K6261m5648k2102q744l347k0361M9057
2457a9788N9103j20159M8383L6911j6717N2722K098k7874j7640j7344P7194O785
2445F3674r6640Q0896J1302n4308j5295k4485J3242L1452K7238K702r6380M3123
2433a3479R1271n7757Q897j5109M8579J6840l5851J293J3844L3419P0425k9887
$$ y = [-10129, -2964, -33070, -50329, -52533, -12371, 33367, -4731, -75177, -26406, -19186, -18163, -103522, -81769, -17922, -84077, -66100, -29722, -55055, -73575, -3688, -15992, -32299, -15847, -12265, -2375, -46795, -45690, -29517, 18745, -56714, -76557, -91979, -75425, -44830, -46016, -1435, -106608, -33615, 21905, -35680, -91989, -33940, -22700, -35606, -37900, -96338, -94673, -67920, -94300, -79261, -6998, -11562, 17285, 5096, 31357, -14291, -36393, -45137, -48484, -68845, -19788, 39315, -80844, -32461, 4450, -12267, 40455, 42553, 14679, -2961, -20305, 56889, 63674, -32966, 47930, 59232, 4924, -10371, -34856, -21614, 9838, 37076, 39778, -56602, -13479, 77792, 20035, 28932, 13823, 62402, 79242, 43391, 44684, 58528, 91947, 162372, 132485]
2421A32485o0066J9279N7727J4493l0334N2858J4787L115m050j1931k3658J6442
2409A81147m1307M6183L9919m6785P84K2682L2120J6824M5018m3094o5015j4961
2397A73515L3013J9520m3416O7466l6758j901N6121o6790o2991K4762M873Q1768
2385B49182N257L554R4528J7728k8011J3008m2553l6121O3333L6855m8980M8188
2373C75968M3481m4588k2585j4723M7615j5511j347R4634o329n6510Q8037J7272
2361E05414p1482J615J2882O6684J8978n2953J5974L5604Q9762m8316J7870K2797
2349F14829m219K6960L363L0614J12921J61661Q5330J23790K01465P8539J32864
2338A568117J67860O7799J01018K07909L54580M34685L95292M76966N63154N40932
$$ y = [132485, 72419, 91698, 149425, 163918, 133584, 186442, 201229, 204344, 200294, 188363, 164705, 181147, 139840, 186023, 225942, 179157, 179941, 202623, 234743, 251567, 296585, 253491, 188476, 173515, 206528, 226048, 182632, 250098, 213340, 211439, 267560, 200770, 137779, 162541, 167414, 249182, 254439, 257993, 352521, 370249, 342238, 355246, 312693, 276572, 339905, 376760, 327780, 375968, 419449, 374861, 352276, 337553, 385168, 369657, 368310, 462944, 456615, 400105, 488142, 505414, 433932, 435547, 448429, 515113, 534091, 481138, 497112, 532716, 622478, 574162, 592032, 614829, 610610, 637570, 640933, 671547, 784468, 946129, 1031459, 1155249, 1356714, 1435253, 1568117, 1735977, 1803776, 1904794, 2112703, 2467283, 2901968, 3297260, 3774226, 4337380, 4878312]
2328D878312M87591L54258M25637M77984O65841Q59885J286084J916075L377604
2319A4729271N970707Q503493J0102348Q332081L434755m37444j688030l978773
2311D4968408n404616m990409n146130m995719m790893m295217l373235k327956
2303I644233j478154r49104p04013n35401n82094m79019l99602l96934l88520
2294C731392l37242k44719l11577k41160k33810k02247j11382q7933P113J3390
2284A981825m0076n2494m46m4311n2408j8645j15308n0911k4162j00468q2058
2273A400538m2251J7916j09840q5746m4035m2480j3227j14638m2228R836l685
2262I30160k4594r2068l6079k2490r680j6611q853j4890q6796l1476o270k3578
$$ y = [4878312, 5365903, 5720161, 6145798, 6623782, 7289623, 8149508, 9435592, 11351667, 14729271, 20699978, 29203471, 39305819, 47637900, 51072655, 50635211, 48947181, 44968408, 39563792, 34573383, 29427253, 24431534, 19640641, 15345424, 11972189, 9644233, 8166079, 7216975, 6512962, 5977561, 5395467, 4916448, 4516846, 4119912, 3731392, 3394150, 3149431, 2837854, 2596694, 2362884, 2160637, 2049255, 1961322, 1968435, 1981825, 1941749, 1889255, 1888809, 1844498, 1792090, 1773445, 1658137, 1607226, 1583064, 1482596, 1400538, 1358287, 1376203, 1266363, 1180617, 1136582, 1094102, 1080875, 966237, 924009, 933845, 930160, 905566, 813498, 777419, 754929, 745249, 728638, 719785, 704895, 618099, 586623, 580353, 556775]
2250E56775L1718l9236o8526m3780p83M329j4877R467l5392J6076j5423j1601
2238C88747L5336M647j29994L7367k5626L268l2074o4968L4685l0186n7573K7915
2226A91544K5686K4657J6888n3653j8123n8344M6000J6946m0267n4185l9337n1911
2214E901Q17L4807j577l7225j6380O793L1424Q435L915k2214M0413l3099J3631
2201C5641O0341P1607o3586J4805R245r1105j3145O3482J4667J2738r8389m5426
2189b9125R4557j4922L8185r5744j1494O1609k3348l5926O5926p5094q945K7800
2177f521l4160m3151L1955J8554K995O4575j4502p3077N444R2507M1450l0184
2165E5885l0006J7719m3819n6168L3888m6609j862M4274P302j00353N4121l371
$$ y = [556775, 588493, 549257, 480731, 436951, 436168, 440497, 425620, 435087, 399695, 415771, 400348, 388747, 424083, 428730, 298736, 336103, 310477, 313745, 281671, 216703, 251388, 221202, 163629, 191544, 217230, 241887, 258775, 205122, 186999, 128655, 174655, 191601, 151334, 97149, 57812, 5901, 6718, 41525, 39948, 2723, -13657, -6864, 24560, 32995, 36910, 14696, 55109, 22010, 35641, 95982, 167589, 104003, 118808, 128053, 36948, 23803, 87285, 101952, 114690, 16301, -29125, 65432, 50510, 88695, -7049, -18543, 43066, 19718, -16208, 49718, -25376, -34321, -6521, -40681, -83832, -51877, -33323, -30328, 34247, 19745, -53332, -47888, 44619, 86069, 55885, 25879, 43598, -221, -56389, -22501, -69110, -70972, -26698, -19396, -119749, -65628, -68999]
2153f8999k171P0737m0445M379k3327K0939q568o6115n0523L8749j304L3205L8686
2140e4757P872j4836k4336o3367l1724L0894J9559m7966k8371R5562L5040m0466
2128a16896K5481j0254l6579j74J4720N1454P1498k0895k4653J9914j40229k6668
2116a93281O0471k8660j2063J713M91M7515K9483j0393l2627J13316J7005r7986
2104a05016m340p0375j6566K5987J00026k1168l3757M7195K3704K4110j4069j29594
2092a73863J9505M0525p197j01762N6096Q4331p2362K6745j6595N2927N2123n6834
2080i6361m1295l6295K3023L2585K9563J0347P553l2933m873J3708q7482q077
2068a90537R9484K0895r380L706n7211n487K4212k5227j565J13383l0496r6278
$$ y = [-68999, -71170, -433, -40878, -36499, -59826, -38887, -47455, -113570, -164093, -125344, -126648, -93443, -54757, -46885, -61721, -86057, -149424, -181148, -150254, -130695, -178661, -207032, -111470, -76430, -116896, -91415, -101669, -138248, -138422, -123702, -72248, -750, -21645, -46298, -26384, -166613, -193281, -132810, -161470, -173533, -171820, -171329, -123814, -94331, -104724, -137351, -24035, -7030, -105016, -109356, -179731, -196297, -170310, -70284, -91452, -125209, -78014, -54310, -30200, -44269, -173863, -154358, -113833, -121030, -222792, -166696, -82365, -154727, -127982, -144577, -91650, -39527, -96361, -137656, -173951, -150928, -118343, -88780, -78433, -70880, -103813, -108686, -94978, -182460, -190537, -91053, -70158, -79538, -75832, -133043, -138530, -114318, -139545, -141110, -27727, -58223, -154501]
2056a54501M0184M9657K188L5642Q14m4037l6055Q0916R2632k9423K3466K2272
2044H3755P0854k801l6917j3499n0203L6601j28096k5665K5520k2948m1326o5450
2032a70175j9364L8701J19279l2771j819o5354J1934R2361n9720r4863K6098L5903
2020a19790P939r292r9033Q3593N1541M37l7095l417N4192k93j07385l579j7898
2007b00080O7398n77o4681p0495P0467J14521l3657o0981M4743K146o08J2293
1995a19511m7358q133N2496M9751o1836K1197r5518m878m549O9257m1545O339
1983a84288K5209j7585l1951l907P1964k248o0151N2286L1621m7997L903o581
1971a69725j8801o3335L0276K3098P4701m5354q2711P8492M0736q0209l1306N104
$$ y = [-154501, -114317, -64660, -62472, -26830, -26016, -70053, -106108, -25192, 67440, 38017, 61483, 83755, 154609, 151808, 114891, 101392, 51189, 87790, -40306, -65971, -40451, -63399, -104725, -170175, -189539, -150838, -31559, -64330, -66149, -131503, -119569, -27208, -86928, -181791, -155693, -119790, -111851, -121143, -220176, -136583, -85042, -84605, -121700, -125117, -70925, -71218, -178603, -182182, -200080, -132682, -133259, -197940, -268435, -197968, -83447, -117104, -178085, -133342, -131196, -131804, -119511, -166869, -175002, -122506, -72755, -134591, -113394, -208912, -213790, -218339, -149082, -190627, -184288, -159079, -176664, -208615, -212522, -140558, -142806, -202957, -150671, -119050, -167047, -163144, -169725, -188526, -251861, -221585, -198487, -123786, -169140, -251851, -173359, -132623, -212832, -244138, -239034]
1959b39034J20518j2464k2918r339K4181p7879n2166K4878J1954J03288M0678
1948h8303k346l8314N580N0873l5466m9534K1447o0679j0820M9707k0538m1126
1936b19519L3985J7024L0536n0313L9034K9437L454q7160J3060K7604K7302K097
1924a33459J0082n27J7902m2911M295Q0407n4827K0955j2653j5511k2314O1432
1912h7129M1642j7346l0697n7851m7906l902J1516l7240m8011L4528J4962K36
1900b27198J1983N8279O3137p7339l2232J7620M5862j8347K3454k17l0187q1069
1888b46254P6414N1444k1387K0262o6239p4010K6190L4167k0346m8635n6443M6905
1876b77932R5384M0038l8631l7848k6473R1824j1462k6993p044J1525J9705n83
$$ y = [-239034, -118516, -130980, -153898, -163237, -139056, -216935, -269101, -244223, -232269, -128981, -88303, -90649, -128963, -123383, -72510, -107976, -157510, -136063, -196742, -207562, -157855, -178393, -219519, -185534, -168510, -137974, -188287, -149253, -119816, -116362, -203522, -190462, -162858, -135556, -133459, -123377, -123904, -106002, -148913, -144618, -64211, -119038, -98083, -110736, -126247, -148561, -87129, -45487, -62833, -93530, -151381, -199287, -203189, -191673, -228913, -276924, -242396, -227434, -227198, -215215, -156936, -93799, -171138, -203370, -185750, -139888, -158235, -134781, -134998, -165185, -246254, -169840, -118396, -139783, -119521, -185760, -259770, -233580, -199413, -219759, -268394, -324837, -277932, -182548, -142510, -181141, -218989, -245462, -153638, -165100, -192093, -199137, -187612, -167907, -168490]
1864a68490m2621K1369m5724K8735K6039P836K33m8743K2046j6124l804j4813
1852b34061N4103M4307p0792L354j0273R508Q8663k4084Q597j07976O692N7834
1840a74128o45O185m8702P8816n5580l3300k7186J31650r798k6760m5575j839
1828b06862P9434K3000p6743l4196O8532l1998m9323M3108P3268k7334p4687Q350
1816b05451m1791k4293N8126j6133L0477n4745L3953O1102N6380n1517J5293k4101
1804a62700m504N0796Q493l1608K8750l7301J2324m4810L6086M5619k8824l4745
1792a62424n219J7290L5323M6851j6911j65132l423J30301k754q6703J3458J09824
1780h9519R352M8140p2229M2p118n1050n2753n9451P0406O0843m4621P744p591
$$ y = [-168490, -211111, -189742, -235466, -206731, -180692, -172856, -172623, -221366, -199320, -215444, -219248, -234061, -179958, -135651, -206443, -203089, -213362, -203854, -115191, -139275, -130678, -238654, -231962, -174128, -174773, -168588, -217290, -138474, -194054, -227354, -254540, -122890, -132688, -159448, -205023, -206862, -127428, -104428, -181171, -215367, -146835, -178833, -228156, -185048, -111780, -139114, -213801, -205451, -247242, -271535, -213409, -229542, -199065, -253810, -219857, -158755, -102375, -153892, -138599, -162700, -167204, -116408, -107915, -139523, -110773, -148074, -135750, -180560, -144474, -98855, -127679, -162424, -167643, -150353, -115030, -68179, -85090, -250222, -253645, -123344, -126098, -212801, -199343, -89519, -80167, -32027, -104256, -104214, -111332, -162382, -215135, -274586, -204180, -143337, -187958, -180214, -187805]
1767a87805Q9629n412M5523r0459o7197M5871K8407o2371m8103L542O4703N4962
1755a28710m2032j16102P1638R6463k8063m1914o5737N5101O2778m4429o4307
1744b45314Q37Q9102M7980j21280p0661R0353M1742m8951M3805m8848N6350k7660
1732a92545l5888l4978k0948k8763O4035J08618k9924N807N3470j7551L8800k6933
1720a16800k8470r929j1669p534L1176j3048J8318l7235k704l3675N4865K684
1708a54021r7220k2345M5222M0158K2795K3576p2618L5635Q499L2674L269l3951
1696a68327k196J9940R68n3311k8233N7521Q32M9934j45013P847P002L0081k9255
1683b52210L8708l0572M2843L9014r162j8378L9267N1156r1808m2014M3781O9041
$$ y = [-187805, -98176, -103588, -58065, -148524, -215721, -169850, -141443, -203814, -251917, -248375, -183672, -128710, -170742, -286844, -215206, -118743, -146806, -188720, -254457, -199356, -136578, -181007, -245314, -244477, -155375, -107395, -228675, -299336, -208983, -167241, -216192, -172387, -221235, -164885, -192545, -228433, -263411, -284359, -313122, -249087, -140469, -170393, -164586, -111116, -128667, -89867, -116800, -145270, -155199, -166868, -174402, -143226, -156274, -137956, -175191, -177895, -211570, -156705, -154021, -251241, -273586, -228364, -188206, -165411, -141835, -214453, -178818, -170319, -137645, -134376, -168327, -170523, -150583, -149615, -202926, -231159, -173638, -172806, -122872, -267885, -260038, -253036, -222955, -252210, -213502, -244074, -201231, -162217, -171379, -189757, -150490, -99334, -191142, -233156, -189375, -120334]
1671a20334k7610m5140l9223l864J4175Q4265n1216l2630j7606P1720m2015m5486
1659b54964J7504Q1216Q5041m1391r2459m5261L3705R8052k2332l3774n391j1390
1647a91444p900l9414k6378K249J25325N2165o7463J7062l3314R573K5794j05935
1635b39680J5802O1882O1827j1125p1982O7948k6146m9841j6065L8810k8366L7796
1623a59140J1732j5073L5871P777J9898j3550l9074n6259M7266R1583m7658j10898
1611b27525L3143K3928l4347p751k1937L5490M1208j5566m6124l5526P229O7445
1599a80333N4328o9732m4763N3524J9727j8644j4426n2073q521N8077K2909p1217
1587b51144j6573M9674Q0259j2604j13813K2188M6439l039K9297n8771K7366M3765
$$ y = [-120334, -147944, -193084, -232307, -236171, -221996, -137731, -188947, -221577, -239183, -167463, -209478, -254964, -237460, -156244, -71203, -112594, -205053, -250314, -216609, -118557, -140889, -174663, -180054, -191444, -199344, -238758, -265136, -262887, -137562, -85397, -152860, -135798, -169112, -159539, -133745, -239680, -223878, -161996, -100169, -111294, -183276, -115328, -141474, -191315, -207380, -168570, -196936, -159140, -147408, -162481, -126610, -118833, -98935, -112485, -151559, -207818, -160552, -68969, -116627, -227525, -194382, -170454, -204801, -212552, -234489, -198999, -157791, -173357, -219481, -255007, -247778, -180333, -126005, -195737, -240500, -186976, -167249, -185893, -200319, -252392, -260913, -202836, -179927, -251144, -267717, -218043, -137784, -150388, -264201, -242013, -195574, -198613, -169316, -228087, -200721, -156956]
1575a56956j5974k1595J3138N7316M2896j02450N4844l566k9021j061j9811P305
1563a74935P1039O1771n6888p7506J8100K0909K5834J4350j08017m3864M9631
1552a99576M9876n0220n313j792m075K3882K6089l0326k4140k53L6735n2451K6492
1539b05072j099j6117O793K5525K556K0120L6998m5329m1372O1158K363o2915
1527b16391j4240Q282J00375n3665K3644l4261j4767k9479K5688L0382p0872P1524
1515a73780J3388n0878j9546P1664j5312Q726m3221k4300R537L3602O6336J9378
1503a04406k6725q975N6134k1061l7315n8650k2858p990m7980j4932O3150N5335
1491a76273K4676P170q4088m5542J9464L3365r515N2301O8559o1531o5211J8956
$$ y = [-156956, -172930, -194525, -181387, -124071, -81175, -183625, -128781, -132347, -161368, -162429, -182240, -174935, -103896, -42125, -99013, -176519, -158419, -137510, -111676, -97326, -205343, -249207, -199576, -149700, -199920, -205233, -207025, -211100, -187218, -161129, -191455, -215595, -215848, -179113, -231564, -205072, -206171, -222288, -215495, -189970, -187414, -167294, -130296, -175625, -216997, -155839, -153476, -216391, -230631, -222349, -121974, -175639, -151995, -186256, -201023, -230502, -204814, -174432, -245304, -173780, -160392, -211270, -230816, -159152, -174464, -165738, -208959, -233259, -223722, -190120, -123784, -104406, -131131, -140106, -83972, -105033, -142348, -200998, -223856, -231846, -279826, -294758, -231608, -176273, -151597, -144427, -228515, -274057, -254593, -221228, -230743, -178442, -109883, -171414, -236625, -217669]
1479b17669Q0249j4088m8779l6229j4293k5927L493L0444P8446R452l8871m957
1467a98729k0722l7734N705l011K2601K5736P774l0244m4433J2687O1442J253
1455a97675N43J8865l9108k0361k0869K9839O8641J6020l8943M4716J3816j09402
1443b33918o8497M2295M1810Q755L7518m1094n9850J28906n978n148k2817l4231
1431b12249O8116J4155j9925J9334q9746K7061L7468j5182m70M003o5298k5470
1419b58203o6126O3054P3859l9404N106n7138O0458M5666O2706l2645k9637J8634
1407a53670k046j8368l6637q575k2716l9964J5906M6300Q432O8905K345o4075
1395b04163L1318M080j8987j1290n8725O4288P0824m3195j9677k5322K0417O2036
$$ y = [-217669, -137420, -151508, -200287, -236516, -250809, -276736, -273243, -242799, -164353, -154901, -193772, -198729, -219451, -257185, -251480, -254491, -231890, -206154, -198380, -228624, -273057, -260370, -198928, -197675, -197132, -178267, -217375, -237736, -258605, -228766, -160125, -144105, -183048, -138332, -124516, -233918, -302415, -260120, -218310, -209555, -172037, -213131, -272981, -144075, -150053, -155201, -178018, -212249, -144133, -129978, -149903, -130569, -220315, -193254, -155786, -170968, -171438, -167435, -232733, -258203, -324329, -261275, -187416, -226820, -221714, -278852, -218394, -172728, -110022, -142667, -172304, -153670, -155716, -174084, -210721, -219296, -242012, -281976, -266070, -219770, -211338, -142433, -140088, -204163, -172845, -168765, -187752, -199042, -257767, -193479, -122655, -165850, -185527, -210849, -190432, -128396]
1383a28396j4996m4537o1756L5173R0706K0218m5218o2069R7305O10q7422L1434
1371a68948k2396L4770M1193k6661p1557k8618J0206Q413N6386l6552L5725L751
1359a64288L0799p7380J3929K7052P9782k8088r4873q236P6170N1651L7333n1163
1347a07312r1311M8266K5077n1494m2307K9207J00834m9228q4775L0701L0511
1336a61831m194q831m504l8029N2629j9969J0680j7907j1545K0772M8909o2024
1324a95844j26638J0930Q1200M0092j1764l7216J3952K2808K34j0252l0566N7982
1312a85082K3666Q635n3487k5389M4668p099J1133k9711q3016Q8900N6327l5932
1300a86387o888K4064R4155m5110r6927q6473J10094K5m6983K2512M4295O1865
$$ y = [-128396, -143392, -187929, -249685, -214512, -123806, -103588, -148806, -210875, -113570, -112960, -200382, -168948, -191344, -156574, -115381, -142042, -213599, -242217, -232011, -223598, -167212, -203764, -168039, -164288, -133489, -210869, -196940, -169888, -90106, -118194, -213067, -221303, -145133, -93482, -56149, -107312, -198623, -150357, -125280, -176774, -219081, -189874, -89040, -138268, -223043, -192342, -161831, -166025, -174856, -179360, -217389, -164760, -184729, -174049, -191956, -203501, -182729, -133820, -195844, -322482, -311552, -230352, -190260, -202024, -239240, -225288, -202480, -202246, -212498, -243064, -185082, -161416, -152781, -206268, -231657, -186989, -194088, -182955, -212666, -295682, -206782, -150455, -186387, -193275, -169211, -75056, -120166, -217093, -303566, -193472, -193447, -240430, -217918, -173623, -111758]
1288a11758k0580m9568J7805j0902M2574Q3937l403r4118O76k3619k876K0473
1276a51359l3812J9146L520N487q1387k911N2628M6329J1278j8069J5287k9953
1264a63816k5265l3547Q542M8201r317N7127l4815n0788l9503P0419O0240q2463
1252a94985j6486k68M272K8969n0774M4360K0849N0797k6229m0506N232K4462
1240a50307j5777j1004L7732n0469L4269j1582o3592Q194P8355p5302L8643K949
1228a77891j7295O1067k4033n5401L56L1987k2780l0891M2202K4785k0116K3226
1216a64784L8890n9419j5476p408O8311m740j273n4317K5915J1745m8762q810
1204b20128r724k4993M7782J4289j0610K6436j2257m0386l6177O0119M8732j0784
$$ y = [-111758, -132338, -181906, -164101, -175003, -132429, -48492, -51895, -146013, -145337, -168956, -171832, -151359, -185171, -166025, -162505, -157018, -238405, -241316, -188688, -142359, -131081, -149150, -133863, -163816, -189081, -222628, -214086, -165885, -175202, -118075, -152890, -203678, -243181, -172762, -112522, -194985, -211471, -211739, -207467, -178498, -229272, -184912, -164063, -113266, -139495, -180001, -174769, -150307, -166084, -177088, -139356, -189825, -155556, -167138, -230730, -222536, -144181, -219483, -180840, -177891, -195186, -134119, -158152, -213553, -213197, -181210, -203990, -234881, -192679, -167894, -188010, -164784, -125894, -185313, -200789, -208197, -139886, -144626, -145899, -200216, -174301, -162556, -211318, -220128, -229852, -254845, -207063, -192774, -203384, -176948, -189205, -229591, -265768, -205649, -156917, -167701]
1192a67701J446j4789n8854M9580p4672K4182N3734N5995n4316J733L7320o2422
1180b08764n4090M565M9893K8660n8848j3276M631M5253L6564j7198o3896J5208
1168b31298O4351k9568m6326M7828K8226n3725M1629k7378k0185k5746K1254k9858
1156b60796m198L8763L0458L6849m4960K804J7339L1370j4795j8753q0781N0452
1144b16248M3297O7058p5738L30J117P454J7858m5504k4292N2062j2579n49P776
1131a77958r6519O3063O4332R153p4187O3K152O914j3499K1763K7692O01k8236
1118a94666o2891M3228N3860M5105o603l7923o4161p232r604r985n700J4323J5901
1105b26348L1361L3836o9280l1901Q7823j2737m665M9588o7190j1439n0819L8047
$$ y = [-167701, -166255, -181044, -239898, -190318, -264990, -240808, -187074, -131079, -185395, -183662, -146342, -208764, -262854, -258289, -208396, -179736, -238584, -251860, -247229, -201976, -165412, -182610, -246506, -231298, -166947, -196515, -242841, -195013, -166787, -220512, -178883, -206261, -226446, -252192, -230938, -260796, -264994, -226231, -195773, -158924, -203884, -201080, -183741, -152371, -167166, -185919, -266700, -216248, -172951, -105893, -181631, -181301, -180184, -172730, -154872, -200376, -224668, -172606, -185185, -185734, -177958, -274477, -211414, -147082, -137929, -212116, -212053, -209901, -202987, -216486, -194723, -167031, -166430, -194666, -257557, -214329, -160469, -115364, -121967, -159890, -224051, -231283, -240887, -250872, -256572, -242249, -226348, -194987, -161151, -230431, -262332, -174509, -187246, -191911, -142323, -209513, -220952, -271771, -233724]
1093b33724N5621M9192m2756l0514k6806O2049m3541j5694k3217o174O095M6643
1081b02826l0536k6624q488N0877M3069n1634K7580J9407P7629q1172m0308j5258
1069b38284k4215P7370m2108k6543o440K4324J5730K8353K2784l1504m4975k0828
1057b66336L1085j3727k8642j6395O0673J37872K6929j22754M0828P870l2809
1046a75406O505m9275L5810O6k7350k4986R4130k9755p79L2033l3234n3456j0593
1033b36290N7830k6187k009n3862R115K8596P9919q6164l9432P4626m8464K308
1021b40014N6810k5868J2399K2653n1685J8878J6956k9760p1433M7691P2486M6118
1009a24769l2544o596j6171m7192r666j3758Q4214K6423J4937q5l2459R317L3197
$$ y = [-233724, -178103, -128911, -171667, -202181, -228987, -166938, -210479, -226173, -249390, -255564, -249469, -202826, -233362, -259986, -268474, -217597, -174528, -226162, -198582, -179175, -101546, -182718, -223026, -238284, -262499, -185129, -227237, -253780, -260220, -235896, -220166, -191813, -169029, -200533, -245508, -266336, -235251, -248978, -277620, -294015, -233342, -95470, -68541, -191295, -150467, -142597, -175406, -168901, -218176, -182366, -182300, -209650, -234636, -140506, -170261, -171040, -139007, -172241, -225697, -236290, -178460, -204647, -206656, -260518, -251403, -222807, -142888, -229052, -268484, -193858, -242322, -240014, -183204, -209072, -196673, -174020, -225705, -206827, -189871, -219631, -291064, -243373, -170887, -124769, -157313, -163909, -180080, -227272, -236938, -250696, -166482, -140059, -125122, -125207, -157666, -148349, -115152]
996a15152l0735J050P38m3752p3591N0603M7540O4696l4639j562m71l4614j2821
983a82710k4875p6765m054K8650N7452O8713M0608k9300j1239k5196R481L5919
971a13316K0905l3153k9494j1927n9357j9027N670J6119r246O1300n8685m2628
959b72839K0318K8743L3669q132n680J1792J0845j6484L0511L8020m9003k1714
947a99954j6104k8817J4136R955N2258M774j4976R050Q199J5321o5170o6899N275
934b72952K2202k8100J2921M0067P0561L416m6934q8571J2947J8546N9700m2172
922b38369r743P1983M2877k8579M544K7296P685p4284J636K3852R230m1672l1935
909b35479K1518p16j8624M8804j3658k2970N6710K073K8350P6055k2674q0464
$$ y = [-115152, -145887, -144837, -144099, -187851, -261442, -210839, -163299, -98603, -133242, -134804, -135275, -169889, -182710, -207585, -284350, -288404, -259754, -202302, -133589, -92981, -122281, -133520, -158716, -149235, -113316, -92411, -125564, -155058, -166985, -226342, -245369, -239699, -223580, -232826, -171526, -230211, -272839, -252521, -223778, -190109, -198241, -203921, -192129, -181284, -197768, -167257, -129237, -178240, -199954, -216058, -244875, -230739, -220784, -168526, -163752, -178728, -169678, -161479, -146158, -211328, -278227, -272952, -250750, -278850, -265929, -225862, -155301, -151885, -198819, -287390, -274443, -255897, -196197, -238369, -248112, -176129, -133252, -161831, -157287, -129991, -122306, -196590, -194954, -171102, -161872, -203544, -235479, -213961, -214677, -233301, -184497, -198155, -221125, -164415, -162342, -133992, -57937, -80611, -161075]
897a61075J1274j23852K0093K6076J5422o6104j9750J1496J34455K8540K481p346
885a28290p0556j9147M1373J4091J6794l7111l2689O2271p208m4089p322j2334
873b24217l2717L6333K1085n025K4217N2120j7823l3069m0713m458K3801M5084
861a55382m5054J8106m7293K7246J4281m1551N7331K4782k0802k9616k7917j704
849b27573j5835R539J4344o05J2656K6007m5383m4057L4327M4325L1532j9600
837a80323j0177M7220M6212n6121p6181M043n0862n9592O7200K1051O1862P425
825a78243J703l7691l3120j3068L0585L4316n8972O5331Q2903k0177o2112m4933
813b33478n2947N5387M8633L0456j4682k3015M5880l2735l9712J116k9760J5168
$$ y = [-161075, -149801, -273653, -253560, -227484, -212062, -278166, -297916, -286420, -151965, -123425, -120944, -128290, -198846, -217993, -176620, -162529, -145735, -182846, -215535, -153264, -160472, -204561, -211883, -224217, -256934, -220601, -199516, -204541, -180324, -128204, -146027, -179096, -219809, -224267, -200466, -155382, -200436, -182330, -229623, -202377, -188096, -229647, -172316, -147534, -168336, -197952, -225869, -227573, -243408, -233869, -219525, -220130, -207474, -181467, -226850, -270907, -236580, -192255, -160723, -180323, -190500, -143280, -97068, -153189, -229370, -225327, -276189, -335781, -268581, -247530, -185668, -178243, -176540, -214231, -247351, -260419, -229834, -195518, -254490, -189159, -106256, -126433, -188545, -233478, -286425, -231038, -182405, -151949, -166631, -189646, -143766, -176501, -216213, -215097, -244857, -229689]
801b29689R8666m743n5050L6343m7615j2688j2683K6345P0815k6725q8247n4207
789b99478J6398N5083M8930k3304m6903N5238M1587o9340J112K740m6113J2534
777b51516P4821k1197j8946K1249O080m2612L8197k2956j6367k985Q288J4557
765b13387K8913k6874k3307m0951K2316R7842l3705l3395n6452M0576P4444j8753
753a82733k4732l2303L6628L1133k9606N528r799J4197L2170m9286L9997l0451
741a99257o6056J2517M3107q6179j3193J11228K7287q518j05484m008K8628M2850
729b17078j2131J6403r050r105J3359O2494J3210R596o6589k3485M378j3478L6702
716a94774j3223j3787o6354Q6336N4244p8693k0489N329M5773M7928n999r566
$$ y = [-229689, -131023, -135766, -190816, -154473, -202088, -214776, -227459, -201114, -130299, -157024, -245271, -299478, -283080, -227997, -179067, -202371, -249274, -194036, -152449, -221789, -220677, -217937, -264050, -251516, -176695, -197892, -216838, -195589, -189509, -232121, -193924, -216880, -233247, -236232, -227944, -213387, -184474, -211348, -234655, -275606, -253290, -155448, -189153, -222548, -279000, -238424, -163980, -182733, -207465, -239768, -203140, -172007, -201613, -196085, -205884, -191687, -159517, -208803, -168806, -199257, -265313, -252796, -209689, -295868, -309061, -197833, -170546, -179064, -284548, -288556, -259928, -217078, -229209, -212806, -221856, -230961, -217602, -155108, -141898, -132302, -198891, -222376, -217998, -231476, -194774, -207997, -221784, -288138, -201802, -147558, -226251, -246740, -241411, -195638, -147710, -153709, -163275]
704a63275q6726N0279K3256m7722K3431J0081j3006Q758j02195N1723L5082j8183
692b28497m9402j3026L063q354N9388m877J542m1568N8066J0842k8744m6272K3133
679b64706Q6719M4313m6475k4217k858K9050l5840n547M422L9333J7414n6414
667b14806q174J2093n6648L3792L8715p540m7972M6681j0200k0602M4844M7969
655a41848l4679k6986j574r657l3595J2423J19201k2805o9116m873L5971j5670
643a93208n4464L3302N3450k3772p2509q975M3273N4089k1098j10976L7690k451
631b65649M5658M3130J3734k0220J5484j8427m1772r833j8794K0832N397J6223
619b14237r0135J8211J06157j3695L3138r2580L2124J7767J0911j125L7325k1927
$$ y = [-163275, -250001, -199722, -176466, -224188, -200757, -190676, -203682, -194924, -297119, -245396, -210314, -228497, -277899, -290925, -287862, -296216, -236828, -241705, -240163, -281731, -223665, -212823, -241567, -287839, -264706, -177987, -133674, -180149, -204366, -207224, -178174, -214014, -219561, -215139, -175806, -158392, -214806, -222980, -210887, -267535, -233743, -195028, -202568, -250540, -203859, -214059, -234661, -189817, -141848, -176527, -203513, -205087, -214744, -248339, -235916, -116715, -139520, -208636, -213509, -177538, -193208, -247672, -214370, -160920, -184692, -257201, -266176, -222903, -168814, -189912, -300888, -263198, -265649, -219991, -176861, -163127, -183347, -167863, -186290, -228062, -237895, -256689, -235857, -230460, -214237, -304372, -286161, -180004, -193699, -160561, -253141, -221017, -203250, -192339, -193464, -156139, -178066]
607a78066l0533O2647J4795j7549m3035j5994Q275j7162j953r218n2514N7085
595b23222L4487m3266m9861N7185J04729p5182l5962Q7997k7822r5391N8616l2458
583b40150k5082P2815K6682o563o9464P135J0805k3829M2940P674l4382N1089
571a80330k8948r3657N2394L9348j0864J6927n8511K423m454R048m6089R2513
559b10200l6232n5731K9728o19J3471N4296J5913k2512M1777l1482L2009K3579
547a46003l2150K9494M432k2448l8645J5711m9053J2302K8599K5034j2838q2197
535b67762K5530q628M6855j2800k3134M9131N5252j2594q4350N9192j3424K9972
523a56760k2435n9144L6770k7643J4264K6656J0249n6812r452P8657J7110o7509
$$ y = [-178066, -208599, -145952, -131157, -148706, -191741, -207735, -199460, -216622, -218575, -227793, -280307, -223222, -188735, -232001, -281862, -224677, -119948, -195130, -231092, -143095, -170917, -266308, -207692, -240150, -265232, -192417, -165735, -172298, -241762, -234627, -223822, -247651, -204711, -197037, -231419, -180330, -209278, -302935, -250541, -211193, -222057, -205130, -263641, -261218, -265672, -256624, -302713, -210200, -246432, -302163, -272435, -273054, -259583, -205287, -189374, -211886, -170109, -201591, -169582, -146003, -178153, -148659, -144227, -166675, -205320, -189609, -238662, -226360, -197761, -172727, -185565, -267762, -242232, -250860, -204005, -216805, -239939, -190808, -135556, -148150, -232500, -173308, -186732, -156760, -179195, -238339, -201569, -229212, -214948, -188292, -178043, -234855, -244307, -165650, -148540, -216049]
511b16049Q069L6694k5446R569L0240j3209l8213o5716n4526M6097P3562n630
499b14558J393l3348k76K9728J2003L9233r581J1578L2249j21992k7106K6354
487b54323l5373M1623O0193m0282P331M9549m6409k1283K957N0522k3450q6479
475b95424L5313j548J00068Q590L1151L389p3157m6725O1810j837k7227o095P8665
462a33027n7082K2096K634j8974N980p7720j0105m7105J43513N4426j27940p84
450b44088J5495K141N2964l5639j5582l4321J00354J2006Q436n520L1528l9294
438a51520j02533P925L1767M1095L3155q3344j6410N1759P028Q85m8708n4421
426b83322O8994O769J0478M2809L44j8811L8471n4822k5251l1108k8283J02681
$$ y = [-216049, -207980, -171286, -196732, -187163, -156923, -170132, -208345, -274061, -328587, -282490, -208928, -214558, -213165, -246513, -246789, -217061, -205058, -165825, -175406, -163828, -131579, -253571, -280677, -254323, -289696, -248073, -187880, -228162, -220831, -171282, -217691, -238974, -236017, -185495, -208945, -295424, -260111, -261659, -161591, -153001, -121850, -118461, -191618, -238343, -176533, -178370, -205597, -211692, -133027, -190109, -168013, -165379, -184353, -178373, -256093, -266198, -313303, -169790, -115364, -243304, -244088, -228593, -226452, -173488, -209127, -224709, -259030, -158676, -146670, -138234, -143754, -112226, -151520, -254053, -246128, -214361, -173266, -140111, -223455, -239865, -188106, -181078, -180193, -228901, -283322, -214328, -207559, -197081, -154272, -153928, -172739, -134268, -189090, -214341, -245449, -273732, -171051]
414a71051N0255j00457j535J06275P44l4511k1388J240N056k4342p8597L882P6081
401a88348l894K3825j31209k7813R5442K9031N4093m8175q9778K2786P5926N330
389a82784n3914o154P1966m2886m3343K2530j4113J0626K0523K2287q1460l3541
377c10263J06702l4410j9557M615Q6200N1620m1318n7103O0130L5717k4145j18351
365b60163J6614m1322p254j4521K0941L062R176J60967o8602r4054O503N6377
353b12276O6029q4726o0011O9869J00327j7784j39874n4208N6167Q3779m9184
342b41892l4240J397L4240J09530j5924q9485L0912r804M9841K92r7908j1086
330b74127J07397L0524l3496k1557L1694k9294m6220J9441n3820P2515l4144q603
$$ y = [-171051, -120796, -221253, -222788, -116513, -115769, -150280, -171668, -170428, -165372, -189714, -268311, -264429, -188348, -192242, -168417, -299626, -327439, -231997, -202966, -148873, -197048, -286826, -264040, -188114, -182784, -236698, -242852, -170886, -213772, -257115, -234585, -248698, -238072, -217549, -195262, -276722, -310263, -203561, -237971, -257528, -252913, -166713, -115093, -156411, -213514, -153384, -117667, -141812, -260163, -243549, -284871, -292125, -306646, -285705, -282643, -273467, -112500, -181102, -275156, -268653, -212276, -146247, -230973, -290984, -221115, -120788, -138572, -278446, -332654, -276487, -192708, -241892, -276132, -274735, -240495, -130965, -146889, -236374, -205462, -215266, -165425, -165133, -263041, -274127, -166730, -136206, -169702, -191259, -159565, -188859, -235079, -215638, -269458, -196943, -231087, -239690]
318b39690K7670k3099K8078k1753J9000R655r7734K9381N9080K9660n4581n5301
306b89634P0578M6144n4448J1393L4964j1297L1733n4755L061O2134j0161m3980
294b04268j9413j1208J3037J4109J9752K5118J2150Q930O6006l0804j13992m203
282b24786Q7669k2883j10416J4468K5437n7328L2332K1709j6573L5163J8691p3296
270b69813J8386L4717K9607q357n5698p9208P6809Q9981m2079p1868M0835L9705
258a96983l683N2494j07062l7009O1367N4556K9469j1846L919L6145j7629q0953
246b17215L3924L1912k7336k2464o7702M2396j189M8416j3444n2939k0126L3177
234b32590K3847k4828l4717M4104M2031l924o4814r0148j044N4732P2564N0149
$$ y = [-239690, -212020, -235119, -207041, -228794, -209794, -200139, -297873, -268492, -209412, -179752, -234333, -289634, -219056, -172912, -227360, -215967, -181003, -192300, -160567, -215322, -212261, -150127, -160288, -204268, -223681, -234889, -221852, -207743, -187991, -162873, -150723, -141793, -75787, -106591, -220583, -224786, -137117, -160000, -270416, -255948, -230511, -287839, -255507, -233798, -250371, -215208, -196517, -269813, -251427, -216710, -187103, -195460, -251158, -330366, -253557, -163576, -205655, -277523, -236688, -196983, -200666, -148172, -255234, -292243, -230876, -176320, -146851, -158697, -154778, -118633, -136262, -217215, -183291, -151379, -178715, -201179, -268881, -226485, -227674, -179258, -192702, -245641, -265767, -232590, -208743, -233571, -268288, -224184, -182153, -186077, -250891, -341039, -342083, -287351, -214787, -164638]
222a64638K1568O504J2419p8229j8339r72Q1451O921m1389o4319K1317m0697J193
209b57210J8342J5141M2065k709m4183r3488P2326O3170k2362n310n7445K4696
197b46967m949p7583L323j6083P3739R8501l1106q8419Q9622L7700k0753q9986
185b72961l5448L8444O2539m6062p3239O691L2521k862L9709N7745j2027q3977
173b88927K3703M8144j305o5816n6752M1641Q748j7779N2861J6258k6709M2739
161b23194M5910m8427p3952N349Q017O687L1973M8181q971o3765l1105L8510j5047
148b79834J7334J2548j0963P865P9035p0693J2970k70M89k3317p5361l479L3153
135c00523J4588j9473M1567l4915j3050P713n1089m069k2292M9567p390M3457
$$ y = [-164638, -143070, -136566, -124147, -202376, -220715, -221687, -140236, -133315, -174704, -239023, -217706, -258403, -257210, -238868, -223727, -181662, -184371, -228554, -322042, -249716, -186546, -208908, -214218, -271663, -246967, -251916, -329499, -326176, -342259, -268520, -170019, -201125, -289544, -199922, -162222, -182975, -272961, -308409, -269965, -207426, -253488, -326727, -320036, -287515, -290377, -250668, -192923, -204950, -288927, -265224, -217080, -218385, -284201, -340953, -299312, -290564, -308343, -255482, -239224, -265933, -223194, -177284, -225711, -299663, -294314, -286297, -279610, -247637, -199456, -208427, -272192, -303297, -264787, -279834, -262500, -249952, -260915, -253050, -174015, -244708, -231738, -232008, -231519, -254836, -330197, -333676, -300523, -285935, -305408, -263841, -298756, -311806, -304093, -355182, -359251, -381543, -331976, -339366, -295909]
123b95909k9200k6845L9339J1825L0930o3281l2597j393J1247M5811J6094n7583
111c51562K27J7852K1216k8838K9117Q218j9360L3712K4948k4430J3042k0958
99b96816l3114k0481k1445K6880j1445J4669J3474l7075O685N0730k7729l5435
87c71102n558l9615M2027K6169J0345k0791o786j8225k7824N7348k9998l2913
75d16923l1881K9678k2144L3174O0684j1507j5908l9626k1597O440l6934J4558
63d51986N7477M823M5609k5496r891j2479O920Q89k0316o7245N4913N8453l7716
50c96045k7688m2328n158p60j8935P865L9822K5928m3034j7956l092p256L8631
37d50006o586p19j0793J4199q734Q3846K1341q3466n8439k2158K8854l8657J0429
$$ y = [-295909, -325109, -351954, -312615, -300790, -269860, -333141, -365738, -367131, -355884, -310073, -293979, -351562, -351335, -333483, -312267, -341105, -311988, -303770, -323130, -289418, -264470, -288900, -275858, -296816, -329930, -350411, -371856, -344976, -356421, -341752, -328278, -365353, -358668, -307938, -335667, -371102, -376660, -416275, -374248, -348079, -337734, -358525, -365311, -383536, -411360, -354012, -384010, -416923, -448804, -419126, -441270, -408096, -347412, -358919, -374827, -414453, -436050, -429610, -466544, -451986, -394509, -389686, -344077, -369573, -379464, -391943, -385023, -384134, -404450, -471695, -416782, -358329, -396045, -423733, -466061, -471219, -471979, -490914, -483049, -443227, -417299, -460333, -478289, -481381, -488637, -450006, -456592, -457311, -468104, -453905, -462639, -378793, -357452, -440918, -499357, -521515, -492661, -531318, -520889]
24e20889K9816J6514k1784R541j9562r859l4101L8879l9790l3933J8096J6204
12e50868J3959J9592k7070l8724K6499j918J9658j0735K9381l0774j9279L3515
0e36764
$$ y = [-520889, -491073, -474559, -496343, -486802, -506364, -516223, -550324, -511445, -551235, -585168, -567072, -550868, -536909, -517317, -544387, -583111, -556612, -558530, -538872, -549607, -520226, -551000, -570279, -536764]
$$ Imaginary data points
##PAGE= N=2
##DATA TABLE= (X++(I..I)), XYDATA
16383b026670N2713P4527K3803q30N0641j8687L0837J2163K7947N7966M7438o390
16371a674542M1417P8734O4179k4854M606J5723O6094M5897L5834j7083K2750
16360a341245L1103R2668p06J9915O8563K6389j4558L1048O6330M346N6877o105
16348i65375K4083Q1446N3339j1142J2449O1929J4770P0591k0436m2887M3335
16337f77898Q8055J2248L7736Q523K116M2400P9229N7968K2311K5867M6210N2689
16325b02546p894k0414k7886Q7737J5124K4811J7469L8447O0206M5858j9733N410
16313A6589M8391J8049J9757j1653Q759O7308L6055N0770n444N9398N5127J172
16301C64278J3282q808M9807L7273Q895K510L4837O7587L4956J2170J8056N356
$$ y = [-2026670, -1973957, -1899430, -1875627, -1876457, -1825816, -1844503, -1813666, -1801503, -1773556, -1715590, -1668152, -1674542, -1633125, -1554391, -1490212, -1515066, -1510460, -1494737, -1428643, -1382746, -1346912, -1363995, -1341245, -1310142, -1217474, -1218180, -1198265, -1129702, -1103313, -1117871, -1086823, -1020493, -1016147, -959270, -965375, -941292, -859846, -806507, -817649, -805200, -743271, -728501, -657910, -678346, -721233, -677898, -589843, -577595, -539859, -531336, -529220, -486820, -407591, -349623, -327312, -301445, -255235, -202546, -210440, -230854, -258740, -171003, -155879, -131068, -113599, -75152, -14946, 30912, 11179, 16589, 64980, 83029, 102786, 91133, 99892, 167200, 203255, 254025, 248581, 307979, 363106, 364278, 377560, 368752, 418559, 455832, 464727, 467237, 502074, 569661, 604617, 616787, 634843, 640199]
16289F40199J2829R0418K0191l0393J1975R7924J6625l3532r1346Q1647P6097
16278H92634L0955n2659N0478M3104L0850K2156J5540O07R5271M755K2814m0583
16266A115922m1289M9718O8579j1924P220O6311J09782M330n7478N0566L6186
16255A397923O9593l6291k3554M7213P7069K3207l6185n038k210J5321M9563m8194
16243A528417p3471Q4899J23927p230L7712J8155K5623K3183O6223p6680n2095
16232A698663K0401Q3943J4082Q222J6563K1145l0677M2150j4483l1027L6981
$$ y = [640199, 653028, 743446, 763637, 733244, 745219, 843143, 859768, 826236, 734890, 816537, 892634, 923589, 870930, 921408, 964512, 995362, 1017518, 1033058, 1033665, 1128936, 1133691, 1156505, 1115922, 1074633, 1124351, 1192930, 1181006, 1188226, 1254537, 1364319, 1368649, 1311171, 1361737, 1397923, 1467516, 1431225, 1407671, 1454884, 1531953, 1555160, 1518975, 1513937, 1511727, 1527048, 1576611, 1528417, 1454946, 1539845, 1663772, 1656542, 1694254, 1712409, 1738032, 1761215, 1827438, 1750758, 1698663, 1719064, 1803007, 1817089, 1825311, 1841874, 1863019, 1832342, 1874492, 1860009, 1828982, 1865963]
$$ [...]
##END NTUPLES=NMR SPECTRUM
##END=
