##TITLE=1H_DE-80H_X3
 200.13MHz, d2o
 8 sc
 
 19ns.26.2.2025
##JCAMPDX= 6.0         $$ Bruker NMR JCAMP-DX V2.0
##DATA TYPE= NMR SPECTRUM
##DATA CLASS= NTUPLES
##ORIGIN= UXNMR, Bruker Analytische Messtechnik GmbH
##OWNER= pz
$$ XWIN-NMR		Version 3.5
$$ Fri Jul 17 10:54:29 2026 Russian Standard Time (UT+4h)  Yarkov@DPX200
##.OBSERVE FREQUENCY= 200.1313
##.OBSERVE NUCLEUS= ^1H
##.ACQUISITION MODE= SIMULTANEOUS
##.ACQUISITION SCHEME= undefined
##.AVERAGES= 8
##.DIGITISER RES= 18
##SPECTROMETER/DATA SYSTEM= spect
##.PULSE SEQUENCE= zg30
##.SOLVENT NAME= DMSO
##.SHIFT REFERENCE= (INTERNAL, DMSO, 0, 15.5023)
##AUDIT TRAIL= $$ (NUMBER, WHEN, WHO, WHERE, WHAT)
$$ ##TITLE= Audit trail, XWIN-NMR		Version 3.5
$$ ##JCAMPDX= 5.01
$$ ##ORIGIN= Bruker BioSpin GmbH
$$ ##OWNER= Yarkov
$$ C:/Bruker/XWIN-NMR/data/yarkov2/nmr/H-C/1/pdata/1/auditp.txt
$$ ##AUDIT TRAIL=  $$ (NUMBER, WHEN, WHO, WHERE, WHAT)
(   1,<2026-07-17 10:53:49.48 +0400>,<Yarkov>,<DPX200>,
      <created by zg, POWCHK disabled, PULCHK disabled
       configuration hash MD5:
       00 E9 B6 7A A2 85 ED C7 34 08 36 98 17 FE 4E 26
       data hash MD5: 16K
       02 E5 36 02 7D 7D 76 A0 1F 2E 72 99 E3 C2 9A BA>)
(   2,<2026-07-17 10:53:54.29 +0400>,<Yarkov>,<DPX200>,
      <Start of raw data processing
       efp BC_mod = 2 LB = 0.25 FT_mod = 6 PKNL = 1 PHC0 = -7255.922 PHC1 = 7.421964 SI = 16K 
       data hash MD5: 16K
       07 5E 08 03 33 DF F4 18 FE 5A 8C 6A 00 88 40 A8>)
$$ ##END=
$$ 
$$ hash MD5
$$ 8C E6 9B AD 12 55 E0 E5 AE E6 6B D2 B8 46 D1 48
##$RELAX= 
##$RELAX= 
##$RELAX= 
##$RELAX= 
##$RELAX= 
##$RELAX= 
$$ Bruker specific parameters
$$ --------------------------
##$DU= <C:/Bruker/XWIN-NMR>
##$EXPNO= 1
##$NAME= <H-C>
##$PROCNO= 1
##$TYPE= <nmr>
##$USER= <yarkov2>
##$AMP= (0..31)
100 100 100 100 100 100 100 100 100 100 100 100 100 100 100 100 100 100 
100 100 100 100 100 100 100 100 100 100 100 100 100 100 
##$AQSEQ= 0
##$AQ_mod= 1
##$AUNM= <au_zg>
##$AUTOPOS= <>
##$BF1= 200.13
##$BF2= 200.13
##$BF3= 200.13
##$BF4= 200.13
##$BF5= 200.13
##$BF6= 200.13
##$BF7= 200.13
##$BF8= 200.13
##$BYTORDA= 1
##$CFDGTYP= 0
##$CFRGTYP= 5
##$CHEMSTR= <none>
##$CNST= (0..31)
1 1 145 1 1 1 1 1 1 1 1 1 1 1 1 1 1 1 1 1 1 1 1 1 1 1 1 1 1 1 1 1 
##$CPDPRG= <>
##$CPDPRG1= <>
##$CPDPRG2= <>
##$CPDPRG3= <>
##$CPDPRG4= <mlev>
##$CPDPRG5= <mlev>
##$CPDPRG6= <mlev>
##$CPDPRG7= <mlev>
##$CPDPRG8= <mlev>
##$CPDPRGB= <>
##$CPDPRGT= <>
##$D= (0..31)
0 0.7 0 0 0 0 0 0 0 0 0 0.03 0 0 0 0 0 0 0 0 0 0 0 0 0 0 0 0 0 0 0 0 
##$DATE= 1784271229
##$DBL= (0..7)
120 120 120 120 120 120 120 120 
##$DBP= (0..7)
150 150 150 150 150 150 150 150 
##$DBP07= 0
##$DBPNAM0= <>
##$DBPNAM1= <>
##$DBPNAM2= <>
##$DBPNAM3= <>
##$DBPNAM4= <>
##$DBPNAM5= <>
##$DBPNAM6= <>
##$DBPNAM7= <>
##$DBPOAL= (0..7)
0.5 0.5 0.5 0.5 0.5 0.5 0.5 0.5 
##$DBPOFFS= (0..7)
0 0 0 0 0 0 0 0 
##$DE= 6
##$DECBNUC= <off>
##$DECIM= 32
##$DECNUC= <off>
##$DECSTAT= 4
##$DIGMOD= 1
##$DIGTYP= 9
##$DL= (0..7)
0 120 120 120 120 120 120 120 
##$DP= (0..7)
$$ [...]
##$SUBNAM2= <"">
##$SUBNAM3= <"">
##$SUBNAM4= <"">
##$SUBNAM5= <"">
##$SUBNAM6= <"">
##$SUBNAM7= <"">
##$SUBNAM8= <"">
##$SUBNAM9= <"">
##$SW= 18.0517328524113
##$SWIBOX= (0..15)
0 0 2 0 0 0 0 0 0 0 0 0 0 0 0 0 
##$SW_h= 3612.71676300578
##$TD= 16384
##$TD0= 1
##$TE= 0
##$TE2= 300
##$TE3= 300
##$TEG= 300
##$TL= (0..7)
0 120 120 120 120 120 120 120 
##$TP= (0..7)
150 150 150 150 150 150 150 150 
##$TP07= 0
##$TPNAME0= <>
##$TPNAME1= <>
##$TPNAME2= <>
##$TPNAME3= <>
##$TPNAME4= <>
##$TPNAME5= <>
##$TPNAME6= <>
##$TPNAME7= <>
##$TPOAL= (0..7)
0.5 0.5 0.5 0.5 0.5 0.5 0.5 0.5 
##$TPOFFS= (0..7)
0 0 0 0 0 0 0 0 
##$TUNHIN= 0
##$TUNHOUT= 0
##$TUNXOUT= 0
##$USERA1= <user>
##$USERA2= <user>
##$USERA3= <user>
##$USERA4= <user>
##$USERA5= <user>
##$V9= 5
##$VALIST= <valist>
##$VCLIST= <CCCCCCCCCCCCCCC>
##$VD= 0
##$VDLIST= <DDDDDDDDDDDDDDD>
##$VPLIST= <PPPPPPPPPPPPPPP>
##$VTLIST= <TTTTTTTTTTTTTTT>
##$WBST= 1024
##$WBSW= 4
##$XGAIN= (0..3)
0 0 0 0 
##$XL= 0
##$YL= 0
##$YMAX_a= 68722
##$YMIN_a= -96643
##$ZGOPTNS= <>
##$ZL1= 120
##$ZL2= 120
##$ZL3= 120
##$ZL4= 120
##$ABSF1= 0
##$ABSF2= 0
##$ABSG= 0
##$ABSL= 0
##$ALPHA= 0
##$AQORDER= 0
##$ASSFAC= 0
##$ASSFACI= 0
##$ASSFACX= 0
##$ASSWID= 0
##$AUNMP= <proc_1d>
##$AZFE= 0.1
##$AZFW= 0.1
##$BCFW= 0
##$BC_mod= 2
##$BYTORDP= 0
##$COROFFS= 0
##$CY= -3
##$DATMOD= 1
##$DC= 0
##$DFILT= <>
##$DTYPP= 0
##$F1P= 0
##$F2P= 0
##$FCOR= 1
##$FTSIZE= 16384
##$FT_mod= 6
##$GAMMA= 0
##$GB= 0
##$INTBC= 1
##$INTSCL= 3.241238e-09
##$ISEN= 128
##$LB= 0.25
##$LEV0= 0
##$LPBIN= 0
##$MAXI= 10000
##$MC2= 0
##$MEAN= 0
##$ME_mod= 0
##$MI= 1.114404
##$NCOEF= 0
##$NC_proc= -8
##$NLEV= 6
##$NOISF1= 3.799351
##$NOISF2= 2.8
##$NSP= 0
##$NTH_PI= 0
##$NZP= 0
##$OFFSET= 15.50229
##$PC= 1
##$PHC0= -7255.922
##$PHC1= 7.421964
##$PH_mod= 1
##$PKNL= yes
##$PPARMOD= 0
##$PSCAL= 0
##$PSIGN= 0
##$REVERSE= no
##$SF= 200.130003885577
##$SI= 16384
##$SIGF1= 3
##$SIGF2= 2
##$SINO= 0.751879
##$SIOLD= 32768
##$SREGLST= <19F.Aceton>
##$SSB= 0
##$STSI= 16384
##$STSR= 0
##$SW_p= 3612.71676300578
##$SYMM= 0
##$S_DEV= 0
##$TDeff= 16384
##$TDoff= 0
##$TI= <>
##$TILT= no
##$TM1= 0
##$TM2= 0
##$TOPLEV= 0
##$USERP1= <user>
##$USERP2= <user>
##$USERP3= <user>
##$USERP4= <user>
##$USERP5= <user>
##$WDW= 1
##$XDIM= 16384
##$YMAX_p= 325873618
##$YMIN_p= -2420758
$$ End of Bruker specific parameters
$$ ---------------------------------
##NTUPLES= NMR SPECTRUM
##VAR_NAME=  FREQUENCY,     SPECTRUM/REAL,   SPECTRUM/IMAG
##SYMBOL=    X,             R,               I
##VAR_TYPE=  INDEPENDENT,   DEPENDENT,       DEPENDENT
##VAR_FORM=  AFFN,          ASDF,            ASDF
##VAR_DIM=   16384,         16384,           16384
##UNITS=     HZ,            ARBITRARY UNITS, ARBITRARY UNITS
##FACTOR=    0.220516191357247, 1,           1
##FIRST=     3102.47331231244, 0,            0
##LAST=      -510.243450693337, 0,           0
##MIN=       -510.243450693337, -2420758,    0
##MAX=       3102.47331231244, 325873618,    0
$$ Real data points
##PAGE= N=1
##DATA TABLE= (X++(R..R)), XYDATA
$$ [...]
5161A6474065J35106o2365L9708j88572J2193M8961P7069K25855j13905l16448
5151A6331667N5859L29533l2998o3543j51103j00345J3910j63100M7042M0325
5141A6307247k01169n7304K22942J12995k39356j21203m4859k49690J81270J08818
5131A6019691k24849j15795M4872K36315j09204n0734J72953j69143k08080K84865
5121A5880891K7784l18839J27058K29351j68297J41022j16414J36246j72517k87089
5111A5479196q765k11828N1309j69998P590q9479J1765J25676j60038O8034r5920
5100A5007542L6587j2539k04893j53525k38052K2760M65336k25269O7177j59850
5090A4605274k38088k43522j2762L4261K0700p5929J1152k8797r3454k5728k52778
$$ y = [16474065, 16609171, 16546806, 16586514, 16397942, 16410135, 16459096, 16536165, 16762020, 16648115, 16331667, 16387526, 16717059, 16684061, 16620518, 16469415, 16369070, 16382980, 16219880, 16266922, 16307247, 16106078, 16048774, 16271716, 16384711, 16145355, 16024152, 15979293, 15729603, 15910873, 16019691, 15794842, 15679047, 15723919, 15960234, 15851030, 15800296, 15973249, 15804106, 15596026, 15880891, 15908675, 15589836, 15716894, 15946245, 15777948, 15918970, 15802556, 15938802, 15766285, 15479196, 15470431, 15258603, 15309912, 15139914, 15147504, 15058025, 15069790, 15195466, 15035428, 15103462, 15007542, 15044129, 15031590, 14826697, 14673172, 14435120, 14457880, 14923216, 14697947, 14765124, 14605274, 14367186, 14123664, 14110902, 14145163, 14165863, 14089934, 14101086, 14072289, 13978835, 13953107, 13700329]
5079A3700329n7076m9386n1509j65790J11621k03751J09895L21832m8614j39879
5069A3527672p2346k24342l89658J66600K88907J23665J10250k44568j06670k01885
5059A2977625j29453k86184q3012P0332J12843j35337o5154Q7658n1581n1997
5049A2445740k18533k35818k01311J22455N7137n2459l298K55575k32560j35381
5039A1801547K09701j26862k8184k78173j90677J59245j17042k8197M6665r6492
5029A1351531o2955k88183J7515o3682J73013n824J6554K4607k22752l8039J31551
5018A1033336j89138k5220o1660l7427M0405r9255k08909K43597p4927m4248l15957
5007A0260597k9963M7390k69457Q1846j14943P1159J96825Q8742J05356M2324
$$ y = [13700329, 13643253, 13593867, 13542358, 13376568, 13488189, 13284438, 13394333, 13716165, 13667551, 13527672, 13455326, 13230984, 12841326, 13007926, 13296833, 13420498, 13530748, 13286180, 13179510, 12977625, 12848172, 12561988, 12478976, 12549308, 12662151, 12526814, 12461660, 12549318, 12497737, 12445740, 12227207, 11991389, 11790078, 11912533, 11969670, 11917211, 11913913, 12169488, 11936928, 11801547, 12011248, 11884386, 11856202, 11578029, 11387352, 11546597, 11429555, 11401358, 11448023, 11351531, 11288576, 11000393, 11017908, 10954226, 11127239, 11121415, 11137969, 11162576, 10939824, 10901785, 11033336, 10844198, 10818978, 10757318, 10719891, 10760296, 10661041, 10452132, 10695729, 10620802, 10576554, 10260597, 10230634, 10278024, 10008567, 10090413, 9975470, 10046629, 10243454, 10332196, 10437552, 10479876]
4997A0479876o07J55981K58804K03698M4003J88205K65495L40522J79427k38662
4987A1876742k22816l09457n98970j18166j56984j27679n05974l34603l3401K8448
4977I497140K25614q5916k36214p6241p7614J14042j02226j25853m1779K54405
4967I345358o2469l80793j21870L7841R935R2327l5525l11890R738k44418m5402
4956H292832Q8862Q9751K98293P3547k82878k43838J28956K2574j76460j46018
4946H145621n0159J81234n3433k15315k14580K08516j644p0741J60470j22217
4936G967752P4642p1011l6939j39502J01624K12243j530k50948k34817n8738J43872
4925G706648J86352N6683Q841j07402o004p7833j66635P2760J94941k2476j9644
$$ y = [10479876, 10479269, 10635250, 10894054, 11097752, 11141755, 11329960, 11595455, 11935977, 12115404, 11876742, 11653926, 11344469, 10745499, 10627333, 10470349, 10342670, 9836696, 9502093, 9468692, 9497140, 9722754, 9636838, 9400624, 9324383, 9246769, 9360811, 9258585, 9132732, 9090953, 9345358, 9282889, 8902096, 8780226, 8818067, 8828002, 8920329, 8884804, 8572914, 8582652, 8338234, 8292832, 8381694, 8471445, 8769738, 8843285, 8560407, 8316569, 8445525, 8468099, 8291639, 8145621, 8095462, 8276696, 8223263, 8007948, 7793368, 8001884, 8000240, 7929499, 8089969, 7967752, 8042394, 7971383, 7934444, 7794942, 7896566, 8108809, 8107279, 7856331, 7621514, 7562776, 7706648, 7893000, 7949683, 7958524, 7851122, 7845118, 7767285, 7600650, 7673410, 7868351, 7845875, 7826231]
4914G826231L0779o0261o2597K50460O4134n33947K1269J24158J33891N181N0863
4903G850161J0888k504K2106J75521m22250m4669L75556j42869q0851q3456O8480
4892G726113K74809L0216K17926q4793j83101j25152k90707l66320l90766N05908
4882G314133J52928L21401J69722O3008K13966J80436k432j37648k88941k9238
4872G957335K39026m0875K18508p3515O6647M19485J85016J06920k14230q5545
4862H778772J60849J50374J82279K6268J23374J3239M72999K88152J71819L32946
4852A0701071M66880O44639P01163M97445K19318L44774J78349L92113Q0294J72469
4842A4398515J65876K00784M20124N08934N12629L44928Q19245P59550J020124
$$ y = [7826231, 7857010, 7796749, 7734152, 7984612, 8048746, 7514799, 7536068, 7660226, 7794117, 7799298, 7850161, 7861049, 7858545, 7880651, 8056172, 7633922, 7589253, 7964809, 7821940, 7741089, 7657633, 7726113, 8000922, 8031138, 8249064, 8164271, 7981170, 7856018, 7565311, 7198991, 6808225, 7314133, 7467061, 7788462, 7958184, 8021192, 8235158, 8415594, 8413162, 8275514, 7986573, 7957335, 8196361, 8155486, 8373994, 8300479, 8367126, 8786611, 8971627, 9078547, 8864317, 8778772, 8939621, 9089995, 9272274, 9298542, 9421916, 9435155, 9908154, 10196306, 10368125, 10701071, 11167951, 11812590, 12513753, 13011198, 13230516, 13575290, 13753639, 14145752, 14226046, 14398515, 14564391, 14765175, 15185299, 15694233, 16206862, 16551790, 17371035, 18130585, 19150709]
4833A9150709R89139Q13877R40764J325763J296119K157263L217195N008207Q038774
4824D2937810J0424931J0341447Q254041M034419J3810p52352m893672o651807
4816F3708627o079019n481034m779544l992310k415445q31913r63520k93290J02842
4807C8975394j3989l5000l2552K63137O47200N76901L35711M68421L99342K97450
4797D1882015J52361j34041k52369p0041k27761k59865n76642m32507m71971p26679
4787C8882500p36372n11640o87900p17602m98164p22786q32152o36364l54625
4778C3184895r13130p23000q31905o45516q19987o26768n51968j368048n04978
4769B6199595p47395q52203n62845p78828p01169q63198j026533o99487n28389
$$ y = [19150709, 20139848, 20953725, 21894489, 23220252, 24516371, 26673634, 29890829, 34899036, 42937810, 53362741, 63704188, 71958229, 75992648, 76006458, 75254106, 70360434, 63708627, 57629608, 52148574, 47369030, 43376720, 40961275, 40129362, 39165842, 38872552, 38975394, 38961405, 38926405, 38893853, 39156990, 39804190, 40381091, 40716802, 41185223, 41584565, 41882015, 42034376, 41900335, 41647966, 41577925, 41350164, 41090299, 40513657, 40081150, 39609179, 38882500, 38146128, 37634488, 36946588, 36228986, 35730822, 35008036, 34175884, 33539520, 33184895, 32271765, 31548765, 30716860, 30071344, 29251357, 28624589, 28072621, 26704573, 26199595, 25452200, 24599997, 24037152, 23258324, 22557155, 21693957, 20667424, 19967937, 19439548]
4760A9439548n28069o41002n2032m59013p41595n75717n40744m17146j78055n3931
4750A5252244m639k10327k49071k72675P0672k71790k62813j20424K0208J10681
4740A4062066j09773J94371J00246o4625K80955L38555l4745k20312M75647J84493
4730A5206878M28813M47637M48690K79343Q40207O07735L20116N53137N88097
4721A9720653P68226R51298P57780N78650P27341R24637P77211P86968P34482
4712B6727246M69680P15022Q31823O36481M57440N95000O18261Q59063P99048
4703C2709064N38742N54154R25664N99599L14461P65457R48415O49932Q45667
4694C8851155N18009M24939J93357M9001j85379l63390j31139l51590m89885l27458
$$ y = [19439548, 18911479, 18270477, 18218445, 17759432, 17017837, 16442120, 15901376, 15484230, 15306175, 15252244, 15247605, 15037278, 14788207, 14515532, 14586204, 14314414, 14051601, 13931177, 13951385, 14062066, 13952293, 14146664, 14246910, 14182285, 14463240, 14801795, 14767050, 14546738, 15022385, 15206878, 15635691, 16083328, 16532018, 16811361, 17651568, 18259303, 18579419, 19132556, 19720653, 20488879, 21440177, 22197957, 22776607, 23503948, 24428585, 25205796, 25992764, 26727246, 27196926, 27911948, 28743771, 29380252, 29837692, 30432692, 31050953, 31910016, 32709064, 33247806, 33801960, 34727624, 35327223, 35641684, 36407141, 37355556, 38005488, 38851155, 39369164, 39794103, 39987460, 40036461, 39851082, 39487692, 39356553, 39004963, 38515078, 38187620]
4684C8187620n80640o69636r11539n36696q94455r77345r69145p51851j157798
4675C0738515r17462p13819q62706o92388r59685m83411m41069n44734m34715
4666B4688526o09297n37260o32990m68157p21635o71213n33527n12933o85007
4657A9316507k99497o43896p69999r11788o56476l81730n39707p28019m54208
4648A3931187m99873m41285l51423n01866k09128l34637j42608k58708j34738
4639A1056921n8036N2220o2870k13811k73644K2275K18295O51000M26460N15866
4629A2334676J552389K749045K742486K844693J367751N48732l2686o42798j517902
4620B1946386k089521j599976j561386j402660r19917k33771J59365K42039N57480
$$ y = [38187620, 37606980, 36937344, 36025805, 35489109, 34594654, 33617309, 32648164, 31896313, 30738515, 29821053, 29107234, 28244528, 27552140, 26592455, 26109044, 25667975, 25123241, 24688526, 24079229, 23541969, 22908979, 22440822, 21719187, 21047974, 20514447, 20001514, 19316507, 19017010, 18373114, 17603115, 16691327, 16034851, 15653121, 15113414, 14385395, 13931187, 13431314, 12990029, 12638606, 12136740, 11927612, 11592975, 11450367, 11191659, 11056921, 10998885, 11051105, 10988235, 10774424, 10500780, 10523055, 10741350, 11392350, 11818810, 12334676, 13887065, 16636110, 19378596, 22223289, 23591040, 24139772, 24107086, 23464288, 21946386, 19856865, 18256889, 16695503, 15292843, 14372926, 14139155, 14298520, 14540559, 15098039]
4611A5098039J276567J286679J379899J649112J213962J432316J051592J411061
4603B5799227J653558J991081K352451K341051K067673J444084J474347P51285
4595C9874757J082477J621833J851093J964124J744421N44424l775o90147j268824
4586D6720383j367582j237714m36981o88734j356217j547992j821659k153690
4578C6109814j969498k119872k001948j506597j733674j975634j645417j685195
4570B1471979k035037j974180j814261j429784j275453j021508j014879p69286
4562A0137591o82051j96365p28668o49801K4858n03009l0577o6944m13364l9769
4552F851901m9488l71130k81750n5102q9484j51496k5545j63007n76304J64014
$$ y = [15098039, 16374606, 17661285, 19041184, 20690296, 21904258, 23336574, 24388166, 25799227, 27452785, 29443866, 31796317, 34137368, 36205041, 37649125, 39123472, 39874757, 40957234, 42579067, 44430160, 46394284, 48138705, 48683129, 48679354, 47989207, 46720383, 45352801, 44115087, 43678106, 42989372, 41633155, 40085163, 38263504, 36109814, 34140316, 32020444, 30018496, 28511899, 26778225, 24802591, 23157174, 21471979, 19436942, 17462762, 15648501, 14218717, 12943264, 11921756, 10906877, 10137591, 9455540, 9259175, 8530507, 7880706, 7905564, 7402555, 7371978, 7305034, 6891670, 6851901, 6802413, 6431283, 6149533, 6094431, 6004947, 5853451, 5827906, 5664899, 5088595, 5252609]
4542E252609J94291k33360O980K6287j66211j09746j03341j55956L46653j8590
4532E039616k76577k73852K2431K83684k42495J50442l73298n2919J92674J07414
4522D577120k85270j11290J68664K2304j48849K00891J01914m74508N7523m02844
4512C705655n7371K05279K07856L2680M5048l04673j37720J00391J02780j65611
4502C734314j52928o6588K22823Q9360j46842j32893K0418n9299r9730l4602m3764
4491C330269k6627K28093k36507k45705k9399K04200j02421N4741J02056j38243
4481C140457k54324M9824Q1338q9779L25203K7604k97868k59083j4157j81058
4471B528157L8642L75342K68320m1219j38106J25582J65602k18058q6118r2376
$$ y = [5252609, 5446900, 5213540, 5220520, 5246807, 5080596, 4970850, 4867509, 4711553, 5058206, 5039616, 4763039, 4489187, 4511618, 4795302, 4552807, 4703249, 4329951, 4277032, 4469706, 4577120, 4291850, 4180560, 4349224, 4371528, 4222679, 4423570, 4525484, 4050976, 4108499, 3705655, 3648284, 3853563, 4061419, 4094099, 4139147, 3834474, 3696754, 3797145, 3899925, 3734314, 3581386, 3514798, 3737621, 3826981, 3680139, 3547246, 3567664, 3508365, 3408635, 3374033, 3330269, 3303642, 3531735, 3295228, 3049523, 3020124, 3224324, 3121903, 3176644, 3278700, 3140457, 2886133, 2935957, 3017295, 2927516, 3252719, 3280323, 2982455, 2723372, 2709215, 2528157, 2566799, 2942141, 3210461, 3169242, 3031136, 3156718, 3322320, 3104262, 3018144, 2925768]
4461B925768J17368k32683J41106R0256M3172J45077j01367l63897j71046K1640
4451B615394m5508K16090P9155k38207j88671J84055N8405R5238N3494J21394
4441B950839M9319j36090O8820j29273O6160R1689J69934k77052J85638K1485
4431C061469j01090K66145J21216p5348j19135o6388k33911q6249M22437K39301
4421C428447J7340o3286p7593J46375J11465j4307J70649L99213N1324n5760j10434
4410D003433K54530j52257R663l7406K78431J65851K0145M32293N63577Q2536
4400E620796l9561Q5698J33523J34195J75250L45767J58144N0441K31731L84126
4390G280110O79137K45279K58476N86239M12591K76546N48251M17414J31829O04012
$$ y = [2925768, 3043136, 2810453, 2951559, 3041815, 3084987, 3230064, 3128697, 2764800, 2593754, 2615394, 2569886, 2785976, 2865131, 2626924, 2438253, 2622308, 2680713, 2775951, 2829445, 2950839, 3000158, 2864068, 2932888, 2803615, 2869775, 2961464, 3131398, 2854346, 3039984, 3061469, 2960379, 3226524, 3347740, 3272392, 3153257, 3086869, 2852958, 2766709, 3189146, 3428447, 3445787, 3382501, 3304908, 3451283, 3562748, 3548441, 3719090, 4118303, 4169627, 4113867, 4003433, 4257963, 4105706, 4115369, 4077963, 4356394, 4522245, 4542390, 4974683, 5538260, 5620796, 5581235, 5666933, 5800456, 5934651, 6109901, 6455668, 6613812, 6664253, 6895984, 7280110, 7959247, 8204526, 8463002, 9049241, 9461832, 9738378, 10286629, 10704043, 10835872, 11439884]
4380A1439884N61381Q63594P21472K64901N70686O75976M89478N58972K97353
4371A6443697P24813P60630K91138N44248K90414J89747L33942M47724L98098
4362B0424451J94727L59048J6068N143L06369K73408R3608l2500j77558J13009
4352B1575773m91777j34756r0082K2044j97223l55645m66191k00934j17735p14281
4342A8829193m96448o17284l84957o53639p23506m22775m68570m88756o05336
4333A3967922q14943m95290j29471n51687k27658m28311m10913k67903p88146
4324I853600m78890n55574k38000l46743m74112j09664j86873k73473m28091k12862
4314F549318m748k72109k25042j58539k9274l94616Q0098k31943k87298j57593
$$ y = [11439884, 12001265, 12864859, 13586331, 13851232, 14421918, 15097894, 15587372, 16146344, 16443697, 17168510, 17929140, 18220278, 18764526, 19054940, 19244687, 19578629, 20026353, 20424451, 20619178, 20978226, 20994294, 20999437, 21305806, 21579214, 21672822, 21640322, 21462764, 21575773, 21083996, 20949240, 20859158, 20881202, 20683979, 20328334, 19862143, 19661209, 19543474, 18829193, 18332745, 17715461, 17330504, 16676865, 15953359, 15530584, 15062014, 14573258, 13967922, 13152979, 12657689, 12528218, 11976531, 11748873, 11320562, 10909649, 10641746, 9853600, 9374710, 8819136, 8581136, 8234393, 7760281, 7650617, 7463744, 7190271, 6762180, 6549318, 6544570, 6272461, 6047419, 5888880, 5859606, 5464990, 5545088, 5313145, 5025847, 4868254]
4304D868254m22887J8677j25821r627J77858L8683j69730j52880j05624l66623
4294C750280q3306N7143j3267k01663j18461q4889J22269J01199m7884O3258q7917
4283C456762J30747J44815j75926l24272K41943J65174J0560k61036k44395J27845
4273C272217j5628j79372k34098K43667J01806j72503k05516L1126O5696j96533
4263B710862M9404K26404k81247J03825J6252n6581O6119o304J73696l0658l2230
4252B939542k45900j62343J58021J14961l6537M4910n5049M9467N7758j61518
4242B703312j80387J38355K80113L465k3800M0533J63493k88563q8044J47677
4232B896154l05834k09399j20220K42888J53196j56335m6260j09249r9470P1656
$$ y = [4868254, 4445367, 4464044, 4338223, 4328596, 4506454, 4545137, 4375407, 4222527, 4116903, 3750280, 3666974, 3724117, 3710850, 3509187, 3390726, 3305837, 3428106, 3529305, 3481421, 3544679, 3456762, 3587509, 3732324, 3556398, 3232126, 3474069, 3639243, 3649803, 3388767, 3144372, 3272217, 3256589, 3077217, 2843119, 3086786, 3188592, 3016089, 2810573, 2841699, 2907395, 2710862, 2760266, 2986670, 2705423, 2809248, 2825500, 2768919, 2835038, 2828734, 3002430, 2971772, 2939542, 2693642, 2531299, 2689320, 2804281, 2767744, 2812654, 2757605, 2807072, 2864830, 2703312, 2522925, 2661280, 2941393, 2944858, 2921058, 2961591, 3125084, 2836521, 2748477, 2896154, 2590320, 2380921, 2260701, 2503589, 2656785, 2500450, 2454190, 2344941, 2245471, 2317127]
4222B317127L54044J80774J07148k04714J4579N4367q9559j0715l5828K2329k7284
4211B682268K140P9357l2387j71304j15438j38733K27360K28736J86158j79113
4201B769044J4357q0600K6304j11833k55184J7347P4137p1834J35016K5829K25429
4190B768012j18254j95884k21967j1648J91837P7136N6423O3093j06373K23507
4180B725882n121O044L4595k20351j02853j01606j00675K08726K96529l7359J66077
4169B869888q8742p0685j47168J76247n2126m8612J35506L21442k7908l87988
4159B679854j81359j24102O7076J74235J57103J55243M3924J35592j5734k69981
4149B821851Q6939M5128q9260l6084j31562Q0616K1273J11817J52597J85129K7858
$$ y = [2317127, 2671171, 2851945, 2959093, 2754379, 2768958, 2823325, 2733766, 2723051, 2687223, 2709552, 2682268, 2684408, 2763765, 2731378, 2560074, 2444636, 2305903, 2533263, 2761999, 2948157, 2769044, 2783401, 2702801, 2729105, 2617272, 2362088, 2379435, 2453572, 2381738, 2516754, 2542583, 2768012, 2649758, 2453874, 2231907, 2220259, 2412096, 2489232, 2545655, 2608748, 2502375, 2725882, 2720761, 2726805, 2761400, 2541049, 2438196, 2336590, 2235915, 2444641, 2741170, 2703811, 2869888, 2781146, 2710461, 2563293, 2739540, 2687414, 2638802, 2774308, 3095750, 3067842, 2679854, 2498495, 2374393, 2441469, 2615704, 2772807, 2928050, 2971974, 3107566, 3091832, 2821851, 2908790, 2953918, 2864658, 2828574, 2697012, 2777628, 2798901, 2910718, 3063315, 3248444, 3276302]
4138C276302j36570q8367q9370P0775Q2738Q7548J17559j22371J2930o9488J35358
4127C277044L60792j38654r1451J59712J25776J26082j1580J33085K0424K15647
4117D176877J57515N699j96016J30702J05325L2485q7653L28714l24782k27837
4107D101029K04560K22480o8263o3911J77883j03166J04013O1149q8856J15653
4097D662571O0891j02622R8321K5365J77315J52993M5082M9039J87644k18914
4087E137685O6071J30831L92750K10711l12769K5318J63907J4659r113k19132
4077E600918J79979K93257J5025K65820O93149m29653K71436N8221L05151M33547
4067G686850j7282L0976j9908L29995M62515L55263K90190J42197J12536M20740
$$ y = [3276302, 3139732, 3051365, 2961995, 3032770, 3115508, 3203056, 3320615, 3198244, 3211174, 3141686, 3277044, 3637836, 3499182, 3407731, 3567443, 3693219, 3819301, 3807721, 3940806, 3961230, 4176877, 4334392, 4340091, 4144075, 4274777, 4380102, 4412587, 4324934, 4653648, 4328866, 4101029, 4305589, 4528069, 4459806, 4395895, 4573778, 4470612, 4574625, 4635774, 4546918, 4662571, 4723462, 4620840, 4719161, 4744526, 4921841, 5074834, 5119916, 5168955, 5356599, 5137685, 5203756, 5334587, 5727337, 5938048, 5625279, 5650597, 5814504, 5829163, 5820050, 5600918, 5780897, 6074154, 6089179, 6354999, 7048148, 6618495, 6889931, 6948152, 7253303, 7686850, 7669568, 7700544, 7680636, 8010631, 8473146, 8828409, 9118599, 9260796, 9373332, 9794072]
4057I794072O47486L58622K97568P27231N37599J441337J379112J558447J804976
4048A8546450J474413J196477P33921N01367j29727j17956l0872m22401k29175
4039B1522497N584L91306L23959N65498J139339J160508J058754J143119J289750
4030B8600314J267277J691846J592343J680603K049854J679598J632027J333772
4022D1527634J435078J347758J180890Q70288P63817R11155P36509L93258K24617
4013D9391004J32674J62768M27231k516l82210l84836n32515p28377q28123q39752
4003D6415348o95720r53529j191027j464200j120567j256580j290326j341100
3995C7102299j236500j260102j462807r27493r81675r11272q03275o57691q25393
$$ y = [9794072, 10441558, 10800180, 11097748, 11824979, 12362578, 13803915, 15183027, 16741474, 18546450, 20020863, 21217340, 21951261, 22452628, 22322901, 22204945, 22174073, 21751672, 21522497, 21528081, 21919387, 22243346, 22808844, 23948183, 25108691, 26167445, 27310564, 28600314, 29867591, 31559437, 33151780, 34832383, 36882237, 38561835, 40193862, 41527634, 42962712, 44310470, 45491360, 46361648, 47125465, 48036620, 48773129, 49166387, 49391004, 49523678, 49686446, 50113677, 50111161, 49728951, 49344115, 48811600, 48083223, 47255100, 46415348, 45719628, 44766099, 43575072, 42110872, 40990305, 39733725, 38443399, 37102299, 35865799, 34605697, 33142890, 32215397, 31233722, 30322450, 29519175, 28861484, 28036091]
3986B8036091r38783m40841l61227m45607n6096l57765j0582k41490k04697k09726
3976B4769277k43306J75123L32366L57779L31507L69267O29518M60002L78341
3967B7559874O88456Q32119R73011R65563J065971J049506R93769J215575J316954
3958C6660798J319668J127267Q11958J459488J414862J053607J350839J510306
3950D6708793J810541J897103K206686L076696K970067K815568J951197J458484
3942F4895135R78666N54153J33595l4776N97983P00319P74614P88509J020673
3933G0408871P68302P89538P05707O72209M86925K03117l9186n11887m07540p46298
3923G2329758r38438q77975r05355r98398p54584k01663J7365R4631n7283n8623
$$ y = [28036091, 27097308, 26656467, 26295240, 25849633, 25793537, 25435772, 25425190, 25183700, 24979003, 24769277, 24525971, 24701094, 25033460, 25391239, 25722746, 26092013, 26721531, 27181533, 27559874, 28248330, 29080449, 30053460, 31019023, 32084994, 33134500, 34128269, 35343844, 36660798, 37980466, 39107733, 39919691, 41379179, 42794041, 43847648, 45198487, 46708793, 48519334, 50416437, 52623123, 55699819, 58669886, 61485454, 63436651, 64895135, 65873801, 66427954, 66561549, 66526773, 67124756, 67825075, 68599689, 69388198, 70408871, 71177173, 71966711, 72672418, 73344627, 73831552, 74034669, 73995483, 73483596, 73076056, 72329758, 71391320, 70513345, 69607990, 68609592, 67855008, 67653345, 67670710, 67765341, 67708058, 67649435]
3913F7649435o00102j538195j683208k056350k784051k191815j997813j663185
3905E3134716j865277j940265j391075j075263j066170j401973p53545o93587
3897D2947561p16135r05660o40396m90840o23028p87125q25342n76860m13968
3888C6968207n98160o68528m42666p55396j117314q99185p10921p22175o57855
3879C0396007o07464m14391o94251p18181m60096l69087k86777k23362j87109
3870B6435289M3582J18551l80182o2573k3919M9952Q7739J9845J53708M09845
3860B6851837M28940M87354M92626O24241P51049P68336J112352P45159R88968
3851C3250862J139630J375489J677315J684046J741904K245806J930582K248547
$$ y = [67649435, 67049333, 65511138, 63827930, 61771580, 58987529, 56795714, 54797901, 53134716, 51269439, 49329174, 47938099, 46862836, 45796666, 44394693, 43641148, 42947561, 42231426, 41325766, 40685370, 40194530, 39571502, 38784377, 37959035, 37382175, 36968207, 36370047, 35701519, 35258853, 34503457, 33386143, 32486958, 31776037, 31053862, 30396007, 29788543, 29374152, 28679901, 27961720, 27501624, 27132537, 26845760, 26622398, 26435289, 26478871, 26597422, 26217240, 26154667, 26130748, 26180700, 26268439, 26288284, 26441992, 26851837, 27280777, 27768131, 28260757, 28884998, 29636047, 30404383, 31516735, 32261894, 33250862, 34390492, 35765981, 37443296, 39127342, 40869246, 43115052, 45045634, 47294181]
3843D7294181K582542K694250K777679K829816K906941K511805K521464K269381
3835F8388059K472131K014455J627296J403139R76668R70463P98478N11986L01235
3826G9463910L7447p1441l20933o51617n75397o12643j219308j009309j142147
3817G3898562j529477j940287k024435k099716j799004k320132k532505k653625
3809E6999381k483714k268128k466578k484929k449401k242926k620561k135930
3801C7847214k020967j867738j634590j552619j789667j213093j030346r40356
3793B5797838q43179j285735r88591j031663q73613o12754o33569m22094l36473
3784A8770167o66255m07522k50694n06542l27652k88544n9971j49428l2488k46088
$$ y = [47294181, 49876723, 52570973, 55348652, 58178468, 61085409, 63597214, 66118678, 68388059, 70860190, 72874645, 74501941, 75905080, 76881748, 77852211, 78650689, 79162675, 79463910, 79501357, 79429916, 79108983, 78457366, 77881969, 77269326, 76050018, 75040709, 73898562, 72369085, 70428798, 68404363, 66304647, 64505643, 62185511, 59653006, 56999381, 54515667, 52247539, 49780961, 47296032, 44846631, 42603705, 39983144, 37847214, 35826247, 33958509, 32323919, 30771300, 28981633, 27768540, 26738194, 25797838, 24954659, 23668924, 22680333, 21648670, 20775057, 20162303, 19528734, 19106640, 18770167, 18103912, 17696390, 17445696, 16939154, 16611502, 16322958, 16262987, 16113559, 16081071, 15834983]
3774A5834983J53049J84611m8648K27122L58882O9892l542j38561J17582j773
3764A6753597L03602n3642m19761j31722m30093k08655n80201o42190k13154n06595
3754A3871186j67369k92984l04987m33842q95360l66705k63205l10762l17745
3745A0518227p02306k7821J79314k47493n49510l84359R6902l24769p4784k3755
3735H459646J4115m44712j79420J81715K32988k61654r2565k25322k34860l3388
3725G416543j67946j26188L6586P4172J20020l78183M3548o9147L8029J1250J54852
3714G153536J68900j71962M8728j26869j63315j1273q9734n0317J47070L2741
3704F937505J40589r6866j64829J93465L29311k84755j426L58628K75824p1806
$$ y = [15834983, 15988032, 16172643, 16123995, 16351117, 16709999, 16779891, 16776349, 16637788, 16755370, 16753597, 17057199, 17003557, 16583796, 16452074, 16021981, 15813326, 15233125, 14590935, 14377781, 13871186, 13703817, 13410833, 13105846, 12672004, 11776644, 11409939, 11146734, 10835972, 10518227, 9815921, 9788100, 9967414, 9719921, 9170411, 8786052, 8882954, 8558185, 8483401, 8459646, 8473761, 8029049, 7849629, 8031344, 8264332, 8002678, 7910113, 7684791, 7449931, 7416543, 7248597, 7122409, 7158995, 7233167, 7353187, 6975004, 7018552, 6949405, 6987434, 6998684, 7153536, 7322436, 7150474, 7199202, 7072333, 6909018, 6897745, 6808011, 6757694, 6904764, 6937505, 7078094, 6981228, 6816399, 7009864, 7339175, 7054420, 7052994, 7411622, 7687446, 7615640]
3694G615640q6240l3940L02946k726n0413o6237P5562Q5700n7860J88573L05373
3683H276378j07467j7151L24566l3662k84312J63419K60091J18033L07022r480
3673H997437J72436k1760J66234N57187L81047N08194M13273L99913K45425P19317
3663A2538703O16103Q43201L43420L08838O91928P78126P21751N53105M49122
3654A7844297L54476Q09913M56151N5003M60120P1259M5219M14784M33513J4465
3644B0959200m9427K21407J45109k09m63200m8236j5529p5337j13335n52175n66063
3633A9442205j26416j99153L1589l83415k54104k01495J87560K1227k63860M98163
3623A8752301J45312K5253L65860M45329Q00968L71734N49951Q88519J180117
$$ y = [7615640, 7529400, 7495460, 7798406, 7795680, 7745267, 7679030, 7754592, 7840292, 7782432, 7971005, 8276378, 8168911, 8151760, 8476326, 8442664, 8158352, 8321771, 8581862, 8699895, 9006917, 8997437, 9169873, 9148113, 9314347, 9871534, 10252581, 10760775, 11174048, 11573961, 11819386, 12538703, 13154806, 13998007, 14341427, 14650265, 15342193, 16120319, 16842070, 17395175, 17844297, 18198773, 19008686, 19464837, 19519840, 19979960, 20051219, 20096438, 20511222, 20944735, 20959200, 20909773, 21131180, 21276289, 21276080, 20812880, 20764644, 20749115, 20673778, 20560443, 20008268, 19442205, 19315789, 19116636, 19148225, 18764810, 18510706, 18309211, 18496771, 18517998, 18254138, 18752301, 18897613, 18922866, 19288726, 19734055, 20535023, 20906757, 21456708, 22345227, 23525344]
3614B3525344J575622J274174J389659K060616K323153K737040L359723M217873
3606D2463204N194377O120742O668618O495663O144887M645060K791845J509338
3598H2033734r2936j812010k477741k827986k614378k226192k215345j772038
3590F5995108j456178j139121j161058r33175o35893o25843o99606l09324j13774
3581E8921136k2169m2598L23075J001851J706535K412671L676105N482745Q258205
3572H1717556J0188953J0426794Q876582N835119K371285j088736m744996p196250
3564A06386307q446324q648968p976557p403143o319896m948619l260623k819699
3556E6562478j698500p25411m98678n01993n2517O32689O73382Q25046J232169
$$ y = [23525344, 25100966, 26375140, 27764799, 29825415, 32148568, 34885608, 38245331, 42463204, 47657581, 53778323, 60446941, 66942604, 73087491, 77732551, 80524396, 82033734, 81940798, 80128788, 77651047, 74823061, 72208683, 69982491, 67767146, 65995108, 64538930, 63399809, 62238751, 61305576, 60669683, 60043840, 59344234, 59034910, 58921136, 58898967, 58856369, 59179444, 60181295, 61887830, 64300501, 67976606, 73459351, 81717556, 91906509, 102333303, 111209885, 117045004, 119416289, 118327553, 113582557, 106386307, 97939983, 89291015, 81314458, 73911315, 67591419, 62642800, 59382177, 56562478, 54863978, 54138567, 53639889, 53137896, 53085379, 53718068, 54391450, 55216496, 56448665]
3547E6448665J228238J714653K139232K612621K773050L641893M297020M520922
3539G9376294M404799L860619K887815J026423n97496k420908l519173m507867
3531H0510506m801552m932699n186491m534534l909731l813223l413808l016762
3523D6901706k566541k613459k692091k127488j821474j438706j256248j147005
3515C1238694q84757m69664l5114K39134p5858J31755k79048j70101m02728q78807
3505B8413506q84427p75972j006922o62253o08199j34803m3681Q8059L47081K09661
3495B4942050K2995K07833K13146M42152K88668M68365L33928N64589P20471P69911
3485B8974108R39537P59076J091043J030059N83773J79755K00682m23952p88854
$$ y = [56448665, 57676903, 59391556, 61530788, 64143409, 66916459, 70558352, 74855372, 79376294, 83781093, 87641712, 90529527, 91555950, 90958454, 88537546, 85018373, 80510506, 75708954, 70776255, 65589764, 61055230, 57145499, 53332276, 49918468, 46901706, 44335165, 41721706, 39029615, 36902127, 35080653, 33641947, 32385699, 31238694, 30353937, 29884273, 29849159, 30088293, 30012435, 30144190, 29865142, 29695041, 29292313, 28413506, 27529079, 26753107, 25746185, 25083932, 24475733, 24340930, 24297249, 24385308, 24732389, 24942050, 24965045, 25172878, 25386024, 25828176, 26116844, 26585209, 26919137, 27483726, 28204197, 28974108, 29913645, 30672721, 31763764, 32793823, 33377596, 33557351, 33758033, 33334081, 32545227]
3476C2545227r82296p33500p63278j152254j419947p31175j011912j040182o87229
3467B4023454o86020p83449j047808p88386o83265q06866p33748n79757k61503
3458A7652652n11182l50299n37599j57725l07792k10032m7354j12501J97765L60454
3448A5976387J88562M01765K61924P8973L43084N30075J01437N58301O05075r79
3438A9044604L50647M15031K36181M22698N43940N96918P91966P09469Q03989
3429B3915443J148238Q83242J341298J425384J272688J374914J242125J185214
3421C3788546J055435J280363J028900J294201Q12721O23616P26570L89419M79419
3412D1479190J13027N52687L07823M60091K50194M69211L09486j53155o270P543
$$ y = [32545227, 31562931, 30829431, 30066153, 28913899, 27493952, 26762777, 25750865, 24710683, 24023454, 23337434, 22553985, 21506177, 20717791, 20034526, 19227660, 18493912, 17914155, 17652652, 17141470, 16791171, 16253572, 16095847, 15788055, 15578023, 15530669, 15418168, 15615933, 15976387, 16164949, 16566714, 16828638, 16907611, 17250695, 17780770, 17882207, 18440508, 19045583, 19044604, 19395251, 19810282, 20046463, 20469161, 21013101, 21610019, 22401985, 23111454, 23915443, 25063681, 25946923, 27288221, 28713605, 29986293, 31361207, 32603332, 33788546, 34843981, 36124344, 37153244, 38447445, 39260166, 39883782, 40610352, 40999771, 41479190, 41592217, 42144904, 42452727, 42912818, 43163012, 43632223, 43941709, 43788554, 43782284, 43789827]
3402D3789827k21112p38674p52314r41002q01963j504395j407602j476857j617951
3393C4327957j709212j740140j912785j653366j637061j393903j463363j302863
3385B1515264j244968j249495r72622p67320p20100o41043j014685r48442m61907
3376A3494682r61009n11627l24825j68740j07547l58060m89356m27445k79136
3367I866937j00628l23051j83709m9594R7994l16714j64599J01987j86022R8323
3357H840924j3852q7567O6988K44975J09368J44944K53301l5189j67864J78267
3347I534295J54961K09553R4442L11810j36080K55311M700j45666j13540l44862
3337I824924l22650k57110J93977k06545J95277K2468k02288j10372j50222n4991
$$ y = [43789827, 43568715, 42830041, 42077727, 41136725, 40334762, 38830367, 37422765, 35945908, 34327957, 32618745, 30878605, 28965820, 27312454, 25675393, 24281490, 22818127, 21515264, 20270296, 19020801, 18048179, 17280859, 16560759, 15919716, 14905031, 13956589, 13494682, 12533673, 12022046, 11697221, 11528481, 11420934, 11062874, 10573518, 10146073, 9866937, 9766309, 9443258, 9259549, 9209955, 9307949, 8991235, 8826636, 8928623, 8742601, 8840924, 8827072, 8739505, 8806493, 9051468, 9160836, 9305780, 9559081, 9523892, 9356028, 9534295, 9689256, 9898809, 9993251, 10305061, 10168981, 10424292, 10428992, 10283326, 10169786, 9824924, 9502274, 9245164, 9439141, 9232596, 9427873, 9450341, 9248053, 9137681, 8987459, 8932468]
3327H932468l32584l09714m18926l13738k37434o1210l02609o0756l81787k02077
3317F311633q4143l15393J32287k14743J19324J84820K27933j04092k3401N1290
3307F285515J10145O8759J59643K82127P73400P74609N77210O64600L82846k04605
3297I874249n7278m40825n66740j62965l71362j33127J23175N95875P02342J435581
3287A0998925J539157K121393J752883O32239L27552M4616o20309j154959j545530
3278A4095967j432045j109889r70815p34852n30159k08612m154N8541L6612J34438
3268I335032J75831J91776k92357N6335K5214l62183P90500J047807J601283J876005
3258A4445243J765837J119109N14838K88020j75352j325859j784956j152583j353203
$$ y = [8932468, 8599884, 8290170, 7871244, 7557506, 7320072, 7258862, 6956253, 6895497, 6513710, 6311633, 6227490, 5912097, 6044384, 5829641, 5948965, 6133785, 6361718, 6257626, 6234225, 6285515, 6395660, 6464419, 6624062, 6906189, 7679589, 8454198, 9031408, 9696008, 10078854, 9874249, 9816971, 9376146, 8809406, 8646441, 8275079, 8141952, 8265127, 8861002, 9563344, 10998925, 12538082, 14659475, 16412358, 17044597, 17372149, 17416765, 16796456, 15641497, 14095967, 12663922, 11554033, 10583218, 9848366, 9318207, 9109595, 9105441, 9163982, 9200594, 9335032, 9510863, 9702639, 9410282, 9466617, 9491831, 9129648, 9920148, 10967955, 12569238, 14445243, 16211080, 17330189, 17845027, 18133047, 17957695, 16631836, 14846880, 13694297, 12341094]
3249A2341094j014202q89799p68959m14456k40889j43628l57126j93770j74513
3240H143752l31571k25238J36467J66687k52922J36345M112L80883n1456K91638
3230H398697o0429J38917M12536L9832J30970R3358J44859L73478J09850L0308
3220I812376K25314k3847J16309L15407p4346K97925N18914L67486K77080M03007
3210A2235625L07616O9924K07046J59903O52226N18190M84714M27422N25303K79986
3200A5867955M97826K82737N11633Q35857Q31122Q52158P16527J137204J034061
3191B2567080Q18939J215420J212091J432193J324611J745764K032731K045078
3183C4393907K321064K606565K879903L030065L600555M354476M945313N663657
$$ y = [12341094, 11326892, 10437093, 9668134, 9253678, 9012789, 8869161, 8512035, 8318265, 8143752, 7812181, 7586943, 7723410, 7890097, 7637175, 7773520, 7777632, 8158515, 8107059, 8398697, 8338268, 8477185, 8889721, 8929553, 9060523, 9153881, 9298740, 9672218, 9782068, 9812376, 10037690, 10013843, 10130152, 10445559, 10371213, 10669138, 11188052, 11555538, 11832618, 12235625, 12543241, 12613165, 12820211, 12980114, 13632340, 14150530, 14635244, 15062666, 15587969, 15867955, 16365781, 16648518, 17160151, 17996008, 18827130, 19679288, 20395815, 21533019, 22567080, 23386019, 24601439, 25813530, 27245723, 28570334, 30316098, 32348829, 34393907, 36714971, 39321536, 42201439, 45231504, 48832059, 53186535, 58131848, 63795505]
3175F3795505O371579P107265Q492306R485435J1056262J3114907J5053444J6658381
3167A51135084J8392811J8967149J8337842J6174132J2736011Q005568K635073
3160B46383670k723660p360276j1213497j3994503j5476779j6026280j6111927
3153A63476748j4915647j3782508j2522175j1179843j0172818r083941p860141
3146H3959675p190645o440745n817179n125890m181172m219290l458641l053692
3138D4472421k798060k549506k063570j961503j798737j557466j205018j462759
3130B9075802r99136j002075j274151q37734j047121q88649q15935r01376r46637
3121B0362988q31029m50633l59165q35665q18129k15990o19372n24191m74728
$$ y = [63795505, 70167084, 77274349, 85766655, 95252090, 106308352, 119423259, 134476703, 151135084, 169527895, 188495044, 206832886, 223007018, 235743029, 243748597, 246383670, 243660010, 236299734, 225086237, 211091734, 195614955, 179588675, 163476748, 148561101, 134778593, 122256418, 111076575, 100903757, 91819816, 83959675, 76769030, 70328285, 64511106, 59385216, 55204044, 50984754, 47526113, 44472421, 41674361, 39124855, 37061285, 35099782, 33301045, 31743579, 30538561, 29075802, 28076666, 27074591, 25800440, 24962706, 23915585, 23026936, 22211001, 21309625, 20362988, 19531959, 19081326, 18722161, 17886496, 17068367, 16852377, 16233005, 15708814, 15234086]
3112A5234086m58494p23722l77094l53337m54355l89623o17884k46184l25620
3103A1287773k95985k19688m73267l70645l69257j81285l64278j30424j71806
3094H711138l18544j34407j00972k70426K4320j86765K3072q6797r3508K3339
3084G590450j56107j55352j24793k70521l52132J98143L3503m21373l77202J75177
3074F139793q7302L7531j00277j57901k73716J5103n5379j42968j55575l45205
3064D874104l91716J25479O9490L3813p5286m42782k44440m5921J24097l8126
3054C988712k50611j84280J24070j03409j83846J21423o2255R8365k37046K19558
3044C530681k04191j45867o9742j39603n5152n8977J67897K66981j06964L0526
$$ y = [15234086, 14775592, 14051870, 13674776, 13321439, 12867084, 12477461, 11859577, 11613393, 11287773, 10991788, 10772100, 10298833, 9928188, 9558931, 9377646, 9013368, 8882944, 8711138, 8392594, 8258187, 8157215, 7886789, 7911109, 7724344, 7747416, 7660619, 7567111, 7590450, 7434343, 7278991, 7154198, 6883677, 6531545, 6729688, 6763191, 6341818, 5964616, 6139793, 6052491, 6090022, 5989745, 5831844, 5558128, 5573231, 5517852, 5374884, 5219309, 4874104, 4482388, 4607867, 4677357, 4711170, 4635884, 4193102, 3948662, 3902741, 4026838, 3988712, 3738101, 3553821, 3677891, 3574482, 3390636, 3512059, 3449804, 3548169, 3311123, 3530681, 3326490, 3180623, 3110881, 2971278, 2916126, 2857149, 3025046, 3292027, 3185063, 3215589]
3034C215589L9633k81386j384k73248m704M5834q5941k0048J95654q6327j13038
3023B630634k1682q173J9428k48439j26107j57004N2040J36138k51796j56962
3013A868077j31988l2941K34888K25903j9554j50602k05047L49326j04163p8493
3003A955406O1462j48256J58446k392l72290j73743L4697L36933K289j49758J61659
2992A864453k41063J19926N9552j02481n8239j06739r3152r0871j47190M36069
2982A640265N20989l3392j40565m21760j3949j0429j63736p0227J07715p9625
2972A335286j31417J37308K70815O6001r4128K4369l46170j80833K25449j52973
2962A153707J39601K29342J4759r9160j38771Q4951J28427J21499k18250o7687
$$ y = [3215589, 3255222, 2973836, 2972452, 2699204, 2694500, 2740334, 2654393, 2634345, 2829999, 2743672, 2630634, 2608952, 2600779, 2620207, 2371768, 2245661, 2088657, 2140697, 2276835, 2025039, 1868077, 1736089, 1703148, 1938036, 2163939, 2144385, 1993783, 1788736, 2138062, 2033899, 1955406, 2016868, 1868612, 2027058, 2024666, 1652376, 1478633, 1513330, 1850263, 1852552, 1702794, 1864453, 1623390, 1743316, 1802868, 1700387, 1642148, 1535409, 1442257, 1351386, 1204196, 1640265, 2161254, 2127862, 1987297, 1565537, 1551588, 1541159, 1377423, 1307196, 1414911, 1335286, 1203869, 1341177, 1611992, 1677993, 1583865, 1608234, 1262064, 1081231, 1306680, 1153707, 1293308, 1522650, 1537409, 1438249, 1299478, 1384429, 1512856, 1634355, 1416105, 1348418]
2952A348418r0098m16453K79262K3434J11471K21885l03346k0056J5712j6551
2942A153678J22621k2026L6355j36575K8008K11451j51992j83598Q9048N3373
2932A200343j6167K12687J71939k12534k13217O0871m0108L075J79012j76639
2922A169262j23443K56126m98719N6640q0189j38504m8916L61573J35352L8476
2912A127658P6462J42666O5299q5146l08137n0953J80319j14666l8023K04776
2902A200255J18807r3710j80742n5083J66471k43747K3541K83948k49046j81549
2892G89145K68922J96636O3587L25637L1334j01883K31373O7423k68592m8979
2882A554603L01934K45228k7479l69691j35549P9560K15202O0960J22231k10309
$$ y = [1348418, 1258320, 841867, 1121129, 1144563, 1256034, 1477919, 1174573, 1154517, 1170229, 1153678, 1276299, 1254273, 1290628, 1154053, 1182061, 1393512, 1241520, 1057922, 1146970, 1200343, 1184176, 1396863, 1568802, 1356268, 1143051, 1203922, 1163814, 1166889, 1345901, 1169262, 1045819, 1301945, 803226, 859866, 779677, 641173, 592257, 953830, 1089182, 1127658, 1204120, 1346786, 1412085, 1326939, 1018802, 967849, 1148168, 1033502, 995479, 1200255, 1319062, 1225352, 1044610, 989527, 1155998, 912251, 935792, 1219740, 970694, 789145, 1058067, 1254703, 1318290, 1643927, 1675261, 1573378, 1804751, 1872174, 1603582, 1554603, 1856537, 2101765, 2074286, 1704595, 1569046, 1648606, 1863808, 1924768, 2046999, 1836690]
2872A836690j67246j72132J52279l64197j4298K25058j28108k9381k76218l5333
2862A027114k5049K54734J26069l76841p542r0529p905r5156K95034j15831r7281
2851H86817j42489j04391J4941K81759J12341n7718j16020j01405M6703j53563
2841F66975m4137n25J09991k3661j289j84844j31442J84620K18446p5131M8301
2830G67304K025O7208r0109l2814j73166R00K66917k36520j26745K05386k3079
2819F27307J4476K65558P3931k90903O5444L7428N3860K2149k17916M3669K21825
2808I16828l03741k43914M29749J61643j14216j77761J20796J22832l39878j56254
2798D16084J97113L54034R5171O3973j79571m0755r9386O7463k4935l37893j46770
$$ y = [1836690, 1669444, 1497312, 1649591, 1285394, 1271096, 1496154, 1368046, 1338665, 1062447, 1027114, 1002065, 1256799, 1382868, 1006027, 998485, 907956, 900051, 804895, 1099929, 984098, 886817, 744328, 639937, 654878, 936637, 1048978, 991260, 875240, 773835, 820538, 666975, 622838, 622313, 732304, 708643, 707354, 522510, 391068, 575688, 794134, 719003, 767304, 769329, 836537, 746428, 713614, 540448, 541348, 808265, 571745, 445000, 650386, 627307, 641783, 907341, 981272, 690369, 755813, 793241, 847101, 869250, 651334, 695003, 916828, 613087, 369173, 798922, 960565, 846349, 668588, 789384, 912216, 572338, 416084, 613197, 967231, 1062402, 1126375, 946804, 906049, 806663, 874126, 849191, 511298, 364528]
2787C64528L86887p2854J7682N6215j82561L40229J6474p5296k61927j89201J44745
2776E44921L72223P8031j70912j19674j00101m4251k3970K56243L6946k23677
2766F05779r1561K32676P0438n4387J17730P6929n7166j95206p4552j46772J84620
2755F68528J46590k02925k9081K6001J7190j66023j530j19902j29147J11628J73837
2744D95166N05o1394K29623j49236k72440K56978p3302q6596K25655j19814K2968
2733D68113m2875r458J86571j45117k60084K34408j20798q4784J25357n0821K46610
2722E47122J58650j28653Q0402m3524Q3043j97597P7571j03443k13365O7427j9531
2711C08102J50502K28863J54934j01790q2680j51092j61101n3456N5431K3841
$$ y = [364528, 751415, 678561, 696243, 752458, 569897, 910126, 926600, 851304, 589377, 400176, 544921, 917144, 995175, 824263, 704589, 604488, 560237, 536267, 792510, 829456, 605779, 514218, 746894, 817332, 762945, 880675, 957604, 900438, 705232, 630680, 483908, 668528, 815118, 612193, 583112, 609113, 626303, 460280, 458750, 338848, 209701, 321329, 495166, 495671, 434277, 663900, 514664, 242224, 499202, 425900, 339304, 564959, 445145, 468113, 425238, 415780, 602351, 457234, 197150, 431558, 310760, 225976, 351333, 300512, 547122, 705772, 577119, 657521, 613997, 697040, 499443, 577014, 473571, 260206, 327633, 308102, 458604, 687467, 842401, 740611, 657931, 506839, 345738, 292282, 347713, 371554]
2701C71554K06140o9553J61876j76960P8908l0722l39931Q4903J91360k0494j61460
2690B95621J31553l1647p7525n828K75619k31116K6189K89093j10347n9779j4337
2679D87496J34768r9665q8466N6503j20492K60820L00737m02625r0574J8186K6167
2668D82855Q808j37092J37333r6418j99934K24166j9145j59242l8306N9052J12519
2657C74596j86071j6166M23264L32186l67533k47320K53869P9369k08151K95069
2647G33112j29531O2388J59651k43821m4765j77160j71321J30529Q9340M2420
2637D50842k758j54062l5880J68777J78543q6195J03441O7887k12407j34134R9963
2626D44017M5228P3385n5943o694j63196J63409R0365r9670l5218J59274j92719
$$ y = [371554, 577694, 508141, 670017, 493057, 571965, 541243, 201312, 286215, 477575, 457081, 295621, 427174, 395527, 318002, 312174, 587793, 356677, 382866, 671959, 561612, 501833, 487496, 622264, 522599, 434133, 490636, 370144, 630964, 931701, 529076, 438502, 456688, 482855, 491663, 354571, 491904, 395486, 195552, 419718, 400573, 241331, 203025, 262077, 374596, 188525, 172359, 595623, 927809, 560276, 312956, 566825, 646194, 438043, 733112, 603581, 665969, 825620, 581799, 537034, 359874, 188553, 319082, 408422, 450842, 448084, 294022, 258142, 426919, 605462, 519267, 622708, 690595, 478188, 344054, 444017, 489245, 562630, 506687, 499993, 336797, 500206, 590571, 490901, 455683, 614957, 422238]
2615D22238k29667J02934J27555J20102j92880P8610J69405q7653l3974J41376
2605F18046K00290Q980l60548K767J30879L76219j68419j80075j87192K29388
2595F70335J23941j23377K7575j71604J04140J34577J44666J07026K54515J70523
2585A442317p303m6603M15452M51466R4133o80P1073l90108l16121j96561k59066
2574A257999J62879J4486m23812j45086j04171L8502k36846j91337M2139O4535
2564D79288J53805j02491O1272J94359j26150j83511P4797L70271j00221J07933
2554I29352N1230k76804q0632l24674J02969j08475J34697Q420O4987j60779p3016
2543B67275Q5911K1936J56765L0869L7034N0672j309k20039K78359J13105n8161
$$ y = [422238, 192571, 295505, 423060, 543162, 350282, 428892, 598297, 510644, 476670, 618046, 818336, 827316, 466768, 469535, 600414, 976633, 808214, 628139, 440947, 670335, 794276, 670899, 698474, 526870, 631010, 765587, 910253, 1017279, 1271794, 1442317, 1435014, 1388411, 1803863, 2255329, 2349462, 2348782, 2419855, 2029747, 1713626, 1517065, 1257999, 1420878, 1435364, 1011552, 866466, 762295, 800797, 563951, 372614, 414753, 479288, 633093, 530602, 591874, 786233, 660083, 476572, 551369, 921640, 821419, 929352, 980582, 703778, 623146, 298472, 401441, 292966, 427663, 436083, 501070, 340291, 267275, 353186, 375122, 531887, 562756, 599790, 650462, 649153, 429114, 707473, 820578, 762417]
2532G62417N7591r9558j24546k41184J09362J31858j24414J19892p5665J26707
2522F42460J89331M7247m74740j22886L09085R6807m3904m2465J00008j04077
2512E96866J75474L7870m03875j18004N08165N5620l29659j35986J19305J37197
2502F42973J66841K21935k07463J16818K58414j75714r190k45937N5347j08334
2492G15690j17496J4164j5040L97098l7732L9257M2063N7421L5363q4740R0168
2481A136216j9484k35024l79771m1574p2659L26724L0827k39878j03840J56011
2471E57548J13630j04630J75138K2742N19j16807K65888R7069J51794n080N929
2460A163740o8761Q6942j12481m25518K84582J09522j73023j07193N2929q3657
$$ y = [762417, 820008, 720450, 595904, 354720, 464082, 595940, 471526, 591418, 515753, 642460, 831791, 879038, 404298, 281412, 590497, 687304, 643400, 600935, 700943, 596866, 772340, 810210, 406335, 288331, 796496, 852116, 522457, 386471, 505776, 642973, 809814, 1031749, 824286, 941104, 1199518, 1023804, 1014614, 768677, 824024, 715690, 598194, 612358, 597318, 994416, 956684, 995941, 1038004, 1095425, 1130788, 1046048, 1136216, 1116732, 881708, 501937, 460363, 387704, 714428, 745255, 505377, 401537, 557548, 671178, 566548, 741686, 764428, 764947, 648140, 914028, 1011097, 1162891, 1157811, 1163740, 1094979, 1181921, 1069440, 643922, 928504, 1038026, 865003, 757810, 810739, 727082]
2450G27082j76913K17720R8026J75297j64953m2354O0030j04506N7670K61306
2440A108405o4937j76673J4822L08995J20371k4415P4127j07539j6188J73261
2430A410229K400J71832K91447o8290L7331j0178K9313l2291j10936q8696K46318
2419A878479j2896n2675j04252M75583o7535l21516J84245j15897Q1811r3992
2409A851355m31397j41588j69539J82800M87614J7219K21848N0963J12353Q0844
2399B262472m6213J33497J92003J2927q2215m1664j54925l5783r383r6847j64067
2388A969802J02847J77569M3428k43825J83321K88573M22489J72957l1464K76659
2378C362356O7556J18719j03371j23478J82386J12593j7693O1291J74301N2374
$$ y = [727082, 550169, 767889, 865915, 1041212, 876259, 833905, 893935, 789429, 847099, 1108405, 1043468, 866795, 881617, 1190612, 1310983, 1286568, 1360695, 1253156, 1236968, 1410229, 1412629, 1584461, 1875908, 1807618, 1844949, 1834771, 1864084, 1831793, 1720857, 1632161, 1878479, 1865583, 1812908, 1708656, 2184239, 2116704, 1795188, 1979433, 1863536, 1945347, 1851355, 1419958, 1278370, 1108831, 1291631, 1779245, 1796464, 2018312, 2069275, 2181628, 2262472, 2216259, 2349756, 2541759, 2554686, 2472471, 2430807, 2275882, 2240099, 2230716, 2133869, 1969802, 2072649, 2250218, 2293646, 2049821, 2233142, 2521715, 2944204, 3117161, 3085697, 3362356, 3429912, 3548631, 3445260, 3321782, 3504168, 3616761, 3599068, 3660359, 3834660, 3887034]
2368C887034j44342P9522J32087N1192K48921Q7565K7141K24816K88950j6878
2358D866008J74540L14002K42329l0145n6463o4881n3105K23838J17166m441J61847
2347E890695K58898M91840M01643J09190K06980L80315N55271M47861P18265R58278
2337A0419236P09497J010516J447434J410849J974132K555749K650152K474771
2329B4652336K174483J542237J557475J204353J721104K778709M470259O552346
2321D6653302J0099734J5338273K7183877M6917969O1214719N7414474M3976498
2314C08798846J7074772k154101r716407l3433343m3843423m0902984l5989572
2307A59833788l1117855k7017641k0084555j4188988r285507n874193m737509
$$ y = [3887034, 3742692, 3822214, 3954301, 4005493, 4254414, 4341979, 4369120, 4593936, 4882886, 4866008, 5040548, 5354550, 5596879, 5566734, 5510271, 5445390, 5392285, 5616123, 5733289, 5728848, 5890695, 6149593, 6641433, 7043076, 7152266, 7359246, 7739561, 8294832, 8742693, 9460958, 10419236, 11128733, 12139249, 13586683, 14997532, 16971664, 19527413, 22177565, 24652336, 26826819, 28369056, 29926531, 31130884, 32851988, 35630697, 40100956, 46653302, 56753036, 72091309, 99275186, 146193155, 207407874, 264822348, 308798846, 325873618, 323719517, 314003110, 280569767, 236726344, 195823360, 159833788, 128715933, 101698292, 81613737, 67424749, 58139242, 52265049, 47527540]
2300D7527540m523031m119324l630842l082826l192838l021196k757430j982087
2292B1217966j477366j743200j386054o58114r42014q98359n78853k33871p21383
2283A2578752m61604k79167n20704o02355n48614L0905j44775n04431o10624n05178
2273H432205k80946j29824n13945m22835j66029k43782j69427q1414j19539j91284
2263F113180l05887m7130k00399j41433l00770j02408o1352k35707J25782q1931
2253D761945k35021m11996k8797l58527j83986J0692j7955k50739P6751J40711
2243C503078K67199J06783k40632j72251k50324P5011Q7241k49983j08543O5773
2233C083352j05751l00975k06470M163k29236k31020m452k0342K09375j0544P092
$$ y = [47527540, 43004509, 38885185, 35254343, 32171517, 28978679, 25957483, 23200053, 21217966, 19740600, 17997400, 16611346, 15953232, 15011218, 14112859, 13534006, 13300135, 12578752, 12117148, 11837981, 11317277, 10714922, 10166308, 10197213, 10052438, 9548007, 8937383, 8432205, 8151259, 8021435, 7507490, 7084655, 6918626, 6674844, 6505417, 6424003, 6304464, 6113180, 5807293, 5760163, 5559764, 5418331, 5117561, 5015153, 4953801, 4718094, 4843876, 4761945, 4526924, 4114928, 4086131, 3727604, 3543618, 3554310, 3536355, 3285616, 3362367, 3503078, 3770277, 3877060, 3636428, 3464177, 3213853, 3288864, 3376105, 3126122, 3017579, 3083352, 2977601, 2676626, 2470156, 2474319, 2245083, 2014063, 2009611, 1989269, 2198644, 2188100, 2195192]
2222B195192J20544k20042P4237j26873j85326j51921j27530M4133k08768M34441
2212A848087J36562m13240J4141P2419J7347j34781k48353J2963L75292j51443
2202A528994k49559L2963J8417l212N8043J34356J0488o338j4180M6037q4272
2191A471737O4958j17637k83737K57360J0948K6119k704K5954J11260p3189J12812
2180A603881O3955n418q135k36538P5813p4512j23216m933P7940r5816j39176
2169A133845k87201l17615M1691R1185N7023l7601M124J56634q3590j27976L3508
2158F64027L9847J71535K13959k10757p1552P4912o1042q3636l005m5650l7795
2147F50843K73797k9151j84918Q7449j99793J22216O3701q3681J1124r9640j22350
$$ y = [2195192, 2315736, 2095694, 2169931, 2043058, 1857732, 1705811, 1578281, 1622414, 1413646, 1848087, 1984649, 1571409, 1585550, 1657969, 1675316, 1540535, 1292182, 1305145, 1680437, 1528994, 1279435, 1312398, 1330815, 1327603, 1385646, 1520002, 1530490, 1524152, 1509972, 1556009, 1471737, 1536695, 1419058, 1135321, 1392681, 1403629, 1429748, 1427044, 1452998, 1564258, 1491069, 1603881, 1667836, 1662418, 1654283, 1417745, 1493558, 1419046, 1295830, 1290897, 1368837, 1273021, 1133845, 846644, 529029, 570720, 661905, 718928, 681327, 685451, 842085, 758495, 630519, 664027, 703874, 875409, 1089368, 878611, 807059, 881971, 820929, 737293, 734288, 688638, 650843, 924640, 895489, 710571, 798020, 598227, 720443, 784144, 700463, 711587, 611947, 489597]
2136D89597J59841K14962j23356N9605K53431l08226j24077P1503r935n5876o4572
2125E62897O8518J07919l9011l7805k00659M0343K26020k06241j50768J69545
2115E40758N3889k35349L29079k5992r5541l31017K07347K45164j14976N1702
2105F25064k852n5889k03749q0004L6448K09910K60747j73805j95433J0099j64076
2094B66460J59561J00537l64409J77260R5568N2751j3294p0480o4258j15019L2837
2083B57514k3159L62238K79599k84134k07570L8796L6450l3194J91942k6064j13791
2072D78627j35406R7417j79287k5003q3384J00862J96926O3062o7472L3405o0360
2061D19387l9059j6483Q2672L4617k1055J71781K61056J28750j95479m6145K2273
$$ y = [489597, 649438, 864400, 741044, 800649, 1054080, 745854, 621777, 693280, 683345, 627469, 562897, 631415, 739334, 700323, 662518, 461859, 502202, 728222, 521981, 371213, 540758, 594647, 359298, 688377, 662385, 566844, 235827, 443174, 688338, 573362, 625064, 622212, 566323, 362574, 282570, 319018, 528928, 789675, 615870, 420437, 430536, 266460, 426021, 526558, 162149, 339409, 434977, 487728, 474434, 403954, 339696, 224677, 257514, 234355, 596593, 876192, 592058, 384488, 423284, 459734, 426540, 618482, 592418, 478627, 343221, 440638, 261351, 236348, 152964, 253826, 450752, 513814, 446342, 479747, 419387, 380328, 363845, 446517, 481134, 460079, 631860, 892916, 1021666, 826187, 780042, 802315]
2050H02315O7197j0633K33025J90593N16493K24465k10174L12M66620k79693k33344
2039A767176l46362k02419k58780j27694P0490Q7751l53071k67950K55618r3737
2029E31022q3528Q4813J3241n6219J4415m4507J33957J75756m0612m54091j88559
2018H5688j26509M6981L69127L7562n1543j34387k1349J63505j45765n6506K35027
2007D01831J25136M2919j92912q5907Q673k23665K55341N2026l339m370j62767
1996B12966J24574j8510K12164m09591k22487J06621K00338K43604j01074j11692
1986B36913K2599k4278j5628J71811K65543j21170k77234O5650j78436k07017
1976f1247K82251K98575j09195p3088j27744j28110K16842J52660K50881k96618
$$ y = [802315, 869512, 858879, 1091904, 1282497, 1798990, 2023455, 1813281, 1813593, 2280213, 2000520, 1767176, 1420814, 1218395, 959615, 831921, 902411, 990162, 637091, 369141, 624759, 531022, 447494, 532307, 545548, 489329, 503744, 459237, 593194, 768950, 728338, 274247, 85688, -40821, 6160, 375287, 412849, 361306, 226919, 205570, 369075, 223310, 166804, 401831, 526967, 569886, 376974, 291067, 299740, 76075, 331416, 383442, 380103, 375733, 212966, 337540, 319030, 531194, 121603, -100884, 5737, 206075, 449679, 348605, 236913, 259512, 235234, 219606, 391417, 656960, 535790, 258556, 324206, 145770, -61247, 221004, 519579, 410384, 337296, 209552, 81442, 298284, 450944, 701825, 405207]
1966D05207l96676J14920J28276n2518k3747L8309o0111J64933m3718O9876j28342
1955B16409K04013j98564R8107J90287j11208J1312k95659M00472L4771L7926
1945E87866P6492m35698K7386k25259Q6843l0706J89776j14693J38151j44901
1935A55257O7841J10215r2845o2753K16117K9584r8371j77116J0466P9139l0107
1924B07427M9159j69188Q3194j00014L227j09748J13353N1160L4040R422K97953
1913D69985j2675k09655l8589J70311j16668K18555j46484K06164p5404M1929
1903E07469Q9346k20267j0797k74982J17984K61197j60881M8305M0063m5339l5618
1892C16480K17798N1319p5590J13865p5654p7538J15398j14446m6380R8576k48661
$$ y = [405207, 8531, 123451, 251727, 199209, 175462, 213771, 153660, 318593, 274875, 344751, 216409, 420422, 221858, 319965, 510252, 399044, 410356, 114697, 515169, 549940, 587866, 664358, 228660, 256046, 30787, 117630, 86924, 276700, 162007, 300158, 155257, 223098, 333313, 240468, 177715, 393832, 423416, 325045, 147929, 158395, 237534, 207427, 256586, 87398, 170592, 70578, 73805, -35943, 77410, 128570, 162610, 172032, 469985, 457310, 247655, 209066, 379377, 262709, 481264, 334780, 540944, 465540, 507469, 596815, 376548, 365751, 90769, 208753, 469950, 309069, 357374, 397437, 352098, 316480, 534278, 585597, 510007, 623872, 548218, 470680, 586078, 471632, 425252, 523828, 275167]
1881B75167j96539K9683Q3597K39065k13701j72926L25529j03146J11442J23484
1871E01655r3917m02277k3992K90782N3427o8998p0595R8753k41592k42305L6530
1860a62529M92584K09489l22531k620J22055k10306J15941m0253Q2152O2495k8951
1849C17526o6481j01362Q4036j43411m2615M1434J08874N455m7178L2970M2096
1838B31344m2921J46925j73672k35766m0714L80329J42281k383n0170j99575k39124
1827h3446J04563J50948M2881N8259j6316R391p9830K04536j54182P0166j9619
1816B87351j88785J00520n6472L3068k20475J15134J02376p2083k2237M0514J09218
1805B28129J61919o9638j530j55511j08694m7144J95672J38838q8545j66714k46242
$$ y = [275167, 78628, 108311, 191908, 430973, 217272, 44346, 369875, 266729, 378171, 501655, 407738, 5461, -18531, 272251, 325678, 256680, 186085, 284838, 43246, -199059, -162529, 330055, 539544, 217013, 214393, 336448, 126142, 242083, 201830, 283982, 346477, 317526, 251045, 149683, 233719, 90308, 47693, 89127, 198001, 203456, 156278, 189248, 231344, 188423, 335348, 161676, -74090, -114804, 265525, 407806, 405423, 355253, 155678, -83446, 21117, 172065, 214946, 273205, 256889, 266280, 186450, 390986, 236804, 306970, 287351, 98566, 199086, 142614, 175682, -44793, 70341, 172717, 100634, 78397, 118911, 228129, 390048, 320410, 318880, 163369, 54675, 7531, 203203, 342041, 253496, 86782, -159460]
1794a59460R2464K55955R9221p062k06325L99283K4733n21545O5149M5483Q2360
1783A70256K5758k8212K58143l1040m4283j89303J62856j733j23358l0110k75104
1772a06130J60505K26623m10178J94137K33835j52657K60281j1236r8999k26070
1762G0111K3331M271K66267J35354j47250j96599L55590j52381j35075O9431J54560
1751D47610l09677j12775J91940K4886J94099J40875l7769k48110k05132o4958
1741B0989R4200k49632K68287J61736K1323K3767j16643j10715j089R4939k30837
1730b3675J40154L1412J57719J46068k1275j83396k4236R1374k14903O188M7926
1719A53356j55586R6786J38957O6855O3709q5377k3283n0718m4716l12453J41617
$$ y = [-159460, -66996, 188959, 288180, 281118, 74793, 474076, 498809, -22736, 42413, 87896, 170256, 196014, 167802, 425945, 394905, 350622, 161319, 324175, 322442, 199084, 168974, -106130, 54375, 280998, -129180, 64957, 298792, 146135, 406416, 395180, 296181, 70111, 93442, 97713, 363980, 499334, 352084, 155485, 511075, 358694, 223619, 293050, 447610, 137933, 25158, 217098, 241984, 436083, 576958, 539189, 291079, 85947, 20989, 115189, -134443, 133844, 295580, 316903, 340670, 224027, 113312, 112223, 207162, -23675, 116479, 147891, 305610, 451678, 430403, 247007, 222771, 314145, 99242, 105430, 153356, -2230, 94556, 233513, 300368, 364077, 278700, 255417, 204699, 159983, -152470, -10853]
1708a0853n6427k6140K4284J24144J37425j63688J46816J579J75840p3986j86428
1697I2566N4174R6786q8669j28871O2409K05791j09071k30367p8376K02048L8420
1686A16840j10838J02910R5054J08780K9946q9267P0498j20468K9726j49119p4584
1675I478o0953j04001k5127P2434L6213n8256j2363k13702K16741O8233P3632
1664B329K54482N6740L952n1345k20164j6737o7419m3807J23614K63475N4856
1653C59976r9415q3707J06848j02028q5915J31989r2628j9186p5285J5220K492
1642E8361L2228J73654K30999l20510k48510n7408J51107J48209J84759J07017
1632D59906o4028k18348J31353q4670j03882N1589K8274K7125J61115J57869m47987
$$ y = [-10853, -67280, -93420, -69136, 55008, 192433, 28745, 175561, 177140, 352980, 278994, 92566, 146740, 243526, 154857, 25986, 88395, 294186, 185115, -45252, -123628, 78420, 116840, 6002, 108912, 203966, 312746, 342692, 253425, 323923, 203455, 233181, 84062, 9478, -51475, -155476, -180603, -108169, -71956, -130212, -142575, -356277, -139536, -71303, 2329, 256811, 313551, 317503, 266158, 45994, 29257, -38162, -81969, 41645, 305120, 359976, 260561, 176854, 283702, 181674, 95759, 227748, 135120, 115934, 40649, 55869, 58361, 90589, 264243, 495242, 174732, -73778, -131186, 19921, 168130, 352889, 459906, 395878, 177530, 308883, 224213, 120331, 171920, 200194, 227319, 388434, 546303, 98316]
1621I8316j01342J06083n3031K0834p1736n6619M17272o1149o1758j00234K4826
1610A61462k2241K63157k19333j70226n8377m8947J0017J58255m2611m9143J32862
1599A14875N1859J04349L8941j45643j34230m26j18285O6455K27598P6127J19362
1588D00982J02398k80722l4390k39948Q9483K5292j48387J42221J48244m7489
1578A57684o5317J17736J203J63167J38374K06009l44027j56841L1246K59749
1568E08983j01843k3040P7425m4138J51957j76284j88558n9497J92856N4162j08228
1557B83795j4817Q2161k95513k81947J47467K73058R1242J04990j32785k8397
1547B29254J77911n8740r6964j27704o5252Q4230K51590K30689j26002l87979
$$ y = [98316, -3026, 103057, 50026, 70860, -876, -57495, 359777, 298628, 236870, 136636, 161462, 139221, 402378, 183045, 12819, -45558, -94505, -84488, 73767, 31156, -17987, 114875, 166734, 271083, 310024, 164381, 30151, 29725, -88560, -22105, 205493, 281620, 400982, 503380, 222658, 188268, -51680, 37803, 63095, -85292, 56929, 205173, 157684, 92367, 210103, 211306, 374473, 512847, 718856, 374829, 217988, 249234, 508983, 407140, 384100, 461525, 417387, 569344, 393060, 204502, 145005, 337861, 392023, 283795, 268978, 351139, 55626, -226321, -78854, 194204, 285446, 390436, 257651, 229254, 407165, 348425, 251461, 123757, 58505, 142735, 394325, 625014, 499012, 111033]
1537A11033N1405O4321J21383K1840j40276l43844k3742L63249J2644m5486j74566
1526A7961N2278R7045P3161k46637L42154K03984L5200r1615j45808k11627k0126
1515A05970M1976n0362J26055J22240j04124j54328Q3796m1649l3240r5007K50406
1504B51733J41366k98956m4686J01913R8892j21600J07464K4495M5382o2552J31557
1493C75008l214j22678p5595j03188j22140O2968N4106P8662J7854j58506K06577
1482B09854Q2605J3274N839j48542r3585P0804O4369j28865m2464M1523Q9218
1471A64030l8872J8875J25032j37510p8558J71699n995l69534J26413N80936j47632
1460D08884j97516j34159j04764K35787o3206N2113k6335O7891m6115Q2137l9403
$$ y = [111033, 162438, 226759, 348142, 369982, 229706, -114138, -137880, 225369, 238013, 192527, 17961, 70239, 167284, 240445, -6192, 335962, 539946, 575146, 483531, 337723, 126096, 105970, 147946, 97584, 223639, 345879, 241755, 87427, 171223, 129574, 96334, 1327, 251733, 393099, 94143, 49457, 151370, 250262, 128662, 236126, 260621, 306003, 243451, 375008, 371794, 249116, 173521, 70333, -51807, 11161, 65267, 143929, 161783, 3277, 209854, 292459, 305733, 311572, 163030, 69445, 140249, 204618, 75753, 33289, 74812, 164030, 125158, 144033, 269065, 131555, 52997, 224696, 218701, -150833, -24420, 556516, 408884, 211368, 77209, -27555, 208232, 145026, 197139, 170804, 238695, 192580, 274717, 235314]
1449B35314J33214k28248k18397K97926p8489J30681j61144r3245J24725O6247
1439B08584K3874j27100Q1880k4503j47137N210J66160M5946o8691k0570P3073
1428B16726l29695L8199K02431n407j46911j98904J12680K02201n5716R4404J39500
1417B69508j60239j85501K45256P0998o4458j29664K5889j23513O8662K28548
1407B45486J6986r8717k84990K18119K42169O2774O212j95313j90958R6354j90256
1396g2134M6960J44815j16022j50759k28663L91611K34912J79229k50212p5937
1386A03800J46383k44720r2287J48471O1758j969J68063J38004J34646k04441
1376C57708n2271J43006l23964n348J17845k08885Q4933q284j29710j14446p7545
$$ y = [235314, 368528, 140280, -78117, 219809, 141320, 272001, 110857, 17612, 142337, 208584, 232458, 105358, 187238, 162735, 15598, 20808, 186968, 232914, 164223, 143653, 216726, -112969, -74770, 127661, 122254, -24657, -223561, -110881, 91320, 35604, 130008, 269508, 109269, -76232, 169024, 240022, 175564, 45900, 71789, -51724, 16938, 245486, 262472, 163755, -121235, 96884, 339053, 401827, 408039, 212726, 21768, 118122, -72134, -25174, 119641, 3619, -147140, -375803, 15808, 250720, 429949, 179737, 103800, 250183, 5463, -86824, 61647, 123405, 121436, 289499, 427503, 562149, 357708, 305437, 448443, 124479, 119131, 236976, 28091, 113024, 104740, -24970, -139416, -216961]
1365b16961n9126J55405P8562R8021N0805K26838k96205r3271J70248J26245J11458
1354C52019j06326j99878J85137J69971J890m5680m72322K13446K50810r8823
1344B50244n0179J78699R736j51974J56127l06055P0607l8179p1285J02359M4437
1333A94537J02857k24399K9562K57159j07896j42039J49612j65175j08465Q8418
1323G4171J96192j09551q5536m475k29457Q9822J43893J45627K06932j75507k29630
1312B2481m6629J41820M7048k24612J36802j49334J7957K35965p2857N4322L8338
1301B01301J9740l22426k7655J30513L46921P8354O0959r6236j28851k22939k63990
1290b24309J91256J59143J6260q5528J53699j36343J53095M7585k64615K17727
$$ y = [-216961, -276087, -120682, -42120, 55901, 106706, 333544, 37339, -55932, 114316, 240561, 352019, 245693, 45815, 230952, 400923, 402813, 357133, -115189, 98257, 349067, 250244, 200065, 378764, 388500, 236526, 392653, 86598, 157205, 119026, 47741, 150100, 194537, 297394, 72995, 102557, 359716, 251820, 109781, 259393, 94218, -14247, 74171, 270363, 160812, 75276, 70801, -158656, -68834, 75059, 220686, 427618, 252111, 22481, -24148, 117672, 164720, -59892, 76910, -72424, -54467, 181498, 108641, 162963, 201301, 221041, -101385, -129040, 1473, 348394, 426748, 487707, 391471, 262620, 39681, -224309, -33053, 126090, 142350, 56822, 210521, 74178, 227273, 274858, 10243, 227970]
1280B27970J50973J13668j59937m2374o1044l2518j7049J83256N922j57779J80654
1269C91742k95656L63084J70626l17222P289k6854j08133K1409N4400J77614k26219
1258B12080k62129Q7800J76956R3551j06318J0983j19743j77318J23666K01788
1248B41316p2574K9521j00347N992L35714k07971m5861K35769j93467k81824J58837
1237A05105P8510J08360J1907o4040K49687Q5398M9709p6043j68081n802l77144
1226b434j1601q5753r6725M24963J6165J06679r194l17807l03846K43887J14668
1215G9002q6159K85831j7427K06207J01084j31189j16269q4194j74532j10569
1205d8215R4801q5905J50746K39404o3128M3714k31969j0220K53865o693j8346
$$ y = [227970, 378943, 492611, 332674, 290300, 229256, 196738, 179689, 362945, 368867, 211088, 391742, 96086, 459170, 629796, 312574, 319863, 293009, 184876, 206285, 260685, 438299, 212080, -50049, 37751, 214707, 308258, 201940, 212923, 93180, -84138, 39528, 241316, 168742, 198263, 97916, 103908, 439622, 231651, 185790, 421559, 228092, -53732, 105105, 183615, 291975, 303882, 239842, 489529, 574927, 624636, 548593, 380512, 374710, -2434, -14035, -99788, -196513, 228450, 244615, 351294, 342100, 24293, -279553, -35666, 79002, -7157, 278674, 261247, 467454, 568538, 437349, 321080, 236886, 62354, -48215, 46586, -39319, 111427, 350831, 287703, 331417, 99448, 89228, 343093, 336400, 318054]
1194C18054j11850J03780j46440j48802J96825J77998r0229j37204k7569j31601
1184B962o4083J27322J30906J81992j50671k29569N1882J13116L3413L0526q7360
1173A40436J26418p1984Q7132p4661j19789J05991P8235o7972q3467R1195L7342
1162B48876m0806k69100M85225J55513j24587j27261p5829k09435P8769k1852
1152I9513j77874J53751j13355L01888J25274l36590l10092J96453K62748N7178
1142B58894P464l19546k50977L74486Q0367j93993K7611J53717o9582l690j81183
1131a16432J0010L69540O2940q1493j16336k07835J42429k11840j4245O0544J69829
1120F7111R541j1675J54165l8818L30835n7869r5311K0882j72246J07112K996
$$ y = [318054, 206204, 309984, 163544, 14742, 211567, 389565, 299336, 162132, 134563, 2962, -61121, 66201, 197107, 379099, 228428, -1141, 50741, 163857, 197270, 227796, 140436, 266854, 194870, 282002, 207341, 87552, 193543, 271778, 203806, 120339, 211534, 248876, 208070, -61030, 424195, 579708, 455121, 327860, 252031, 42596, 121365, 99513, -78361, 75390, -37965, 263923, 389197, 52607, -257485, -61032, 201716, 258894, 266358, -53188, -304165, 70321, 150688, -43305, -15694, 138023, 68441, 64751, -116432, -106422, 263118, 326058, 244565, 128229, -79606, 62823, -149017, -163262, -102718, 67111, 76652, 64977, 219142, 180324, 511159, 453290, 357979, 378861, 206615, 313727, 316723]
1109C16723j56967n3772k2797K09552J02802m8172Q8734j88858j33294J74922
1099B88873P6271l9358o7907J15544l9389J64435j84479p2297k77781j75661J79665
1088c2084l2683L1311K39797n6283P0030O8855k60967r3995m9698O4213j10087
1077a61591K70713J11175K2131q9678k37986L24407K7094Q0982r3342j72932J17827
1066A98800j33423K07960o4740n92M7327m0427Q685J80390J19906l68646J02187
1055B57427l01370M59668J30977j43813j30256j02218k07223N7818N0869J17480
1045A89359K14574m46608l4114P4950K7726j1730Q151M6579p7633J74078J25266
1034B90598J47985k00579o2912J62309k87889R3720J35805j66582k42950K42841
$$ y = [316723, 159756, 105984, 83187, 292739, 395541, 347369, 436103, 247245, 113951, 288873, 365144, 325786, 257879, 373423, 334034, 498469, 313990, 241693, -36088, -211749, -32084, -64767, -33456, 206341, 150058, 220088, 288943, 27976, -66019, -115717, -51504, -161591, 109122, 220297, 242428, 152750, -85236, 239171, 266265, 347247, 253905, 80973, 198800, 65377, 273337, 208597, 208005, 255332, 214905, 223590, 403980, 523886, 155240, 257427, -43943, 415725, 546702, 402889, 272633, 170415, -36808, 21010, 71879, 189359, 403933, -42675, -76789, -1839, 25887, 14157, 22308, 68887, -8746, 165332, 290598, 438583, 238004, 175092, 337401, 49512, 143232, 279037, 112455, -130495, 112346]
1024A12346J66436n428Q9542O68k71432j06825o3026L16661m2058l6022m5391
1013A15471j96855L45395Q4480j40358r5522k1375P5895N8252k45499m3779J53806
1002H9911J92672J05315p7739j41352J42379j62552Q7624L8029j4135P1754k60957
991G0949L03493K2741K5622j54346j32873l6312M46033o4347p1374k8663j82167
980A98756k92740J38984l3801n6157K14316P652R3799m6004m3369P1436J16434
969C69306M9354j97078l3121J74933L8549j78330o6373J9253l3795M5217p0257
958A17658j03352j20545K44246J27301J9666J61506M3071j21970j39672k86952
948e9043M0714K60912k01369J8552J67340n6560k82505P1844L6897K76802L55910
$$ y = [112346, 278782, 273354, 362896, 363564, 92132, -14693, -77719, 238942, 196884, 160862, 115471, -81384, 264011, 348491, 208133, 112611, 91236, 167131, 225383, -20116, -63895, 89911, 282583, 387898, 310159, 168807, 311186, 148634, 236258, 274287, 260152, 331906, 70949, 374442, 397183, 422805, 268459, 135586, 99274, 545307, 480960, 409586, 380923, 198756, -93984, 45000, 11199, -44958, 169358, 177010, 270809, 224805, 181436, 252872, 369306, 418660, 221582, 188461, 363394, 401943, 223613, 157240, 176493, 142698, 187915, 117658, 14306, -106239, 138007, 265308, 284974, 446480, 489551, 367581, 227909, -59043, -18329, 242583, 41214, 59766, 227106, 170546, -111959, -40115, -3218, 273584, 629494]
937F29494k12046J15873j14639l20563k2860J18480L7154q7209n9841J03465j79531
926G777P9692j53856K77671J00920j50872n0338R5743J25098N3762k70084l11066
915a95553r8422K00347q7745Q8886J62720K31832P4604m1067l02785Q1747L1993
904A46557l7947K52060k92031j65358j04414K00389N8385r728p1463L6053J53258
893A65761j36001l85J00063q6701K08814j06396J96775L855K0753J26744q3691
882D09591j54399k17044l9749J08273J77562L4811j19486j32561J57510r6716
872A27792k73892o7629Q214l6452J48743o7380L6958J07480j93282N7605L2631
861a19212M7344k0308Q3647P3992K27951J3144k16420n1068j21020j20894J07149
$$ y = [629494, 417448, 533321, 418682, 98119, 75259, 193739, 230893, 143684, 83843, 187308, 7777, 87469, -66387, 211284, 312204, 161332, 110994, 206737, 331835, 385597, 115513, -195553, -293975, -93628, -181373, -92487, 70233, 302065, 376669, 335602, 32817, 114564, 146557, 108610, 360670, 68639, -96719, -201133, -744, 57641, 47913, -23550, 12503, 165761, 29760, 29375, 129438, 42737, 251551, 145155, 341930, 345785, 366538, 493282, 409591, 255192, 38148, -1601, 106672, 284234, 319045, 199559, 66998, 224508, 127792, -146100, -213729, -205515, -241967, -93224, -160604, -123646, -16166, -209448, -151843, -119212, -71868, -92176, -8529, 65463, 293414, 306558, 90138, 39070, -81950, -202844, -95695]
850i5695M0691q3184K39168J47501r3340K7893j02108M4492p5574l14566j6153
839b80875o7860J06970P0605J38902j36474K8427K3902L00609L5563r2915L277
828A30131k58742J29296n2673J63843k66629K8946K64874N5985p4980N7569K7096
817B04716J68969j119l39997j69548J25344j53088K33165N0619J04122J4670R0306
806C28159J74133p3394m01820k04680J95943L1969L1933j52059J96559J39881
796B66624J61124j58812j84479k60314J53561L54978K7048j35795j81379j12116
786f9560J16718J14583L96547n9709l43318m257j1097r4588p9740R6846l8461
775B3964K75230M8884j57559J96031k12282j17902J09206l8763J72235o1621m7854
$$ y = [-95695, -55004, -138188, 100980, 248481, 155141, 183034, 80926, 125418, 49844, -264722, -280875, -348735, -241765, -171160, -32258, -168732, -140305, -116403, 184206, 219769, 126854, 130131, -128611, 685, -51988, 111855, -154774, -125828, 139046, 195031, 120051, 177620, 204716, 373685, 372566, 32569, -136979, -11635, -164723, 68442, 119061, 223183, 237853, 328159, 502292, 428898, 27078, -177602, 18341, 50310, 82243, -69816, 126743, 266624, 427748, 268936, 84457, -175857, -22296, 332682, 359730, 223935, 42556, -69560, 47158, 161741, 558288, 498579, 155261, 151004, 139907, 45319, -34421, 62425, 23964, 299194, 348078, 190519, 386550, 174268, 56366, 165572, 126809, 299044, 237423, 189569]
764A89569Q1870J61193l5034L0379J87943j48148j11579P4232k11529j30922j75610
753h7636L60067J09428J25428P3997j82651q4008k26926j49811O5358K5941j93137
742a63950p579J34397j27168j57626M98837j97667q0146j80008J62814K6130j3820
731a05786N1543q819K41343J39804k97224L4015K15619k9043j56606k16344Q1806
720d9692J35859l93000J1755N7359O3794Q3268Q2238L31775j68078k24862p2688
709a42272K0125k4999j34519J24051j87121M00823J32227l4603Q0972j05738j0961
698A17985J8106K8152O8474J40890k165p9149k96706R1428K69241j24775O5910
687B97391K82894k35952o6567j22784o848k6974N3403j35084N5053j3662R7000
$$ y = [189569, 271439, 432632, 397598, 427977, 615920, 467772, 356193, 430425, 218896, 87974, -87636, 272431, 381859, 507287, 581284, 398633, 314625, 87699, -62112, 3246, 29187, -163950, -171529, -37132, -164300, -321926, 176911, -20756, -100902, -280910, -118096, -91966, -105786, -54243, -63062, 178281, 318085, 20861, 54876, 270495, 241452, 84846, -131498, -49692, 86167, -306833, -295078, -237719, -173925, -90657, -8419, 323356, 155278, -69584, -142272, -122147, -147146, -281665, -157614, -344735, 56088, 188315, 153712, 234684, 128946, 117985, 136091, 164243, 232717, 373607, 371442, 292293, -4413, 87015, 356256, 231481, 297391, 580285, 344333, 277766, 154982, 148134, 121160, 174563, 39479, 94532, 80870, 177870]
676A77870j13077j072J15394K68137k4180m49868j14901J27173K5069j31959J99264
665G7850L20849J83319j83176j79105j06319K73478J1268j09526n1786j0920j96849
654B9083Q1496L12329O8493j01724k70100j10708k30982R55J75732J68694m9948
643G3320P9290k07887O0024J03994k05075J46995K5804r2733J6921j12448L37922
632B26127J86516j11880l95378J17383q8261q6937k6557J5908J58455M732L48389
621C48497K06399M0663m12107j76630K37770P0457M1510j39534j05550o9759O5703
610A07419k00228L68024Q7759o4858o1367j74622O2194j37788l2018m3550O1695
599b7340K39290k04036N4576J84473k74188l0125K46687Q7508o5737j08852L8377
$$ y = [177870, 64793, 63721, 179115, 447252, 423072, -26796, -141697, -14524, 10545, -121414, 77850, 398699, 582018, 398842, 219737, 113418, 386896, 398164, 288638, 236852, 225932, 29083, 110579, 422908, 491401, 389677, 119577, 8869, -222113, -221158, -45426, 123268, 73320, 152610, -55277, 4747, 108741, -96334, 50661, 76465, -16268, 653, -111795, 226127, 412643, 300763, -94615, 22768, -65493, -152430, -178987, -163079, -4624, 108, 348497, 554896, 595559, 183452, 6822, 244592, 315049, 356559, 217025, 111475, 41716, 107419, -92809, 275215, 362974, 298116, 236749, 62127, 124321, -13467, -45485, -89035, -27340, 211950, 7914, 62490, 246963, -27225, -57350, 189337, 276845, 211108, 102256, 140633]
588A40633M7269O219k6752R1085k18135R755K86795k38091j3259P0127J68688
577C24334k81301R3204L251j86354j09312N9441J55265j1105j75025J61012L6313
566F9723J58288k83870j50877R5761J64037J15049L1656J00411l52715J11535
556E8998J37791j28805n3670O9927N23902j41271m5459k32746j36773j14668j18687
545a81461Q5197J34650j84091J50062J04955l1319J4662p0634J87673Q386j51972
534F6108J69573J98410k24448K50902j2821j69139n8687J30614J46677k6630m27848
523D2711k41486J79179O496L70739J09912j28189p8667P9211l32330l16286j98065
512e06775L06665J54234p8678M21073R9413J68223j75180Q9600j84111m42439
$$ y = [140633, 187902, 194121, 167369, 258454, 40319, 50074, 336869, 98778, 85519, 155646, 324334, 43033, 136237, 139488, -46866, -156178, -96737, 58528, 47423, -127602, 33410, 69723, 228011, -55859, -206736, -110975, 53062, 168111, 199767, 300178, -52537, 58998, 196789, 67984, 14314, 84241, 608143, 466872, 421413, 188667, 51894, -62774, -181461, -96264, 38386, -145705, 4357, 109312, 77993, 92655, 22021, 209694, 218080, 66108, 235681, 434091, 209643, 460545, 447724, 278585, 219898, 350512, 497189, 470559, 42711, -198775, -19596, -13100, 357639, 467551, 339362, 260695, 339906, 7576, -308710, -506775, -200110, -45876, -124554, 296519, 395932, 564155, 388975, 478575, 294464, -147975]
502a47975J65096m3602L1140R3409p5557k8139l2106K18950p6714J28209k53170
491b0459j96065K37134L44155j71864j4712l0241k04271j2170k1214J35116J24371
480A69780K9417j58730R9242l2909O4960K0828R00J00666k20733j84407M10485
469B99499K24893k08031j52334J04897j90844K7355K28980j07152q7482J58445
459B98226R0638l03847O138j78303m9948J42709L1782L34222L9415m18509Q8391
448H0914Q7071n7636n1822j83959l8672R1110j03307J66309J02112J27618j17999
437A01739j93834k04528O1300J25316o603K6633O8229J6340K6568j13184O3630
426b8394R0368m9130J15270O5652o5206r3863L2221R5094P194j21435j12416j9
$$ y = [-147975, 17121, -26481, 4659, 98068, 22511, -5628, -37734, 181216, 104502, 232711, -20459, -216524, 20610, 364765, 192901, 178189, 147948, -56323, -68493, -89707, 45409, 169780, 199197, 40467, 139709, 106800, 171760, 192588, 193488, 294154, 73421, -110986, 299499, 524392, 316361, 164027, 268924, 78080, 105435, 334415, 227263, 139781, 298226, 388864, 85017, 91155, -87148, -137096, 5613, 37395, 371617, 411032, -7477, 80914, 167985, 110349, 58527, -125432, -164104, -72994, -176301, -9992, 92120, 219738, 101739, -92095, -296623, -235323, -110007, -116610, -89977, -21748, -5408, 21160, -92024, -28394, 61974, 12844, 128114, 193766, 128560, 34697, 66918, 162012, 169206, 47771, -64645, -64664]
414f4664K03892N3854J29798O6757r1947o0563j48137O4208r0358m9081J41515
403A55274j06476L791j26952q3058o6834J96527J89912j75723K043p0587j4k05182
391b87279R6315R8640O0631N1065K71810K02913j33222k65230j57967L94326J86726
380E18728j60955m30004o4550M9266K27792j4348m7353R0236n4812Q914o3669
369E9245R2695o7389k3381Q6314M9343j59087K6322L25606O9807j97685m82694
358b20904J41217J82174O6682j76445j0501K31110k9628j41292p5163L04833n1899
347B20184j00768J008N4604K7494j09292M909R0407j11302p0629n1822j34929
336a80136K28126N6950Q6091k47108K33920Q8598O890p3061j18480J05610J06903
$$ y = [-64664, 139228, 193082, 322880, 389637, 297690, 237127, 88990, 153198, 62840, 13759, 155274, 48798, 52589, -74363, -157421, -224255, -27728, 162184, -13539, -11496, -82083, -82097, -287279, -190964, -92324, -31693, 19372, 291182, 494095, 360873, 95643, -62324, 332002, 518728, 357773, -72231, -136781, -87515, 140277, 125929, 78576, 168812, 114000, 122914, 59245, 151940, 84551, 61170, 147484, 196827, 37740, 64062, 389668, 459475, 261790, -220904, -79687, 102487, 169169, -7276, -17777, 213333, 183705, 42413, -32750, 272083, 220184, 119416, 120424, 175028, 202522, 93230, 98139, 188546, 77244, 6615, -45207, -180136, 47990, 104940, 191031, -56077, 177843, 266441, 273331, 200270, 81790, 187400, 294303]
325B94303K6998J39777j21345J3030j24260j05663p4566J36145O3493O5511k29020
314H4403O8058j7971J42301j24794J04401O0078k30609Q9022k7691J25330j94292
303G8236q6378j71518K69238l03432J93108N3397J10J50244N7531r7846l33846
292a91156M3450J5618J65266L7665j35910J60846N0341j14847J4661K69148k09042
281A06040K7557j7908m5676j41846j08033M02884K98999m2011j59706p9823l1131
270B09346j52725J47187J27212j16058p1489j05549m3766K26169K852l33456k30819
259c41096K56030q1834R8961J86022j3664J78969m8103k2826L1373R9687P8184
248D21703n8949j81151J59731j55674l1357k29080R6526J08221j91336K34540
$$ y = [294303, 321301, 461078, 339733, 352763, 228503, 122840, 48274, 184419, 247912, 313423, 84403, 152461, 134490, 276791, 151997, 256398, 316476, 85867, 174889, 147198, 272528, 78236, -8142, -179660, 89578, -213854, -20746, 32651, 32761, 183005, 240536, 142690, -191156, -147706, -132088, 33178, 70843, -65067, 95779, 146120, 31273, 45934, 315082, 106040, 133597, 115689, 70013, -71833, -179866, 223018, 522017, 480006, 320300, 240477, 209346, 56621, 203808, 331020, 214962, 143473, 37924, -5842, 220327, 223179, -110277, -341096, -85066, -166900, -67939, 118083, 104419, 283388, 235285, 212459, 243832, 343519, 421703, 362754, 181603, 341334, 185660, 154303, -74777, 21749, 129970, -61366, 173174]
238A73174p0322J47407j12387K7490q6733j15385Q2053J2779K38354j98369J73713
227B71774j89k07209J27938j97328O3640k962q530j36556k0150L7558J04447j3641
215A8792j42872K0795J26515J30131q2322L71916R4286k14049k69993j5385L32005
204C69819j11535j0485j15389k25533K0862Q9377j29901j0911O6696J55425L8070
193A36495k50556k39604o267o63O4407K33797J77456k23885q5929n8224j42465
182c95438J73578J59147J4897J1589J49048k75810j07425K58305K79515O2657
172C30063j11178j46946K23372j55123K32247l9915k94723j55857J38471k5238
162d827j08461J53716k19364M2798O5306J84999j50421J17019K70499j35362k00567
$$ y = [173174, 102852, 250259, 137872, 165362, 78629, -36756, 45297, 58076, 296430, 98061, 271774, 271585, 64376, 192314, -5014, 58626, 55664, 47134, -89422, -109572, -72014, 32433, 18792, -124080, -103285, 23230, 153361, 71039, 442955, 537241, 323192, 53199, 37814, 369819, 258284, 247799, 132410, -93123, -72261, 17116, -112785, -123696, -57000, 98425, 136495, -114061, -353665, -359932, -360595, -296188, -62391, 115065, -108820, -194749, -252973, -395438, -221860, -62713, -47816, -36227, 112821, -162989, -270414, -12109, 267406, 330063, 218885, 71939, 295311, 140188, 372435, 332520, 37797, -118060, 20411, -4827, -113288, 40428, -178936, -136138, -70832, 114167, -36254, 80765, 351264, 215902, 15335]
151A5335j65388O2107K40066k05450o0262n8856R277J52013l2473Q8251J74622
140B19242j7356r3135P4282J8277n8198Q0684j7017k11850m0801N9141j6189j09722
128a12642R2767J4577q8680J84536K73233j78798j59153J0068J8496Q5269q4360
117E5313k13814L42717l0576q2965J32059p1424l7774j61741j55198K49375K0585
106D6557k9028j60625L89477J15613l4057P58q6062j9546j27269J25805p0701
95A50922k05885j05403R2431l65467J72745J48164q7265q9442l3664J7670J1149
84b94045L283Q859Q6864n2345J77009o3636J43812J38945j59371N3401N9105o517
72I5364j91305r3975p546J02580k204j36029n3658J91886l08445M8232J29489
$$ y = [15335, -150053, -87946, 152120, -53330, -113592, -172448, -163171, -11158, -43631, 44620, 219242, 201886, 108751, 183033, 201310, 143112, 223796, 206779, -5071, -45872, 13269, -2920, -112642, -19875, -5298, -93978, 90558, 363791, 184993, 25840, 35908, 54404, 139673, 55313, -158501, 184216, 153640, 70675, 202734, 131310, 93536, -68205, -223403, 25972, 46557, 17529, -143096, 246381, 361994, 327937, 328695, 242633, 223087, 95818, 221623, 150922, -54963, -160366, -67935, -433402, -260657, -112493, -199758, -289200, -322864, -305194, -294045, -290762, -281903, -195039, -247384, -70375, -134011, 9801, 148746, -10625, 42776, 101881, 95364, -95941, -189916, -197462, -94882, -97086, -233115, -286773, -94887, -403332, -355100, -225611]
61b25611K74708q7035k69127J70994J59996j35444m063J26254p1444O8925o6153
50e8000j27529l6283K19180n3531P0972j47674j966l9747R4142k00573j51554
39d32563Q3374J10581P9228l5501j58960q5454J18387J48477R3626p8657L2334
28a25128P8462M0040j57003k03761J83786j21433q2732K08603n2727J2746l2582
17b51729P7081J0569j26015J40644J4775l1839k02068j36643N3594r6964Q8559
6d60036J50992j7243R978k6600O471K02996
0a33442
$$ y = [-225611, 49097, -37938, -307065, -136071, 23925, -111519, -115582, 10672, -60772, 8153, -58000, -185529, -221812, -2632, -56163, 14809, -132865, -134831, -174578, -80436, -281009, -432563, -349189, -238608, -159380, -194881, -353841, -439295, -320908, -172431, -78805, -157462, -125128, -46666, -6626, -163629, -367390, -183604, -305037, -387769, -179166, -231893, -219147, -251729, -174648, -164079, -290094, -149450, -134675, -166514, -368582, -505225, -451631, -548595, -460036, -309044, -326287, -316309, -342909, -336438, -133442]
$$ Imaginary data points
##PAGE= N=2
##DATA TABLE= (X++(I..I)), XYDATA
16383a366995k81913l7093R1711J16821p868K34620o6722R4845Q8496j00711K5912
16372a208897j33534R1511M6620R456o4665J99931P1276j6173l0792K67401j33426
16361i01292J3672J00124k2633k63561J2098J6464J08289N5916P7159J53638Q0348
16350e69778n7593j64825J04529n6079k4081K18337J06396k56608J33391j272
16340e67583J66363N8791j3384k7775P929m7510m1885R8747K1575Q3843j41596
16329d02485j5356K19397J50939J1850L05497k08224L9355p383k26622p1214O8844
16318a35402R9995M2351j33842J83102J46364J2072J42501J21404m49498k1957
16308G090J87092r245p1289J14448R2584K25291R4740R7413J68124l25233k35728
$$ y = [-1366995, -1648908, -1686001, -1594290, -1477469, -1485337, -1250717, -1317439, -1222594, -1134098, -1234809, -1208897, -1342431, -1250920, -1204300, -1194844, -1259509, -1059578, -988302, -1004475, -1035267, -767866, -901292, -887620, -787496, -810129, -1073690, -1061592, -1045128, -936839, -880923, -803764, -650126, -569778, -627371, -792196, -687667, -743746, -767827, -549490, -443094, -699702, -566311, -567583, -401220, -342429, -355813, -383588, -375659, -423169, -465054, -366307, -344732, -260889, -402485, -417841, -198444, -47505, -35655, 269842, 61618, 100973, 93590, -133032, -204246, -135402, -35407, 6944, -126898, 56204, 202568, 214640, 357141, 478545, 29047, 7090, 194182, 184937, 113648, 228096, 320680, 545971, 640711, 738124, 906248, 581015, 345287]
16297C45287J13319j05329R1646Q4299P9979m4750J41198J74415j61845j2792
16287G05427P5860J09242k95979k6473q9364K60348j05332o4552K70076K6701
16277H65954j74911O579K55578j0029p3859j42680R2292K66242k27954J03135
16267I60347M7752k18028K43308J98149N1876J87989l78851M8654R8868J79414
16257A419478K2984q7911q7226j53367M7195k5015Q0567J39768Q9400j78161o0052
16246A207660J6107L07332j63254j08604K00640O0667j77138P1730J15279q951
16236A521468K78188j51477k7622q5437M108L2504K9089J93114M114k57214k6236
16225A514599K86815J39150k10999j65503J72680J16679q0995L12887j51861k3317
$$ y = [345287, 458606, 353277, 444923, 529222, 609201, 564451, 705649, 880064, 718219, 705427, 781287, 890529, 594550, 568077, 478713, 739061, 633729, 569177, 839253, 865954, 691043, 697622, 953200, 943171, 869312, 726632, 818924, 1085166, 857212, 960347, 1008099, 790071, 1033379, 1231528, 1283404, 1471393, 1092542, 1141196, 1240064, 1419478, 1442462, 1354551, 1267325, 1113958, 1161153, 1136138, 1216705, 1356473, 1445873, 1267712, 1207660, 1223767, 1531099, 1367845, 1259241, 1459881, 1520548, 1343410, 1415140, 1530419, 1521468, 1799656, 1648179, 1620557, 1535120, 1539228, 1571732, 1600821, 1793935, 1798049, 1540835, 1514599, 1801414, 1940564, 1729565, 1564062, 1736742, 1853421, 1772426, 2085313, 1933452, 1910135]
16215A910135j65424j28370p947J00601P4812j3956k5097N3730l8978o8019K4354
16204A715841q6910M68197j89894K3717N7573j72810K06721P8869l8021N4754
16194B118037j83775m2454k50864J34476l9703m6117K30483K5787J12750k04830
16184A853790r5203m2322K88542L7591J21213J15093n4931j15202q1684q4732
16174A942155J0544J70715R3876j6765M482K03786j79109k38284K22736j4270
16164B199866m8756J21392N7339N8728k23228P1153K51085j5489k62625j39532
16154B069933l9858r6418Q728K61194J32301j52506k8057N2375J13K44744k80521
16143B172028l27564L42323M7267l00441J99451K0483N2957J81374n9936O6829
$$ y = [1910135, 1744711, 1616341, 1608394, 1708995, 1783807, 1769851, 1744754, 1798484, 1759506, 1691487, 1715841, 1628931, 2097128, 1907234, 1930951, 1988524, 1815714, 2022435, 2101304, 2063283, 2118037, 1934262, 1891808, 1640944, 1775420, 1735717, 1689600, 1920083, 1945870, 2058620, 1853790, 1758587, 1716265, 2004807, 2042398, 2163611, 2278704, 2223773, 2108571, 2026887, 1942155, 1952699, 2123414, 2217290, 2200525, 2205007, 2408793, 2229684, 1991400, 2214136, 2199866, 2151110, 2272502, 2329841, 2388569, 2165341, 2236494, 2487579, 2472090, 2209465, 2069933, 2030075, 1933657, 1942385, 2203579, 2335880, 2183374, 2155317, 2207692, 2207805, 2452549, 2172028, 1844464, 2186787, 2234054, 1933613, 2133064, 2153547, 2206504, 2387878, 2327942, 2394771]
16133B394771J1129j9021l3486n1649P0299j3228O1613K24601k08144m22892j253
16122B012740J79210O3385j32988j58045J76391o8687J94620j1435j32292J71226
16112B294125K05746M35882l0737k17185q7299K8104j20628q2533m5388l1020
16102B349067Q2497Q413K9250j61305j21805J19910J82056o5415j0884J17715
16092B529499n6163q3116j09919J53535Q5220J04536q3622k11539n643J65554
16082B488342P0240k33555j00446K43695J33781J92925k20244j8646q7679n5715
16072B412698j38190R8256j24621j75738P9246J22334K13985n6599J09792n8598
16062B482565k2792j0980N4550o8922j08766M4689J81106L2496j06577j96882
$$ y = [2394771, 2405900, 2386879, 2353393, 2301744, 2372043, 2358815, 2420428, 2645029, 2436885, 2013993, 2012740, 2191950, 2255335, 2122347, 1964302, 2140693, 2072006, 2266626, 2255191, 2122899, 2294125, 2499871, 2935753, 2905016, 2687831, 2600532, 2628636, 2508008, 2425475, 2380087, 2349067, 2431564, 2439977, 2469227, 2307922, 2186117, 2306027, 2488083, 2422668, 2411784, 2529499, 2473336, 2390220, 2280301, 2433836, 2519056, 2623592, 2539970, 2328431, 2322788, 2488342, 2558582, 2325027, 2224581, 2468276, 2602057, 2794982, 2574738, 2556092, 2468413, 2412698, 2274508, 2372764, 2248143, 2072405, 2151651, 2273985, 2487970, 2431371, 2541163, 2482565, 2459773, 2448793, 2503343, 2434421, 2325655, 2370344, 2551450, 2583946, 2477369, 2280487]
16052B280487K89713L3235n1523N150M859K54574j34205o1814J99275j55321j84270
16041B480160J48903J28179j12709N6746m00256o6511K9242j10522Q6341Q6378
16031B325951J09990J91297O8405j58487o1882L2000M733j44533p9450j80883
16021B107141K56907k1664n3244n1969K24792J24761J32705j63832l89743R8740
16011B264594j00934K81525J04928j25747m3081J03419q1906j96008M8706K37741
16001B493237q1897P8251M5000q7712J22555k25158j19385K98705K06867n9605
15991B670858k48754J21902k66370p488J29129K24711p0568j88831K7267N1561
15981B443417j28908K11313J97541j03699j81299l92549J47591K45350J38075
$$ y = [2280487, 2570200, 2603435, 2551912, 2557062, 2561921, 2816495, 2682290, 2620476, 2819751, 2664430, 2480160, 2629063, 2757242, 2644533, 2701279, 2301023, 2234512, 2263754, 2153232, 2239573, 2325951, 2435941, 2627238, 2695643, 2537156, 2475274, 2507274, 2512007, 2367474, 2288024, 2107141, 2364048, 2342384, 2289140, 2237171, 2461963, 2586724, 2719429, 2555597, 2165854, 2264594, 2163660, 2445185, 2550113, 2424366, 2381285, 2484704, 2402798, 2206790, 2255496, 2493237, 2411340, 2489591, 2534591, 2446879, 2569434, 2344276, 2224891, 2523596, 2730463, 2670858, 2422104, 2544006, 2277636, 2270148, 2399277, 2623988, 2553420, 2364589, 2391856, 2443417, 2314509, 2525822, 2723363, 2619664, 2438365, 2045816, 2193407, 2438757, 2576832]
15972B576832K74031J34608k26726l24941R0156J51555j49440J23249N3665o0015
15962B642974l8980j39637P3685j5210l18545K94996L68645O5962k01694m35872
15952B296324O4077K95283k21877K9634J30894Q3018Q522k90644O6155R7910J46994
15941B706290R7271k94435K55631m1194q7862j93324k22847m3115l27092K07692
15931B057015L04746K45001j8596j49868K03464O7252P6838j74374k9844j46959
15921B434675r5442Q9141k0014J0056J70478q604j68825M1845J00159L9724J10325
15910B703518l9583J14179k1647r1627k19929K51693j88493l0945J17852j84204
15900B410814P048J35317K7430J94425J40189j89609o2036r8870O7612j05617
$$ y = [2576832, 2850863, 2985471, 2758745, 2433804, 2523960, 2675515, 2526075, 2649324, 2702989, 2642974, 2603994, 2464357, 2538042, 2522832, 2204287, 2499283, 2867928, 2933890, 2732196, 2296324, 2360401, 2655684, 2433807, 2463441, 2594335, 2677353, 2685875, 2395231, 2461386, 2559296, 2706290, 2803561, 2509126, 2764757, 2723563, 2635701, 2442377, 2219530, 2176415, 1849323, 2057015, 2361761, 2606762, 2588166, 2438298, 2641762, 2709014, 2785852, 2611478, 2581634, 2434675, 2339233, 2428374, 2408360, 2418416, 2588894, 2580290, 2411465, 2453310, 2553469, 2593193, 2703518, 2663935, 2778114, 2756467, 2664840, 2444911, 2696604, 2508111, 2477166, 2595018, 2410814, 2417862, 2553179, 2580609, 2775034, 2915223, 2725614, 2663578, 2564708, 2632320, 2526703]
15890B526703K19781o8244n1132j02415k62220O0587k0093P5051L23919N2632
15880B754569l7965o7791O7167k69810J6710j1100j46903j53347m4172l7242J23418
15869B193534K05670K41855j55865q3056k86475j96867M1646P3526K16388K03248
15859B453604J64542n5674K87770l86248J2706J51881j31512k29322k2171R0781
15849B336357J21827J86788j05934J6475m238J0722j76957Q7452k8184L66514
15839B810822k14224l93948J98823j595n996j67036Q4810K04586j8798R487J01889
15828B608820P8023j68088j86037L9120p5207M95733N4650j16198j68268j14411
15818B448137P7952k0989n9342p0636R4500k25024j94984J40253J58219K71189
$$ y = [2526703, 2746484, 2678240, 2627108, 2524693, 2262473, 2323060, 2302967, 2378018, 2701937, 2754569, 2716604, 2648813, 2715980, 2446170, 2462880, 2451780, 2304877, 2151530, 2107358, 2070116, 2193534, 2399204, 2641059, 2485194, 2402138, 2115663, 1918796, 1960442, 2033968, 2250356, 2453604, 2618146, 2562472, 2850242, 2463994, 2476700, 2628581, 2497069, 2267747, 2245576, 2336357, 2458184, 2644972, 2539038, 2555513, 2551275, 2561997, 2385040, 2472492, 2444308, 2810822, 2596598, 2202650, 2401473, 2399878, 2393882, 2226846, 2311656, 2516242, 2497444, 2506931, 2608820, 2686843, 2518755, 2332718, 2371838, 2296631, 2792364, 2847014, 2730816, 2562548, 2448137, 2526089, 2505100, 2445758, 2375122, 2469622, 2244598, 2049614, 2189867, 2348086, 2619275]
15808B619275j39905j49294J04195J52031q3508O6405j25293k58911L34835q6839
15798B432991q155L23195j53976O2557M56514k43233j73722J28540M7493l20533
15788B551671j27227k26102P4235K45492O5325k2810r0111K25992l0574q7948
15778B577943J16036j47250L7000K5490m8178M2799k53214m2563J0331P2289L43559
15767B734242J89156o0220k24234k24519N6621K84000o9813j19431k97789J62812
15757B430825J27366j53887J84555L6122r36J74232j67573L3627J8757j68414
15747B514674j6331N9182K33205j86235Q6179j05611L9393J39195r3141k29014
15737B441496j03228R8760K3332j63395Q5009L6196R7011K03926J16405l05462
$$ y = [2619275, 2479370, 2330076, 2434271, 2586302, 2502794, 2569199, 2443906, 2184995, 2519830, 2432991, 2424836, 2748031, 2594055, 2656612, 3113126, 2869893, 2696171, 2824711, 2872204, 2551671, 2424444, 2198342, 2272577, 2518069, 2583394, 2560584, 2470473, 2696465, 2665891, 2577943, 2693979, 2546729, 2583729, 2609219, 2561041, 2603840, 2350626, 2308063, 2318394, 2390683, 2734242, 2923398, 2863178, 2638944, 2414425, 2471046, 2755046, 2685233, 2565802, 2268013, 2430825, 2558191, 2404304, 2588859, 2624981, 2624045, 2798277, 2630704, 2664331, 2683088, 2514674, 2498343, 2557525, 2790730, 2604495, 2690674, 2585063, 2624456, 2763651, 2670510, 2441496, 2338268, 2437028, 2460360, 2296965, 2381974, 2418170, 2515181, 2719107, 2835512, 2530050]
15727B530050j22066k01749L329K01574Q3928J70244j15911K03458o7585J6365
15717B701637q4734J22820J32415j79965j21062M7725J0257j6171J38865k33561
15707B518226l7597K64898m9559J18009K08802k83340j07075j30370j34133K64983
15697B632844q2616m0477R5322O1558j99211k43644J65119K06047Q6359j30880
15687B550421J43204m3926j92196l3996K02441J63273L8551k05551r4610q3095
15677B444516R6506p6821j74745J3953J87532L8221R5714j66942O7799k1444L1383
15666B535672J29439j94326K6076p1196o0274n4341K5758n1883P0414k0538Q6628
15655B421429K83536J27310q0935K837q1112j73240J04828r5830r8043M77808
$$ y = [2530050, 2407984, 2206235, 2209564, 2411138, 2495066, 2665310, 2549399, 2752857, 2685272, 2701637, 2616903, 2739723, 2872138, 2692173, 2571111, 2618836, 2629093, 2612922, 2751787, 2518226, 2480629, 2745527, 2695968, 2813977, 3022779, 2739439, 2632364, 2501994, 2367861, 2632844, 2550228, 2509751, 2605073, 2666631, 2467420, 2223776, 2388895, 2594942, 2681301, 2550421, 2693625, 2649699, 2457503, 2423507, 2625948, 2789221, 2827772, 2622221, 2527611, 2444516, 2541022, 2464201, 2289456, 2303409, 2490941, 2529162, 2624876, 2457934, 2525733, 2504289, 2535672, 2665111, 2470785, 2496861, 2425665, 2365391, 2311050, 2336808, 2284925, 2355339, 2334801, 2421429, 2704965, 2832275, 2751340, 2754177, 2673065, 2499825, 2604653, 2508823, 2410780, 2888588]
15645B888588l9879j53929j79529o9402J19256J38363P4097r4476l9717m3624
15635B599748P5746O9922m03882p8M5790J21285J33169j33090K4417k71900p4156
15624B186971L02590k82795L65573L9781j14228L7824N6791J12061k47999J5826
$$ y = [2888588, 2848709, 2694780, 2515251, 2445849, 2565105, 2703468, 2777565, 2683089, 2643372, 2599748, 2675494, 2745416, 2341534, 2341456, 2387246, 2508531, 2641700, 2508610, 2533027, 2261127, 2186971, 2489561, 2206766, 2572339, 2612120, 2497892, 2535716, 2592507, 2704568, 2456569, 2472395]
$$ [...]
##END NTUPLES=NMR SPECTRUM
##END=
