##TITLE=1H_DE-80H_X3
 200.13MHz, d2o
 8 sc
 
 19ns.26.2.2025
##JCAMPDX= 6.0         $$ Bruker NMR JCAMP-DX V2.0
##DATA TYPE= NMR SPECTRUM
##DATA CLASS= NTUPLES
##ORIGIN= UXNMR, Bruker Analytische Messtechnik GmbH
##OWNER= pz
$$ XWIN-NMR		Version 3.5
$$ Fri Jul 10 11:53:52 2026 Russian Standard Time (UT+4h)  Yarkov@DPX200
##.OBSERVE FREQUENCY= 200.1313
##.OBSERVE NUCLEUS= ^1H
##.ACQUISITION MODE= SIMULTANEOUS
##.ACQUISITION SCHEME= undefined
##.AVERAGES= 8
##.DIGITISER RES= 18
##SPECTROMETER/DATA SYSTEM= spect
##.PULSE SEQUENCE= zg30
##.SOLVENT NAME= DMSO
##.SHIFT REFERENCE= (INTERNAL, DMSO, 0, 15.5023)
##AUDIT TRAIL= $$ (NUMBER, WHEN, WHO, WHERE, WHAT)
$$ ##TITLE= Audit trail, XWIN-NMR		Version 3.5
$$ ##JCAMPDX= 5.01
$$ ##ORIGIN= Bruker BioSpin GmbH
$$ ##OWNER= Yarkov
$$ C:/Bruker/XWIN-NMR/data/yarkov2/nmr/H-C/1/pdata/1/auditp.txt
$$ ##AUDIT TRAIL=  $$ (NUMBER, WHEN, WHO, WHERE, WHAT)
(   1,<2026-07-10 11:53:01.79 +0400>,<Yarkov>,<DPX200>,
      <created by zg, POWCHK disabled, PULCHK disabled
       configuration hash MD5:
       00 E9 B6 7A A2 85 ED C7 34 08 36 98 17 FE 4E 26
       data hash MD5: 16K
       6A 7D 00 87 B3 54 87 15 8A C8 10 58 D5 A7 64 BC>)
(   2,<2026-07-10 11:53:18.06 +0400>,<Yarkov>,<DPX200>,
      <Start of raw data processing
       efp BC_mod = 2 LB = 0.25 FT_mod = 6 PKNL = 1 PHC0 = -7253.948 PHC1 = 6.42196 SI = 16K 
       data hash MD5: 16K
       74 93 26 13 55 36 7B 80 08 AF BC 3C 08 4F 3D 89>)
$$ ##END=
$$ 
$$ hash MD5
$$ FA 8B 6A EE 6B 0E C0 3D 5F 9C 89 F3 B8 0B B0 1D
##$RELAX= 
##$RELAX= 
##$RELAX= 
##$RELAX= 
##$RELAX= 
##$RELAX= 
$$ Bruker specific parameters
$$ --------------------------
##$DU= <C:/Bruker/XWIN-NMR>
##$EXPNO= 1
##$NAME= <H-C>
##$PROCNO= 1
##$TYPE= <nmr>
##$USER= <yarkov2>
##$AMP= (0..31)
100 100 100 100 100 100 100 100 100 100 100 100 100 100 100 100 100 100 
100 100 100 100 100 100 100 100 100 100 100 100 100 100 
##$AQSEQ= 0
##$AQ_mod= 1
##$AUNM= <au_zg>
##$AUTOPOS= <>
##$BF1= 200.13
##$BF2= 200.13
##$BF3= 200.13
##$BF4= 200.13
##$BF5= 200.13
##$BF6= 200.13
##$BF7= 200.13
##$BF8= 200.13
##$BYTORDA= 1
##$CFDGTYP= 0
##$CFRGTYP= 5
##$CHEMSTR= <none>
##$CNST= (0..31)
1 1 145 1 1 1 1 1 1 1 1 1 1 1 1 1 1 1 1 1 1 1 1 1 1 1 1 1 1 1 1 1 
##$CPDPRG= <>
##$CPDPRG1= <>
##$CPDPRG2= <>
##$CPDPRG3= <>
##$CPDPRG4= <mlev>
##$CPDPRG5= <mlev>
##$CPDPRG6= <mlev>
##$CPDPRG7= <mlev>
##$CPDPRG8= <mlev>
##$CPDPRGB= <>
##$CPDPRGT= <>
##$D= (0..31)
0 0.7 0 0 0 0 0 0 0 0 0 0.03 0 0 0 0 0 0 0 0 0 0 0 0 0 0 0 0 0 0 0 0 
##$DATE= 1783669981
##$DBL= (0..7)
120 120 120 120 120 120 120 120 
##$DBP= (0..7)
150 150 150 150 150 150 150 150 
##$DBP07= 0
##$DBPNAM0= <>
##$DBPNAM1= <>
##$DBPNAM2= <>
##$DBPNAM3= <>
##$DBPNAM4= <>
##$DBPNAM5= <>
##$DBPNAM6= <>
##$DBPNAM7= <>
##$DBPOAL= (0..7)
0.5 0.5 0.5 0.5 0.5 0.5 0.5 0.5 
##$DBPOFFS= (0..7)
0 0 0 0 0 0 0 0 
##$DE= 6
##$DECBNUC= <off>
##$DECIM= 32
##$DECNUC= <off>
##$DECSTAT= 4
##$DIGMOD= 1
##$DIGTYP= 9
##$DL= (0..7)
0 120 120 120 120 120 120 120 
##$DP= (0..7)
$$ [...]
##$SUBNAM2= <"">
##$SUBNAM3= <"">
##$SUBNAM4= <"">
##$SUBNAM5= <"">
##$SUBNAM6= <"">
##$SUBNAM7= <"">
##$SUBNAM8= <"">
##$SUBNAM9= <"">
##$SW= 18.0517328524113
##$SWIBOX= (0..15)
0 0 2 0 0 0 0 0 0 0 0 0 0 0 0 0 
##$SW_h= 3612.71676300578
##$TD= 16384
##$TD0= 1
##$TE= 0
##$TE2= 300
##$TE3= 300
##$TEG= 300
##$TL= (0..7)
0 120 120 120 120 120 120 120 
##$TP= (0..7)
150 150 150 150 150 150 150 150 
##$TP07= 0
##$TPNAME0= <>
##$TPNAME1= <>
##$TPNAME2= <>
##$TPNAME3= <>
##$TPNAME4= <>
##$TPNAME5= <>
##$TPNAME6= <>
##$TPNAME7= <>
##$TPOAL= (0..7)
0.5 0.5 0.5 0.5 0.5 0.5 0.5 0.5 
##$TPOFFS= (0..7)
0 0 0 0 0 0 0 0 
##$TUNHIN= 0
##$TUNHOUT= 0
##$TUNXOUT= 0
##$USERA1= <user>
##$USERA2= <user>
##$USERA3= <user>
##$USERA4= <user>
##$USERA5= <user>
##$V9= 5
##$VALIST= <valist>
##$VCLIST= <CCCCCCCCCCCCCCC>
##$VD= 0
##$VDLIST= <DDDDDDDDDDDDDDD>
##$VPLIST= <PPPPPPPPPPPPPPP>
##$VTLIST= <TTTTTTTTTTTTTTT>
##$WBST= 1024
##$WBSW= 4
##$XGAIN= (0..3)
0 0 0 0 
##$XL= 0
##$YL= 0
##$YMAX_a= 429681
##$YMIN_a= -355088
##$ZGOPTNS= <>
##$ZL1= 120
##$ZL2= 120
##$ZL3= 120
##$ZL4= 120
##$ABSF1= 0
##$ABSF2= 0
##$ABSG= 0
##$ABSL= 0
##$ALPHA= 0
##$AQORDER= 0
##$ASSFAC= 0
##$ASSFACI= 0
##$ASSFACX= 0
##$ASSWID= 0
##$AUNMP= <proc_1d>
##$AZFE= 0.1
##$AZFW= 0.1
##$BCFW= 0
##$BC_mod= 2
##$BYTORDP= 0
##$COROFFS= 0
##$CY= -3
##$DATMOD= 1
##$DC= 0
##$DFILT= <>
##$DTYPP= 0
##$F1P= 0
##$F2P= 0
##$FCOR= 1
##$FTSIZE= 16384
##$FT_mod= 6
##$GAMMA= 0
##$GB= 0
##$INTBC= 1
##$INTSCL= 3.241238e-09
##$ISEN= 128
##$LB= 0.25
##$LEV0= 0
##$LPBIN= 0
##$MAXI= 10000
##$MC2= 0
##$MEAN= 0
##$ME_mod= 0
##$MI= 1.114404
##$NCOEF= 0
##$NC_proc= -5
##$NLEV= 6
##$NOISF1= 3.799351
##$NOISF2= 2.8
##$NSP= 0
##$NTH_PI= 0
##$NZP= 0
##$OFFSET= 15.50229
##$PC= 1
##$PHC0= -7253.948
##$PHC1= 6.42196
##$PH_mod= 1
##$PKNL= yes
##$PPARMOD= 0
##$PSCAL= 0
##$PSIGN= 0
##$REVERSE= no
##$SF= 200.130003884303
##$SI= 16384
##$SIGF1= 3
##$SIGF2= 2
##$SINO= 0.751879
##$SIOLD= 32768
##$SREGLST= <19F.Aceton>
##$SSB= 0
##$STSI= 16384
##$STSR= 0
##$SW_p= 3612.71676300578
##$SYMM= 0
##$S_DEV= 0
##$TDeff= 16384
##$TDoff= 0
##$TI= <>
##$TILT= no
##$TM1= 0
##$TM2= 0
##$TOPLEV= 0
##$USERP1= <user>
##$USERP2= <user>
##$USERP3= <user>
##$USERP4= <user>
##$USERP5= <user>
##$WDW= 1
##$XDIM= 16384
##$YMAX_p= 410474265
##$YMIN_p= -448740
$$ End of Bruker specific parameters
$$ ---------------------------------
##NTUPLES= NMR SPECTRUM
##VAR_NAME=  FREQUENCY,     SPECTRUM/REAL,   SPECTRUM/IMAG
##SYMBOL=    X,             R,               I
##VAR_TYPE=  INDEPENDENT,   DEPENDENT,       DEPENDENT
##VAR_FORM=  AFFN,          ASDF,            ASDF
##VAR_DIM=   16384,         16384,           16384
##UNITS=     HZ,            ARBITRARY UNITS, ARBITRARY UNITS
##FACTOR=    0.220516191357247, 1,           1
##FIRST=     3102.47331229269, 0,            0
##LAST=      -510.243450713087, 0,           0
##MIN=       -510.243450713087, -448740,     0
##MAX=       3102.47331229269, 410474265,    0
$$ Real data points
##PAGE= N=1
##DATA TABLE= (X++(R..R)), XYDATA
$$ [...]
6195a17649O1548M6629k9014q8576q763M4706M44j438J3184L537j6539o8308n22
6182a60761J8449K7417J0590J9910n278m9123K8277N605q031k9579K6332O7810
6170d8382N4521n1854q1407m9659J9281L6303J6685J4758O7353k6402k8008k4214
6158a01025o1529j4077O6677J9013k5649l8588J9224N166J22q059J8217K7614
6146i2894K5520J936k5132j3480j6942l2264j23J0038J8190P5430n771q3398l5383
6133a74273J5974l913L0531L6369O74K9908j5394p9523o336K240J1859L6444L5270
6120h0170m1538l5577J3625P707N307M1100L06Q845L684k7285k2495k9023j0117
6107a65631P618M6723L6490o95M02l1727m3744J0826J9185L559K9219O8877q841
$$ y = [-117649, -56101, -9472, -38486, -127062, -135825, -91119, -90675, -92113, -78929, -75392, -91931, -160239, -160761, -142312, -114895, -104305, -84395, -89673, -138796, -110519, -104914, -112945, -142524, -116192, -48382, 6139, -45715, -127122, -176781, -157500, -121197, -104512, -89754, -22401, -48803, -76811, -101025, -162554, -176631, -109954, -90941, -116590, -155178, -135954, -130788, -130666, -138725, -120508, -92894, -67374, -65438, -90570, -104050, -120992, -153256, -153379, -143341, -125151, -49721, -55492, -138890, -174273, -158299, -162212, -131681, -95312, -94638, -64730, -80124, -159647, -165983, -163743, -151884, -115440, -80170, -121708, -157285, -143660, -135953, -130646, -89546, -89240, -80395, -76711, -103996, -126491, -155514, -165631, -158013, -111290, -74800, -75495, -75093, -106820, -150564, -139738, -120553, -116994, -87775, -18898, -27739]
6094b7739o4355m3895k4885k5999J0552M6803L3810J2226m8209j2774j3657j8227
6082a76349r188N8555N6386j5452L2430l5845m2562k6917L9282J1481J5243L8289
6070e4647L2382j8919m7179m9751J4175j0029k1843K4179J9965J1596k9723k5072
6058a54866j6849N9582K2560M9793k2745l2131o6535l3632K7503N4701O022j7169
6046a23766K6565M3911l4023k4944J6528j4966J7667O067P183K1198k8513k4580
6034a11673j7121k5615Q833M7017N3587k135m0836j6759r047O174O507K2273N8607
6021b0188q602m3295p4271n5047J812M4497O2379N093K5358m179l0661l6282j2153
6008a45539p895M7924L0846J5032r303l6242k9334Q49p589J9440L4046J3027N0739
$$ y = [-27739, -92094, -135989, -160874, -186873, -176321, -129518, -95708, -83482, -131691, -144465, -158122, -176349, -185537, -126982, -70596, -86048, -53618, -89463, -132025, -158942, -119660, -108179, -92936, -54647, -22265, -41184, -88363, -138114, -123939, -133968, -155811, -131632, -111667, -100071, -129794, -154866, -171715, -112133, -89573, -39780, -62525, -94656, -161191, -194823, -167320, -112619, -106597, -123766, -97201, -53290, -87313, -112257, -95729, -110695, -93028, -86961, -79778, -58580, -87093, -111673, -128794, -154409, -145576, -98559, -44972, -47107, -87943, -104702, -113749, -107575, -101068, -78795, -20188, -28790, -72085, -146356, -201403, -199591, -155094, -92715, -87622, -62264, -66443, -97104, -133386, -145539, -153434, -105510, -74664, -59632, -68935, -105177, -134511, -133662, -141251, -121811, -87765, -74738, -23999]
5995b3999J1767n6305n3968J2472K8170l8196J684N6989n27j3304o3954k3427
5983a62598J9560P4120P3645K7819o8422l6678n9408r43j3906n666M7919K9105
5971g5453K7743L0211l5674l4917M094L0497k3638R842L1141j3055m0108Q89L163
5958h5265Q313j0237J6793r400o384j3586m5293r923m410N6375M3403r739j2956
5945h2309j9123k9479j2891J160J2535J6737j0796Q769J1653K5779n3j6413N609
5932h8822Q369L564J6324N3662o7247q3038O565Q0471m940K3170J0771M7901m836
5919A914o6456k4376N167l7778K137l657J9480q024j1382k3316J8340L1878M7347
5906d8726J3818l4470m2098m7850j6546L8729L1365J5072k8311n196N167j7168
$$ y = [-23999, -12232, -68537, -122505, -110033, -81863, -120059, -118375, -61386, -61913, -75217, -139171, -162598, -143038, -68918, 4727, 32546, -35876, -72554, -131962, -132905, -146811, -152477, -104558, -75453, -47710, -17499, -53173, -88090, -83996, -53499, -77137, -67295, -36154, -49209, -89317, -88428, -85265, -76952, -87189, -70396, -79796, -86180, -99766, -145059, -154982, -159392, -103017, -59614, -69353, -82309, -101432, -130911, -143802, -142642, -130107, -113370, -124166, -115397, -103744, -77965, -78018, -94431, -88822, -80453, -76889, -60565, -6903, -74150, -157188, -150623, -70152, -75092, -51922, -41151, 6750, 1914, -64542, -88918, -83751, -121529, -119392, -123049, -103569, -111593, -122975, -146291, -127951, -96073, -48726, -34908, -69378, -111476, -159326, -175872, -137143, -105778, -90706, -119017, -124213, -119046, -136214]
5894a36214L0200L2147N8361k1897l8140k8290k973K2090J5023k3444o1345j3770
5882a68252N3655K8418K6506N026m9678k9681L7118J9316J4980l5417M6530j7072
5870f8551m8492k3082Q547Q7572J6987k1071j5004j4308k0102L0381M0963m389
5858c0549m1271J363J3019j0320r494n873J8811J771p458k470K8466M5836L7989
5845C9820j0395l5943P633J1302j5381k9911l3067L1428J9002k2243K3569J3649
5833e37J3059K2441m3577m9380K4730L8938J2021J1081P797j7714n3660K4910
5821i891K9086l4424J476L0853K634n6264O577L3544J3760j3884q876j0911k8768
5808d5088L441L0653L6961j6051l1726J2874j0132K0992N5827k2731k1904j0232
$$ y = [-136214, -106014, -73867, -15506, -37403, -75543, -103833, -106806, -84716, -69693, -93137, -154482, -168252, -114597, -86179, -59673, -54647, -104325, -134006, -96888, -77572, -62592, -98009, -51479, -68551, -117043, -140125, -131578, -44006, -27019, -48090, -63094, -77402, -97504, -67123, -26160, -30549, -71820, -70457, -57438, -67758, -77252, -83125, -64314, -62543, -70001, -72471, -44005, 1831, 39820, 29425, -6518, 1115, 12417, -2964, -32875, -65942, -34514, -15512, -37755, -14186, -537, 12522, 34963, -8614, -57994, -33264, 5674, 17695, 28776, 36573, 18859, -34801, -9891, 19195, -15229, -13753, 17100, 19734, -36530, -29953, 3591, 17351, 3467, -5409, -16320, -45088, -41647, -10994, 25967, 9916, -21810, -8936, -19068, 1924, 57751, 35020, 13116, 2884]
5796B884j1565j6156L5375M7395L5445l808J1496j0327J9258O862K1693L66j5399
5783A23519q7249l347P5933M6040J155k3129l4376J2484R5976P6886K7001M3282
5771C54175Q8008J7021K1944O9550O7032P7981J19056J06633J48100K26942M09949
5760A706391O91584J057091J434170J705611J476836Q05131J93042j98676p89920
5751H081260j176267j226544j212759j028681p16630o07527m35051l35799j82551
5742A159451j32750j39497j25821p0513q3572n5364n3371o0885l8687n0308m019
5731C44664k675n0442j8531L7848Q903k7372o1576l9333j1143K4946J110k4907
5719A81492l2725o726n3132j8817L1149L0358M391L3874L1150k0786n7070k5020
$$ y = [2884, -8681, -24837, 10538, 57933, 93378, 89570, 101066, 90739, 109997, 116859, 138552, 138918, 123519, 36270, 32923, 108856, 154896, 156051, 132922, 98546, 111030, 207006, 283892, 310893, 354175, 442183, 459204, 481148, 550698, 617730, 695711, 814767, 921400, 1069500, 1296442, 1706391, 2397975, 3455066, 4889236, 6594847, 8071683, 8876814, 9069856, 8871180, 8081260, 6904993, 5678449, 4465690, 3437009, 2720379, 2112852, 1677801, 1342002, 1159451, 1026701, 887204, 761383, 690870, 607298, 551934, 498563, 437678, 398991, 348683, 344664, 341989, 291547, 273016, 310864, 319767, 292395, 230819, 191486, 180343, 205289, 206399, 181492, 148767, 142041, 88909, 70092, 101241, 131599, 135990, 169864, 201014, 180228, 123158, 98138]
5707I8138L5090N53l0813j6387j0849M3527k8444j5879j1730J1763N3516J5605
5695A44090k2456j6629j2777k8377j6641k2794m8375M663M5407O5340J1832m6337
5683E6946k3367J8578J5350k7234J6166K164l4133k6146q200J2119L9983L8763
5671H0989L5969m0866l5720p081l570n594N308m313l4510r193J3615j2386P249
5658a0103j3751N915M6113K0299J592J5814j8940k7584l0798j6212L2755P2900
5646G8000L3496n3949j8503r946o9236K9394P4107K8976j3386m3200J5267Q963
5634E9983j1898M1712N1623m28k6132k7276k0668P007j5103l7368P3818L9191
5622A34461L5782J751K3416k6206k2836m9507M924L8770n098J4887O8432J3600
$$ y = [98138, 133228, 133781, 102968, 86581, 75732, 119259, 90815, 74936, 63206, 74969, 128485, 144090, 121634, 105005, 92228, 63851, 47210, 24416, -23959, -19296, 26111, 91451, 103283, 56946, 33579, 52157, 67507, 40273, 56439, 58603, 24470, -1676, -9876, 2243, 42226, 80989, 116958, 76092, 40372, 33291, 29721, 24127, 29435, 25122, -9388, -18581, -4966, -17352, -10103, -23854, -17939, 28174, 48473, 50065, 65879, 46939, 19355, -11443, -27655, 5100, 78000, 111496, 57547, 39044, 29098, -40138, -10744, 63363, 92339, 78953, 35753, 51020, 59983, 48085, 89797, 141420, 140992, 114860, 87584, 66916, 73923, 58820, 21452, 95270, 134461, 170243, 171994, 195410, 169204, 146368, 96861, 101785, 140555, 135457, 150344, 218776, 232376]
5610B32376m093l890P0771N2032Q3317P9608L0247J3869l9728j1335l726k432
5598D97016L842N859J0984L0040J7344P485K6300K0701j5704j9646k2645m4013
5586E17563l5651j5762o7167j8161m4863m713J1617k8223K042K4756k6967k2778
5574B91693J7591M9185L7706j1797p8162n8767J7834L1772N9555P1420p111l9146
5562C81773M622N2306o79N0209R9905M5785l5317j284M2739R4280P3110L4935
5550H42384N3021M8531P7867J17518J21659J46719Q0593J16369K16958L16586
5540B138205L96138M87461N91644O63570P74606Q71707Q90244Q12777O16045L27366
5530H569763P8373j42541j46673n1542N1741J54286K25764J99806J14582j38130
$$ y = [232376, 228283, 224393, 295164, 347196, 430513, 510121, 540368, 554237, 514509, 503174, 499448, 497016, 500858, 506717, 517701, 547741, 565085, 572570, 598870, 619571, 603867, 584221, 561576, 517563, 481912, 466150, 398983, 380822, 335959, 331246, 342863, 314640, 316682, 341438, 314471, 291693, 309284, 358469, 396175, 384378, 306216, 247449, 265283, 297055, 356610, 428030, 420919, 381773, 386395, 438701, 438022, 488231, 588136, 633921, 598604, 597320, 640059, 734339, 807449, 842384, 895405, 943936, 1021803, 1139321, 1260980, 1407699, 1488292, 1604661, 1821619, 2138205, 2534343, 3021804, 3613448, 4277018, 5051624, 5923331, 6813575, 7626352, 8242397, 8569763, 8648136, 8505595, 8358922, 8307380, 8359121, 8513407, 8739171, 8938977, 9053559, 8915429]
5520H915429l18146n55692o91749q04446q82311p96690o82171o18313n76653m28910
5510B560348l46906k76079j72939j24313j46203j70351j25325n7809r0780p0112
5500I79531o334R28n8653j00591r8797j9626l7251K1773k092m3901m8272l4712
5488E52003q791j122K4752j0538k5674l5234k9693k0829m3552R626l1567k5047
5476C54334K5009J4084l4129K7143O8415j4034m9958p944j9367j7247Q019j2150
5464C42175j5036k2846j8519K8079k3982K1786M7976M043o2266j7177k597J8086
5452B99722N7019m0727k4494J698N8000K0503m063K9369K7710m2449m6105N2227
5440C88410N3484m1694m0667l1760L628k0461L5969P3960K7566l9351k1613m7937
$$ y = [8915429, 8597283, 8041591, 7349842, 6545396, 5663085, 4866395, 4184224, 3565911, 2989258, 2560348, 2213442, 1937363, 1764424, 1640111, 1493908, 1323557, 1198232, 1140423, 1049643, 979531, 973197, 974125, 915472, 814881, 716084, 696458, 659207, 680980, 678888, 634987, 586715, 552003, 543212, 542090, 566842, 556304, 530630, 495396, 465703, 444874, 401322, 410948, 379381, 354334, 379343, 393427, 359298, 386441, 454856, 440822, 390864, 382920, 363553, 346306, 354325, 342175, 327139, 304293, 285774, 313853, 289871, 311657, 359633, 363676, 301410, 284233, 281636, 299722, 356741, 316014, 291520, 293218, 351218, 371721, 367658, 397027, 424737, 382288, 336183, 388410, 441894, 400200, 359533, 327773, 331401, 310940, 346909, 420869, 448435, 409084, 387471, 339534]
5428C39534q290K8970M5505K8920L875m0729n317q158K4554J67k1123n832q388
5415C73688k4319K9971M9144M7779K232K314j8416j455K7352O9041R061m0629
5403E25763k1984L7703J7658R592L3061L5317L1472n366m977p361q41O765O6748
5390G23550K5313k4820o0986L43K9923K1877k466M3606N2470j5713j3559J8438
5378G97976K6396J5035l6224L6637L5988j9465K5912P2841J7570K8511O4471L2684
5366A098332J2167L1619M4614L9173J1789j7002p60J01668O8148K6224L7701M6243
5354A499916M3845P6593Q2010k551j1357K2528N1273M0696J8791N3499N1709R393
5342A936345K7125N0780N5393Q8860R0565M9747n906J8768K5519J25116J14093
$$ y = [339534, 331244, 360214, 405719, 434639, 438514, 397785, 392468, 384310, 408864, 409031, 387908, 382076, 373688, 349369, 379340, 428484, 476263, 478495, 480809, 462393, 460938, 488290, 557331, 566392, 525763, 503779, 541482, 559140, 568732, 601793, 637110, 668582, 663216, 658239, 650878, 650037, 656802, 723550, 748863, 724043, 663057, 663400, 693323, 715200, 712734, 756340, 808810, 793097, 779538, 797976, 824372, 839407, 803183, 839820, 875808, 856343, 882255, 955096, 972666, 1001177, 1065648, 1098332, 1110499, 1142118, 1186732, 1225905, 1237694, 1220692, 1219932, 1321600, 1389748, 1415972, 1453673, 1499916, 1543761, 1620354, 1702364, 1699813, 1688456, 1710984, 1762257, 1802953, 1821744, 1875243, 1926952, 1936345, 1963470, 2014250, 2069643, 2158503, 2249068, 2298815, 2292909, 2311677, 2337196, 2462312, 2576405]
5331B576405J01125J00839R2443P3682J19645J14726J04889J32819J13604J33632
5321C663809J40210J82912J86712K51097K81628K68744K79998L03787L76608M29363
5311F364868M46480M81327N82930O98799Q15360R29316J173391J413761J623833
5302A4530065K019065K794327L995296O077247Q649505J1092416J2078075J0686319
5294G1922315P374126L325716k24086l576703n603858n467163l722370m86101
5286F3541876L362516O292949P056593N276535J608841k013235n440401q532533
5278G1153141r821308r769523r062526p821321o338756m904035l609533k757181
5270A7068958k159800j758839j468023j237030r21009q05409o95817n86129m56182
$$ y = [2576405, 2677530, 2778369, 2870812, 2944494, 3064139, 3178865, 3283754, 3416573, 3530177, 3663809, 3804019, 3986931, 4173643, 4424740, 4706368, 4975112, 5255110, 5558897, 5935505, 6364868, 6811348, 7292675, 7875605, 8574404, 9389764, 10319080, 11492471, 12906232, 14530065, 16549130, 19343457, 23338753, 29416000, 38065505, 49157921, 61235996, 71922315, 79296441, 82622157, 82398071, 78821368, 73217510, 67750347, 64027977, 63541876, 66904392, 73197341, 80253934, 85530469, 87139310, 85126075, 79685674, 71153141, 61331833, 51562310, 42499784, 34678463, 28339707, 23435672, 19826139, 17068958, 14909158, 13150319, 11682296, 10445266, 9524257, 8718848, 8023031, 7436902, 6980720]
5261F980720m30823m07258l03929k39032l20622l12516k22512k80604k71877k19020
5251C972527j43016j76751j66764j60885j26711j36588j19295p7169j08138n9543
5241B697667j24943j11285q2671n1513q4344r5234q2474m4836p1943l3032P498
5230A922890j05615j09102p6670O92o4022q2025m656k0287o4227q0166l8752q638
5218A269422J6443j4752j0207k0858n4310n534m3800k6866o1960o920K6933P911
5206A075502l5211K6609n061k7878k5874k0528k5725M3958r24r4827q3914p2129
5194G53998j2776M2990O3012R85r382k5523l3099r7930m5329K5685P0041k4001
5182G08671n8967j9229l4053l821K0002R48J8394P571L5972P57k8168o4158l0746
$$ y = [6980720, 6549897, 6142639, 5838710, 5599678, 5279056, 4966540, 4744028, 4463424, 4191547, 3972527, 3829511, 3652760, 3485996, 3325111, 3198400, 3061812, 2942517, 2865348, 2757210, 2697667, 2572724, 2461439, 2378768, 2327255, 2242911, 2147677, 2065203, 2020367, 1948424, 1915392, 1922890, 1817275, 1708173, 1631503, 1632195, 1568173, 1486148, 1481492, 1461205, 1396978, 1316812, 1278060, 1269422, 1285865, 1271113, 1260906, 1240048, 1185738, 1180204, 1136404, 1109538, 1047578, 1040658, 1067591, 1075502, 1040291, 1066900, 1061839, 1033961, 1008087, 987559, 961834, 1005792, 1004868, 910041, 826127, 753998, 741222, 784212, 847224, 848209, 838827, 813304, 780205, 682275, 636946, 662631, 732672, 708671, 649704, 630475, 596422, 592601, 612603, 613551, 631945, 639516, 675488, 676245, 648077, 583919, 553173]
5169E53173J0245K8792J6798k7941j4431K790p679l5648L622Q603O749L7655J4024
5156E96752l4613l4324o3099m6657R698K7290L4786N551l2059m4542l9616k3983
5144C55184K2467J5572K5831J9400k1576k5005l0063o686k2763n117j6756j0018
5132C00470K1197O045m2624k1918j8581J0523M2407R1576k2222n8777J5453m2226
5120B81323j7062j7663J8243O8409N588l5790k6403m2498l1798L8459N8259K8909
5108C27976l3870j2500r806p927o8213l1683M2336M3275J2509J6883L7710k1851
5096B94839n3466m4030J6875J9904j2581J2905q04k4742j854N789l2148k4558
5084A56129L3170L1862K3841n5630l9458k5753k1943M7661K9408k6413J9156L9355
$$ y = [553173, 563418, 592210, 609008, 581067, 566636, 569426, 561747, 526099, 529721, 538324, 545073, 582728, 596752, 562139, 527815, 464716, 418059, 427757, 455047, 489833, 495384, 463325, 418783, 379167, 355184, 377651, 393223, 419054, 438454, 416878, 391873, 361810, 355124, 332361, 327244, 310488, 300470, 321667, 327712, 285088, 263170, 244589, 255112, 297519, 389095, 366873, 308096, 323549, 281323, 264261, 246598, 264841, 333250, 338838, 303048, 276645, 234147, 202349, 240808, 299067, 327976, 294106, 281606, 271800, 263873, 195660, 163977, 206313, 249588, 262097, 278980, 316690, 294839, 241373, 197343, 214218, 234122, 221541, 234446, 233642, 208900, 207046, 212835, 180687, 156129, 189299, 221161, 245002, 189372, 149914, 124161, 102218, 149879, 179287, 152874, 172030, 211385]
5072B11385k0045n2179K0964M2387M8670K1767m2698l2720K8754j3738j7664j0854
5060A84029O6454P8641j6781r332J9997m3949n5347O8760N1059M0131J4439K7150
5048D25251l787m8230l0204j8692l07K0732p411k3661m1714j1860n470k8914L6362
5035B62095L4915l0414k7136J764p769q0955J9769J5371J4545j0774M5679K965
5023B40055k2272o129k9636J081j8696L6746J6395l0973l3367N931j2458L566
5011A50243M6848O7056j7916k3273l7717J79l0839L1266N4030p561K8807M3412
4999C04535j3998l4576j685R174J8858O6085P3709L129M1134J1096J4878L2288
4987E24627l480K8115N7268L5396k2374j2860j658J2311J7519L9531k882p4025
$$ y = [211385, 191340, 139161, 160125, 202512, 251182, 272949, 230251, 197531, 226285, 212547, 194883, 184029, 250483, 329124, 312343, 303011, 323008, 279059, 223712, 292472, 343531, 383662, 398101, 425251, 421464, 373234, 343030, 324338, 324031, 344763, 337352, 313691, 271977, 260117, 254647, 225733, 262095, 297010, 266596, 239460, 241224, 233455, 152500, 172269, 187640, 202185, 191411, 237090, 240055, 217783, 211654, 182018, 183099, 164403, 201149, 217544, 186571, 153204, 159135, 146677, 150243, 197091, 264147, 246231, 222958, 185241, 185420, 154581, 185847, 239877, 232316, 261123, 304535, 290537, 255961, 254276, 263450, 282308, 348393, 422102, 425231, 466365, 477461, 492339, 524627, 521147, 549262, 606530, 641926, 619552, 606692, 605034, 617345, 634864, 674395, 671513, 597488]
4975E97488o2930k3876m0174K3219N1952N0372L4561O4158l9087k7197p3328j08979
4963D46179n0925n5584M4073j8705l8938j5703l6732q303m9242o489N9584J2909
4951B82124J5701J7132q636j1281L0264o1735j7934J2329J7612l0153m7154J0912
4939B09181o955K5560K7119J2183J2592O422J0413P836l6243j6810J0164J8797
4927B80259O22j5242j0425K3820J243k7468k5445L0776N0621j5069l5565k2142
4915B35985m672J6479K3793k1798J9292J5572K1777L1180l8417l3819J1638k41
4903B76769L7449j4258o975J0319O03K2138j740R383L5833o996J079l9693k8809
4890B95102K4511M967J9443J2903L0009J7960m812l1662k2542J8062k4280n4565
$$ y = [597488, 534558, 510682, 470508, 493727, 545679, 596051, 630612, 694770, 655683, 628486, 555158, 446179, 395254, 339670, 383743, 365038, 326100, 310397, 273665, 265362, 216120, 209631, 269215, 282124, 297825, 314957, 306321, 295040, 325304, 263569, 245635, 257964, 275576, 245423, 198269, 209181, 202226, 227786, 254905, 267088, 279680, 286102, 296515, 304351, 268108, 251298, 261462, 280259, 280881, 265639, 255214, 279034, 280277, 252809, 227364, 258140, 308761, 293692, 258127, 235985, 231313, 247792, 271585, 249787, 269079, 284651, 306428, 337608, 299191, 265372, 277010, 276769, 314218, 299960, 292985, 303304, 303907, 326045, 324305, 333688, 369521, 362525, 363604, 323911, 295102, 319613, 324580, 344023, 356926, 386935, 404895, 400083, 368421, 345879, 363941, 339661, 285096]
4878B85096N7062L1481L843q099l5251j176l670R624L7241k6443j8314O109K851
4865C40354j018J6027K8415J6164N3377O889j3387Q411j1514j2785L016J8736
4853D52685N7207J04340K5868L3005N6895K880J0703j7442K6503j3460m9456n4187
4841F35541k2949k6640k4019J6304M1555Q5405K6306J3100K9401K9692L5956O2439
4829I02091J26507J23952Q4681P7576K27541M74937P08145J031498J219028J066710
4819F042666O56759J62547r4828n18128p47182p91565q33267p69898o27742m66059
4809B013303l33409j78699j27756j32123j46954p5703k0528j1631m0368p0293
4799H75839m6587j6400j6042k4038l2911k3512J7067k2789R257k2128K384J287
$$ y = [285096, 342158, 373639, 377482, 369383, 334132, 332956, 329286, 338910, 376151, 349708, 331394, 337503, 340354, 339336, 355363, 383778, 399942, 453319, 460208, 446821, 455232, 443718, 430933, 433949, 452685, 509892, 614232, 640100, 673105, 730000, 732880, 743583, 726141, 752644, 739184, 689728, 635541, 612592, 585952, 561933, 578237, 619792, 705197, 731503, 744603, 774004, 803696, 839652, 902091, 1028598, 1152550, 1237231, 1314807, 1542348, 2017285, 2725430, 3756928, 4975956, 6042666, 6699425, 6861972, 6767144, 6249016, 5501834, 4710269, 3877002, 3107104, 2479362, 2013303, 1679894, 1501195, 1373439, 1241316, 1094362, 1018659, 998131, 986500, 946132, 875839, 829252, 812852, 796810, 772772, 739861, 716349, 733416, 710627, 719884, 697756, 700140, 701427]
4787G01427j5547J5910n0898j3230K6779R416l9212J5371l2296L1643J0588J6681
4775F76632p453J3202r853l7489J197L2294K0014r885j5284l4798L8997n19J1849
4762F78904K1370n622j6142k655K7112o772k5639R156M132j049j6184K2236K1459
4749G10306J7939j508k9877L392J5514N2444K9906n99j4360k0504J0485K744r547
4736G66335K014L3190j0280k2822P668k0691n47K5910K3957K5053J0491k1946
4724H18332N1710j097m4521J3975Q058Q44j9893k2627P2506O551l9825L8284M9808
4711I32105j2202J1585o755m148j4468k4743L350M6668M0000M095J1993J0212
4699I97692J179K2910j2150N1469K1004j8481J039J5334k4495l4486P0650L4257
$$ y = [701427, 685880, 701790, 650892, 637662, 664441, 673857, 634645, 650016, 617720, 649363, 659951, 676632, 669179, 682381, 672528, 635039, 636236, 668530, 688544, 678659, 663375, 628577, 667574, 667055, 678904, 700274, 694652, 678510, 675855, 702967, 696195, 670556, 679712, 683844, 682795, 666611, 688847, 710306, 728245, 726737, 696860, 700252, 715766, 768210, 798116, 797517, 783157, 762653, 773138, 775882, 766335, 768349, 801539, 791259, 768437, 776105, 755414, 754867, 780777, 804734, 829787, 840278, 818332, 870042, 868945, 824424, 838399, 846457, 847301, 827408, 804781, 877287, 883838, 844013, 882297, 932105, 919903, 931488, 924733, 920585, 906117, 881374, 884724, 931392, 971392, 975487, 987480, 997692, 998871, 1021781, 1009631, 1061100, 1082104, 1063623, 1064662, 1079996, 1055501, 1021015, 1091665, 1125922]
4687A125922K514k476M134K4874O6270O854m5613O670j7429N0131R1915j2951
4675A300815J1347k0390j9064M153J904K7095K6685q854r800k7272K9630O2723
4663A378972M3493J6115O1695q553j8278l7174L4961J0738j1940K4364N6905M9590
4651A600888J1879L7771L0934K0274J3810J6380N1946k4194M9009J3319n1484
4640A770532K1487Q8469O5512O4477N934M6864J7377N3896Q4656K0321J23793
4629B363318K48308L18028L91432M07563K93911J32412m3797j04631k24726j98101
4619C583717j77883j48305j47534j11432m738R1423Q6191J41760J63842K16535
4609C693576J94553K30289K19282K17478J61671J57259K37601K86038L30027L56617
$$ y = [1125922, 1128436, 1125960, 1130094, 1154968, 1221238, 1228092, 1182479, 1189149, 1171720, 1221851, 1313766, 1300815, 1312162, 1291772, 1272708, 1276861, 1278765, 1305860, 1332545, 1323691, 1313891, 1286619, 1316249, 1378972, 1422465, 1438580, 1500275, 1491722, 1473444, 1436270, 1471231, 1481969, 1470029, 1494393, 1551298, 1600888, 1612767, 1650538, 1681472, 1701746, 1715556, 1731936, 1783882, 1759688, 1808697, 1822016, 1770532, 1792019, 1880488, 1946000, 2010477, 2016411, 2063275, 2080652, 2134548, 2219204, 2239525, 2363318, 2611626, 2929654, 3321086, 3728649, 4022560, 4154972, 4111175, 4006544, 3781818, 3583717, 3405834, 3257529, 3109995, 2998563, 2993825, 3085248, 3171439, 3313199, 3477041, 3693576, 3888129, 4118418, 4337700, 4555178, 4716849, 4874108, 5111709, 5397747, 5727774, 6084391]
4599F084391L26697K18422J29097J19468J50276J96190K36196K41700J66222R1315
4589G959974K0004j9342q2993j65983j05860n9515n8008r8899j14765j99592k03360
4578F871661k24643k19651j54980j71912j77469j73714r9637j19422j55160k00664
4568E174409j79058j41629j24011l7904K2092O326Q151J1085L7099L0286K0639
4557D827485M7974J01063J40735J45853K04312K70200K40760K43303K76654K99334
4547F797673L05895K80624K21744J77835J86481J82833K66182L14657L71801L65844
4537I471569K61356R7273P1604O700p4050j44070j54087j76072j49937j24666
4527I085620j19175j32357j16455o5560j53526p8765p3789p7241j04432o0906
$$ y = [6084391, 6411088, 6629510, 6758607, 6878075, 7028351, 7224541, 7460737, 7702437, 7868659, 7959974, 7979978, 7960636, 7877643, 7711660, 7605800, 7546285, 7488277, 7389378, 7274613, 7075021, 6871661, 6647018, 6427367, 6272387, 6100475, 5923006, 5749292, 5649655, 5530233, 5375073, 5174409, 4995351, 4853722, 4729711, 4691807, 4713899, 4720225, 4728376, 4739461, 4776560, 4806846, 4827485, 4875459, 4976522, 5117257, 5263110, 5467422, 5737622, 5978382, 6221685, 6498339, 6797673, 7103568, 7384192, 7605936, 7783771, 7970252, 8153085, 8419267, 8733924, 9105725, 9471569, 9732925, 9830198, 9901802, 9908502, 9834452, 9690382, 9536295, 9360223, 9210286, 9085620, 8966445, 8834088, 8717633, 8652073, 8498547, 8419782, 8345993, 8268752, 8164320, 8103414]
4517H103414k4213j8870N1028J57144J57935J53192J56453K34659K72345L11496
4507I554583M54178N67203P08791R08434J414775J967653K526197L010351L091963
4498B4204128K314464J402103J019459O34651K18241j94964j87183P31151K163945
4489C2305995L789128M711798L710503J515491M39651k82310j164557k410498
4481D2615201l913091m047519k874305j367385j55117L10378j26796n79518q65860
4472B8995988j225176j713520k426586k834798k588509k071026j547743j065868
4464A3522762p31519n92247m39557l29303k59236k73697k88473j97689q1940j02942
4454A0226159j15888j00737j28637q8966J641k3033j7419M2678l0523l7654n1068
$$ y = [8103414, 8079201, 8060331, 8111359, 8268503, 8426438, 8579630, 8736083, 8970742, 9243087, 9554583, 10008761, 10575964, 11284755, 12193189, 13607964, 15575617, 18101814, 21112165, 24204128, 26518592, 27920695, 28940154, 29574805, 29793046, 29598082, 29410899, 30142050, 32305995, 36095123, 40806921, 44517424, 46032915, 46472566, 46190256, 45025699, 42615201, 38702110, 34654591, 31780286, 30412901, 30257784, 30568162, 30441366, 29861848, 28995988, 27770812, 26057292, 23630706, 20795908, 18207399, 16136373, 14588630, 13522762, 12791243, 12198996, 11759439, 11430136, 11170900, 10897203, 10608730, 10411041, 10329101, 10226159, 10110271, 10009534, 9880897, 9791931, 9793572, 9770539, 9753120, 9795798, 9765275, 9727621, 9676553]
4443I676553k0600K553n1824Q079k426n5908j5623N5647j0563m8308j7273J4626
4431I534933J385J3188p38j7926j9919n2912q104K5971n741K2035k0034l5116
4419I437022k6977r197m4251K3540N0198K3363K0437l2363m7830o2817J3111J4272
4407I358508J7225k4649p595q399p4049l2551K2754j338j7408K1665J6076J0240
4395I280479n8012m8009J3338l6204k3782q637M6134j7186k8026k1301l4762l696
4383I060336j8859j3189j127m3445o6497r6800j1359j369J0809o229k7061o3114
4371H722096l8207J487k6776j07343m9284p3683m7289N654k8848m4556r9967j21799
4359H091485p7664o3918j7771J3781l4134p2255j16377q1333p2898J1187J9431
$$ y = [9676553, 9655953, 9658506, 9606682, 9614761, 9612335, 9556427, 9540804, 9596451, 9585888, 9537580, 9520307, 9534933, 9536318, 9549506, 9548768, 9530842, 9510923, 9458011, 9449907, 9475878, 9470137, 9492172, 9472138, 9437022, 9410045, 9400848, 9356597, 9380137, 9430335, 9453698, 9474135, 9441772, 9393942, 9331125, 9344236, 9358508, 9375733, 9351084, 9343489, 9335090, 9261041, 9228490, 9251244, 9249906, 9232498, 9254163, 9270239, 9280479, 9222467, 9174458, 9187796, 9151592, 9127810, 9119173, 9165307, 9148121, 9120095, 9098794, 9064032, 9060336, 9041477, 9028288, 9027161, 8983716, 8917219, 8820419, 8809060, 8807691, 8818500, 8812271, 8785210, 8722096, 8683889, 8685376, 8658600, 8551257, 8501973, 8428290, 8381001, 8386655, 8357807, 8313251, 8213284, 8091485, 8013821, 7949903, 7932132, 7945913, 7911779, 7839524, 7723147, 7641814, 7568916, 7580103, 7599534]
4348G599534p6137q3026l2744p0930o0434n4042m2300n4978o4711o8399l3368
4337F958465p7105q0307q4717l7314j18940p1116j9903o1050n7454n4717p4276
4326F221566p2238j4222J4554N293q6064j02719n8486r1658n1176k6543p1853
4315E666454o1214m1968n6561n4419r955j7603m6385k9221j7777m5933p5062p1865
4303E138491o3736l0849k9268l1754j7296j3176J4289j2066o6239n9777l4095
4292D794524m0562J3384M060O476n7424n4811k7841l8905J7909J2996N7980K28
4280D688014j7239O5623L291O2205O3931P7006L4842O1182J11605P6391R2266
4269E319117J19879J14459J23121J93652J78036J28729J02052J80926K36893K57874
$$ y = [7599534, 7523397, 7440371, 7407627, 7336697, 7276263, 7222221, 7179921, 7124943, 7060232, 6991833, 6958465, 6881360, 6801053, 6716336, 6679022, 6560082, 6488966, 6469063, 6408013, 6350559, 6295842, 6221566, 6149328, 6135106, 6149660, 6154953, 6068889, 5966170, 5907684, 5816026, 5764850, 5738307, 5666454, 5605240, 5563272, 5506711, 5452292, 5442337, 5424734, 5378349, 5349128, 5331351, 5285418, 5210356, 5138491, 5074755, 5043906, 5014638, 4982884, 4965588, 4952412, 4966701, 4954635, 4888396, 4828619, 4794524, 4753962, 4767346, 4771406, 4777882, 4720458, 4665647, 4637806, 4598901, 4616810, 4629806, 4687786, 4688014, 4670775, 4736398, 4739689, 4801894, 4865825, 4942831, 4977673, 5038855, 5150460, 5226851, 5319117, 5438996, 5553455, 5676576, 5870228, 6048264, 6176993, 6279045, 6459971, 6696864, 6954738]
4259F954738K33997L79423M53355M62224M95738N36879N36071M85593M27642L80504
4249A1346164L04575K25376K08577K46542L98952N44642P35201R05955J030232
4240A5946216J156342J116862R01561O53833L97602P1171j09908k08798k57647
4231A9667234j27017M2811M00312O03894Q94286J167994J099376R73775O23128
4222B5345793J64097k68044p17703r10291j044838j098440q72433o17893k90664
4213A9689584N3102L67267M69118L97414K42562j23556m54325q41338j078277
4204A8721551j247438j319107j207604j011478q42630n56622l58502k24423j92994
4195A1760753j71914k25212m20860m94459n56225o92342q03982p16079n82213
$$ y = [6954738, 7188735, 7568158, 8021513, 8483737, 8979475, 9516354, 10052425, 10538018, 10965660, 11346164, 11650739, 11876115, 12084692, 12331234, 12730186, 13274828, 14010029, 14915984, 15946216, 17102558, 18219420, 19120981, 19774814, 20172416, 20243587, 20133679, 19924881, 19667234, 19540217, 19583028, 19983340, 20587234, 21481520, 22649514, 23748890, 24722665, 25345793, 25509890, 25241846, 24524143, 23613852, 22569014, 21470574, 20598141, 19980248, 19689584, 19742686, 20109953, 20579071, 20976485, 21219047, 21095491, 20641166, 19799828, 18721551, 17474113, 16155006, 14947402, 13935924, 13093294, 12536672, 12178170, 11953747, 11760753, 11588839, 11363627, 10942767, 10448308, 9892083, 9199741, 8395759, 7679680, 7097467]
4186G097467n06957m84290m09210l11514k33382k53981j72839j65792j99317k35598
4176D124587k06550j92224j79201k11425j77251j74041j97942j60514j17161j03705
4166B404573q3546m9196r2580l3746p859m9357q598l3182n9985k7635l8597m5796
4154A874496k7861p5738p1278p2898k3543J976k4664q710j9792k9121j6853k696
4142A503318j1164J660j0724n1932m8601l4115J2492R012j9187K201P142k7139
4130A332963k0298m0726k545J3799k900l0667n6937k4391R492Q631k0701j6369
4118A149351l2870K1093K7242p951k2153J3649j5718l9934k5371J8412l8195m5186
4106A002369m83K386l1628j3200p06O5649l2081j8840J525J7205l0287K682Q301
$$ y = [7097467, 6590510, 6106220, 5697010, 5385496, 5152114, 4898133, 4725294, 4559502, 4360185, 4124587, 3918037, 3725813, 3546612, 3335187, 3157936, 2983895, 2785953, 2625439, 2508278, 2404573, 2321027, 2271831, 2179251, 2145505, 2137646, 2088289, 2079691, 2046509, 1986524, 1958889, 1920292, 1874496, 1846635, 1770897, 1699619, 1626721, 1603178, 1605154, 1580490, 1571780, 1551988, 1522867, 1506014, 1503318, 1492154, 1493814, 1483090, 1431158, 1382557, 1348442, 1360934, 1369946, 1350759, 1352960, 1360102, 1332963, 1312665, 1271939, 1269394, 1283193, 1280293, 1249626, 1192689, 1168298, 1177790, 1186421, 1165720, 1149351, 1116481, 1137574, 1164816, 1156865, 1134712, 1148361, 1132643, 1092709, 1067338, 1085750, 1047555, 1002369, 1001886, 1004272, 972644, 959444, 958738, 1024387, 992306, 973466, 974991, 992196, 961909, 964591, 972892]
4093I72892k4017m1285K579K1816N073j5749J6530K7769l5186j7110l5699r086
4081H68527K542n17q193l8527m8815J9420M2232L5783k293K1203j7025J3835k555
4068H85617l9179J4287K0547n8351j4356k975K1747j3694k6362L2696k8793j9598
4056G71586M3107M9119K6849n1888k108m60j1970j8883M760k3652k8201m6910
4044G11349J8934N341N4587P5404K0346l5584N419J2915j8629m361l873l1940
4032H09908q2672Q864J5293o713j5385l655K173M7J1111Q5526J0073l9814l9397
4019G55359n5679n8396J5956M6023j0969m4800r375j2082J4336L3732K6472j7782
4007F82795o1561k4212k3687J2192m625J059o259n3412l1707J5595K0798M9710
$$ y = [972892, 948875, 907590, 910169, 931985, 937058, 921309, 937839, 965608, 930422, 913312, 877613, 868527, 871069, 870552, 862359, 823832, 775017, 794437, 836669, 872452, 870159, 891362, 874337, 888172, 885617, 846438, 860725, 881272, 822921, 808565, 805590, 827337, 813643, 787281, 819977, 791184, 771586, 814693, 863812, 890661, 838773, 836665, 836205, 824235, 805352, 810112, 786460, 758259, 711349, 730283, 735624, 790211, 865615, 885961, 850377, 855796, 868711, 850082, 845721, 841848, 809908, 727236, 736100, 751393, 744680, 729295, 725640, 727813, 727860, 738971, 824497, 834570, 794756, 755359, 699680, 641284, 657240, 703263, 692294, 647494, 638119, 626037, 640373, 674105, 700577, 682795, 621234, 597022, 573335, 585527, 580902, 581961, 575702, 522290, 490583, 506178, 526976, 576686]
3995E76686K4602n8522j6650K5445L4125m2506J9322K0034m7302l6157L3921K3372
3983E56370j5940K11L2053l0308n0797J1939J1086J8673k2556N913L0042N327
3971E52013R144L0311n5329L2355r311K6186L645o019K4668r291Q108l5977k587
3958E67916K2412l332k4877o470O908K2796L6077M1934N7639N4211K4598Q0868
3946H80680J01055J35778J79666J94688J11319J6288l7534p0050j13066o0248
3936A338576j27871m9661j0291p1046j12598o7594J488j8685j2143O3279k0929
3925I12525l1850N5683Q2439M7929K9308J6464p066J2205J2505N1538J21386Q5503
3913A388569J49604J95778J52868O2699k6487p2976j01359q0865j55779j22818
$$ y = [576686, 601288, 542766, 526116, 551561, 585686, 543180, 562502, 582536, 535234, 499077, 532998, 556370, 540430, 540641, 572694, 542386, 491589, 503528, 514614, 533287, 510731, 516644, 546686, 552013, 561157, 591468, 536139, 568494, 559183, 585369, 589014, 582995, 607663, 598372, 606480, 570503, 567916, 590328, 586996, 562119, 555649, 562557, 585353, 621430, 663364, 721003, 775214, 799812, 880680, 981735, 1117513, 1297179, 1491867, 1603186, 1619474, 1581940, 1511890, 1398824, 1338576, 1210705, 1161044, 1150753, 1079707, 967109, 899515, 901003, 882318, 870175, 933454, 912525, 880675, 936358, 1018797, 1066726, 1096034, 1112498, 1105432, 1117637, 1130142, 1181680, 1303066, 1388569, 1538173, 1733951, 1886819, 1949518, 1923031, 1850055, 1748696, 1667831, 1512052, 1389234]
3903A389234j00835m7206p0318j10970o3191l6435q1j9017k8179k3535l6331L1224
3891H84360N5804J0627l9565j1370j4139M143n4739k3056k3494k8048l6410o5379
3879F58734m0866K7621N5018J1832n4935m4952j4101J1339j4870J92L0985O844
3867F32841l2122j6353k9030q419j1731q256N5943M9304m2194m2213m6984m097
3855D96689K6378L1764J6884J1630J0803p896N623j5543k828Q623L0525m969n341
3842F02342j4427K1754j9656j6941J6822M0691k0054j7285O7297Q230m0623k0214
3830F07936j9413p933N5877O7059l3513k3814R195K9858j855L6665L3036p563
3818G45535J0506J4623K216k181K6107K6745K5558M5589O0237n947o720O0880
$$ y = [1389234, 1288399, 1241193, 1170875, 1059905, 996714, 960279, 960198, 941181, 913002, 889467, 853136, 884360, 940164, 950791, 911226, 899856, 885717, 889860, 835121, 812065, 788571, 760523, 724113, 658734, 617868, 645489, 700507, 712339, 657404, 612452, 598351, 609690, 594820, 595012, 625997, 632841, 600719, 584366, 555336, 546917, 535186, 526930, 582873, 632177, 589983, 547770, 500786, 496689, 523067, 554831, 571715, 583345, 594148, 586252, 591875, 576332, 573504, 582127, 612652, 607683, 602342, 587915, 609669, 590013, 573072, 589894, 630585, 610531, 593246, 660543, 668773, 628150, 607936, 588523, 580590, 636467, 703526, 670013, 646199, 655394, 685252, 683397, 720062, 753098, 745535, 756041, 770664, 772880, 770699, 796806, 823551, 849109, 894698, 954935, 948988, 942268, 1003148]
3806A003148K0381j8515K7501R5044J21650M8978O5278P5709R3053J08361J96491
3795A837079K06733J84787J59931K26216K23865J98782K63264K02318J86327J47899
3785C837201R9932R1020M1345K6952n196k7466j1274n3295k4240J7954N0619j1248
3773D032304O558K5159O052q764p0463j26010j30519k08752j82830j71480j83206
3762B988049j73682j04808j57378j64639j10033n1628p3322p8440o1731l5455
3752A976933N260p5551m1558j5338R265K5078Q419K1621k2508l3260n3054K5635
3740A830942M738k9689J0867K6156L2518m7653j1552j0253k6827o6194n3266N996
3728A665783N2232k4671n5178o4589l577N0809O8394L5947K0458L8262J7368L393
$$ y = [1003148, 1023529, 1005014, 1032515, 1127559, 1249209, 1298187, 1363465, 1439174, 1532227, 1640588, 1837079, 2043812, 2228599, 2388530, 2614746, 2838611, 3037393, 3300657, 3502975, 3689302, 3837201, 3937133, 4028153, 4069498, 4096450, 4091254, 4063788, 4052514, 3999219, 3974979, 3992933, 4043552, 4032304, 4038862, 4064021, 4070073, 4061309, 3990846, 3864836, 3734317, 3525565, 3342735, 3171255, 2988049, 2814367, 2709559, 2552181, 2387542, 2277509, 2225881, 2152559, 2074119, 2012388, 1976933, 1982193, 1906642, 1865084, 1849746, 1859011, 1884089, 1892508, 1914129, 1891621, 1858361, 1805307, 1830942, 1835680, 1805991, 1816858, 1843014, 1875532, 1827879, 1816327, 1806074, 1779247, 1713053, 1659787, 1665783, 1718015, 1693344, 1638166, 1573577, 1570000, 1620809, 1689203, 1725150, 1745608, 1783870, 1801238, 1804631]
3716A804631K6238N6082L7785K691L4289o997k1367M9325O8710o497P291q841
3704B043340J2901P4161N6257M819K3864K2359J5361L4102Q5899R6640O1673j2180
3692B519196k7670l7151j4991M2784M1875L4050j3364m5939K936N5904M2011J7427
3680B617068L6519M5462k968L6986K9101M7077O6595P4559O8381Q6210Q1379P9711
3668C266080J6811M9409L5715L7672P1787J35266J13142M2588N9432L1713R3228
3657C952843J27609J20341J54034J54111J18688J16637J66321J87071K14290K59986
3647E571931K46848L04604K90934L32066L74258L38843M24920M73235N02429N21689
3637I381757O19223O83627P91819Q67027J029231J340803J619810K013774K507227
$$ y = [1804631, 1830869, 1886951, 1924736, 1927427, 1961716, 1954719, 1933352, 1982677, 2051387, 2044890, 2052181, 2043340, 2056241, 2130402, 2186659, 2191478, 2215342, 2237701, 2253062, 2287164, 2373063, 2469703, 2531376, 2519196, 2491526, 2454375, 2439384, 2482168, 2524043, 2558093, 2544729, 2498790, 2501726, 2557630, 2599641, 2617068, 2653587, 2699049, 2696081, 2733067, 2762168, 2809245, 2875840, 2950399, 3018780, 3104990, 3186369, 3266080, 3282891, 3332300, 3368015, 3405687, 3477474, 3612740, 3725882, 3768470, 3827902, 3859615, 3952843, 4080452, 4200793, 4354827, 4508938, 4627626, 4744263, 4910584, 5097655, 5311945, 5571931, 5818779, 6123383, 6414317, 6746383, 7120641, 7459484, 7884404, 8357639, 8860068, 9381757, 10000980, 10684607, 11476426, 12343453, 13372684, 14713487, 16333297, 18347071, 20854298]
3628B0854298L073982L650212M188129M608550M911847M905766M710176M241506
3620E5144466L428299K489983J581464P42984j11466o63521q97873q76375n66762
3611F0271199n7274M75205Q99207J161168J127319P02384P0364o27877j475429
3602F2546266k298811l162991l824510m189451m365978m307127m134660l835379
3594C2427359l409862k944559k505799k030677j662363j315187j124201r90387
3586A6444324q41574q06693p28155o08696n96744n92780o01496n36856n25007
3577A0606323n54712m42733m03558l37696l10559k22467j92723j94391j40063
3568G807421j13591r2845m2288J3488M1973O2460M1780M2430Q7380J86197J44837
$$ y = [20854298, 23928280, 27578492, 31766621, 36375171, 41287018, 46192784, 50902960, 55144466, 58572765, 61062748, 62644212, 63387196, 63275730, 62612209, 61714336, 60837961, 60271199, 60213925, 60689130, 61588337, 62749505, 63876824, 64579208, 64649572, 64021695, 62546266, 60247455, 57084464, 53259954, 49070503, 44704525, 40397398, 36262738, 32427359, 29017497, 26072938, 23567139, 21536462, 19874099, 18558912, 17434711, 16444324, 15602750, 14796057, 14067902, 13459206, 12862462, 12269682, 11668186, 11131330, 10606323, 10051611, 9608878, 9205320, 8867624, 8557065, 8334598, 8141875, 7947484, 7807421, 7693830, 7600985, 7558697, 7572185, 7614158, 7676618, 7718398, 7760828, 7848208, 8034405, 8179242]
3557H179242J27723J89359K16457K70375J97450J84934K27639J53765J79848J32550
3547A0059342R9942K2266K699n604q6155j06645q2269l1130M0458L5557P8169
3536A0026630J27442J33390K95522K67806K82152L28560K88247K18212J87181
3527A2155142J38356J11986P2735R7173J40667J23553J06827J38768J67203J72508
3517A3424918J86366K04582J64752J63661J21275R6696P5008J1515m133P5505
3507A4520145N6589J11693J50201J71793K37613K58555M15095M26553N06300N83114
3497A7437651O83200P25317P97045R61378J080556J251904J434470J632797J909038
3488B7913356K148742K384216K668094K894253L193949L452759L766084M075680
$$ y = [8179242, 8306965, 8496324, 8712781, 8983156, 9180606, 9365540, 9593179, 9746944, 9926792, 10059342, 10159284, 10181550, 10184249, 10178645, 10092490, 9985845, 9903576, 9872446, 9912904, 9948461, 10026630, 10154072, 10287462, 10582984, 10850790, 11132942, 11461502, 11749749, 11967961, 12155142, 12293498, 12405484, 12478219, 12575392, 12716059, 12839612, 12946439, 13085207, 13252410, 13424918, 13611284, 13815866, 13980618, 14144279, 14265554, 14362250, 14437258, 14448773, 14444640, 14520145, 14576734, 14688427, 14838628, 15010421, 15248034, 15506589, 15921684, 16348237, 16854537, 17437651, 18120851, 18846168, 19643213, 20604591, 21685147, 22937051, 24371521, 26004318, 27913356, 30062098, 32446314, 35114408, 38008661, 41202610, 44655369, 48421453, 52497133]
3480E2497133M342672M653107M992467N287875N602449N856869O097903O097623
3472I5428098N975698N811267N410839M947601M431996M060027L615099L205972
3464A32886597K886027K516844K151994J773974J168076N54637j62028r53300
3456A42822821j804612k680478l351724m001254m602820n080109n363316n572454
3448A10366054n613392n576099n552504n451420n135109m685793m158476l450218
3440G0743043k591226j501387m40951P26231J919763L085550M167673M966485
3432H1075181N504559N640964N444734M946014M161698L198713K161042J112273
3424A13245178J09726p03063j289336j671386j805182j741721j520229j234364
$$ y = [52497133, 56839805, 61492912, 66485379, 71773254, 77375703, 83232572, 89330475, 95428098, 101403796, 107215063, 112625902, 117573503, 122005499, 126065526, 129680625, 132886597, 135772624, 138289468, 140441462, 142215436, 143383512, 143938149, 143776121, 142822821, 141018209, 138337731, 134986007, 130984753, 126381933, 121301824, 115938508, 110366054, 104752662, 99176563, 93624059, 88172639, 83037530, 78351737, 74193261, 70743043, 68151817, 66650430, 66209479, 66935710, 68855473, 71941023, 76108696, 81075181, 86579740, 92220704, 97665438, 102611452, 106773150, 109971863, 112132905, 113245178, 113354904, 112651841, 111362505, 109691119, 107885937, 106144216, 104623987, 103389623]
3416A03389623q39538l60867n8648K2676m2631l38165q17967j406216k073792
3407I7474475k899616l758048m418800m963855n354344n578457n500545n316509
3399E9684301n066907m796466m451846m038722l701397l322940k992025k653664
3391B8660334k382583k114739j795251j579685j364916j246165j088618q95171
3383A6193206q19997o85086n03012m14464m20244l99533k32402j79140j29854
3374A2409474j5095O3270P4160R6992J54038K81852L77536N24776N38920O42113
3364A5148036P09023P01838P92711P47352O76259O67260N28932L91941J68737
3355B0532089L1123r6909k89256m39512n26760n33344n23693n50057o51094p00146
$$ y = [103389623, 102550085, 102189218, 102130570, 102153246, 102110615, 101772450, 100954483, 99548267, 97474475, 94574859, 90816811, 86398011, 81434156, 76079812, 70501355, 65000810, 59684301, 54617394, 49820928, 45369082, 41330360, 37628963, 34306023, 31313998, 28660334, 26277751, 24163012, 22367761, 20788076, 19423160, 18176995, 17088377, 16193206, 15373209, 14688123, 14185111, 13770647, 13350403, 12950870, 12718468, 12539328, 12409474, 12394379, 12457649, 12531809, 12628801, 12782839, 13064691, 13442227, 13967003, 14505923, 15148036, 15857059, 16558897, 17351608, 18098960, 18775219, 19442479, 19971411, 20363352, 20532089, 20563212, 20466303, 20177047, 19737535, 19210775, 18677431, 18153738, 17603681, 16952587, 16252441]
3345A6252441q02891p84974q19537q03840p61497o42170o02278m92911m28226
3336A0114117l38800j80744q8877n8550l2212r936M2629L2409P0241J41210K19039
3325I910526K23287K35905L29844M48440M72196O19162P41643R01634J017540
3316A4900177J218007J508539J869746K221847K683179L178357L883941M547004
3308C6010797N159580N735948O220400O426394O512428O496343O263077N689241
3300H4514208M823483L754677K333217O67594j014815k503406l962819n108527
3292H3503612o025000o626099o919031o862588o615275o145180n635598m984579
3284C3690262m287199l648241l149203k674868k172667j770554j537103j295634
$$ y = [16252441, 15449550, 14664576, 13845039, 13041199, 12279702, 11637532, 11035254, 10542343, 10114117, 9775317, 9594573, 9505696, 9447146, 9414934, 9404998, 9447627, 9480036, 9550277, 9691487, 9910526, 10133813, 10369718, 10699562, 11148002, 11620198, 12239360, 12981003, 13882637, 14900177, 16118184, 17626723, 19496469, 21718316, 24401495, 27579852, 31463793, 36010797, 41170377, 46906325, 53126725, 59553119, 66065547, 72561890, 78824967, 84514208, 89337691, 93092368, 95425585, 96093179, 95078364, 92574958, 88612139, 83503612, 77478612, 70852513, 63933482, 57070894, 50455619, 44310439, 38674841, 33690262, 29403063, 25754822, 22605619, 19930751, 17758084, 15987530, 14450427, 13154793]
3276A3154793j125069q84522p93901o92311n84479n04480m78028m11724l35910
3267G344369l01419l17625k62298k37095k37888k53515j76367r9819j57597j29774
3257E170972j12589j22340q5101o4725m1290l2630l2070m4148o5693L2258K2131
3246D624775k1610L1593P8739O1952M5624L517K1384K4551m6107l4001j31845
3235D658572j54592j69152j29062j08730j42779j26418j06720n4525r0421q8042
3225C488131m0778q1530j04834l6588p0823j01913m7926L8716M597n675o7318
3214B974059k4097L2786J9032j9173K8610L8113m4432q0216l761j5524K683J0934
3202B919014k230M000o491L8056O6318P1171L0311J574N4060N6811J6112N3295
$$ y = [13154793, 12029724, 11145202, 10351301, 9658990, 9074511, 8570031, 8092003, 7680279, 7344369, 7042950, 6725325, 6463027, 6225932, 5988044, 5734529, 5558162, 5458343, 5300746, 5170972, 5058383, 4936043, 4850942, 4786217, 4744927, 4712297, 4680227, 4636079, 4570386, 4602644, 4624775, 4603165, 4634758, 4713497, 4775449, 4821073, 4824590, 4845974, 4870525, 4824418, 4790417, 4658572, 4503980, 4334828, 4205766, 4097036, 3954257, 3827839, 3721119, 3666594, 3576173, 3488131, 3447353, 3365823, 3260989, 3224401, 3153578, 3051665, 3003739, 3042455, 3047052, 3041377, 2974059, 2949962, 2982748, 3001780, 2982607, 3011217, 3049330, 3004898, 2924682, 2920921, 2905397, 2908080, 2919014, 2916784, 2920784, 2914293, 2952349, 3018667, 3089838, 3120149, 3121723, 3175783, 3232594, 3248706, 3302001]
3190C302001P0680J6450J3625j1005Q5337J68575J21682Q2505O0622Q8868J02955
3179D102295J74832R1780M7095K67K1490N2336M4834N2266L0625L8401L2838J1665
3167D700724J14642R1182Q1785N7300M2440Q1785K7199L8950J36367J45826J02295
3156E620495J18270J93104K95966K73282K87263L68547L04937L25166L89136L55937
3146H532103L09557L15286K75695J92654J41333J31749J78549J62032K03515J49068
3136A0591541J09901M5547J02222P9660J18413J14938J27665J76307K02071K16814
3126A1885079K23250K82680L64622M29030N39957Q00511J128057J293476J173542
3117A8120204R17103N24770J87798j99541m54575n63957o69224o86663o12006
$$ y = [3302001, 3372681, 3389131, 3402756, 3391751, 3477088, 3645663, 3767345, 3849850, 3910472, 3999340, 4102295, 4277127, 4368907, 4416002, 4416269, 4437759, 4490095, 4534929, 4587195, 4617820, 4656221, 4689059, 4700724, 4815366, 4906548, 4988333, 5045633, 5088073, 5169858, 5197057, 5236007, 5372374, 5518200, 5620495, 5738765, 5931869, 6227835, 6501117, 6788380, 7156927, 7461864, 7787030, 8176166, 8532103, 8841660, 9156946, 9432641, 9625295, 9766628, 9898377, 10076926, 10238958, 10442473, 10591541, 10701442, 10746989, 10849211, 10928871, 11047284, 11162222, 11289887, 11466194, 11668265, 11885079, 12108329, 12391009, 12755631, 13184661, 13724618, 14525129, 15653186, 16946662, 18120204, 19037307, 19562077, 19749875, 19550334, 19095759, 18531802, 17862578, 17175915, 16563909]
3108A6563909n62152l21937j04960K0055J47921K04081K43857K81044L81445M02101
3098A7255364L88648M50558N31754O53507P51939R80496J098974J248251J395973
3089B4755464J553225J769924J974528K342422K726150L165958L670460M406447
3081D6364578N429352O610797P790054Q697593R205622R573171J0305396J2247845
3073A16224408J6301539K3395437L3397795M4158645N1694053N1459786M1803882
3066C78435545K5359330O679390j1550010k7765922l8973182m4329282m4754908
3059B43100961m1375632l5678619k9143575k2747626j7401833j3451227j0807231
3052G2495218r073969p733424o624207n637384m671102l769903l067589k530242
$$ y = [16563909, 16001757, 15679820, 15574860, 15594915, 15742836, 15946917, 16190774, 16471818, 16853263, 17255364, 17644012, 18094570, 18626324, 19279831, 20031770, 21012266, 22111240, 23359491, 24755464, 26308689, 28078613, 30053141, 32395563, 35121713, 38287671, 41958131, 46364578, 51793930, 58404727, 66194781, 74892374, 84097996, 93671167, 103976563, 116224408, 132525947, 155921384, 189319179, 233477824, 285171877, 336631663, 378435545, 403794875, 410474265, 398924255, 371158333, 332185151, 287855869, 243100961, 201725329, 166046710, 136903135, 114155509, 96753676, 83302449, 72495218, 63421249, 55687825, 49063618, 43426234, 38755132, 34985229, 31917640, 29387398]
3044B9387398k143682j879517j685640j417638j208072j080121j010534r48699
3036A8013495r80745r14684q45064q02754o98841o13169m64425m40508m59880
3027A1793425m02221l32313l39970l67213l56229l44312l29809k50398k03288
3018H867672k49443k59601k72998j59702j36660j87924j96203k13670k70358k84478
3008F636635l13522k84473k46864k23027j86873j74514k15352j98269j50184j19797
2998D523760j27886j26061j03945j06272j33260q9925m8979k2443k5452k4528
2988C715009k2854p148m6991l4534k4876j12521j46396j62533o7606M193o7845
2977C025898n3735l5080n5274l346l852j4924k4420q2154q9210j37305j49779
$$ y = [29387398, 27243716, 25364199, 23678559, 22260921, 21052849, 19972728, 18962194, 18013495, 17032750, 16118066, 15273002, 14470248, 13771407, 13158238, 12693813, 12253305, 11793425, 11391204, 11058891, 10718921, 10351708, 9995479, 9651167, 9321358, 9070960, 8867672, 8618229, 8358628, 8085630, 7925928, 7789268, 7601344, 7405141, 7191471, 6921113, 6636635, 6323113, 6038640, 5791776, 5568749, 5381876, 5207362, 4992010, 4793741, 4643557, 4523760, 4395874, 4269813, 4165868, 4059596, 3926336, 3836411, 3787432, 3764989, 3739537, 3715009, 3692155, 3685007, 3638016, 3603482, 3578606, 3466085, 3319689, 3157156, 3089550, 3093743, 3025898, 2972163, 2937083, 2881809, 2878463, 2874611, 2859687, 2835267, 2753113, 2663903, 2526598, 2376819]
2966B376819m5497k3016j8237m5744l3295n2577J273k0510n2740n4964J6549l1424
2954B016637q2277p2037L0363m6089k8513L0280j899J5977M1715L6836P037m9248
2942A898782k4206J860m4172o2657K3037K6372m9456m1471q7900m9804k4908J0255
2930A575732l9038k8379k2920k7922m9211n1757R182k6668m6110n0758n4158o6475
2918A121518o3884l1532j00151l4566M7666J2728j999K5747K1877K8683n3657
2907I72430q5998o2388l0400k3340K5627j1773o2865m0081K6965J7546M1341K2413
2895G89477j5653L566j1413p8341J9802O1799P740k9134J42k0141J8255k2269
2883G23830l0499P424p0136m5362k816L4283l6582j0097O97m4913o3262P241L6574
$$ y = [2376819, 2331322, 2308306, 2290069, 2244325, 2211030, 2158453, 2159726, 2139216, 2086476, 2031512, 2048061, 2016637, 1934360, 1862323, 1892686, 1846597, 1818084, 1848364, 1846465, 1862442, 1904157, 1940993, 1948030, 1898782, 1874576, 1876436, 1832264, 1769607, 1792644, 1819016, 1769560, 1728089, 1640189, 1590385, 1565477, 1575732, 1536694, 1508315, 1485395, 1457473, 1408262, 1356505, 1365687, 1339019, 1292909, 1242151, 1187993, 1121518, 1057634, 1026102, 925951, 891385, 939051, 951779, 949780, 975527, 997404, 1026087, 972430, 886432, 824044, 793644, 770304, 795931, 784158, 721293, 681212, 708177, 725723, 767064, 789477, 773824, 777390, 765977, 687636, 707438, 769237, 776977, 747843, 747985, 727844, 746099, 723830, 693331, 700755, 630619, 585257, 582441, 616724, 580142, 570045, 570742, 525829, 462567, 469808, 506382]
2870E06382N7154K9534l6445m3071k1581j7570L6906L1321L639m4173p0406m8719
2858C82971K1340L5669k2370k0689q429l3029N6849N3701J6326n94L5169k1153
2846D95761n1530P315L7042j4930j8199l3890k047N8230J9655K5065M0201J6504
2834E79177m0538k9666P67q921k9627m4696o9742r3889k3974J3508O1775L9390
2822C53564K4489L326k1614K3698l6421j3894K4011K948k5716K1351K0104K5774
2810D01620J0835L0878K5513k601j462J9565L6789P521L175J313k6640K7343L6225
2797E70074P4991N7368J8773j3528r211J13446R7950J06165J34412J96686J94002
2786A541128K57865K67464K20469J37558N6784m4006j77219k47704k01488j77815
$$ y = [506382, 563536, 593070, 556625, 513554, 491973, 474403, 511309, 542630, 546269, 502096, 431690, 382971, 404311, 439980, 417610, 396921, 388492, 355463, 412312, 466013, 482339, 481745, 516914, 495761, 444231, 451546, 488588, 473658, 455459, 421569, 419522, 477752, 497407, 522472, 562673, 579177, 538639, 508973, 509740, 500819, 471192, 426496, 356754, 262865, 238891, 252399, 314174, 353564, 378053, 381379, 359765, 383463, 347042, 333148, 357159, 360107, 334391, 355742, 375846, 401620, 412455, 443333, 468846, 466245, 464783, 484348, 521137, 528658, 531833, 533146, 506506, 533849, 570074, 645065, 702433, 721206, 707678, 698467, 811913, 909863, 1016028, 1150440, 1347126, 1541128, 1798993, 2066457, 2286926, 2424484, 2481268, 2437262, 2260043, 2012339, 1810851, 1633036]
2776A633036k31829k25440j61539p5068q8090m8899n2550q1148p8021j23555o2901
2765D03996k3578k3615M7748j2676j15668n7644L0108L7942O008K7060r119l872
2753C06690j7240n1733M1475M809m951l3286l8016j656N0400J3333J2967l5889
2741B46903j09391r790L5195P0467L6137m6140k837K3954j5581K2699O7709N9520
2729C78845k1782p2091q2435m6648P561O8525K3620j7329K7664j5944M7632m1178
2717B56440j8801l0258L5696k1437l7769N782N6357M9972l7996l7223K6238K5464
2705B72465K2706N3770M020k8413l2524l4031J0070j598j579m5728m1425J182
2693A78915J5284J4541k5385L1439l7730J3903J2065l446M6045K6583J8381M339
$$ y = [1633036, 1401207, 1175767, 1014228, 939160, 851070, 802171, 749621, 668473, 590452, 466897, 403996, 380418, 356803, 404551, 391875, 276207, 218563, 248671, 286613, 292621, 319681, 310562, 306690, 289450, 237717, 279192, 284001, 279050, 245764, 207748, 206092, 256492, 269825, 282792, 246903, 137512, 127722, 162917, 233384, 269521, 223381, 220544, 244498, 228917, 251616, 319325, 378845, 357063, 284972, 202537, 155889, 163450, 231975, 255595, 238266, 265930, 249986, 297618, 256440, 237639, 207381, 243077, 221640, 183871, 189653, 246010, 295982, 257986, 220763, 247001, 272465, 295171, 348941, 352961, 324548, 292024, 257993, 268063, 266465, 264886, 219158, 177733, 178915, 194199, 208740, 183355, 214794, 177064, 190967, 203032, 199586, 245631, 272214, 290595, 294934]
2681B94934o794J2224m6218m8827k978Q393k3195k5947j7621N9319L3505L5960
2669B72755j3634l4793m0783J0156M0713j11L2223l6797l1037k0552k507J0884
2657A86517k5802O5695P47m3555o2632l408K668Q78l156l606k158K9288j5696
2644A25780P92o559n21O9592J879k8173J8661K2468k0081q294n4343l2280L8876
2631A27797N1146k6181J5746K455l3254j6964L6682N5522M8169k5169q1013l9136
2619A15800J1035j9955K145k2722J1030P934k597J238k0423J3290M022k8389q5553
2606a3145j1103M2901K3816Q331j7294n0874J1313Q9141J9487k430L6085Q542
2594A44770o116o7369p636j3306K879N3784Q904k7917O300M0726L2063L8176K802
$$ y = [294934, 288140, 300364, 254146, 205319, 202341, 210734, 187539, 161592, 143971, 203290, 236795, 272755, 259121, 224328, 183545, 193701, 234414, 234303, 266526, 229729, 198692, 178140, 175633, 186517, 160715, 226410, 227157, 183602, 120970, 117562, 120230, 121108, 117952, 114346, 112188, 141476, 125780, 126572, 120013, 119492, 189084, 190963, 162790, 181451, 203919, 183838, 175544, 121201, 88921, 127797, 178943, 152762, 168508, 170963, 137709, 120745, 157427, 212949, 261118, 235949, 154936, 115800, 126835, 106880, 109025, 86303, 97333, 105267, 102670, 103908, 83485, 96775, 100797, 72408, -13145, -24248, 18653, 42469, 50800, 33506, -17368, -6055, 83086, 102573, 100143, 136228, 144770, 138654, 71285, 63649, 50343, 53222, 107006, 115910, 87993, 94293, 135019, 167082, 205258, 208060]
2581B08060L7723N5211K9367k140m5588j4416j4659p075n4352n0359K7339M0790
2569B09901k0866k1440q9325p3978j1471M9144K8369K5058j129N798j762l5884
2557F2415K0001O6392J4758m5383l0733j7186K8222L2955J6082k1031K5420j7656
2545A34256J8361J8195K6811j8002l8774O141j5713o937L6061P1336O419m2487
2533A95667q338n6849K2186M9101K437p1001n2252j9009M1041O7220M887j4026
2521A61064M104K8833K3361q276k5890k2701L4579K693l7611k3128j606J9042
2509A54464K0295j0061k0698p263J4723M728k6145k0151J7451o0099l0123L6181
2497G3302N0321L8930k3239l5170L883j6599r088Q216L4112J5411J4757J50l4025
$$ y = [208060, 245783, 300994, 330361, 328221, 282633, 268217, 253558, 246483, 192131, 141772, 169111, 209901, 189035, 167595, 78270, 4292, -7179, 41965, 70334, 95392, 94263, 100061, 98299, 62415, 82416, 148808, 163566, 118183, 87450, 70264, 98486, 131441, 147523, 126492, 151912, 134256, 152617, 170812, 197623, 179621, 140847, 146988, 131275, 124338, 160399, 231735, 238154, 195667, 187329, 130480, 152666, 201767, 204204, 133203, 80951, 61942, 102983, 170203, 175090, 161064, 165168, 194001, 217362, 209086, 183196, 160495, 195074, 197767, 160156, 137028, 135422, 154464, 174759, 164698, 144000, 136737, 151460, 156188, 130043, 109892, 127343, 67244, 37121, 73302, 123623, 162553, 139314, 104144, 108027, 91428, 82340, 90556, 124668, 140079, 154836, 154986, 120961]
2484A20961N734j512k209M9425N043m3532K1781K0365k2743l4725K9403J0619
2472A58610K000m5040K5157N1243l80l3307l1247Q889O4812Q1596n315m9335l7643
2459A90040n3090j0707Q890M4619K5641L0639K174m0681o2354j4041Q7121K3346
2447B31597j9201j0375J460n8156J4785r366k0224K2748K5315P857k2859J2567
2435A76148N398o5808n5253O482M2341Q5026P415k1269k0431l3134J1052L1093
2423A69060M6276j694k266N384k9135J431n343j787K3846J3261K2615R960R659
2410B61267q579n1532j754p526J4667J8039N7109L8552k8474p2364J2677J0159
2398B42241M7745J5392N4442j1582r1329m2246j2201k3563N4842M2041K4042M149
$$ y = [120961, 126695, 125183, 122974, 172399, 177442, 133910, 155691, 176056, 153313, 118588, 147991, 158610, 160610, 115570, 140727, 191970, 191590, 158283, 127036, 135925, 200737, 282333, 277018, 227683, 190040, 136950, 126243, 135133, 179752, 205393, 236032, 238206, 197525, 135171, 121130, 208251, 231597, 212396, 202021, 203481, 145325, 160110, 150744, 130520, 153268, 178583, 186440, 163581, 176148, 181546, 115738, 60485, 66967, 109308, 194334, 201749, 180480, 160049, 126915, 137967, 169060, 215336, 213642, 211376, 216760, 187625, 189056, 183713, 181926, 205772, 219033, 241648, 251608, 261267, 252688, 201156, 199402, 191876, 206543, 224582, 281691, 320243, 291769, 219405, 232082, 242241, 289986, 305378, 359820, 348238, 256909, 214663, 202462, 178899, 233741, 275782, 299824, 303973]
2386C03973K1533M6687J0625j5151K6689p265K0033J2927m4972l5927K9550L1493
2374D00195M7245L0871K1827M7778N819m8772n9597l3720n0850L1260O2409J3571
2362D68036L8049O2178J6009j8315j8622M5840M3650K1630k7619j7098l7466j5434
2350E60838R9501L9150N1191O4807J5936J0435M9392K1391j8781J1342N29L4316
2338I40047M9527R2662J47239O8910N8892J50878K29585L23647M09593M24326
2328B895306L03008J92341J89804K61845K83631N22887M83223O13880Q85335J410213
2318H041473K540787M364861O113441P389643O587192M267123J000192p21058
2310C9583654l013854m979739n078204n073389m507178l761356k876599k118560
$$ y = [303973, 325506, 372193, 382818, 367667, 394356, 387091, 407124, 420051, 375079, 339152, 368702, 400195, 447440, 478311, 500138, 547916, 553735, 504963, 445366, 411646, 360796, 392056, 454465, 468036, 506085, 568263, 584272, 565957, 547335, 593175, 636825, 658455, 630836, 613738, 576272, 560838, 660339, 699489, 750680, 815487, 831423, 841858, 891250, 912641, 893860, 905202, 905731, 940047, 989574, 1082236, 1229475, 1298385, 1357277, 1508155, 1737740, 2061387, 2470980, 2895306, 3198314, 3390655, 3580459, 3842304, 4125935, 4648822, 5132045, 5745925, 6631260, 8041473, 10582260, 14947121, 21060562, 28450205, 35037397, 39304520, 40304712, 39583654, 36569800, 31590061, 26511857, 21438468, 16931290, 13169934, 10293335, 8174775]
2302H174775j332295r24809n33156m32313l26781l78290l43350l35527k88916
2293C279338l48467k89661k40654j93769j49313j29385j59739p8466n4375n5825
2283A579684o4191m6623o1653o4060l0847r5372j26375o9323p167J3767l3691
2272I94149M407q812j6040m1877q5172m9864L683q882R026l0538m7716o5005l9945
2259F17414m2095K8685N5640L5661k752m3760q4590n9274k5909K502K9279k0147
2247D90654l6365j9601j5441l4260O295j6476N146L340K6441j0762j4501j4861
2235C69609J7939l2351j3924J9706Q225j0111j3026m0802l7688l4755M3845N6396
2223C33063k2309K6457Q728k4065o2591o477J1387J2350O856l014p3140L65K7596
$$ y = [8174775, 6842480, 5917671, 5384515, 4952202, 4625421, 4247131, 3903781, 3568254, 3279338, 2930871, 2641210, 2400556, 2206787, 2057474, 1928089, 1768350, 1689884, 1635509, 1579684, 1515493, 1468870, 1407217, 1343157, 1312310, 1216938, 1090563, 1021240, 1014073, 1027840, 994149, 998556, 989744, 973704, 931827, 846655, 796791, 800474, 791592, 800618, 770080, 722364, 657359, 617414, 575319, 604004, 659644, 695305, 692553, 648793, 564203, 504929, 479020, 481522, 510801, 490654, 454289, 434688, 419247, 384987, 391282, 374806, 379952, 383292, 409733, 398971, 384470, 369609, 387548, 355197, 341273, 360979, 369204, 359093, 346067, 305265, 267577, 232822, 276667, 333063, 310754, 337211, 345939, 321874, 259283, 252806, 264193, 276543, 283399, 280385, 207245, 207610, 235206]
2210B35206M258k5985K5271K051J6247k996L645j5658l5309n2886K3409L2984
2198B10237k4299M3466N1655o5688q7975M3004M9325J6859o951j3503M00k1873
2186A94657l3133j8839L6051J1681n1096J4350k0409J3252M6018j2333m2145N937
2174A43991j2364N7932J9388n4805k7409J3032J2804L397L055j5904l6655k3804
2162H2658J9693q484p620L8139K6406o783k8003J0243p205l1092n2066K350L7424
2149G5660K9579K2691J8002j1028k6705j7503q487n306j0176K1825K4108l9470
2137G3190P434J2543J225N0619K2586n2842M900q248j1306j62o5303N1757r07
2124H5486N343J2906J394K4119k191M547j5042k2591J9918R982m5438l1599l3677
$$ y = [235206, 239464, 213479, 238750, 240801, 257048, 254052, 257697, 242039, 206730, 153844, 177253, 210237, 185938, 229404, 281059, 215371, 127396, 170400, 219725, 236584, 229633, 216130, 216530, 194657, 161524, 142685, 178736, 190417, 139321, 153671, 133262, 146514, 192532, 180199, 138054, 143991, 131627, 189559, 208947, 154142, 126733, 139765, 152569, 155966, 159021, 143117, 106462, 82658, 102351, 93867, 86247, 124386, 150792, 144009, 116006, 126249, 119044, 87952, 35886, 38236, 75660, 105239, 127930, 145932, 134904, 108199, 90696, 82209, 76903, 66727, 88552, 112660, 73190, 80624, 93167, 94392, 145011, 167597, 114755, 119655, 111407, 100101, 99939, 34636, 86393, 85486, 90829, 103735, 105129, 129248, 127057, 131604, 116562, 93971, 113889, 123871, 78433, 46834, 13157]
2111A3157L0883O8952r695L0328m1114k9880j4939J2570Q538l0384J03M206Q428
2098E1153j0600j1825M5132M2749k4564L476j2335J2123j0526m2506k8167J1541
2086B5651L2802L9481J6299Q466k8621j670L2915J6333m9510k1320L2841l5377
2074F8290k3138k4920P845O3572j5954J2839k2585o32l5834J83r660n0046J2777
2061a7263O2170K3990L465k9082m266K0274K8204k6252k9771L2326J9436j6969
2049F6262l771J4048M5198K3716O4976L2476m516L4754j0358r6353o8528l4577
2037F3327k7918M3268K9987k7881j9379K6451j9978L3618J2677M0342m702o6678
2025H3134l8069j7882k5384N1964K2998j0842m4518O4543k6068r521J5007Q115
$$ y = [13157, 44040, 112992, 103297, 133625, 92511, 62631, 47692, 60262, 68800, 38416, 38519, 42725, 51153, 40553, 28728, 73860, 116609, 92045, 95521, 83186, 95309, 84783, 42277, 14110, 25651, 58453, 97934, 114233, 122699, 94078, 92408, 125323, 141656, 92146, 70826, 103667, 68290, 45152, 20232, 28077, 91649, 75695, 88534, 65949, 65317, 29483, 29666, 20006, -30040, -17263, 44907, 68897, 72362, 43280, 39014, 59288, 87492, 61240, 31469, 63795, 83231, 66262, 62491, 76539, 121737, 145453, 210429, 242905, 238389, 273143, 262785, 166432, 97904, 63327, 35409, 78677, 108664, 80783, 61404, 87855, 67877, 101495, 114172, 154514, 149812, 83134, 45065, 27183, 1799, 53763, 76761, 65919, 21401, 85944, 59876, 50355, 65362, 73477]
2013G3477o4880k7254J9288M0856L1025n159m1437j8600k5914J6090R3028L5178
2001A25698M53p9442l3513j1440j0843N6667L8462R200p0167m2463K2357M0093
1989D5062L53j9728L3347L3183l2064M958K8173o4474m293L1997K7403o1495K1447
1976D3869N4175j3256m2884l9123J4280L3990J7217L8337k9503n9966l2469K2558
1964G225r339K0621L1087J1667J3209k7229p2020M5151Q8284J45l2967j9157Q721
1951F5398K165k4205l2130O3524K120k0999J2027J4795J1898r287p8401j3328
1939f423l7830L3801L7999M6308O0715l6800q7017J5246l4492N7322O7015k6080
1927H9764k4188m8302j0259P612K1835L7941L9163l417m3029p0187J7008K6840
$$ y = [73477, 8597, -18657, 631, 41487, 72512, 67353, 25916, 7316, -18598, -2508, 90520, 125698, 126151, 46709, 13196, 1756, -9087, 47580, 86042, 95242, 25075, -17388, 4969, 45062, 45415, 25687, 59034, 92217, 60153, 65111, 93284, 28810, 24517, 56514, 83917, 22422, 43869, 98044, 84788, 41904, 2781, 17061, 51051, 68268, 106605, 77102, 17136, -15333, 7225, -2114, 18507, 49594, 61261, 74470, 47241, -24779, 20372, 108656, 108801, 75834, 56677, 65398, 67563, 43358, 11228, 74752, 76872, 55873, 67900, 82695, 94593, 85306, 6905, -6423, -44253, -10452, 27547, 73855, 134570, 97770, 10753, 25999, -8493, 48829, 115844, 89764, 65576, 17274, 7015, 14627, 36462, 74403, 113566, 110149, 67120, -3067, 13941, 40781]
1915D0781L0208m1091k4364J3999M2739M4907K2007m4864n9068k9789J8988L461
1903A7914m026J1304J3403l0978l2620J0550J14813L8678n2069l9422j7804m0282
1891a0539J2187q643J9796p480m97j2953L1781K5370K4326M3365j0343r0153k3918
1878g701N0545N2267p1973n1951J7160K45O741L7058M8903J9074j06928k5453
1866c2013K9976J8201J4569N838M1684o1282k8461J0790R529P312O350N452J9452
1853D7397n5985m3984J8763M8578l0763J2068P437L6104K2925m451m3316l134
1841A1639r235L9192K2610n607q493j5147k0601l0938r632J05058L2681j7334
1829I4193l6054j0480p0859K6533J0895j5281L8197J3909R085P07r263n9081J424
$$ y = [40781, 70989, 29898, 5534, 19533, 62272, 107179, 129186, 84322, 25254, -4535, 14453, 17914, 13888, 25192, 38595, 7617, -25003, -14453, 100360, 139038, 86969, 47547, 29743, -10539, 1648, -6995, 12801, 5321, 4824, -8129, 23652, 49022, 73348, 116713, 106370, 16217, -7701, 42844, 95111, 23138, -28813, -11653, -11408, -4667, 32391, 81294, 100368, -6560, -32013, -2037, 16164, 30733, 36571, 78255, 16973, -11488, -698, 8831, 16143, 22493, 27945, 47397, -8588, -52572, -33809, 14769, -15994, -3926, 3511, 39615, 62540, 58089, 14773, 11639, 2404, 41596, 64206, 58599, 50106, 34959, 14358, -16580, -26212, 78846, 111527, 94193, 58139, 47659, -23200, 3333, 14228, -1053, 37144, 51053, 60138, 60845, 51582, -7499, -6075]
1816f075N0847R180k1515l1639O3743J9088m2848j1263j6890K4738J613k2460
1804A6519J2991r220p1889L3641p534k8375l574J08314L7580k8466j272m3898
1792A4817k3654M8564M5769m877k5265q718m2498j4811J0404J8488M2219J62Q538
1779F9138k457o1571P279m291K2492L4589O123k3804k7964j0533L776k1456Q325
1766c54K6429K8735q989k0216L3424M917r434l2019l3635J9658L6002n4510J5041
1753E049M7101j1011n9765k1917Q923K0345K0753N7800K7049n6678n9805j2148
1741c4304K8087j8733L5936N0142l5763m4046o449O1969J9461j5441k6462K4459
1729C8856L672n281j0747Q906j8066n387J5045L8760J6110j3388j7727l9483m3129
$$ y = [-6075, 44772, 53952, 32437, 798, 64541, 83629, 40781, 29518, 12628, 37366, 38979, 16519, 29510, 20290, -51599, -17958, -25492, -53867, -57441, 50873, 88453, 59987, 58715, 14817, -8837, 39727, 85496, 80619, 55354, 46636, 4138, -10673, -269, 18219, 60438, 60600, 69138, 66681, 5110, 12389, 8098, 30590, 65179, 71302, 47498, 19534, 9001, 12777, -8679, -354, 26075, 54810, 45821, 25605, 59029, 63946, 54512, 22493, -11142, 8516, 44518, -9992, 5049, 52150, 41139, -18626, -40543, -31620, -11275, 9478, 67278, 94327, 37649, -22156, -34304, -6217, -24950, 10986, 61128, 25365, -18681, -25130, 36839, 56300, 40859, 14397, 38856, 42528, 37247, 26500, 35406, 17340, 11953, 26998, 65758, 81868, 68480, 50753, 11270, -31859]
1716c1859J1406L4691O6723k0514m6213k2973l8578L5725J6521K9995Q346n465
1704C7805l9507M4702k9921o743K83Q488k5799k2714M006M8108l5632l1345q771
1691e7040L2852L3252J1371j112J4783J052m4346m2785k383P5666N8678k8112
1679E1876o9400l2780L919N2703K8622J5862n433L2385k651n0277k5215J3125
1667A2736k8419k1559k1744J0268K9369Q942M2789j5884l1216L5780M6492J0046
1655G7600j0215k8922o2778j6647m7851n001R3444N2386m479M3596n9381n683
1643B6069J662L7272K7972k5374o2863l5392J809m69j4976M3346K3586m8329j4857
1630d0544K1218M4119J4227j2336k2748R723K975K9788J6146j5403j9259l9954
$$ y = [-31859, -20453, 14238, 80961, 60447, 14234, -8739, -47317, -11592, 4929, 34924, 43270, 37805, -1702, 43000, 13079, 6336, 6619, 15107, -10692, -33406, -29400, 18708, -16924, -48269, -57040, -24188, 9064, 20435, 19323, 34106, 35158, -9188, -51973, -54356, 21310, 79988, 51876, -17524, -50304, -46385, 6318, 34940, 50802, 45369, 77754, 75103, 24826, -389, 12736, -15683, -37242, -58986, -48718, -19349, -10407, 32382, 16498, -14718, 21062, 67554, 77600, 67385, 38463, -24315, -40962, -88813, -93814, -370, 52016, 47537, 91133, 31752, 26069, 27731, 65003, 92975, 67601, 4738, -30654, -28845, -29314, -44290, -944, 22642, -25687, -40544, -19326, 24793, 39020, 26684, 3936, 13659, 16634, 46422, 62568, 47165, 27906, -12048]
1618a2048o6319O333L5150M7460M924L3703j6854k9613o535N2599k603l491j0472
1605C2234l5480n7100k4190N5879O2459m3161k5197J4197N2751N8378K4043l9311
1593G5502p1995n0133m065L8258j7505M2608J3988k369n4329l0621N0392M6857
1581C6588K7331l2192j9959p035j7952q224K7567j3455k3676j7085L0001N4979
1569C6888L7012n8726o230m8563m6031N1261K5054K6515j4589K0626L31j5027
1557H521n2703L5497N4550K940n3306J414j0352l653J2583J9296l8043L2112l4716
1544b5860k8686p606O8063J2199j6178K8351j3699j0570L5714L593o8478j6578
1532c9735J7760m950K4801R704j9814j0929k1246J3243K2094K7148j166K6869
$$ y = [-12048, -78367, -72034, -36884, 10576, 15500, 49203, 32349, 2736, -3799, 48800, 46197, 42706, 32234, -3246, -60346, -84536, -28657, 33802, -9359, -34556, -20359, 32392, 90770, 114813, 75502, 3507, -46626, -50691, -12433, -29938, 12670, 26658, 24289, -30040, -60661, -10269, 36588, 63919, 31727, 11768, 4733, -13219, -21443, 6124, -7331, -31007, -48092, -18091, 36888, 73900, 15174, 8944, -39619, -85650, -34389, -9335, 17180, 2591, 23217, 23548, 8521, -44182, -8685, 45865, 48805, -4501, -3087, -13439, -17092, -4509, 14787, -23256, 8856, -25860, -54546, -62152, 5911, 18110, 1932, 30283, 16584, 6014, 41728, 45321, -23157, -39735, -21975, -26925, -2124, 7580, -12234, -23163, -44409, -31166, -9072, 18076, 16910, 43779]
1520D3779r987n8585j7684M0055j0082R144l8079J2175L7983r89j3061J419K8468
1507B4556k648N871Q859k7867j4922l113k14j6521j3033K5781L9395J3699l4292
1494E551j9330J1527k6403j5939J1395N1568L2704o446n7454j2615l0628J006
1482e5064J3894L0569K022j5896R035m87J9788j7753R64L9536j0654n6396J1388
1469b9054K9565r350o0397O939L7303N8069L1053K8855o7133l9508m917j5221
1457c3796L8115J9847j27m5614k6277k792J1593M1442J4195R127M8833j5923n9553
1444i30o6200l7957J2424M5714M4984L5148K4743k3159n8220r361l952M4049J2060
1431A9343j8034n9433j4149R489K1598J7953k2108K8630O4341J6032L214l0396
$$ y = [43779, 33792, -24793, -42477, -2422, -12504, -3360, -41439, -29264, 8719, 7730, -5331, -3912, 24556, 21908, 27779, 36638, 8771, -6151, -9264, -9478, -25999, -39032, -13251, 26144, 39843, 5551, -13779, -2252, -28655, -44594, -33199, 18369, 51073, 44627, -12827, -25442, -56070, -55064, -41170, -10601, -8579, -24475, -15440, -15927, 3861, -13892, -12928, 26608, 15954, -40442, -29054, 511, -8839, -69236, -62297, -24994, 33075, 64128, 92983, 25850, -13658, -18575, -33796, 4319, 24166, 24039, -21575, -47852, -50644, -39051, 2391, 16586, 25713, 74546, 58623, -930, -67130, -105087, -92663, -46949, -1965, 33183, 57926, 34767, -23453, -32814, -36766, 7283, 19343, 1309, -58124, -72273, -62784, -41186, -23233, -45341, -16711, 47630, 63662, 66876, 36480]
1419C6480k136l2851p6323K0872K1185J9911J7828j4585k7021j40M595J2259K1420
1406A494K4779K9902l0775k8748l0245R761n267N3004Q377l8064l235m6705k4910
1393h0632o908M6080K7801M6933Q524j3063l8570J6004j0716k423m2362K4214
1381b5118M0405J2955n7383m4373K5620l922K6867J7629M9089J5434n6284k489
1369a570j5953J0374j5831N5219n768k4131l055K3561k3488l8612k3170Q723L6393
1356a7308j1224p082r860L2486j2404m9311j2637N9854L4085M5463j1872o1150
1344b0960m5153K0911P025L4095J9387J1592J8670q138r6919k8318J6966J2475
1332e8367J4397L2545J5388l268K325l9473k4270N22N0821O2750m1901J343k9308
$$ y = [36480, 34344, 1493, -74830, -53958, -32773, -12862, 4966, -9619, -36640, -36780, -32185, -19926, 1494, 26273, 56175, 25400, -3348, -33593, -23832, -29099, 23905, 32282, -5782, -9017, -55722, -80632, -87540, -41460, -13659, 33274, 41798, 28735, -9835, 6169, -4547, -6970, -49332, -25118, 15287, 28242, -29141, -73514, -47894, -51816, -24949, -7320, 41769, 57203, 919, -1570, -17523, -7149, -22980, 32239, 26471, 2340, -715, 22846, -642, -39254, -62424, -53701, -17308, -28532, -35614, -45474, -12988, -25392, -74703, -87340, -27486, 6599, 52062, 40190, -20960, -66113, -45202, -38177, -4082, 15305, 26897, 45567, 37429, -59490, -87808, -70842, -58367, -43970, -11425, 3963, 695, 3020, -36453, -60723, -60201, -9380, 53370, 11469, 12812, -16496]
1319a6496l9095J2086Q711J3009L7547J5341j1903m1532j2693j0608J2168M5842
1307A2377L7246j2092n6600o8293k2659N4581M1195M2658N0213k7766l4190m5989
1295b9319o696M1367j500l6445j0736K4257j4873N1317n687j2596n4538K3112
1283c2337L8235K2773R511j3570m4963m5999o808K9423K2529L5777K5670N94l4307
1270F528n7436o2455N3259K7666j3295N673K9032K344l8331l23L5304L3059l5969
1257a4944k1805K0714K2618l6469Q808m6094q717Q1918N3579J0471m8540p6205
1245e4666O654l290m845J3084K6293L2511j1529J3866R167J2242L3621r276j4735
1232D9097n6934l8697j8818J0462n68K3014J5144n82J9046l2212J7104O3495o9684
$$ y = [-16496, -55591, -43505, -34794, -21785, 15762, 31103, 19200, -22332, -35025, -45633, -33465, 12377, 49623, 37531, -19069, -87362, -110021, -55440, -14245, 28413, 78626, 50860, 16670, -29319, -36015, 5352, 3852, -32593, -43329, -19072, -33945, 17372, 11685, -911, -55449, -32337, 5898, 28671, 38182, 24612, -20351, -66350, -73158, -43735, -21206, 14571, 40241, 40835, 6528, -50908, -113363, -60104, -32438, -45733, -40060, -11028, -8684, -47015, -47338, -12034, 21025, -14944, -36749, -16035, 6583, -29886, -21078, -67172, -75889, 6029, 59608, 70079, 21539, -54666, -48012, -51302, -56147, -43063, -16770, 15741, 4212, 18078, 27245, 39487, 73108, 63832, 49097, -7837, -46534, -65352, -54890, -55458, -32444, -17300, -17882, 1164, -31048, -13944, 49551, -20133]
1219b0133n6670K9918m773m6371M188K0257J5396K8782k417J4555N731K4863K5841
1206C9167k8614p3178k2811L3695M4065k9156J1358M5565j4586l571k2967O559
1194a4474M1345k5396j3781k048m995R451L2036n607J8251l8947J8322K2474K986
1181C9617k0551m1674j3122j852j5666L8765K3568L654L057m8976R482M327L35
1168a9036P006q589m3715j0756P998M4126K8927M9467M6447p7442n1558J5071
1156a2054o686j3738j2046J0684J572P608j2017K2182J4849R824j5016j9715k8698
1143e3251J0129K5333P321l4787J1464J62j9509L5533N5389O426l510m5487k6439
1130c1226m9879j331M0892J8059j9496J0466j8604J5610J7647j1411L3313K5610
$$ y = [-20133, -76803, -46885, -51658, -98029, -93841, -73584, -58188, -29406, -31823, -17268, -11537, 13326, 39167, 10553, -62625, -85436, -51741, -7676, -36832, -25474, 20091, 5505, 1934, -21033, -14474, 26871, 1475, -12306, -14354, -19349, -9898, 22138, 16531, 34782, -4165, 14157, 36631, 39617, 19066, -22608, -35730, -37582, -53248, -14483, 9085, 12739, 15796, -33180, -23698, -19371, -19036, -12030, -20619, -64334, -75090, -67092, -22966, 5961, 55428, 101875, 24433, -27125, -12054, -18740, -32478, -44524, -33840, -32268, -24660, -36677, -14495, 354, 10178, -4838, -24553, -53251, -43122, -17789, -10468, -45255, -33791, -33629, -53138, -17605, 37784, 44210, 40700, -4787, -31226, -81105, -82436, -41544, -23485, -42981, -32515, -51119, -35509, -17862, -29273, 4040, 29650]
1118B9650j681l3993k8833k7276K0886j1969Q83K1848K5504k9312J7597r961n7112
1105h3769K2162K7115N648j3804J0975N1223m7994k0946J1772J2699J794P968
1093a5157k2033k7076k6568N3760N9926K7608j9151n443j4207k640m2335q824
1081d2140k103n90k9883R946M3053j7011m355J3598R836q326O768K1031j3178
1068a3354Q970j8162P851l2765j8723J2947O3011N9814L977j7070l0610j0272
1056A5614o0246j1832Q374K3696k4487j639J7577M7438k4555p911p239q618o47
1043c4475M1477m0828j2933J8548K3361J0198P077k9100J052j9624k8871M2565
1031b1553n484n2703N2395N819k0759r511K4881j3506R234J144j9532o076l0430
$$ y = [29650, 27969, -6024, -34857, -62133, -41247, -53216, -52333, -30485, -4981, -34293, -16696, -26657, -83769, -61607, -34492, -28844, -42648, -31673, 19550, -28444, -49390, -37618, -24919, -23125, -15157, -37190, -64266, -90834, -37074, 22852, 50460, 31309, 25866, 11659, 9019, -33316, -42140, -44243, -44833, -74716, -64770, -21717, -38728, -43083, -29485, -19649, -27975, -21207, -176, -13354, -4384, -22546, -14695, -47460, -66183, -53236, 9775, 69589, 73566, 56496, 25886, 15614, -44632, -56464, -48090, -24394, -48881, -50520, -32943, 14495, -10060, -17971, -25210, -33828, -34475, 7002, -33826, -46759, -28211, -4850, 5348, 12425, -16675, -15623, -35247, -64118, -21553, -27037, -79740, -27345, -21526, -42285, -51796, -26915, -40421, -31187, -30043, -49575, -55651, -86081]
1018h6081J431K0139K770P24K2744p514N6077k9041k5014j6358J6681j0375q607
1005f2424k810J3888K033K7059K4153J3867m0080R921K4064o355J498J6340n8374
992c7220j7171j7947r950L1700M5077J0809o618l8988L4364j5614O157k4575k0935
979f0911J9400l227n218j4859L3301J3662K9079J5094p375j5356J4778J1010M779
966C4157p6186k2478M3218K9542m8489j6127L1457L6308k9958q829m4052K2010
954d9427L8016J395n5031K526K8239M3680l9432m196l3939K231n823l6531K8415
941g9877K1024Q523N740r55L1358j397k0864N431P894k4637k7308J9929Q711j1787
927e8215j4812L2695N5095k5520k2320j3587O465M049K7098L359r2438J4050L0606
$$ y = [-86081, -84650, -64511, -61741, -61017, -38273, -45787, 10290, -18751, -43765, -60123, -43442, -53817, -62424, -65234, -51346, -49313, -22254, 1899, 15766, -24314, -14393, 9671, 3316, 4814, 21154, -37220, -54391, -72338, -82288, -50588, -5511, 5298, -1320, -40308, -5944, -21558, -15401, -39976, -60911, -41511, -44738, -49956, -64815, -31514, -17852, 11227, 26321, 18946, 3590, 18368, 29378, 34157, -42029, -64507, -21289, 8253, -40236, -56363, -24906, 11402, -18556, -27385, -71437, -49427, -11411, -10016, -65047, -62521, -34282, 9398, -30034, -34230, -68169, -65938, -71761, -108292, -79877, -58853, -50330, -44590, -45545, -14187, -15584, -36448, -31017, -23123, -47760, -75068, -55139, -46428, -58215, -73027, -40332, 14763, -10757, -33077, -46664, -40199, -36150, -9052, -5693, -98131, -84081, -53475]
914e3475J7503k7046K1819j3129J4861M8596J3252l2910J4237l7111o09n9722
902i3734k8216O1558K1383J769J3935j4549J1960k002Q953k4007K5774l006k5630
889d5812j7068j4333j9538O796J2330M3313M3384l0389J4485l4567K827J7233
877b1339m0554P403K3578l390j2415l0616k3796J3765j728j930K9226j115J9416
864d3495q48m985l4617J5174L0507j9699k3559K7620l304J9J9884J9683N305K7284
850A4969J7212m348j0103J488m25l0345p0084J1438K9880k1696K5159J1537l3714
837e9032K8634k238K2327O0139K1075o3880l8621m3112l5645j511P757M8944L2531
824b2632K6580l775m3964k8858J0244K963L8993j8214l042j4928J0383l8425m0673
$$ y = [-53475, -35972, -63018, -41199, -54328, -39467, 9129, 22381, -10529, 3708, -33403, -34012, -93734, -121950, -60392, -39009, -37240, -23305, -37854, -25894, -27896, -18943, -42950, -17176, -20182, -45812, -62880, -77213, -96751, -89955, -77625, -34312, 9072, -21317, -6832, -41399, -38572, -21339, -61893, -54490, -30912, -34302, -46717, -77333, -101129, -87364, -89092, -91022, -61796, -62911, -43495, -44343, -49328, -83945, -68771, -38264, -57963, -81522, -53902, -57206, -57187, -37303, -17620, -12315, 14969, 32181, 27833, 17730, 19218, 18793, -11552, -81636, -70198, -40318, -62014, -36855, -25318, -59032, -30398, -32636, -10309, 49830, 70905, 7025, -31596, -74708, -110353, -111864, -104107, -55163, -22632, 3948, 173, -43791, -72649, -62405, -59442, -20449, -38663, -41705, -56633, -46250, -84675, -125348]
811a25348J6322K4781O2474J1577m5999j4759J5602j7821n1954P3136K7206L0211
799E428j8617o6867l7994m980P797N1013K4506Q848o814J8304n574n4610K4048
786e5512M9192K9638l871p0114k1257M176M294J2114m4892p677L6690J13902j7611
773B9072j3125o5611k8756J038K7974j9530K4390k4978L755k0275j390K7133P5667
760A5364M4458l0224k2941o1391k7116L8176O253m0032J3914j4307q955R253j2913
747i0461L2177n081P242K2919M451j0865j1058J6294m4411m7622K3165J10863
735G613K2112M65j6j8882l6303r944J5175J8251M287m746k2091l694l3647P693
721e3727l004K5241j3595k6847j1823J3347j4547L3632l1134P39J8286K6228q698
$$ y = [-125348, -109026, -84245, -21771, -10194, -56193, -70952, -55350, -73171, -125125, -51989, -24783, 5428, -13189, -80056, -118050, -123030, -115233, -64220, -39714, -30866, -37680, -19376, -24950, -79560, -55512, -6320, 23318, 19447, -50667, -71924, -67748, -63454, -51340, -96232, -103909, -67219, 46683, 29072, 15947, -49664, -78420, -77382, -49408, -68938, -44548, -69526, -65771, -86046, -87436, -60303, 15364, 59822, 29598, 6657, -54734, -81850, -43674, -37421, -77453, -63539, -77846, -86801, -77548, -90461, -58284, -63365, -56123, -33204, -28753, -39618, -50676, -34382, -78793, -126415, -103250, 7613, 29725, 30190, 30174, 11292, -25011, -34955, -19780, -1529, 2758, -1988, -24079, -27773, -61420, -53727, -56731, -31490, -45085, -71932, -83755, -70408, -84955, -51323, -82457, -81718, -63432, -37204, -45902]
708d5902O791R269j3186k6204l1127M998M5924L9845j5800k4196k25o423j3161
695f9397L9385M7970P876p1669m5067l8481J7663K5756M9294M2084k617j2638
683i841M650k2064o0499J8138K9005j0595q456j3060K6432J2960n838j7483m451
670f1102K3596M0882O858m7390n2918J837j6422J5116J6175N3662q386n676r610
657d3378R59r957L6512M7326J9545n1546l8846m0186K5843k8781L202L0086M782
644d4439Q700K4335J7015O828j1951l1354l4220M339M6018J5639M623o1119m4095
631i9681J0900N4492l4370J0448N7964M6407q3985k6139k234N169j8469L7044
619d2454K6657k1249n2044j1622J8106J3872p708L8174L8808J6018k1844l720
$$ y = [-45902, -39111, -29842, -43028, -69232, -100359, -95361, -49437, -9592, -25392, -49588, -49813, -56236, -69397, -30012, 17958, 25834, -45835, -90902, -129383, -111720, -85964, -36670, 5414, 2797, -9841, -5191, -27255, -87754, -69616, -40611, -51206, -59662, -72722, -46290, -33330, -39168, -56651, -61102, -37506, 3376, 10234, -37156, -90074, -88237, -104659, -89543, -73368, -19706, -28092, -33768, -43378, -42419, -52376, -15864, 31462, 51007, -539, -39385, -79571, -53728, -82509, -79307, -49221, -44439, -35739, -11404, 5611, 12439, 488, -30866, -65086, -60747, -14729, 910, 5533, -55586, -99681, -88781, -34289, -68659, -58211, -247, 46160, -37825, -63964, -66198, -61029, -79498, -42454, -15797, -37046, -89090, -100712, -82606, -68734, -76442, -38268, 540, 16558, -5286, -9006]
607i006r365k1456l9996J9022J3311J0508l4055K3883P631n7325j604M3519N5259
594C26j2480p284o565m2139j0829J2236r249J4726K098N1271K0347p789l0316
581b5647K1944l1892j6688q202J1164K8372J353m3966j4241j0225J8898M4635
569b4495L5981l8530l8748L5776k1595l9301M9754L8166K5112o0773n8211k6839
557a23703M0355j1185k674N0186J8509K1398M6824j6257j978n2592j8398J9873
545b9642m5685J8589P376L1752m1615m5752L315M9856K1992N428R609J913n3154
532f6018O978K869n939q1373Q258N4969L3168L3964j34j6232l6929J0939L8925
519a6555n09k2253K2872N255o6932k3019M8953O062J1832J8965J6778q911m8818
$$ y = [-9006, -18371, -39827, -79823, -60801, -47490, -36982, -71037, -47154, -39523, -96848, -98452, -54933, 326, -12154, -19438, -26003, -68142, -78971, -66735, -75984, -61258, -59160, -7889, 12458, 4669, -25647, -3703, -35595, -52283, -60485, -49321, -20949, -19596, -63562, -77803, -88028, -69130, -24495, 11486, -27044, -65792, -30016, -51611, -90912, -41158, -2992, 22120, -38653, -96864, -123703, -83348, -94533, -97207, -47021, -28512, -7114, 39710, 23453, 21475, -31117, -49515, -29642, -75327, -56738, -49362, -17610, -59225, -104977, -101662, -51806, -29814, -24386, -14777, -12864, -66018, -59040, -56171, -62110, -143483, -135225, -80256, -47088, -13124, -13258, -29490, -66419, -55480, -16555, -17064, -39317, -16445, -11190, -78122, -101141, -52188, -46126, -34294, -15329, 1449, -7462, -56280]
506e6280N805l011o981K2249J3471l817p010M1874l9488k4807J553P494J0209
493c8739m7262J417K8125P813k7762M281r271L5355L5791j182k6529l6238J2620
480f1581j3256N0722O044j5889l9040J8982j6059J2284K8373Q139q499k6602k36
467e6618j3961q757J2081k480j7097J0097K8816N0109R942k287m5267j3105m2665
454i1192q452L0804N7709K7092R201k5763l7518j0008J3529L1431P90m5613k7952
441g5942P859K9744l0379n2436K4243L3324L9152J5648j4062m007m072k1002l8331
428i0261K781L3813N9330j7665m7387p0993o685N8379K8828K562M3882J0844l7205
415b9777l7572L7761J086k0795K1656j4907m6132k0337P953N0885J5397k9153
$$ y = [-56280, -50475, -53486, -60467, -38218, -24747, -28564, -35574, 6300, -33188, -57995, -56442, -48948, -38739, -86001, -84584, -56459, -48646, -76408, -72127, -81398, -46043, -10252, -11434, -37963, -74201, -61581, -74837, -24115, -18071, -33960, -73000, -54018, -70077, -57793, -29420, -21281, -29780, -56382, -56618, -70579, -79336, -67255, -69735, -86832, -76735, -47919, 2190, 12132, 9845, -35422, -48527, -91192, -99644, -68840, -11131, 15961, 25162, -601, -38119, -48127, -34598, -3167, -2377, -47990, -75942, -68083, -38339, -68718, -121154, -96911, -63587, -24435, -8787, -22849, -26856, -30928, -51930, -90261, -87480, -53667, 5663, -12002, -59389, -130382, -137067, -78688, -49860, -47298, -3416, 7428, -29777, -67349, -29588, -28502, -49297, -27641, -42548, -88680, -109017, -101064, -50179, -34782, -63935]
403f3935J0129N2198O0314k1056k1461p1926N368k2733J5373o522J7493L7834
391h924m3592p1902K0266J5350Q1324K2066j07m952k3107p0923q197L043L7499
378e2156k1828K0508Q990l6515l7027M0825M0129j8049O689P742J4678K1112l7777
365d2679l5899j06j3455L7444N2888L412m4537l1291n0728j3544Q548N4198M4457
352c1292M114l4903R142l9185J0624J7276O6744N9o3553l1721N8094k5093j3233
339g2927p797J9282J5311J3633m310J7883k3968k6567m4209L2071j5180N7517
327c9261M0592j5051J608m7296j01519q477Q2151M9668L369o4737l3235K1955
315a10233R280M502O2136K0954N0621j9746k4472o4773l6472k8171K1275N46L2303
$$ y = [-63935, -53806, -1608, 58706, 37650, 16189, -55737, -50369, -73102, -57729, -64251, -46758, -8924, -52516, -124418, -104152, -88802, -7478, 14588, 14481, 9529, -13578, -84501, -92698, -89655, -52156, -73984, -53476, -44486, -81001, -118028, -77203, -37074, -55123, -48434, -40692, -26014, -4902, -42679, -78578, -78684, -92139, -54695, -1807, 1605, -42932, -74223, -124951, -138495, -129947, -75749, -31292, -27178, -62081, -52939, -92124, -81500, -64224, 2520, 2579, -60974, -92695, -34601, -59694, -72927, -80724, -61442, -46131, -32498, -36808, -18925, -42893, -69460, -113669, -81598, -96778, -39261, 1331, -13720, -12112, -59408, -160927, -169404, -87253, -37585, -34216, -98953, -132188, -110233, -100953, -96451, -34315, -13361, 37260, 17514, -6958, -71731, -108203, -136374, -115099, -114553, -82250]
302h2250q657N257K718j6557K1357M0289Q038l127j7070q638o3815l7732O956
289a53231N5564K1077J8926K0415M5202l639n5397r063J2049K8366j7188k8007
277f4926J208L4472l0693j4852j0188j1695J5365N3440j1785k3458j4427o938
265h4477J259j8264n351P1427N8168l0290r4280m2780p234N4321K8010L8964l313
252c3840k5565q400j7392j9005J1042J2306L9724r097q985k3434j7343l0123K4196
239a05916k0230L6515K1086K4634p655J435m264m1956L4163l641M7478l6198k0078
226g4627m5469l1360l7009L8482N1296Q5926j3502l6333l5113P294l7671L4802
214i3284K8945l3137J455L6232M5673r436m6242k462l6896L0434L7400K3769m4787
$$ y = [-82250, -90907, -85650, -82932, -99489, -78132, -37843, -29805, -32932, -50002, -58640, -122455, -160187, -153231, -97667, -76590, -57664, -37249, 7953, 4314, -51083, -60146, -48097, -19731, -36919, -64926, -63718, -29246, -59939, -74791, -84979, -96674, -81309, -27869, -39654, -63112, -77539, -84477, -83218, -101482, -106833, -35406, 22762, -7528, -101808, -144588, -151822, -97501, -69491, -30527, -33840, -59405, -67805, -85197, -104202, -93160, -80854, -41130, -50227, -59212, -82646, -99989, -130112, -105916, -126146, -89631, -68545, -43911, -51566, -50131, -54395, -96351, -62188, -65829, -18351, -54549, -74627, -120096, -151456, -188465, -149983, -98687, -12761, -26263, -62596, -97709, -90415, -128086, -93284, -64339, -97476, -96021, -59789, -14116, -23552, -69794, -72256, -109152, -78718, -41318, -17549, -62336]
201f2336l7662n7809K7443J0243N0032K5135N933k9002m5695L145K1992j0083
189i8664l7688J4748M5162K7921m1195m1655j5195O0361J7288K8897J117l100
177d2003J1389j001l3432k2188j0212L9351M671l652l7500j12l4087K421J0026
164a16329L6090K4930L2968j6462k4127n3224q943M0715M0329J868m131l7257
152h3573j0468k0965J9905r202J6033M4907k045m760P356o2119K4853J7118j7488
139h0448j2212J4199J5499j0045o755k0752o1537J7703N1374L4450K3483m5071
127h0112r06k5575l067j500K7079q623K67j7632m865j0150o235J56K4233K587
113a04343P10p707M4449K497l4731m4726j804M46L9891o107j1520j2479J7708
$$ y = [-62336, -99998, -157807, -130364, -120121, -70089, -44954, -39021, -68023, -113718, -110573, -88581, -98664, -136352, -121604, -76442, -48521, -89716, -131371, -146566, -86205, -68917, -40020, -38903, -42003, -30614, -31615, -65047, -87235, -97447, -58096, -53425, -57077, -94577, -94689, -128776, -126355, -116329, -80239, -55309, -22341, -38803, -62930, -116154, -125097, -84382, -44053, -42185, -46316, -83573, -94041, -115006, -95101, -104303, -88270, -43363, -45408, -50168, -42812, -104931, -80078, -62960, -80448, -92660, -78461, -62962, -73007, -79762, -100514, -162051, -144348, -92974, -58524, -35041, -80112, -81018, -106593, -109660, -111160, -84081, -92704, -92437, -110069, -114934, -125084, -131319, -131163, -106930, -104343, -103633, -111340, -66891, -64394, -99125, -143851, -145655, -145209, -105318, -111425, -122945, -135424, -117716]
100a17716J362J779M8072L5013o233j8369n4720l4318j1157J7070K1187L5883
88h2147R494l6621J8779M834k1429j3826Q975K5627j8810o2564N461L16J2726
75a49185M776o592J6529J8740L7984O02l9372J492j8285J0745J2726M794l1852
62a36898J2142J6095j4799k0409j3983J4066L1690k3895p154j3873j7190J819
50a72389K9676j6497l248l109L2541K3848k2891n473j7522j6628J7302L9039j793
37a17144K37m392J724m3339j1674P116k709J25m97k7440R588J4192m721J73K8370
22a50391J2750n657k8985J0959k1549O545K3648l468j7430L380L267P523j0120
9a69528j7859L3474K5669k4475j5783P014j8793k6716k329
$$ y = [-117716, -116354, -114575, -66503, -31490, -37723, -56092, -110812, -145130, -156287, -139217, -118030, -82147, -72653, -109274, -90495, -85661, -107090, -120916, -111941, -86314, -105124, -167688, -162227, -161911, -149185, -144409, -151001, -134472, -115732, -77748, -77146, -116518, -115026, -133311, -122566, -109840, -105046, -136898, -124756, -108661, -123460, -143869, -157852, -143786, -112096, -135991, -143145, -157018, -174208, -172389, -142713, -159210, -162458, -165567, -133026, -109178, -132069, -137542, -155064, -171692, -154390, -115351, -117144, -116907, -121299, -119575, -162914, -174588, -167472, -170181, -170056, -170553, -197993, -188405, -174213, -178934, -178761, -150391, -137641, -143298, -172283, -161324, -182873, -176328, -152680, -156148, -173578, -170198, -166931, -159408, -169528, -187387, -153913, -128244, -152719, -168502, -161488, -180281, -206997, -209326]
0b09326
$$ y = [-209326]
$$ Imaginary data points
##PAGE= N=2
##DATA TABLE= (X++(I..I)), XYDATA
16383a044849L8260L0868J7930L825j8081K0674j3716q608K8466M1876K7466J2778
16371h63111k093J2011N588R649M0387K0808J4473k7974j049j9615L2926P121
16359g70879J6931J8927K1277K935J6091J1264K3487L0516J4241J7564k509k1352
16347f21507j0691N1958j3385J8337L8696M0296j1303n417j8707N046L1569M5605
16335d49503N6275l970k6854R179P136R248K203L4354J4152J4865L690r531M8
16322c38708J7974P593K5306L8034L5821o703l467J4769j0134K4776J0413m79
16310a84805N62N563J2355J8881M7176J499p725l647M8329j0209N547R346k5179
16297h2307k3114J7317O3805j6803K6964O047r33J4986j6646o80M1320m97L0979
$$ y = [-1044849, -1006589, -975721, -957791, -953966, -972047, -951373, -965089, -973697, -945231, -903355, -875889, -863111, -865204, -853193, -847605, -837956, -797569, -776761, -762288, -790262, -791311, -810926, -778000, -770879, -753948, -735021, -713744, -710809, -694718, -683454, -659967, -629451, -615210, -597646, -600155, -621507, -632198, -580240, -593625, -575288, -536592, -496296, -507599, -513016, -531723, -526677, -495108, -449503, -393228, -397198, -424052, -414873, -407737, -398489, -396286, -361932, -347780, -332915, -329225, -338756, -338708, -320734, -313141, -287835, -249801, -213980, -220683, -224150, -209381, -219515, -194739, -184326, -184805, -184243, -178680, -166325, -147444, -100268, -98769, -106494, -110141, -61812, -72021, -66474, -57128, -82307, -105421, -88104, -24299, -41102, -14138, -8091, -9024, 5962, -10684, -11364, 29956, 29459, 60438]
16284F0438J1021P611o505L7693J0166L824M403j0791J6083K5097j9710K351M299
16271A45980q735L3428O0704M5323Q377k1114p121j4048R117q76j1925J2171j8051
16258B33230k2009K264O1628N106J4567j254K3818K7466k3700K1971J3330j5507
16246C40910n888K5901K8352N291L0754K9519k8388l7494l055L7008K7538L219
16234D53667R422j4674J0919K2026m487M600K0460j1392J055M2952j8593k6301
16222D89654N471J1658J4945K6851J235J7334j3220j4165M444k6979K3099J3125
16210E53452J5471j4515k977K7875Q0525k1346m5266J9443J5356O045j7091q289
16198F08683J3434P325K7291O09P903K4696j116O894m1983l8801N3348M5130J789
$$ y = [60438, 71459, 79070, 72565, 110258, 120424, 124248, 128651, 117860, 133943, 159040, 139330, 141681, 145980, 137245, 170673, 231377, 276700, 285077, 263963, 256842, 242794, 251911, 251035, 239110, 251281, 233230, 211221, 213485, 275113, 280219, 294786, 293532, 317350, 344816, 321116, 343087, 356417, 340910, 335022, 360923, 389275, 394566, 425320, 454839, 426451, 388957, 385902, 422910, 450448, 453667, 463089, 448415, 459334, 481360, 476873, 481473, 501933, 490541, 491596, 534548, 515955, 489654, 495125, 506783, 521728, 548579, 549814, 567148, 553928, 539763, 544207, 517228, 540327, 553452, 568923, 554408, 551431, 579306, 659831, 638485, 593219, 612662, 628018, 634063, 616972, 608683, 622117, 629442, 656733, 657342, 665245, 689941, 688825, 695719, 653736, 614935, 668283, 713413, 715202]
16185G15202l5290l2422J8208J1094R829J3566J4825K27k5074P042L3001J96K2081
16172G52485m878m1011Q5J927K0417M6630l0410r809J0342K5897l415l8919j5927
16159G13414K3998m10j1338K3022K8939l3422k251N9866q207j2316J6164J5755
16147H13214J157k6774J3853L1708J1553l1691n338K3573m8591L301R378n991
16135G89352n241j4582K6730M0940K3331j007j5418K3692n1286m4663J2790M6584
16123H31222p812m0845J1444M3955k9j1517M9788J8933m670o574o2094j1963J3163
16110H23001k3504N87J8574K5308M0845L1558n73q013k7365l2989j3643j1755
16098H22031o628P561k2058k3033K0092P6244K2873o11M773m4546l6961J4322
$$ y = [715202, 679912, 647490, 665698, 676792, 686621, 700187, 715012, 715239, 690165, 697207, 730208, 730404, 752485, 747607, 706596, 706681, 708608, 729025, 775655, 745245, 735436, 745778, 771675, 768260, 729341, 713414, 737412, 737002, 725664, 748686, 777625, 744203, 741952, 801818, 793611, 781295, 797459, 813214, 814371, 787597, 801450, 833158, 844711, 813020, 807682, 831255, 782664, 785965, 795343, 789352, 784111, 769529, 796259, 837199, 860530, 859523, 844105, 867797, 816511, 771848, 784638, 831222, 823410, 782565, 794009, 837964, 837935, 826418, 876206, 895139, 890469, 883895, 821801, 809838, 823001, 799497, 800084, 818658, 843966, 884811, 916369, 915796, 907783, 880418, 847429, 833786, 822031, 815403, 822964, 800906, 777873, 797965, 874209, 897082, 896471, 901244, 856698, 819737, 834059]
16086H34059q203J3249n3173J1658K9929M7171P354k6446L1037O3318l4619o7367
16074H47967M7540J3999j9035l6880j9703j2584k829L3986L8559J1070n0570k7871
16062H23649K8206l6291J5865K9991J5443O2092N419l6410M800l6425j2093J9463
16050H83709l2973k2649K7155P423J2872N287n0177P4519P097j525K0217R43m828
16037I27070n2184l1799r983r908L1385N6077K5530O71l0023K7712m7686M945
16025H91807M267K8135L009m9132m4248n446K9827Q525J9040N5750k2870l5225
16013H83439O366j6262j2795r725j8777M0462J8375l0880N540L7939k795q2936
$$ y = [834059, 825856, 839105, 785932, 797590, 827519, 874690, 882044, 855598, 886635, 949953, 915334, 847967, 895507, 909506, 890471, 853591, 833888, 821304, 818475, 852461, 891020, 902090, 851520, 823649, 851855, 815564, 831429, 861420, 876863, 938955, 944374, 907964, 912764, 876339, 864246, 883709, 850736, 828087, 855242, 862665, 875537, 880824, 830647, 905166, 912263, 910738, 930955, 931898, 927070, 874886, 843087, 833104, 823196, 854581, 910658, 936188, 936859, 906836, 934548, 886862, 891807, 896074, 924209, 927218, 878086, 833838, 828392, 858219, 866744, 885784, 941534, 918664, 883439, 889805, 873543, 860748, 851023, 832246, 872708, 891083, 860203, 865743, 903682, 900887, 817951]
$$ [...]
##END NTUPLES=NMR SPECTRUM
##END=
