##TITLE=1H_DE-80H_X3
 200.13MHz, d2o
 8 sc
 
 19ns.26.2.2025
##JCAMPDX= 6.0         $$ Bruker NMR JCAMP-DX V2.0
##DATA TYPE= NMR SPECTRUM
##DATA CLASS= NTUPLES
##ORIGIN= UXNMR, Bruker Analytische Messtechnik GmbH
##OWNER= pz
$$ XWIN-NMR		Version 3.5
$$ Fri Jul 10 10:25:05 2026 Russian Standard Time (UT+4h)  Yarkov@DPX200
##.OBSERVE FREQUENCY= 200.1313
##.OBSERVE NUCLEUS= ^1H
##.ACQUISITION MODE= SIMULTANEOUS
##.ACQUISITION SCHEME= undefined
##.AVERAGES= 8
##.DIGITISER RES= 18
##SPECTROMETER/DATA SYSTEM= spect
##.PULSE SEQUENCE= zg30
##.SOLVENT NAME= DMSO
##.SHIFT REFERENCE= (INTERNAL, DMSO, 0, 15.5023)
##AUDIT TRAIL= $$ (NUMBER, WHEN, WHO, WHERE, WHAT)
$$ ##TITLE= Audit trail, XWIN-NMR		Version 3.5
$$ ##JCAMPDX= 5.01
$$ ##ORIGIN= Bruker BioSpin GmbH
$$ ##OWNER= Yarkov
$$ C:/Bruker/XWIN-NMR/data/yarkov2/nmr/H-C/1/pdata/1/auditp.txt
$$ ##AUDIT TRAIL=  $$ (NUMBER, WHEN, WHO, WHERE, WHAT)
(   1,<2026-07-10 10:24:22.34 +0400>,<Yarkov>,<DPX200>,
      <created by zg, POWCHK disabled, PULCHK disabled
       configuration hash MD5:
       00 E9 B6 7A A2 85 ED C7 34 08 36 98 17 FE 4E 26
       data hash MD5: 16K
       41 19 33 CB E0 52 CD D6 F5 59 CE 14 28 03 B9 2C>)
(   2,<2026-07-10 10:24:28.01 +0400>,<Yarkov>,<DPX200>,
      <Start of raw data processing
       efp BC_mod = 2 LB = 0.25 FT_mod = 6 PKNL = 1 PHC0 = -7253.948 PHC1 = 6.42196 SI = 16K 
       data hash MD5: 16K
       FC 96 8D C0 A2 AB A2 AE 04 21 AA 3F 44 4B CE ED>)
$$ ##END=
$$ 
$$ hash MD5
$$ 2F 91 16 F8 37 1B 05 09 C0 A4 FF AC B6 F9 62 D0
##$RELAX= 
##$RELAX= 
##$RELAX= 
##$RELAX= 
##$RELAX= 
##$RELAX= 
$$ Bruker specific parameters
$$ --------------------------
##$DU= <C:/Bruker/XWIN-NMR>
##$EXPNO= 1
##$NAME= <H-C>
##$PROCNO= 1
##$TYPE= <nmr>
##$USER= <yarkov2>
##$AMP= (0..31)
100 100 100 100 100 100 100 100 100 100 100 100 100 100 100 100 100 100 
100 100 100 100 100 100 100 100 100 100 100 100 100 100 
##$AQSEQ= 0
##$AQ_mod= 1
##$AUNM= <au_zg>
##$AUTOPOS= <>
##$BF1= 200.13
##$BF2= 200.13
##$BF3= 200.13
##$BF4= 200.13
##$BF5= 200.13
##$BF6= 200.13
##$BF7= 200.13
##$BF8= 200.13
##$BYTORDA= 1
##$CFDGTYP= 0
##$CFRGTYP= 5
##$CHEMSTR= <none>
##$CNST= (0..31)
1 1 145 1 1 1 1 1 1 1 1 1 1 1 1 1 1 1 1 1 1 1 1 1 1 1 1 1 1 1 1 1 
##$CPDPRG= <>
##$CPDPRG1= <>
##$CPDPRG2= <>
##$CPDPRG3= <>
##$CPDPRG4= <mlev>
##$CPDPRG5= <mlev>
##$CPDPRG6= <mlev>
##$CPDPRG7= <mlev>
##$CPDPRG8= <mlev>
##$CPDPRGB= <>
##$CPDPRGT= <>
##$D= (0..31)
0 0.7 0 0 0 0 0 0 0 0 0 0.03 0 0 0 0 0 0 0 0 0 0 0 0 0 0 0 0 0 0 0 0 
##$DATE= 1783664661
##$DBL= (0..7)
120 120 120 120 120 120 120 120 
##$DBP= (0..7)
150 150 150 150 150 150 150 150 
##$DBP07= 0
##$DBPNAM0= <>
##$DBPNAM1= <>
##$DBPNAM2= <>
##$DBPNAM3= <>
##$DBPNAM4= <>
##$DBPNAM5= <>
##$DBPNAM6= <>
##$DBPNAM7= <>
##$DBPOAL= (0..7)
0.5 0.5 0.5 0.5 0.5 0.5 0.5 0.5 
##$DBPOFFS= (0..7)
0 0 0 0 0 0 0 0 
##$DE= 6
##$DECBNUC= <off>
##$DECIM= 32
##$DECNUC= <off>
##$DECSTAT= 4
##$DIGMOD= 1
##$DIGTYP= 9
##$DL= (0..7)
0 120 120 120 120 120 120 120 
##$DP= (0..7)
$$ [...]
##$SUBNAM2= <"">
##$SUBNAM3= <"">
##$SUBNAM4= <"">
##$SUBNAM5= <"">
##$SUBNAM6= <"">
##$SUBNAM7= <"">
##$SUBNAM8= <"">
##$SUBNAM9= <"">
##$SW= 18.0517328524113
##$SWIBOX= (0..15)
0 0 2 0 0 0 0 0 0 0 0 0 0 0 0 0 
##$SW_h= 3612.71676300578
##$TD= 16384
##$TD0= 1
##$TE= 0
##$TE2= 300
##$TE3= 300
##$TEG= 300
##$TL= (0..7)
0 120 120 120 120 120 120 120 
##$TP= (0..7)
150 150 150 150 150 150 150 150 
##$TP07= 0
##$TPNAME0= <>
##$TPNAME1= <>
##$TPNAME2= <>
##$TPNAME3= <>
##$TPNAME4= <>
##$TPNAME5= <>
##$TPNAME6= <>
##$TPNAME7= <>
##$TPOAL= (0..7)
0.5 0.5 0.5 0.5 0.5 0.5 0.5 0.5 
##$TPOFFS= (0..7)
0 0 0 0 0 0 0 0 
##$TUNHIN= 0
##$TUNHOUT= 0
##$TUNXOUT= 0
##$USERA1= <user>
##$USERA2= <user>
##$USERA3= <user>
##$USERA4= <user>
##$USERA5= <user>
##$V9= 5
##$VALIST= <valist>
##$VCLIST= <CCCCCCCCCCCCCCC>
##$VD= 0
##$VDLIST= <DDDDDDDDDDDDDDD>
##$VPLIST= <PPPPPPPPPPPPPPP>
##$VTLIST= <TTTTTTTTTTTTTTT>
##$WBST= 1024
##$WBSW= 4
##$XGAIN= (0..3)
0 0 0 0 
##$XL= 0
##$YL= 0
##$YMAX_a= 305066
##$YMIN_a= -261858
##$ZGOPTNS= <>
##$ZL1= 120
##$ZL2= 120
##$ZL3= 120
##$ZL4= 120
##$ABSF1= 0
##$ABSF2= 0
##$ABSG= 0
##$ABSL= 0
##$ALPHA= 0
##$AQORDER= 0
##$ASSFAC= 0
##$ASSFACI= 0
##$ASSFACX= 0
##$ASSWID= 0
##$AUNMP= <proc_1d>
##$AZFE= 0.1
##$AZFW= 0.1
##$BCFW= 0
##$BC_mod= 2
##$BYTORDP= 0
##$COROFFS= 0
##$CY= -3
##$DATMOD= 1
##$DC= 0
##$DFILT= <>
##$DTYPP= 0
##$F1P= 0
##$F2P= 0
##$FCOR= 1
##$FTSIZE= 16384
##$FT_mod= 6
##$GAMMA= 0
##$GB= 0
##$INTBC= 1
##$INTSCL= 3.241238e-09
##$ISEN= 128
##$LB= 0.25
##$LEV0= 0
##$LPBIN= 0
##$MAXI= 10000
##$MC2= 0
##$MEAN= 0
##$ME_mod= 0
##$MI= 1.114404
##$NCOEF= 0
##$NC_proc= -6
##$NLEV= 6
##$NOISF1= 3.799351
##$NOISF2= 2.8
##$NSP= 0
##$NTH_PI= 0
##$NZP= 0
##$OFFSET= 15.50229
##$PC= 1
##$PHC0= -7253.948
##$PHC1= 6.42196
##$PH_mod= 1
##$PKNL= yes
##$PPARMOD= 0
##$PSCAL= 0
##$PSIGN= 0
##$REVERSE= no
##$SF= 200.130003884351
##$SI= 16384
##$SIGF1= 3
##$SIGF2= 2
##$SINO= 0.751879
##$SIOLD= 32768
##$SREGLST= <19F.Aceton>
##$SSB= 0
##$STSI= 16384
##$STSR= 0
##$SW_p= 3612.71676300578
##$SYMM= 0
##$S_DEV= 0
##$TDeff= 16384
##$TDoff= 0
##$TI= <>
##$TILT= no
##$TM1= 0
##$TM2= 0
##$TOPLEV= 0
##$USERP1= <user>
##$USERP2= <user>
##$USERP3= <user>
##$USERP4= <user>
##$USERP5= <user>
##$WDW= 1
##$XDIM= 16384
##$YMAX_p= 460497184
##$YMIN_p= -804210
$$ End of Bruker specific parameters
$$ ---------------------------------
##NTUPLES= NMR SPECTRUM
##VAR_NAME=  FREQUENCY,     SPECTRUM/REAL,   SPECTRUM/IMAG
##SYMBOL=    X,             R,               I
##VAR_TYPE=  INDEPENDENT,   DEPENDENT,       DEPENDENT
##VAR_FORM=  AFFN,          ASDF,            ASDF
##VAR_DIM=   16384,         16384,           16384
##UNITS=     HZ,            ARBITRARY UNITS, ARBITRARY UNITS
##FACTOR=    0.220516191357247, 1,           1
##FIRST=     3102.47331229344, 0,            0
##LAST=      -510.243450712343, 0,           0
##MIN=       -510.243450712343, -804210,     0
##MAX=       3102.47331229344, 460497184,    0
$$ Real data points
##PAGE= N=1
##DATA TABLE= (X++(R..R)), XYDATA
$$ [...]
6032b82018K7117K0545M7313Q091L5814k1290K3136J8268L5959J6920q3620M725
$$ -282018 -254901 -234356 -187043 -178952 -143138 -164428 -141292 -123024 -87065 -70145 -153765 -149040
6020a49040n0485o0953l2327L7922P9018J27620l863r2647J3311n5923K7883R844
$$ -149040 -199525 -260478 -292805 -254883 -175865 -48245 -52108 -144755 -131444 -187367 -159484 -149640
6008a49640l1124M1417L2377n7585j0053J6428J7445q4038k5781r623O3014J03867
$$ -149640 -180764 -139347 -106970 -164555 -174608 -158180 -140735 -224773 -250554 -260177 -197163 -93296
5996i3296k7393R2097j26616l1296L053N2062q8649K1345K2790J08961j08452
$$ -93296 -120689 -28592 -155208 -186504 -183451 -131389 -220038 -198693 -175903 -66942 -175394
5985a75394O0237j22173O3822j03302R2699O6613l3770k9062N9921K4736l4450
$$ -175394 -115157 -237330 -173508 -276810 -184111 -117498 -151268 -180330 -120409 -95673 -130123
5974a30123M0041n5826L5239l2533N2766l2866P3296j03207k4730o4302r652N1208
$$ -130123 -90082 -145908 -110669 -143202 -90436 -123302 -50006 -153213 -177943 -242245 -251897 -200689
5962b00689O3925Lk6872l8121l4942M6336j7816k8062R6353l5492J28551J3981
$$ -200689 -136764 -136761 -163633 -201754 -236696 -190360 -208176 -236238 -139885 -175377 -46826 -32845
5950c2845o2629Q1769k8474m1724n3239r8496M3457N3389q1629n3554M2135n0671
$$ -32845 -95474 -13705 -42179 -83903 -137142 -235638 -192181 -138792 -220421 -273975 -231840 -282511
5938b82511J37358j1050k3968Q1573K4770l7405Q1325J0793J4358m1565p0074
$$ -282511 -145153 -156203 -180171 -98598 -73828 -111233 -29908 -19115 -4757 -46322 -116396
5927a16396Q2504J8752r1925m5273N4641o7897L0600k1400m9426K6768J37816
$$ -116396 -33892 -15140 -107065 -152338 -97697 -165594 -134994 -156394 -205820 -179052 -41236
5916d1236q781J8843j11973k9417j5779O7523Q084L2141J6768k512m3874q682
$$ -41236 -50017 -31174 -143147 -172564 -188343 -120820 -112736 -80595 -63827 -66339 -110213 -118895
5904a18895o2247N3213k9440R881k5239r403k387j917L1266O9786k8702m0480
$$ -118895 -181142 -127929 -157369 -147488 -172727 -182130 -184517 -186434 -155168 -85382 -114084 -154564
5892a54564j306O9179q0779k9210O46J34209j26829L2733J6733k8929K1593m3409
$$ -154564 -155870 -86691 -167470 -196680 -196034 -61825 -188654 -155921 -139188 -168117 -146524 -189933
5880a89933L0779M0390L9699l4452L1362j82713J54632M2895M2246p8067k5051
$$ -189933 -159154 -118764 -79065 -113517 -82155 -264868 -110236 -67341 -25095 -103162 -128213
5869a28213j0731l0834p3147J53432k8146M2618J7959J10443n2380k623o1973
$$ -128213 -138944 -169778 -242925 -89493 -117639 -75021 -57062 53381 1001 -1622 -63595
5858f3595K8052L6498L3644R1851k6286P2861J13480K2144m8195O5132O6868K7544
$$ -63595 -35543 955 34599 126450 100164 173025 286505 308649 260454 325586 392454 419998
5846D19998j7146j2401N6149k7400l9170P4230Q330n5376K0691l9174P300M5127
$$ 419998 402852 390451 446600 419200 380030 454260 462590 407214 427905 388731 396031 441158
5834D41158n5629p3271o7500o0031Q9212r0891o9694J03371j2730q2818m9302
$$ 441158 385529 312258 244758 184727 273939 183048 113354 216725 203995 121177 71875
5823G1875N1L7230N162J5810J00584q1559N947m6077J08655p3151j1524o5627
$$ 71875 71926 109156 114318 130128 230712 149153 155100 109023 217678 144527 133003 67376
5811F7376r424m6825R7284R0980l9517k9728l2681O5465o5249L8537j0588n0553
$$ 67376 57952 11127 108411 199391 159874 130146 97465 162930 97681 136218 125630 75077
5799G5077k8414J20545j7577P5946L6957j5771r7988J22053l0949M3563l1198
$$ 75077 46663 167208 149631 225577 262534 246763 148775 270828 239879 283442 252244
5788B52244j8378n1213J7389K6977J68408P8450l5299L9464L2619l5987Q4213
$$ 252244 233866 182653 200042 227019 395427 473877 438578 478042 510661 474674 558887
5777E58887Q1626O3725N3647N399J44447O9348O2552Q8770J44093J8494J88138
$$ 558887 640513 704238 757885 763284 907731 977079 1039631 1128401 1272494 1290988 1479126
5766A479126K48461K90370M33220N99512J051428K163531L251113M123665L399305
$$ 1479126 1727587 2017957 2451177 3050689 4102117 6265648 9516761 13640426 17039731
5757A7039731J827578j98108j139936j953328k239904k242046j979558j762190
$$ 17039731 18867309 18669201 17529265 15575937 13336033 11093987 9114429 7352239
5749G352239j457497j261181r16598p93542m27198k38208k81487l19139j93165
$$ 7352239 5894742 4633561 3716963 2923421 2496223 2258015 1976528 1657389 1464224
5740A464224j03882o7845r9902j32942p4018l2179M5073m1080q9367p8696P2346
$$ 1464224 1360342 1292497 1192595 1059653 985635 953456 998529 957449 868082 789386 861732
5729H61732k8398k5495J750K3495p2606r2056o0541l625p6233L8878K0486K7556
$$ 861732 833334 807839 809589 833084 760478 668422 607881 604256 528023 566901 587387 614943
5717F14943p3252J2477M6037k5997q5707P926l9356J2782k0994k5632K9284Q4615
$$ 614943 541691 554168 600205 574208 488501 496427 457071 469853 448859 423227 452511 537126
5705E37126o0212o314n4210R3709l3321n6777j0457K5927k3437L7242o3096J00299
$$ 537126 476914 470600 416390 510099 476778 420001 409544 435471 412034 449276 386180 486479
5693D86479R122K0682p1605M9604M7279o3421n6619K8119M1726L2727k0763r090
$$ 486479 495601 516283 444678 494282 541561 478140 421521 449640 491366 524093 503330 494240
5681D94240O7639j33827l8414k2990R432m1424K5771j00781J14477J5991J5169
$$ 494240 561879 428052 389638 366648 376080 334656 360427 259646 374123 390114 405283
5670D05283j3949k0722j1682k4285J456M6803N7189J23455k4107Q007j58249J08401
$$ 405283 391334 370612 358930 334645 336101 382904 440093 563548 539441 547448 389199 497600
5658D97600R367M6822N1568p5948j9241J27282l2537q6142J2600M7385M6572K2570
$$ 497600 506967 553789 605357 529409 510168 637450 604913 518771 531371 578756 625328 647898
5646F47898j4611K2929R4149o7580j06132l5420j200Q9303J08225j5717M6687
$$ 647898 633287 656216 750365 682785 576653 541233 540033 629336 737561 721844 768531
5635G68531K9340j9265j6872R7854K0081J7534j9031Q4965l4511K0490l6460N1835
$$ 768531 797871 778606 761734 859588 879669 897203 878172 963137 928626 949116 912656 964491
5623I64491J8798P3077j0781k6971q047P3599J7363N7885o2722J51586L5664N4706
$$ 964491 983289 1056366 1045585 1018614 1010567 1084166 1101529 1159414 1096692 1248278 1283942 1338648
5611A338648O9870N8728M9995J38771R1006l3263N3201P3824P7743m2653J02850
$$ 1338648 1408518 1467246 1517241 1656012 1747018 1713755 1766956 1840780 1918523 1875870 1978720
5600A978720m2172n4499K3013J37813O3809J35923J17043O9866j6881J7198q3130
$$ 1978720 1936548 1882049 1905062 2042875 2106684 2242607 2359650 2429516 2412635 2429833 2346703
5589B346703L3080K7826J6384n894O3561P5063Q8502Q0418l5487K3329J37819
$$ 2346703 2379783 2407609 2423993 2418099 2481660 2556723 2645225 2725643 2690156 2713485 2851304
5578B851304Q3740K7578Q8067R5368J61780N5976K4613J50282P3575J00397K11930
$$ 2851304 2935044 2962622 3050689 3146057 3307837 3363813 3388426 3538708 3612283 3712680 3924610
5567C924610J82280K12187K08273J10187J49849K94722K47318K64692L27548L66236
$$ 3924610 4106890 4319077 4527350 4637537 4787386 5082108 5329426 5594118 5921666 6287902
5557F287902M87707L94706L29961M94244N39523O33428P44642R04069R61402J052054
$$ 6287902 6775609 7170315 7500276 7994520 8534043 9167471 9912113 10816182 11777584 12829638
5547A2829638J183161J309234J506878J913231K385104L293340M296966N683239
$$ 12829638 14012799 15322033 16828911 18742142 21127246 24420586 28717552 34400791
5539C4400791P204922Q891082J0372008J0780661R669459P110960M062900J198039
$$ 34400791 41605713 50496795 60868803 71649464 81318923 88429883 92492783 93690822
5531I3690822o87263j596338j113294K12951J952095L377015L703856K185548
$$ 93690822 93003559 91407221 90293927 90506878 92458973 95835988 99539844 101725392
5523A01725392m45883l270792n942174p696189q711989r039791q662438p942920
$$ 101725392 101279509 98008717 92066543 84370354 75658365 66618574 57956136 50013216
5515E0013216p047035o038279n071349m312746l378843k787010k414022j892531
$$ 50013216 42966181 36927902 31856553 27543807 24164964 21377954 18963932 17071401
5507A7071401j622022j410793j005993r41292q49088p17139o85391o67860n81854
$$ 17071401 15449379 14038586 13032593 12091301 11242213 10525074 9839683 9171823 8589969
5498H589969n57782m36520m30462k85836k61770k49061k52418k51092k45037k73385
$$ 8589969 8032187 7595667 7165205 6879369 6617599 6368538 6116120 5865028 5619991 5346606
5488E346606k25869k15861j63959r1585j72751k13172j19095j49278j31746j11586
$$ 5346606 5120737 4904876 4740917 4649332 4476581 4263409 4144314 3995036 3863290 3751704
5478C751704r2753q7259j03401j48106j06752j50580q1863o1343r1014l8088r5693
$$ 3751704 3658951 3571692 3468291 3320185 3213433 3062853 2980990 2919647 2828633 2790545 2694852
5467B694852p5102j00143o4843l3725p3531r5049l7816M2881j1203R5350r1230
$$ 2694852 2619750 2519607 2454764 2421039 2347508 2252459 2214643 2257524 2246321 2341671 2250441
5456B250441j11943l9190r6721j65107J03462l4931O1981o7211l3393l6332l6799
$$ 2250441 2138498 2099308 2002587 1837480 1940942 1906011 1967992 1900781 1867388 1831056 1794257
5445A794257o6350k6555k6205p3468k8867p270P286j06946J2224n4002k7542k9872
$$ 1794257 1727907 1701352 1675147 1601679 1572812 1565542 1572828 1465882 1478106 1424104 1396562 1366690
5433A366690K5201k5769j6023r0979k1151l4281o1407l43n3430L7275N3249l3351
$$ 1366690 1391891 1366122 1350099 1259120 1237969 1203688 1142281 1141938 1088508 1125783 1179032 1145681
5421A145681J08548m2500j24569l5015K5573O0508O1482O0024J4034j4022o049
$$ 1145681 1254229 1211729 1087160 1052145 1077718 1138226 1199708 1259732 1273766 1259744 1253695
5410A253695q0638r484J6560J7889N3939p270j8787J70856k2689q1384m2465l7028
$$ 1253695 1173057 1163573 1180133 1198022 1251961 1244691 1225904 1396760 1374071 1292687 1250222 1213194
5398A213194J6987O2705M0820L4547j1984o7456J23639r2664j3396j436j2001
$$ 1213194 1230181 1292886 1333706 1368253 1356269 1288813 1412452 1319788 1306392 1304956 1292955
5387A292955o3018R8153n786K031Q776k7716N3441m1013J8229L8347n385q3232
$$ 1292955 1229937 1328090 1322304 1324335 1333111 1305395 1358836 1317823 1336052 1374399 1369014 1285782
5375A285782l9154p3818l473O4970M6931O470O6170L6667k471j3643K8148r2790
$$ 1285782 1246628 1172810 1169337 1234307 1281238 1287708 1353878 1390545 1388074 1374431 1402579 1309789
5363A309789m4275J33123P9062J63230K1381K0211k818J1920q9373Q1046K2355
$$ 1309789 1265514 1398637 1477699 1640929 1662310 1682521 1679703 1691623 1602250 1683296 1705651
5352A705651L5695J10965R5221Q9510O7675m9225n0813N3647j8435N7456N2263
$$ 1705651 1741346 1852311 1947532 2037042 2104717 2055492 2004679 2058326 2039891 2097347 2149610
5341B149610J1786K2317N8660l5937P5118J33948J28965M4533J39985N2763N0474
$$ 2149610 2161396 2183713 2242373 2206436 2281554 2415502 2544467 2589000 2728985 2781748 2832222
5330B832222L7689J7726O7962P6662J14027K67236J65842J93312K49929J74255
$$ 2832222 2869911 2887637 2955599 3032261 3146288 3413524 3579366 3772678 4022607 4196862
5320D196862J81818J93415K46030K88099L54730L65653M11696M79537M06748M53686
$$ 4196862 4378680 4572095 4818125 5106224 5460954 5826607 6238303 6717840 7124588 7578274
5310G578274N84306O86167Q43259J149720J224937J460444K033502K673736L892393
$$ 7578274 8162580 8848747 9692006 10841726 12066663 13527107 15560609 18234345 22126738
5301B2126738O362481R816826J2875856J3111474R536680M146766o35679l830109
$$ 22126738 28489219 38306045 51181901 64293375 73830055 77976821 77341142 73511033
5293G3511033n441212n551091m464569j724860K259102O557911R023797P599950
$$ 73511033 68069821 62518730 58054161 56329301 58588403 65146314 74170111 81770061
5285H1770061L032024j947050n768481q011920q912929q797163p997699o949793
$$ 81770061 84802085 82855035 77086554 69074634 60161705 51364542 43366843 36417050
5277C6417050o050117n156237m126533l192740k312915j920935j516129j217055
$$ 36417050 30366933 25210696 21084163 17891423 15578508 13657573 12141444 10924389
5269A0924389j031883q67884o81120o14703m99627m24829m00257l76683k58861
$$ 10924389 9892506 9024622 8343502 7728799 7229172 6804343 6404086 6027403 5768542
5260E768542k63295k92303k23360k96065k01977j53387j12756j26107j10921j99582
$$ 5768542 5505247 5212944 4989584 4693519 4491542 4338155 4225399 4099292 3988371 3788789
5250C788789j52085j24874k34235j18069o8710o6758l0357j6526j56497p7798
$$ 3788789 3636704 3511830 3277595 3159526 3090816 3024058 2993701 2977175 2820678 2742880
5240B742880r5641r2184m3267r2303p5573K6654j7405j03461r3659j40028j3592
$$ 2742880 2647239 2555055 2511788 2419485 2343912 2370566 2353161 2249700 2156041 2016013 2002421
5229B002421m5758p0612j7740k066p4244k3886n0754m9286k4564Q8287K4353Q759
$$ 2002421 1956663 1886051 1868311 1866245 1792001 1768115 1717361 1668075 1643511 1731798 1756151 1764910
5217A764910N0070J5807K3252m734j00614k2428N590L004r5431n3943O476j2944
$$ 1764910 1814980 1830787 1854039 1849305 1748691 1726263 1731853 1734857 1639426 1585483 1591959 1579015
5205A579015N0383m6590j28151n7103q4419j3344M5822k0071j21718l9738J3709
$$ 1579015 1629398 1582808 1454657 1397554 1313135 1299791 1345613 1325542 1203824 1164086 1177795
5194A177795j00585l9476l3333L8703P8159q2966p6154p5106j15047K403j4970
$$ 1177795 1077210 1037734 1004401 1043104 1121263 1038297 962143 887037 771990 774393 759423
5183G59423P3342O5213P284o036k4472j0202j07423k9740k0021Q5300K091j3104
$$ 759423 832765 897978 905262 899226 874754 864552 757129 727389 707368 792668 794759 781655
5171G81655J2052P102q9790p6068l0559M2139J20567K5002m5360p1721K0301J1204
$$ 781655 793707 800809 711019 634951 604392 646531 767098 792100 746740 675019 695320 706524
5159G06524l6319o3086L6885M2876n755k7599N0207K8564m0578q1315m0992K9625
$$ 706524 670205 607119 644004 686880 681125 653526 703733 732297 691719 610404 569412 599037
5147E99037M9977l2491N6484K7889J057k3935l2254j49269J3321R0654Q436M5374
$$ 599037 649014 616523 673007 700896 701953 678018 645764 496495 509816 600470 608906 654280
5135F54280J5722j22713n374o6335K3556m4711K8600P7086M5857q2071M9720R195
$$ 654280 670002 547289 541915 475580 499136 454425 483025 560111 605968 523897 573617 582812
5123E82812q5019N1385q0603L1901M4418L4372j7374J21720r2150N4447L4485
$$ 582812 497793 549178 468575 500476 544894 579266 561892 683612 591462 645909 680394
5112F80394j9378K0266R4219J3720m1486P709j2835J00160j7392l8322K1400M1749
$$ 680394 661016 681282 775501 789221 747735 755444 742609 842769 825377 787055 808455 850204
5100H50204o6851K549r2520o4429K1710j3280j0956N3914N4919j361j2214p8994
$$ 850204 783353 785902 693382 628953 650663 637383 626427 680341 735260 733899 721685 642691
5088F42691o7057l6801K0390q7894Q202M9626J03325k7418l6973p4875N1607l5299
$$ 642691 575634 538833 559223 471329 479531 529157 632482 605064 568091 493216 544823 509524
5076E09524N9792K9924J08389m231n1631j3673m9344L6165j8641J02259p0747
$$ 509524 569316 599240 707629 703398 651767 638094 588750 624915 606274 708533 637786
5065F37786O0884K6007K3375m6948k658j8013L0222j1716Q2049R7912k5892l0978
$$ 637786 698670 724677 748052 701104 698446 680433 710655 698939 780988 878900 853008 822030
5053H22030j6281j6800j5277r2313M8252M8119L7277m942j5441j680j04030m1749
$$ 822030 805749 788949 773672 681359 729611 777730 815007 810065 794624 792944 688914 647165
5041F47165p8789M6968L0577J7289k599j8927J8826k8518k6942p0643O0582J2670
$$ 647165 568376 615344 645921 663210 660611 641684 660510 631992 605050 534407 594989 607659
5029F07659Q9796K6164L8516n4680r2680K2682M7563M2124o0565J95448p3383
$$ 607659 697455 723619 762135 707455 614775 637457 685020 727144 666579 862027 788644
5018G88644l4250K7090k1471r6870J02593Q389P5286K645p6090J0722n5221l1474
$$ 788644 754394 781484 760013 663143 765736 774125 849411 852056 775966 786688 731467 699993
5006F99993N8195M5083L2100J13013L3932L9396q2016q6517n0636J51585l5807
$$ 699993 758188 803271 835371 948384 982316 1021712 939696 853179 802543 954128 918321
4995I18321J14238J07163Q4603Q1455J08415R057J412R9104m1675l7360L1701
$$ 918321 1032559 1139722 1224325 1305780 1414195 1423252 1424664 1523768 1482093 1444733 1476434
4984A476434J38926n1300k6313j89227j7855O674m0194j1319n7031k5802M9877
$$ 1476434 1615360 1564060 1537747 1348520 1330665 1337339 1297145 1285826 1228795 1202993 1252870
4973A252870R269o492R1821L2884p7750j3444j3721o8989P9420o6396j01089j32009
$$ 1252870 1262139 1255647 1347468 1380352 1302602 1289158 1275437 1206448 1285868 1219472 1118383 986374
4961I86374l6408m1622J23223o851J03959N9890j0011m9941o7160M8033l5469
$$ 986374 949966 908344 1031567 1024716 1128675 1188565 1178554 1128613 1061453 1109486 1074017
4950A074017J17819J989O646o4157L4331j7479J1670r1875M2980J183O4029Q021
$$ 1074017 1191836 1193825 1200471 1136314 1170645 1153166 1164836 1072961 1115941 1117124 1181153 1189174
4938A189174m2655R1202p0237q8256N5246M4078J7605O4930O1955L7239r7977
$$ 1189174 1146519 1237721 1167484 1079228 1134474 1178552 1196157 1261087 1323042 1360281 1262304
4927A262304N478O3518n4480L0113K3888L157Q0416K0965r4553N1376j05875n7198
$$ 1262304 1267782 1331300 1276820 1306933 1330821 1333978 1414394 1435359 1340806 1392182 1286307 1229109
4915A229109P7850J19755P4026L61o4258l6464J17179L6943M8540k9068N5612
$$ 1229109 1306959 1426714 1500740 1501101 1436843 1400379 1517558 1554501 1603041 1573973 1629585
4904A629585j08107k1671M550J66847l7228N0895k9654j0966j4968J29047l7149
$$ 1629585 1521478 1499807 1504357 1671204 1633976 1684871 1655217 1644251 1629283 1758330 1721181
4893A721181J03517k6004o6628L3740M5131M3858K5672m5159J9918P6754m8857
$$ 1721181 1824698 1798694 1732066 1765806 1810937 1854795 1880467 1835308 1855226 1931980 1883123
4882A883123J8869k1352Q5786n9022N5396K3527Q9658P880O1262m949O0543L4478
$$ 1883123 1901992 1880640 1966426 1907404 1962800 1986327 2075985 2083865 2145127 2140178 2200721 2235199
4870B235199n2467O2240j0162N662j8717K9634l6465k6789R1676R8641K5446N5525
$$ 2235199 2182732 2244972 2234810 2240472 2221755 2251389 2214924 2188135 2279811 2378452 2403898 2459423
4858B459423J03645L5521l968Q8905J55938j248J94536J55354J45514R6297J08727
$$ 2459423 2563068 2598589 2594621 2683526 2839464 2838216 3032752 3188106 3333620 3429917 3538644
4847C538644r9026J7807j43659O0230n222K8854n3658O2209O0593N0735J53833
$$ 3538644 3439618 3457425 3313766 3373996 3368774 3397628 3343970 3406179 3466772 3517507 3671340
4836C671340O0801J03502J00461J62613J11885J27275J61664L13316K42721O47097
$$ 3671340 3732141 3835643 3936104 4098717 4210602 4337877 4499541 4812857 5055578 5702675
4826E702675J020070J791722K794763L073417K100283N95668n15460j035863j474646
$$ 5702675 6722745 8514467 11309230 14382647 16482930 17078598 16563138 15527275 14052629
4817A4052629j689377j495181j259112j007373q76536o71626n42114l48186k83313
$$ 14052629 12363252 10868071 9608959 8601586 7725050 7053424 6511310 6163124 5879811
4808E879811k02700j00419k47354k4182n0812j05486k957L8473j05521N9624R592
$$ 5879811 5677111 5576692 5329338 5305156 5254344 5148858 5145901 5184374 5078853 5138477 5148069
4797E148069O5162R9103p439M9252R6794o481P792P0811R1937O7489O8088K4090
$$ 5148069 5213231 5312334 5304895 5354147 5450941 5444460 5452252 5523063 5615000 5682489 5750577 5774667
4785E774667r843K9930Q7410R0423k4981M9220J23737J84384o531J6533R0158
$$ 5774667 5764824 5794754 5882164 5972587 5947606 5996826 6120563 6304947 6298416 6314949 6405107
4774F405107R6544m570J8289L4144J24666J51144R7210P5977N3431K1882R640
$$ 6405107 6501651 6497081 6515370 6549514 6674180 6825324 6922534 6998511 7051942 7073824 7083464
4763G083464L6350J63854J47361J31556N7419P2887R3435N1970J50607J29460
$$ 7083464 7119814 7283668 7431029 7562585 7620004 7692891 7786326 7838296 7988903 8118363
4753H118363K0207J00824J14251K5810M6208J69238K01724l0330M7787J90430
$$ 8118363 8138570 8239394 8353645 8379455 8425663 8594901 8796625 8766295 8814082 9004512
4743I004512J43215J51888K01108L3164P2270M9667O2360J12742J02726L3648
$$ 9004512 9147727 9299615 9500723 9533887 9606157 9655824 9718184 9830926 9933652 9967300
4733I967300K02703M2868R5864R8444J34635N8287O5297N5112J13596K12600J40032
$$ 9967300 10170003 10212871 10308735 10407179 10541814 10600101 10665398 10720510 10834106 11046706 11186738
4722A1186738J56093J11825N4339Q4884J91830n4513L2334K15656Q1290O8584
$$ 11186738 11342831 11454656 11508995 11593879 11785709 11731196 11763530 11979186 12060476 12129060
4712A2129060M7898J60019J01567j5657J51773J64402Q5040j545K05298J05093
$$ 12129060 12176958 12336977 12438544 12422887 12574660 12739062 12824102 12822557 13027855 13132948
4702A3132948j4441J66695J18972K2912K02408l647J24715O308j8339J28395P3862
$$ 13132948 13118507 13285202 13404174 13427086 13629494 13625847 13750562 13756870 13738531 13866926 13940788
4691A3940788L6693N6592N5999M4359O5281J22759n0917L6223P7594O910L4686
$$ 13940788 13977481 14034073 14090072 14134431 14199712 14322471 14271554 14307777 14385371 14392281 14426967
4680A4426967Q0995J43168P6622l9898R2972L3768p0673J1590N8760J9773j2147
$$ 14426967 14507962 14651130 14727752 14687854 14780826 14814594 14743921 14755511 14814271 14834044 14821897
4669A4821897L3719R6277O7820J9R8189P7634p2127j4574J44684l5838q2001M3654
$$ 14821897 14855616 14951893 15019713 15019732 15117921 15195555 15123428 15108854 15253538 15217700 15135699 15179353
4657A5179353N9156l7957k7826k4375Q0791k3457K0807n4729j02005q1779N7o6129
$$ 15179353 15238509 15200552 15172726 15148351 15229142 15205685 15226492 15171763 15069758 14987979 14988036 14921907
4645A4921907O1890p3963R301n0287m2201q1341o9105n6662j58883k326m7483
$$ 14921907 14983797 14909834 14919135 14868848 14826647 14745306 14676201 14619539 14460656 14458330 14410847
4634A4410847j752M4652L8418R9425K2277J27164N38210P59349P85327N50036
$$ 14410847 14409095 14453747 14492165 14591590 14613867 14741031 15279241 16038590 16823917 17373953
4624A7373953J48051k60381l11997m42065n18188n23333m32865k87425l25602
$$ 17373953 17522004 17261623 16949626 16507561 15989373 15466040 15033175 14745750 14420148
4615A4420148k97043n0027R770k2543J61010L20165K80473L79333K74184J89997
$$ 14420148 14123105 14073078 14082848 14060305 14221315 14541480 14821953 15201286 15475470 15665467
4605A5665467J70496K57262K34863M02278N66133O62672M35436J68824N9316O3964
$$ 15665467 15835963 16093225 16328088 16730366 17296499 17959171 18394607 18563431 18622747 18686711
4595A8686711j0875K30715N82199N38511N01594K41911j67602l21372m96275n32966
$$ 18686711 18675836 18906551 19488750 20027261 20528855 20770766 20603164 20281792 19785517 19252551
4585A9252551k16577o8401j64029j89015l34852n42091n09216n93065n23105m00734
$$ 19252551 19035974 18967573 18803544 18614529 18279677 17737586 17228370 16635305 16112200 15711466
4575A5711466k89460k93157l05744l90983l49572l57242l72316k30399p2880p9092
$$ 15711466 15422006 15128849 14823105 14432122 14082550 13725308 13352992 13122593 13049713 12970621
4565A2970621O2454J82752K51202M60496P21126J012942J257094J619844K095691
$$ 12970621 13033075 13215827 13467029 13927525 14648651 15661593 16918687 18538531 20634222
4556B0634222K376924K583626K604951K420913K001164J710578J548413J587204
$$ 20634222 23011146 25594772 28199723 30620636 32621800 34332378 35880791 37467995
4548C7467995J913772K388461L092147L407740L091597K441256J388897j37076
$$ 37467995 39381767 41770228 44862375 48270115 51361712 53802968 55191865 55054789
4540E5054789j171505j838125k355820k432214k270607k079269j907559j969140
$$ 55054789 53883284 52045159 49689339 47257125 44986518 42907249 40999690 39030550
4532C9030550j916046k017993k289927k452847k494586k613346k481718k203385
$$ 39030550 37114504 35096511 32806584 30353737 27859151 25245805 22764087 20560702
4524B0560702k051866j635694j456772j132491q97868p34883o02305l42687l09707
$$ 20560702 18508836 16873142 15416370 14283879 13386011 12651128 12048823 11706136 11396429
4515A1396429k88453k9711J39642K35663N29866R62540J571493K286035K680909
$$ 11396429 11107976 11078265 11217907 11453570 11983436 12945976 14517469 16803504 19484413
4506A9484413K610524K168852J347097N42786j43426o75845o07142o7501R19238
$$ 19484413 22094937 24263789 25610886 26153672 26010246 25334401 24727259 24659758 25578996
4497B5578996K489110L868099M151318L399746K081956J57080j529754k571173
$$ 25578996 28068106 31936205 36087523 39487269 41569225 41726305 40196551 37625378
4489C7625378l104449l035936k621570j741345p18226k36727q1354j97956o40552
$$ 37625378 34520929 31484993 28863423 27122078 26403852 26167125 26085771 25887815 25247263
4480B5247263j351390j863345k132205k134573k128813k001657j653179j588841
$$ 25247263 23895873 22032528 19900323 17765750 15636937 13635280 11982101 10393260
4472A0393260j247098q86480p18973n35332m14337l78007l26978m00490j79578
$$ 10393260 9146162 8259682 7540709 7005377 6591040 6213033 5886055 5485565 5305987
4463E305987j52813k22205k50468j2060j47823q4966j07019o2064r3918p6955
$$ 5305987 5153174 4930969 4680501 4668441 4520618 4435652 4328633 4266569 4172651 4095696
4453D095696r4106n8132j21445j44311P466m5241o7349L4672j014j08910j14289
$$ 4095696 4001590 3943458 3822013 3677702 3685168 3639927 3572578 3607250 3606236 3497326 3383037
4442C383037L5811K5323L9156k6944R582j01862p1218K394K6660q1616m9638O3867
$$ 3383037 3418848 3444171 3483327 3456383 3465965 3364103 3292885 3295279 3321939 3240323 3190685 3254552
4430C254552j36993j8335p9809p2891j12312k2668j24745M0444n735j2713j3012
$$ 3254552 3117559 3099224 3019415 2946524 2834212 2811544 2686799 2727243 2721508 2708795 2695783
4419B695783m9619j60059Q6824m4337j40582L5551P2100q6731q6260P842J09455
$$ 2695783 2646164 2486105 2572929 2528592 2388010 2423561 2495661 2408930 2322670 2330512 2439967
4408B439967O59j70246l8920k2920j27262q428Q0167r7113p134J03343n395N4507
$$ 2439967 2440626 2270380 2231460 2208540 2081278 2072850 2153017 2055904 2048770 2152113 2146718 2201225
4396B201225k608L45n4679r8549L509J1565r5524l1040J7624o6275q2198k4121
$$ 2201225 2198617 2198962 2144283 2045734 2049243 2060808 1965284 1934244 1951868 1885593 1803395 1779274
4384A779274J39909M0502q1040K7236J3073o5589k3664p0750L7635l4963j2961
$$ 1779274 1919183 1959685 1878645 1905881 1918954 1853365 1829701 1758951 1796586 1761623 1748662
4373A748662M2774L147o6017O6283J6465m9920j3799Q8000r720p566k2397k0541
$$ 1748662 1791436 1794583 1728566 1794849 1811314 1761394 1747595 1835595 1825875 1818309 1795912 1775371
4361A775371L976m0516j1027l9987m8316L1844P4054q6725j3949J21321j3258
$$ 1775371 1779347 1738831 1727804 1687817 1639501 1671345 1745399 1658674 1644725 1766046 1752788
4350A752788o2888J3295n1394O92Q65n5486J5643J0201j06107P9044Q160o0825
$$ 1752788 1689900 1703195 1651801 1652493 1653358 1597872 1613515 1623716 1517609 1596653 1604813 1543988
4338A543988M2914M0381o0188O5234L297o0544L8612n1074j973O6251o8664P7389
$$ 1543988 1586902 1627283 1567095 1632329 1635626 1575082 1613694 1562620 1560647 1626898 1558234 1635623
4326A635623P5866j33720k515J5766j846M7997J34892l1143M9015M8208k7442
$$ 1635623 1711489 1577769 1575254 1591020 1589174 1637171 1772063 1740920 1789935 1838143 1810701
4315A810701l0672j8269l2551Q8486O0561m81J24614j1092j36524L4930N3416
$$ 1810701 1780029 1761760 1729209 1817695 1878256 1877775 2002389 1991297 1854773 1889703 1943119
4304A943119m6906M4028L6301J72248K0415j6747J9314N0651N8339R8375Q0319
$$ 1943119 1896213 1940241 1976542 2148790 2169205 2152458 2171772 2222423 2280762 2379137 2459456
4293B459456J4742J35854J28358P6548N1066J43692J17044J96145N7889J66522
$$ 2459456 2474198 2610052 2738410 2814958 2866024 3009716 3126760 3322905 3380794 3547316
4283C547316J34612J43921J73797K51027L52716K94869L43789M75195M66933L85088
$$ 3547316 3681928 3825849 3999646 4250673 4603389 4898258 5242047 5717242 6184175 6569263
4273F569263M04731K90668L26392K49553K81858K63428K90105L62004N14651O32377
$$ 6569263 6973994 7264662 7591054 7840607 8122465 8385893 8675998 9038002 9552653 10185030
4263A0185030P44265R09464J023119R29357J031096Q77671O90703O60722M75364
$$ 10185030 10929295 11838759 12861878 13791235 14822331 15700002 16390705 17051427 17526791
4254A7526791K59398J70114K27975K78610L91490O64910R80432J161738J214952
$$ 17526791 17786189 17956303 18184278 18462888 18854378 19519288 20499720 21661458 22876410
4245B2876410J190465J291363J072039Q89509P12094M12433J9087j97745l38739
$$ 22876410 24066875 25358238 26430277 27319786 28031880 28444313 28463400 28265655 27926916
4236B7926916m63035m68176k22350J21048L13135O28318R24761R28315Q18644
$$ 27926916 27463881 26995705 26773355 26894403 27207538 27835856 28760617 29688932 30507576
4227C0507576O71521L66849k17245n88592j031399j181554j308069j314206j046346
$$ 30507576 31179097 31545946 31328701 30740109 29708710 28527156 27219087 25904881 24858535
4218B4858535q69146o95037l23031O1608J00335K60316J20169j54186n16585r42871
$$ 24858535 23989389 23294352 22971321 23032929 23133264 23393580 23513749 23359563 22842978 21900107
4208B1900107j318286j347841j453527j294429j107837j074058q11364o02577
$$ 21900107 20581821 19233980 17780453 16486024 15378187 14304129 13492765 12890188
4200A2890188m12066k59204k07008k25821k78264n10708n90154p31041q19389
$$ 12890188 12478122 12218918 12011910 11786089 11507825 10997117 10406963 9675922 8856533
4191H856533p75508o77052o31628n71441l85970l53261k25283k33608k12088k54548
$$ 8856533 8081025 7403973 6772345 6200904 5814934 5461673 5236390 5002782 4790694 4536146
4181D536146k98771k54658k27952k19000j57366j77061j30900k54797j03669j91261
$$ 4536146 4237375 3982717 3754765 3535765 3378399 3201338 3070438 2815641 2711972 2520711
4171B520711j47181q9093j33988l1779j41091q19j379J0694j17622j1992n3750
$$ 2520711 2373530 2284437 2150449 2118670 1977579 1976760 1975381 1986075 1868453 1856461 1802711
4160A802711m5101q37l1052r1837M73r8484m8670k7463o0925P9260J7609q9988
$$ 1802711 1757610 1756773 1725721 1633884 1634357 1535873 1487203 1459740 1398815 1478075 1495684 1405696
4148A405696j9571Q4243m4122q3586m4671L7517n6518P769n0985k150p2766o116
$$ 1405696 1386125 1470368 1426246 1342660 1297989 1335506 1278988 1286757 1235772 1233622 1160856 1154740
4136A154740o1840j36637l2540R5119l9779l3602Q9530k9585l7848K737l3224
$$ 1154740 1092900 956263 923723 1018842 979063 945461 1034991 1005406 967558 970295 937071
4125I37071M230j0368L1879q893j875q2953L9604j8298q0683m6883N1282L235
$$ 937071 941301 930933 962812 953919 952044 869091 908695 890397 809714 762831 814113 817348
4113H17348m7696J5215l0174q51n9989J17171J4878J0572M0185J9259j13277k6631
$$ 817348 769652 784867 754693 753842 693853 811024 825902 836474 876659 895918 782641 756010
4101G56010L7294P0442m5488r0515M7957L9118q4895L1169J3033m1233o5222N5204
$$ 756010 793304 863746 818258 727743 775700 814818 729923 761092 774125 732892 667670 722874
4089G22874K659J5097j05410K6762j869l9993J0897J39146o566R3148O2271q7126
$$ 722874 725533 740630 635220 661982 660113 620120 631017 770163 763597 856745 919016 831890
4077H31890r1890L7510j1701J18210N139m5262M4001l4732Q533K1627o054n1223
$$ 831890 740000 777510 765809 884019 889158 843896 887897 853165 861698 883325 877271 826048
4065H26048q5589Q713J19460O4719l0368J05383j9669j48735P3953O0352M0417
$$ 826048 740459 749172 868632 933351 902983 1008366 988697 839962 913915 974267 1014684
4054A014684l7027N3650p6660P4273N296Q3956p3106K0270k3493L5962l1661M5236
$$ 1014684 977657 1031307 954647 1028920 1034216 1118172 1045066 1065336 1041843 1077805 1046144 1091380
4042A091380O194J5990m1259j8240k7701o76L8466K4309q5377o5062M114K5728
$$ 1091380 1097574 1113564 1072305 1054065 1026364 1025688 1064154 1088463 1003086 938024 942138 967866
4030I67866m6328Q1650O323R674j66672K9957J1821r9675J5064l1342m5846j1541
$$ 967866 921538 1003188 1009511 1019185 852513 882470 894291 794616 809680 778338 732492 720951
4018G20951P1350N9885J0562j08662l59j2767l2095j4416J08931j47619j12925
$$ 720951 792301 852186 862748 754086 753727 740960 708865 694449 803380 655761 542836
4007E42836P2039K9561p471L1915n7578P3249q1772j8199j839l2462n3455J6465
$$ 542836 614875 644436 636965 668880 611302 684551 602779 584580 582741 550279 496824 513289
3995E13289k262J6642P0701P5465n0380L4289l625l447k1655P5310L9310R3776
$$ 513289 511027 527669 598370 673835 623455 657744 654119 650672 629017 704327 743637 837413
3983H37413m0102P319R226P9953j7927K4454Q3174K6833O4487P7850M5939o3082
$$ 837413 797311 804630 813856 893809 875882 900336 983510 1010343 1074830 1152680 1198619 1135537
3971A135537N6032n2626P4187J5165L4602n1803L7696K2201J0538l3280k0370
$$ 1135537 1191569 1138943 1213130 1228295 1262897 1211094 1248790 1270991 1281529 1248249 1227879
3960A227879J4790k4069j09815P0387j13573O4322n592k0675M5494J02166L108
$$ 1227879 1242669 1218600 1108785 1179172 1065599 1129921 1124329 1103654 1149148 1251314 1254422
3949A254422J73423K86094L07834N49471L74839J5206j36546j06576k69933k36529
$$ 1254422 1427845 1713939 2021773 2571244 2946083 2961289 2824743 2718167 2448234 2211705
3939B211705k03245j76096p8752j03917j43303j07921j70486l9703P9153L07q9462
$$ 2211705 2008460 1832364 1753612 1649695 1506392 1398471 1227985 1188282 1267435 1267742 1178280
3928A178280J74193k7463O819o0271L4149l5972j870K4092K1308R7385J41541
$$ 1178280 1352473 1325010 1331829 1271558 1305707 1269735 1267865 1291957 1313265 1410650 1552191
3917A552191K16158M34448M85166L46494J98762l1046j77691k17705k23253k38122
$$ 1552191 1768349 2202797 2687963 3034457 3233219 3202173 3024482 2806777 2583524 2345402
3907B345402k62696k10407j81350j11986r742K5511p3993j02251K14m7783n0066
$$ 2345402 2082706 1872299 1690949 1578963 1569221 1594732 1520739 1418488 1418702 1370919 1320853
3896A320853j1490Q9773L0314k5314N9409N67j12498k1679p7638L861r8657N8010
$$ 1320853 1309363 1399136 1429450 1404136 1463545 1464112 1351614 1329935 1252297 1256158 1157501 1215511
3884A215511Q3156J42376r8514k4780n7715o1963j0783O7541K5994J32487k5600
$$ 1215511 1298667 1441043 1342529 1317749 1260034 1198071 1187288 1254829 1280823 1413310 1387710
3873A387710l2069J2410m5726r097O7328k9564j9276M4450l0799P2856K7965n8727
$$ 1387710 1355641 1368051 1322325 1313228 1380556 1350992 1331716 1376166 1345367 1418223 1446188 1387461
3861A387461m6125n434L8870J01609k505P3482p6565O1703r4771P2723O344J09324
$$ 1387461 1341336 1335902 1374772 1476381 1473876 1547358 1470793 1532496 1437725 1510448 1516792 1626116
3849A626116R1289Q9627m1702L9371N9785M2664k5683m982K2645R9257P5863R4082
$$ 1626116 1717405 1807032 1765330 1804701 1864486 1907150 1881467 1876485 1899130 1998387 2074250 2168332
3837B168332K8632n2917M971Q5964l0471M03O4313J03115M8385P3385M5473N3529
$$ 2168332 2196964 2144047 2149018 2234982 2204511 2204914 2269227 2372342 2420727 2494112 2539585 2593114
3825B593114M5338N3749J19654J06617j5059N7968J39744M3310R2338J06420J02170
$$ 2593114 2638452 2692201 2811855 2918472 2903413 2961381 3101125 3144435 3236773 3343193 3445363
3814C445363J65513J88049J74125L58942R6847K62347K55811L22253L63736N26738
$$ 3445363 3610876 3798925 3973050 4331992 4428839 4691186 4946997 5269250 5632986 6159724
3804F159724M34036O57762P44545Q62114R32269J205962J458130J918718K047821
$$ 6159724 6593760 7251522 7996067 8858181 9790450 10996412 12454542 14373260 16421081
3795A6421081K393073K580144K624959K603337K527999K327963J975275J616012
$$ 16421081 18814154 21394298 24019257 26622594 29150593 31478556 33453831 35069843
3787C5069843J315515P45976M17578J90246k51882l21797k13622k48069r2309
$$ 35069843 36385358 37131334 37548912 37739158 37487276 37165479 36951857 36703788 36611479
3778C6611479R9714J50451K79444K11721o9378j80769m54871r15011j285269j574832
$$ 36611479 36711193 36861644 37141088 37352809 37283431 37102662 36647791 35732780 34447511 32872679
3768C2872679j964391k120495k201169k477859k378909k266022j933980j841896
$$ 32872679 30908288 28787793 26586624 24108765 21729856 19463834 17529854 15687958
3760A5687958j481556j503615j106110j105635q48890p07855n81525o09935l09046
$$ 15687958 14206402 12702787 11596677 10491042 9642152 8934297 8352772 7742837 7433791
3751G433791l51427k94325k08575k17783k35769k73513j76161q2864k28520j57206
$$ 7433791 7082364 6788039 6579464 6361681 6125912 5852399 5676238 5593374 5364854 5207648
3741E207648j9430j07731j23783j06367j06846j94069Q124J6755r1787j00157
$$ 5207648 5188218 5080487 4956704 4850337 4743491 4549422 4557546 4574301 4482514 4382357
3731D382357m0806j13467p2438j15208r6447K2379p4136q1874J11310M8681k7037
$$ 4382357 4341551 4228084 4155646 4040438 3943991 3966370 3892234 3810360 3921670 3970351 3943314
3720C943314j03146O6270j5009k8234m4916R9228n0190m2164n1929N5994j56823
$$ 3943314 3840168 3906438 3891429 3863195 3818279 3917507 3867317 3825153 3773224 3829218 3672395
3709C672395L7346j3329l1215r0101J18490p547j4998j8941R4759M26j2589P4298
$$ 3672395 3709741 3696412 3665197 3575096 3693586 3686039 3671041 3652100 3746859 3747285 3734696 3808994
3697C808994L1864O5847j8256P6768p0338m0502r2089J02356j5203J40108m8580
$$ 3808994 3840858 3906705 3888449 3965217 3894879 3854377 3762288 3864644 3849441 3989549 3940969
3686C940969M7248n1323J34112m1495M2987L8801M5491J69924J00428k5134R0357
$$ 3940969 3988217 3936894 4071006 4029511 4072498 4111299 4156790 4326714 4427142 4402008 4492365
3675D492365j4446O3880J13749P6257O5289Q8883J54612J75378M1783J59708J36997
$$ 4492365 4477919 4541799 4655548 4731805 4797094 4885977 5040589 5215967 5257750 5417458 5554455
3664E554455K15131J66016J71598K54386K48876K90879L79634K75844K88271M53861
$$ 5554455 5769586 5935602 6107200 6361586 6610462 6901341 7280975 7556819 7845090 8298951
3654H298951N41504O53744O61560Q19322R21734J080602R88200J250637J226044
$$ 8298951 8840455 9494199 10155759 10975081 11896815 12977417 13965617 15216254 16442298
3645A6442298J269145J216883J106937O18245P68197N82370L79991K55895K15297
$$ 16442298 17711443 18928326 20035263 20653508 21421705 22004075 22384066 22639961 22855258
3636B2855258L6254J99422L09944O25663J099810J565453K183817K925902L477082
$$ 22855258 22891512 23090934 23400878 24026541 25126351 26691804 28875621 31801523 35278605
3627C5278605M015982M541337M458477M207179L685629K981613K276408J259616
$$ 35278605 39294587 43835924 48294401 52501580 56187209 59168822 61445230 62704846
3619F2704846N48160j41631o45772q68814o03323k88557K90672Q69608J208409
$$ 62704846 63253006 63111375 62465603 61596789 60993466 60704909 60995581 61865189 63073598
3610F3073598J390235J253027J083576M63550l3585q03582j447917k107025k346606
$$ 63073598 64463833 65716860 66800436 67263986 67230401 66426819 64978902 62871877 60525271
3601F0525271k502503k285127k130560j447350r37446j57039K91184J000653J251934
$$ 60525271 58022768 55737641 53607081 52159731 51222285 51065246 51356430 52357083 53609017
3592E3609017J421368J309134J140478N74076K24350k95451r76887j612595k259996
$$ 53609017 55030385 56339519 57479997 58054073 58278423 57982972 57006085 55393490 53133494
3583E3133494k616438k840758k912700l090254k960075k911295k690560k350442
$$ 53133494 50517056 47676298 44763598 41673344 38713269 35801974 33111414 30760972
3575C0760972k048329j918638j457379j132342q42988o11107k99465K9947L30281
$$ 30760972 28712643 26794005 25336626 24204284 23361296 22750189 22450724 22480671 22810952
3566B2810952M18046P06317R10575J230046J395508J842581J826396K108595K206175
$$ 22810952 23228998 23935315 24845890 26075936 27471444 29314025 31140421 33249016 35455191
3557C5455191K317530K242309K209531J889160J817286J332900J020653O80905
$$ 35455191 37772721 40015030 42224561 44113721 45931007 47263907 48284560 48965465
3549D8965465J66691m21629p25427j249977j512212j758765j876331k070106k185740
$$ 48965465 49132156 48710527 47985100 46735123 45222911 43464146 41587815 39517709 37331969
3540C7331969k109520k040029j807872j691243j324778j056841r58093p75407
$$ 37331969 35222449 33182420 31374548 29683305 28358527 27301686 26343593 25568186
3532B5568186m72766n46142l86497l85386l53257l43302k37247k83489j14548
$$ 25568186 25095420 24549278 24162781 23777395 23424138 23080836 22843589 22560100 22445552
3523B2445552j69158K5265q121k9534j354K13812J23928J21879J51780K00203
$$ 22445552 22276394 22301659 22293538 22264004 22262650 22476462 22600390 22722269 22874049 23074252
3513B3074252Q4480J74497J67783J97827M4732L25236L71795O30906N45037P60939
$$ 23074252 23158732 23333229 23501012 23698839 23743571 24068807 24440602 25071508 25616545 26377484
3503B6377484Q27450Q96750R67175J127273J170532J207980J253432J297913J233476
$$ 26377484 27204934 28101684 29068859 30196132 31366664 32574644 33828076 35125989 36359465
3494C6359465J329752J485180J567329J769265J792608K239919K347789K739939
$$ 36359465 37689217 39174397 40741726 42510991 44303599 46543518 48891307 51631246
3486E1631246K910611L317785L685739M440968M879006N690586O303887P071911
$$ 51631246 54541857 57859642 61545381 65986349 70865355 76555941 82859828 89931739
3478H9931739P488171Q031824Q088213Q198246Q025744P575476O941449O480232
$$ 89931739 97419910 105451734 113539947 121738193 129763937 137339413 144280862 150761094
3470A50761094N706377N015327M736080M283316M011369L836676L590133L233546
$$ 150761094 156467471 161482798 166218878 170502194 174513563 178350239 181940372 185173918
3462A85173918K667411J877934R36929q6609j253323k411604l387382m625735
$$ 185173918 187841329 189719263 190656192 190569583 189316260 186904656 183517274 178891539
3454A78891539n410574o044360o685876p052214p140349p438108p231403p127415
$$ 178891539 173480965 167436605 160750729 153698515 146558166 139120058 131888655 124761240
3446A24761240o990034o596264o077154n572903m623427l954458k805371j579323
$$ 124761240 117771206 111174942 105097788 99524885 94901458 90947000 88141629 86562306
3438H6562306l70846P21132K079127K834158L647367L969485L990148L517686
$$ 86562306 86191460 86912592 88991719 91825877 95473244 99442729 103432877 106950563
3430A06950563K996905K092677J310553L93179n27233j059189j546458j810855
$$ 106950563 109947468 112040145 113350698 113743877 113216644 112157455 110610997 108800142
3422A08800142j893957j727673j480415j246395q02829k96737r3541J55693M3033
$$ 108800142 106906185 105178512 103698097 102451702 101648873 101352136 101258595 101414288 101457321
3413A01457321j87930o99935j197467k058691k649190l492982m116560m581598
$$ 101457321 101269391 100569456 99371989 97313298 94664108 91171126 87054566 82472968
3405H2472968m933678n116506m958607m936653m676139m488920m025161l793866
$$ 82472968 77539290 72422784 67464177 62527524 57851385 53362465 49337304 45543438
3397D5543438l451852l168539k809280k608683k238453k066950j764906j673575
$$ 45543438 42091586 38923047 36113767 33505084 31266631 29199681 27434775 25761200
3389B5761200j467036j289478j125844j067314q12725r61040p82977o51164o04412
$$ 25761200 24294164 23004686 21878842 20811528 19998803 19037763 18254786 17603622 16999210
3380A6999210n03757l41053l55912j64971k13869j96998J06907J1390J42834K67837
$$ 16999210 16495453 16154400 15798488 15633517 15419648 15222650 15329557 15340947 15483781 15751618
3370A5751618L80262L92342O46976O61010Q22038P28734R49102Q71887Q84668
$$ 15751618 16131880 16524222 17171198 17832208 18654246 19382980 20332082 21203969 22088637
3361B2088637O92931P04594M95014K67338J7863q6170l78680l51943o00013p28945
$$ 22088637 22781568 23486162 23981176 24248514 24266377 24180207 23801527 23449584 22849571 22120626
3351B2120626p42596p19200q31201q13480q77421r18315q00055q45552p36790
$$ 22120626 21378030 20658830 19827629 19014149 18136728 17218413 16418358 15572806 14836016
3342A4836016o00623n36501m35191k33622k80541j68408l2548j40639J8711N9632
$$ 14836016 14235393 13698892 13263701 13030079 12749538 12581130 12548582 12407943 12426654 12486286
3332A2486286J67599K16567J71715K78284L59925M45979L92967N12054N60089
$$ 12486286 12653885 12870452 13042167 13320451 13680376 14126355 14519322 15031376 15591465
3323A5591465P44508P28901J010581J144350J363122J446288J896685K266651
$$ 15591465 16335973 17064874 18075455 19219805 20582927 22029215 23925900 26192551
3315B6192551K844894L431352M142417M975737N831121O754669P696468Q256728
$$ 26192551 29037445 32468797 36611214 41586951 47418072 54172741 61869209 70125937
3307G0125937Q755275R087850R200388R081305Q636317P762944O236940M536310
$$ 70125937 78881212 87969062 97169450 106250755 114887072 122650016 128886956 133423266
3299A33423266K445938K40744j992263l923055n658812p290411q397592q978392
$$ 133423266 135869204 136109948 134117685 130194630 124535818 117245407 108847815 99869423
3291I9869423r263532r271760q887327q225100p557327o755151n999050n208052
$$ 99869423 90605891 81334131 72446804 64221704 56664377 49909226 43910176 38702124
3283C8702124m486856l881890l249802k576887k300188j866669j650043j357921
$$ 38702124 34215268 30333378 27083576 24506689 22206501 20339832 18689789 17331868
3275A7331868j224017r35399r97090p42114p01082n02624n52472m36988m80955
$$ 17331868 16107851 15172452 14175362 13433248 12732166 12229542 11677070 11240082 10759127
3266A0759127l87798l87722l31406k74259l04691l32847j91246j81152k32318
$$ 10759127 10371329 9983607 9652201 9377942 9073251 8740404 8549158 8368006 8135688
3257H135688j45287j58470j53786j29604l611k6133Q9673p1919P9882m8916K9320
$$ 8135688 7990401 7831931 7678145 7548541 7544930 7518797 7608470 7536551 7616433 7567517 7596837
3246G596837J09094K10761Q6644J03915J6504N9268r5795j09463j25533j22079
$$ 7596837 7705931 7916692 8003336 8107251 8123755 8183023 8087228 7977765 7852232 7730153
3236G730153l31362j45037j64911q6285j41039j81687k18389k18989k85872j45775
$$ 7730153 7398791 7253754 7088843 7002558 6861519 6679832 6461443 6242454 5956582 5810807
3226E810807j70708j32712r2823j69822j04432r5443m1478r9845o1147q9960q4206
$$ 5810807 5640099 5507387 5414564 5244742 5140310 5044867 5003389 4903544 4842397 4752437 4668231
3215D668231r4130q7750m3402J7340r3136R4446l0544j6597J3818k1110k3449
$$ 4668231 4574101 4486351 4442949 4460289 4367153 4461599 4431055 4414458 4428276 4407166 4383717
3204D383717K9567K9343J13953O1569K3702R4785J32375K9544N7124Q3402O5283
$$ 4383717 4413284 4442627 4556580 4618149 4641851 4736636 4869011 4898555 4955679 5039081 5104364
3193E104364m037R4470Q3134J61657l502R1205K0273J08837Q4509P0025J62115
$$ 5104364 5100327 5194797 5277931 5439588 5436086 5527291 5547564 5656401 5740910 5810935 5973050
3182E973050Q4549J77090R2693J12086J61820J30020J5168R7290O9780Q6354P3213
$$ 5973050 6057599 6234689 6327382 6439468 6601288 6731308 6746476 6843766 6913546 6999900 7073113
3171G073113J24624K88776K93306J82340K65101K77477M7348n9204P0108j05684
$$ 7073113 7197737 7486513 7779819 7962159 8227260 8504737 8552085 8492881 8562989 8457305
3161H457305k8990j4284m0096J3823J26138J04508J61305J02851J11554L5862
$$ 8457305 8428315 8414031 8373935 8387758 8513896 8618404 8779709 8882560 8994114 9029976
3151I029976J29525J57138K78487K09009K17146J62499K84855J48532K94633R9299
$$ 9029976 9159501 9316639 9595126 9804135 10021281 10183780 10468635 10617167 10911800 11011099
3141A1011099J17105J55469K26489K45259K51908J31342K3271K23423K21393K74334
$$ 11011099 11128204 11283673 11510162 11755421 12007329 12138671 12161942 12385365 12606758 12881092
3131A2881092K58293L56397K80454L40610K28511L51823J91229N43324O48161
$$ 12881092 13139385 13495782 13776236 14116846 14345357 14697180 14888409 15431733 16079894
3122A6079894R15891P94945R44792O64978M34136N2524J5367p3250r1236R0302
$$ 16079894 16995785 17790730 18735522 19400500 19834636 19887160 19902527 19829277 19738041 19828343
3112A9828343J11061K75731K62330M64333N36116O90397O88218P00726O74078
$$ 19828343 19939404 20215135 20477465 20941798 21477914 22168311 22856529 23557255 24231333
3103B4231333Q73550R97988J098076J222412J381308J636075J822721K234542
$$ 24231333 25104883 26102871 27200947 28423359 29804667 31440742 33263463 35498005
3095C5498005K682463L168297L461449L940077M261006M914081N570772O653897
$$ 35498005 38180468 41348765 44810214 48750291 53011297 57925378 63496150 70150047
3087G0150047Q289232J0519304J3731724J8428652K4892172L2056987L7566184
$$ 70150047 78439279 88958583 102690307 121118959 146011131 178068118 215634302
3080B15634302L7772153L1434652K0577009R276976R10925k056143J237086J1726542
$$ 215634302 253406455 284841107 305418116 314695092 315606017 313549874 314786960 326513502
3072C26513502K6232759L7843324L8557385K6143592N206622j5381249l1328146
$$ 326513502 352746261 390589585 429146970 455290562 460497184 445115935 413787789
3065D13787789m1401931m5577322m5063298m1589670l6549064l1223435k6083116
$$ 413787789 372385858 326808536 281745238 240155568 203606504 172383069 146299953
3058A46299953k1340193j7184865j3798972j1360819r507255p963627o632025
$$ 146299953 124959760 107774895 93975923 82615104 73107849 65144222 58512197
3051E8512197n596869m550209l840981l330480k916660k539435k183743j881713
$$ 58512197 52915328 48365119 44524138 41193658 38276998 35737563 33553820 31672107
3043C1672107j758677j468314j474250j281155j149124r17054r68738q97835r55259
$$ 31672107 29913430 28445116 26970866 25689711 24540587 23623533 22654795 21756960 20801701
3034B0801701q44818p92130o99797o14784n89160o51810m68600n94147l83205
$$ 20801701 19956883 19164753 18464956 17850172 17261012 16609202 16140602 15546455 15163250
3025A5163250k44018k81904k97318k86827m16631m97899m29563m67947l36049
$$ 15163250 14919232 14637328 14340010 14053183 13636552 13138653 12709090 12241143 11905094
3016A1905094m28486l09461k61424k71713m48856k33306l48570k92804l67375
$$ 11905094 11476608 11167147 10905723 10634010 10185154 9951848 9603278 9310474 8943099
3007H943099k75002k24897j68292j62426k31626k70324j45672k19220j38127k44630
$$ 8943099 8668097 8443200 8274908 8112482 7880856 7610532 7464860 7245640 7107513 6862883
2997F862883k33576j36736j18637r0461j82170n7245j58102j59587q2187p1639
$$ 6862883 6629307 6492571 6373934 6283473 6101303 6044058 5885956 5726369 5644182 5572543
2987E572543j1954j26941j53491j57563q3760j01770j43865j29675j1677r8736
$$ 5572543 5560589 5433648 5280157 5122594 5038834 4937064 4793199 4663524 4651847 4553111
2977D553111q2731j40675r3704j53508n9072j54131j67651k979l0692q3879m6065
$$ 4553111 4470380 4329705 4236001 4082493 4023421 3869290 3701639 3698660 3667968 3584089 3538024
2966C538024K9438j08187k8390j54842k788m2622K2322l8802k9667j18305m6801
$$ 3538024 3567462 3459275 3430885 3276043 3273255 3230633 3252955 3214153 3184486 3066181 3019380
2955C019380o9636P0114o2051R8204m766N6514r2846Q601n6323l5863j03648j1863
$$ 3019380 2949744 3019858 2957807 3056011 3051245 3107759 3014913 3023514 2967191 2931328 2827680 2815817
2943B815817q4463p4758L396r1770L5173N0431K9838o8724L0250M58k6061j14329
$$ 2815817 2731354 2656596 2659992 2568222 2603395 2653826 2683664 2614940 2645190 2645648 2619587 2505258
2931B505258j7346Q385j8126r2871k2478j13488n7837j00550m1099j23420n1294
$$ 2505258 2487912 2496297 2478171 2385300 2362822 2249334 2191497 2090947 2049848 1926428 1875134
2920A875134o7974j18793j07576k5282o1449q744o1767k4700m6095N7703q72j2974
$$ 1875134 1807160 1688367 1580791 1555509 1494060 1485316 1423549 1398849 1352754 1410457 1409585 1396611
2908A396611j30392q5878o6595R6384L6111M9034j2365M9978j4840L8641o2417
$$ 1396611 1266219 1180341 1113746 1210130 1246241 1295275 1282910 1332888 1318048 1356689 1294272
2897A294272j3327J411N0505J7281k7471k4088o0648L1004o493K6079L572j1939
$$ 1294272 1280945 1282356 1332861 1350142 1322671 1298583 1237935 1268939 1262446 1288525 1292097 1280158
2885A280158j904r205N3299l356j28310N2224o8390q4601l4035L7205p1259M5150
$$ 1280158 1278254 1269049 1322348 1318992 1190682 1242906 1174516 1089915 1055880 1093085 1021826 1066976
2873A066976l7708n2681o1934L1642M887O1971j10135N8453p535J2482K9162P1102
$$ 1066976 1029268 976587 914653 946295 951182 1013153 903018 961471 953936 966418 995580 1066682
2861A066682m4964p364O5616J6453k607j9855m6570l8061M3426K0947p237n353
$$ 1066682 1021718 1014354 1079970 1096423 1093816 1073961 1027391 989330 1032756 1053703 1046466 1041113
2849A041113k9551J14805N4205N647m5018K1074j2437k5376L5885J8502q545l9464
$$ 1041113 1011562 1126367 1180572 1186219 1141201 1162275 1149838 1124462 1160347 1178849 1170304 1130840
2837A130840o233p6477L9526j25583M1727l209k4412J699O2304j00924m3653j41751
$$ 1130840 1124607 1048130 1087656 962073 1003800 1000591 976179 977878 1040182 939258 895605 753854
2825G53854L2682l3118k1040j4804j1680M430J7337L7448n0263J0004J2422P2344
$$ 753854 786536 753418 732378 717574 705894 710324 727661 765109 714846 724850 737272 809616
2813H09616K7836L8963n7031M3630M0637k3837Q047J12078P9932J66090o0737
$$ 809616 837452 876415 819384 863014 903651 879814 887861 999939 1079871 1245961 1185224
2802A185224K4760N1522J36556Q7488K22745K66091J10159J32715Q3698M6231
$$ 1185224 1209984 1261506 1398062 1485550 1708295 1974386 2084545 2217260 2300958 2347189
2792B347189p6380J10222P0999J24870J58187J37883J77957L1635j44206j86438
$$ 2347189 2270809 2381031 2452030 2576900 2735087 2872970 3050927 3082562 2938356 2751918
2782B751918k15106k85959j55874j42564j98815k86754j17981j30863O425o794
$$ 2751918 2536812 2250853 2094979 1952415 1753600 1466846 1348865 1218002 1224427 1217633
2772A217633n7412r4393j3665O943L8961l5935j42367o5999r1852k8641O6115
$$ 1217633 1160221 1065828 1052163 1059106 1098067 1062132 919765 853766 761914 733273 799388
2761G99388J8869l5560o5091j50950P9854J3369k5163n9079N3782k5768l7278
$$ 799388 818257 782697 717606 566656 646510 659879 634716 575637 629419 603651 566373
2750E66373K6254o6341K9433J27034q7390o5161L7621R1721n1569l3836p3315
$$ 566373 592627 526286 555719 682753 595363 530202 567823 659544 607975 574139 500824
2739E00824R0253k589p717R8678M441p5506J7101l9611m7713j2666M7792K2241
$$ 500824 591077 588488 580771 679449 683890 608384 625485 585874 538161 525495 573287 595528
2727E95528P2692M1397L8255j15383j7450j00684m4488N2031q6N0738J6676M675
$$ 595528 668220 709617 747872 632489 615039 514355 469867 521898 521812 572550 589226 593901
2715E93901L9854n3583j19396L0965j25358J39608j9020P8506m2842p1522m5517
$$ 593901 633755 580172 460776 491741 366383 505991 486971 565477 522635 451113 405596
2704D05596R7386N6581j8879K3666j280p5186O0554K3352r2108m0407p3018q038
$$ 405596 502982 559563 540684 564350 563070 487884 548438 571790 479682 439275 366257 358219
2692C58219O5424Q9242N673l6222p4499p7545R716m0448J7806J37630J8425J5305
$$ 358219 423643 512885 518558 482336 407837 330292 340008 299560 317366 454996 473421 488726
2680D88726K6544m8195l5976j9856k3093j0974Q4864j2479O0925m6164j31662
$$ 488726 515270 467075 431099 411243 388150 377176 462040 449561 510486 464322 332660
2669C32660m8958J8638k627m1318j8538j13195L1089r117N3009l4428J00393m6686
$$ 332660 283702 302340 299713 258395 239857 126662 157751 148634 201643 167215 267608 220922
2657B20922J15927K475Q0790L5038j41397o0237P6252j9680m4002j0702M8212
$$ 220922 336849 339324 420114 455152 313755 253518 329770 310090 266088 255386 303598
2646C03598P8960n5776J1714j23704k8669p7394Q8580J16994r502m2368O7100
$$ 303598 382558 326782 338496 214792 186123 108729 197309 314303 304801 262433 329533
2635C29533q5048J0459N189l0101N3997N6228q961O7470j3483p472M804j40166
$$ 329533 244485 254944 260133 230032 284029 340257 331296 398766 385283 377811 382615 242449
2623B42449n0820R3666K6967L3026P0947N1267r1451k2697J1578L4727R614J7979
$$ 242449 191629 285295 312262 345288 416235 467502 376051 353354 364932 399659 409273 427252
2611D27252m7402J963j315O9004q1255r1058m1140O9572P5979J7328L7223r2192
$$ 427252 379850 381813 380498 449502 368247 277189 236049 305621 381600 398928 436151 343959
2599C43959n5657o9025j5834R4306Q6348L7527j4458j14835j0806j7780r374l1305
$$ 343959 288302 219277 203443 297749 384097 421624 407166 292331 281525 263745 254371 223066
2587B23066P5219P7735J64941J13336J41145l7272K767j23968o5577k7140j7574
$$ 223066 298285 376020 540961 654297 795442 758170 760937 636969 571392 544252 526678
2576E26678k9547K9518j24854l468N119n1949k7924J5397L1996k3860L1399M3734
$$ 526678 497131 526649 401795 398327 403446 351497 323573 338970 370966 347106 378505 422239
2564D22239q8999n7217n1720J4859J06461J9421J02100m7130o9394j2477m4374
$$ 422239 333240 276023 224303 239162 345623 365044 467144 420014 350620 338143 293769
2553B93769p5418L8753P1890K9258M0545K9668l9912l3448j31083j8780L3727
$$ 293769 218351 257104 328994 358252 398797 428465 388553 355105 224022 205242 238969
2542B38969J05364J1108L8279q2470J1224j9454O8592O004j4594n7351J01579
$$ 238969 344333 355441 393720 311250 322474 303020 371612 377616 363022 305671 407250
2531D07250R3400j31320n9252m5683j11776K960L2766L2521M7985K0173n748J3150
$$ 407250 500650 369330 310078 264395 152619 155579 188345 220866 268851 289024 283276 296426
2519B96426k418j6903k6267j4339N5008K5569L5555l1314j8540L9441p2328l4976
$$ 296426 294008 277105 250838 236499 291507 317076 352631 321317 302777 342218 269890 234914
2507B34914K5329L4348K0899J8986N2403k2194k0351j04910j7547N5490J9570
$$ 234914 260243 294591 315490 334476 386879 364685 344334 239424 221877 277367 296937
2496B96937N2769K2603r1266K8892J0562m5968p1463Q7855k948P0634P904J05632
$$ 296937 349706 372309 281043 309935 320497 274529 203066 290921 287973 358607 366511 472143
2484D72143j42430Q266j9551N2509m9986O8360L3720J02582n6411n1929J0891
$$ 472143 329713 337979 318428 370937 320951 389311 423031 525613 469202 417273 428164
2473D28164o2747L5493l2179L4592j5821J01170J1980j261j09214K9282l4402
$$ 428164 365417 400910 368731 403323 387502 488672 500652 499391 390177 419459 385057
2462C85057r2550M7499J00029r1994K2976r5307J1511l6926L1303J5925M9598
$$ 385057 292507 340006 440035 348041 371017 275710 287221 250295 281598 297523 347121
2451C47121L6632J7665j7724n1342Q132q761O2255k3107Q5343o5865p5454L8874
$$ 347121 383753 401418 383694 332352 340484 331723 393978 370871 456214 390349 314895 353769
2439C53769R324n0102J1198l137J9962R680n9792L5911M4429K4192L8099K0799
$$ 353769 363093 312991 324189 321052 341014 350694 290902 326813 371242 395434 433533 454332
2427D54332L8810P016r4307M8335L2827J1689j1273q8403K381R317N9370O0474
$$ 454332 493142 500158 405851 454186 487013 498702 487429 399026 401407 410724 470094 530568
2415E30568k0227K7730O7648k3260l6770J4791N238j5187O330q059K7697K1376
$$ 530568 510341 538071 605719 582459 545689 560480 565718 550531 556861 548802 576499 597875
2403E97875N7742L0904o1359M5303o7811K556r745K3469l0231j4460O5736M9743
$$ 597875 655617 686521 625162 670465 602654 605210 595465 618934 588703 574243 639979 689722
2391F89722O8069j5570k4183L0780L4329k5937J32M5074L1748N9276q1384k4633
$$ 689722 757791 742221 718038 748818 783147 757210 757342 802416 834164 893440 812056 787423
2379G87423J8639R2305k8948O8776L0794o4953j0486L4956p110J70568l8739R824
$$ 787423 806062 898367 869419 938195 968989 904036 893550 928506 921396 1091964 1053225 1063049
2367A063049N1423K9251r0398R5101j06371o2949L1832J3174J44513K4181O8933
$$ 1063049 1114472 1143723 1053325 1148426 1042055 979106 1010938 1024112 1168625 1192806 1261739
2356A261739L1135K8603M4717J84866J03285m7962p4924J72822k3366J38645O5910
$$ 1261739 1292874 1321477 1366194 1551060 1654345 1606383 1531459 1704281 1680915 1819560 1885470
2345A885470N4803L5997P1714L0215J88231J50793K03278J68834J01885K25469
$$ 1885470 1940273 1976270 2047984 2078199 2266430 2417223 2620501 2789335 2891220 3116689
2335C116689L06697M98167O13654R25819Q24075N65605M33903L26601J56764K11133
$$ 3116689 3423386 3921553 4535207 5461026 6285101 6850706 7284609 7611210 7767974 7979107
2325G979107N30124R67674J502116K079384L098577N154362R893686J5589438
$$ 7979107 8509231 9476905 10979021 13058405 16156982 21311344 31205030 46794468
2317D6794468J8385895J3724573N352483k447700o310287q804541j0244597r688835
$$ 46794468 65180363 78904936 84257419 81809719 75499432 66694891 56450294 46761459
2309D6761459q538396p127704o151692m842498l760883k584140j522877r82664
$$ 46761459 38223063 31095359 24943667 20101169 16340286 13756146 12233269 11250605
2301A1250605r91354q78793q71442p28820o84474o54690o48479m82478m30976
$$ 11250605 10259251 9380458 8509016 7780196 7095722 6441032 5792553 5310075 4879099
2292D879099l26365l74728k70683k29268m3232j77471j76188j24557j89138j85470
$$ 4879099 4552734 4178006 3907323 3678055 3634823 3457352 3281164 3156607 2967469 2781999
2282B781999j39761r5868r8809j25070q2478o1624r7600r8108P9715J4176j22661
$$ 2781999 2642238 2546370 2447561 2322491 2240013 2178389 2080789 1982681 2062396 2076572 1953911
2271A953911r4830O1082L3506O257n5683k02031j53220n7038k4217o9040n0435
$$ 1953911 1859081 1920163 1953669 1959926 1904243 1702212 1548992 1491954 1467737 1398697 1348262
2260A348262n2804O0402p1305p0420m1982q5021p2879L5732k312P5463k7772m7354
$$ 1348262 1295458 1355860 1284555 1214135 1172153 1087132 1014253 1049985 1047673 1123136 1095364 1048010
2248A048010q9030M4640M7798k7041k3719j5443J0732j14091l9629o200l1695
$$ 1048010 958980 1003620 1051418 1024377 1000658 985215 995947 881856 842227 836027 804332
2237H04332j38687P2843K5667L7167Q8934k2555j02540q037P187j2066Q516j2810
$$ 804332 665645 738488 764155 801322 890256 867701 765161 757124 764311 752245 760761 747951
2225G47951m0882k5469m0116L3461l0725j5028k0003q3483O0841M3499p2483N94
$$ 747951 707069 681600 641484 674945 644220 629192 609189 525706 586547 630046 557563 558157
2213E58157J5384l2702J4830j3298m7890r259n0423J1293j7503l5266k7914R6713
$$ 558157 573541 540839 555669 542371 494481 485222 434799 446092 428589 393323 365409 462122
2201D62122K3259Q405L082K8111n9277r3720L5625L6293o4249k9486Q5475n9784
$$ 462122 485381 493786 496868 524979 465702 371982 407607 443900 379651 350165 435640 375856
2189C75856k0808P5616J2011q4798J3350r9069M3637L033m4399J38497O2906k8964
$$ 375856 355048 430664 442675 357877 371227 272158 315795 318828 274429 412926 475832 446868
2177D46868j7009l0569j5614j2233L054n0517M3610n2789K6598L2686n3582k3343
$$ 446868 429859 399290 383676 371443 374497 323980 367590 314801 341399 374085 320503 297160
2165B97160o9016J9182J7907q068q3257M5323J0813K4204N4777J1438k4137k8401
$$ 297160 228144 247326 265233 257165 173908 219231 230044 254248 309025 320463 296326 267925
2153B67925n8378m5374M9277j7145M5289n4967m3325L7451l2364M9033m646K094
$$ 267925 209547 164173 213450 196305 241594 186627 143302 180753 148389 197422 192776 194870
2141A94870l0567J5356j0412j1682J0467K0366M9906J6702K3808o6038J093K3401
$$ 194870 164303 179659 169247 157565 168032 188398 238304 255006 278814 212776 213869 237270
2129B37270j3132m645k2790k0210L2471J2869K6402O690M1812N613r5857n0489
$$ 237270 224138 219493 196703 176493 208964 221833 248235 254925 296737 302350 206493 156004
2117A56004K8640N7508J3772p3725j6446j9111K0385K7250J9442l010m8660k5369
$$ 156004 184644 242152 255924 182199 165753 146642 167027 194277 213719 210709 162049 136680
2105A36680J6867L3494L6139J4681K95J4256o6230k5278J4209j8170Q121l89J1507
$$ 136680 153547 187041 223180 237861 238156 252412 186182 160904 175113 156943 165064 164675 176182
2092A76182N274O4046l3157l3796Q0661m2019P930m957n313J067n1062L8255P0909
$$ 176182 181456 245502 212345 178549 259210 217191 225121 220164 214851 215918 164856 203111 274020
2079B74020M501K4235K5278n0158m8347J0487j8983Q693p6834j28725N5835J15147
$$ 274020 278521 302756 328034 277876 229529 240016 221033 229726 152892 24167 80002 195149
2067A95149J637O6100k819o7407N0890k595M416J2327j6346q0265L0415j243N7605
$$ 195149 196786 262886 260067 192660 243550 240955 245371 257698 241352 161087 191502 190259 247864
2054B47864J4256o2097k8778k3651L4995J35297J48257J00369N472j2907o6162
$$ 247864 262120 200023 171245 147594 182589 317886 466143 566512 571984 559077 492915
2043D92915J0271k4177k7636l9965n1381N998m2801N756o0100o7109J5641p449
$$ 492915 503186 479009 451373 411408 360027 366025 323224 328980 268880 201771 217412 209963
2031B09963o5712L1646N5368j1957K1170o0145m4476r602P8922j760L1132P858
$$ 209963 144251 175897 231265 219308 240478 180333 135857 126255 205177 203417 234549 242407
2019B42407k8510j8160j04538r91R1375n0228l4733M3899m0953N1579R9646m9082
$$ 242407 213897 195737 91199 90208 181583 131355 96622 140521 99568 151147 250793 201711
2007B01711o7110l8931o9868M8084L365l3236L4514l84o8632J14344K972K4625
$$ 201711 134601 95670 25802 73886 77251 44015 78529 78145 9513 123857 126829 151454
1995A51454l5615L6705K462P818j15212J34507n9522p0437k572K7632K3424M2776
$$ 151454 115839 152544 155006 162824 47612 182119 122597 52160 49588 77220 100644 143420
1983A43420P135q9579L3727m9161J9063K9955j7830N981j1884j1881K7459J29648
$$ 143420 150555 60976 94703 45542 64605 94560 76730 82711 70827 58946 86405 216053
1971B16053J570l5844j3518j11173K493J04044L0820l1326k8128J0720q6689p7193
$$ 216053 217623 181779 168261 57088 59581 163625 194445 163119 134991 145711 59022 -18171
1959a8171O605J12983l4354k5586O8850j6878o4460k4909J9030K855L6555N454
$$ -18171 -11566 101417 67063 41477 110327 93449 28989 4080 23110 25965 62520 67974
1947F7974J18481n2302k8248j8126N7546o1167J1370j9793q41o5713O0003N6503
$$ 67974 186455 134153 105905 87779 145325 84158 95528 75735 74894 9181 69184 125687
1935A25687l8392q5947j7977J8810O9319K6416O2266m6097o2536m4124L46P9891
$$ 125687 87295 1348 -16629 2181 71500 97916 160182 114085 51549 7425 7771 87662
1923H7662o2212L800k0765J129O9492L0365n4914K0644l0378r7762M1674O6426
$$ 87662 25450 29250 8485 9614 79106 109471 54557 75201 44823 -52939 -11265 55161
1911E5161K7952j9811n9313K3130M1498K140N5629M1082n8844K2279P452m4584
$$ 55161 83113 63302 3989 27119 68617 70757 126386 167468 108624 130903 138355 93771
1899I3771J6076q3859p620J04382R216m3636O1651o8640l2277O2862l6754Q424
$$ 93771 109847 25988 18368 122750 131966 88330 149981 81341 49064 111926 75172 83596
1887H3596j589k2048J2740K8157J7027l501n5056j03121J3708J06986L1287R6418
$$ 83596 82007 59959 72699 100856 117883 114382 59326 -43795 -30087 76899 108186 204604
1875B04604J4013r9770N5978l2757o7657l3763L2447K5630M4027M891j1485K4522
$$ 204604 218617 118847 174825 142068 74411 40648 73095 98725 142752 147643 136158 160680
1863A60680j55571l5410N8098K9164N8877K892m7624N6536j0654P0488l4620m1156
$$ 160680 5109 -30301 27797 56961 115838 118730 71106 127642 116988 187476 152856 111700
1851A11700L4921p337R79l1742m1677o6421k3647m3117N6526L6548l3385K4428
$$ 111700 146621 139284 140263 108521 66844 423 -23224 -66341 -9815 26733 -6652 17776
1839A7776N0885k9617j4941P9217j2487n093J9896K9397l0545M0666m1523k7723
$$ 17776 68661 39044 24103 103320 90833 85740 105636 135033 104488 145154 103631 75908
1827G5908m5054k4199k0910K8304l6331J07693j46442l093J14478K7253L9250
$$ 75908 30854 6655 -14255 14049 -22282 85411 -61031 -64124 50354 77607 116857
1816A16857m4845r2498K2875O5239k432O8732p7065J165N1026M8848o792M089
$$ 116857 72012 -20486 2389 67628 65196 133928 56863 58028 109054 157902 151110 155199
1804A55199N169l5288k7481J145l1617N3152m5833M5215K7023k2577o8439O1874
$$ 155199 160368 125080 97599 98744 67127 120279 74446 119661 146684 124107 55668 117542
1792A17542p1758J4001j3975O6279J2174J0297p413m335n6518o1880K6001N531
$$ 117542 45784 59785 45810 112089 124263 134560 127147 122812 66294 4414 30415 35946
1780C5946l5667O0372J6475r915M1327J3059m4743l2466J2793K4193L8978k4362
$$ 35946 279 60651 77126 67211 108538 121597 76854 44388 57181 81374 120352 95990
1768I5990j2060n8440o1399N016J62766k3761Q7319K6227m8966m8984m4634l8560
$$ 95990 83930 25490 -35909 -30893 131873 108112 195431 221658 172692 123708 79074 40514
1756D0514k864l9037O1904O7032k1853j1576J715j3897o9417m3856P4241j8135
$$ 40514 37650 -1387 60517 127549 105696 94120 95835 81938 12521 -31335 42906 24771
1744B4771K8071K6283k3148m6074N4893j4303J9211j6301N9136o4053O0458l0251
$$ 24771 52842 79125 55977 9903 64796 50493 69704 53403 112539 48486 108944 78693
1732G8693j7422L504o1285L1428Q8247K2784j08771N6193m1320K6961J5070P18
$$ 78693 61271 64775 3490 34918 123165 145949 37178 93371 52051 79012 94082 94800
1720I4800k544p178P3751O0071r2771n2881j4090m5617j19025J03850P0889Q3330
$$ 94800 92256 85078 158829 218900 126129 73248 59158 13541 -105484 -1634 69255 152585
1708A52585J5767m3133m1837l9283n5765R4191K5026M2192K9570q4780r842Q2236
$$ 152585 168352 125219 83382 44099 -11666 82525 107551 149743 179313 94533 84691 166927
1696A66927j3432l1229q8518k3978P2678r0785m201J12977L3207q9194J8320J06114
$$ 166927 153495 122266 33748 9770 82448 -8337 -12538 100439 133646 44452 62772 168886
1684A68886k7191J0322j1234q2748M8977m3517o5852K0833M0885l4568J487N73
$$ 168886 141695 152017 140783 58035 107012 63495 -2357 18476 59361 24793 26280 26853
1672B6853L5934j6233k1102l8688Q0302o0493N1638O8786l1940R494q127r6079
$$ 26853 62787 46554 25452 -13236 67066 6573 58211 126997 95057 104551 96424 345
1660C45Q8675O2131p0450O5978L2807q1452r7792j3979O4186M9597j4713O946
$$ 345 89020 151151 80701 146679 179486 98034 242 -13737 50449 100046 85333 92279
1648I2279n0772j9341k0904K3595J4253j0070n0256L0915j3582L5373J1635l7935
$$ 92279 41507 22166 1262 24857 39110 29040 -21216 9699 -3883 31490 43125 5190
1636E190o1316M1905L454J7116P5756L3982K5386M9485j23206l583j31172K0111
$$ 5190 -56126 -14221 -10767 6349 82105 116087 141473 190958 67752 64169 -67003 -46892
1624d6892M1591R4971m9489Q5272j5656p3061k0972L6779j4196k5568L9666J1902
$$ -46892 -5301 89670 40181 125453 109797 36736 15764 52543 38347 12779 52445 64347
1612F4347J07602k6427p395J156j32145l5089P1905J5838Q5009l1353q276o3806
$$ 64347 171949 145522 138127 139283 7138 -27951 43954 59792 144801 113448 105172 41366
1600D1366l345p242J0961n6354J13371n3733M542n1773J02954o1827j03593J17299
$$ 41366 38021 30779 41740 -14614 98757 45024 49566 -2207 100747 38920 -64673 52626
1588E2626Q8950m8403O2685J9297l9422j11724l3416l4293K7037q757L9771L0787
$$ 52626 141576 93173 155858 175155 135733 24009 -9407 -43700 -16663 -25420 14351 45138
1576D5138j6433l2542J02774o0784K3329J3221m1002Q5628k5822K240m8477m7176
$$ 45138 28705 -3837 98937 38153 61482 74703 33701 119329 93507 95747 47270 94
1564I4j8957Q4985l0847M6285L7255o6357o6620O7520r045M793n2060J10230J1122
$$ 94 -18863 66122 35275 81560 118815 52458 -14162 53358 44313 49106 -2954 107276 118398
1551A18398O5887k1937L9543k32932O4669Q499n3825j3884q629J18709j6578p794
$$ 118398 184285 162348 201891 -31041 33628 42127 -11698 -25582 -34211 84498 67920 60126
1539F0126p1490P6366j22796J5628Q3384K9967K7156O1463n0247j0095r4429j5895
$$ 60126 -11364 65002 -57794 -42166 41218 71185 98341 159804 109557 99462 5033 -10862
1527a0862R9243k2369o2897O0118q5117o1790J7528J627jL4768P093M6658Q4406
$$ -10862 88381 66012 3115 63233 -21884 -83674 -66146 -64519 -64520 -29752 -22659 23999 108405
1514A08405p9513j6799n6253k4795J45499R1083k8585q2145J06097r0523j3589
$$ 108405 28892 12093 -44160 -68955 76544 167627 139042 56897 162994 72471 58882
1503E8882l6530m5452j41386L2545M2418R7553M3703q6361N8805j18097j8769
$$ 58882 22352 -23100 -164486 -131941 -89523 8030 51733 -34628 24177 -93920 -112689
1492a12689R8271J79241q1667N3719O9o2891n1243l916M9289n4250l5361P1156
$$ -112689 -14418 164823 83156 136875 136944 74053 22810 18894 68183 13933 -21428 49728
1480D9728K3573l7342o7538K5690j04665L5273J04424R1366K2528j4427l9680
$$ 49728 73301 35959 -31579 -5889 -110554 -75281 29143 120509 143037 128610 88930
1469H8930o3771r246P921K8218p854R141N3013L8418n1137l1009Q8595j79260
$$ 88930 25159 15913 23834 52052 44198 53339 106352 144770 93633 62624 151219 -28041
1457b8041j5468Q0178P9112n1979n9702n961l3061l7572L592J31351k8781k0627
$$ -28041 -43509 36669 115781 63802 4100 -1861 -34922 -72494 -68902 62449 33668 13041
1445A3041M1945O010n4133O8077j1917j00582J8057J41333j4046K5545n9489p421
$$ 13041 54986 60996 6863 74940 63023 -37559 -19502 121831 107785 133330 73841 66420
1433F6420o3481p8541L0123Q3555j27511L8880J40148n4433o9867M275k439k4307
$$ 66420 2939 -75602 -45479 38076 -89435 -50555 89593 35160 -34707 -30432 -32871 -57178
1421e7178M468l6126J87006R817k7950J3390q9816n0722P1458L6251k6734K006
$$ -57178 -52710 -88836 98170 107987 80037 93427 3611 -47111 24347 60598 33864 35870
1409C5870M9693n731r6923o5418K1359J2216j5382Q6636R2950q4406j00091J4826
$$ 35870 85563 79832 -17091 -82509 -61150 -48934 -64316 22320 115270 30864 -69227 -54401
1397e4401R310N6672J36655j6193l3679l1261N9571k9328m1694r4506P8908r2825
$$ -54401 -45091 11581 148236 132043 98364 67103 126674 97346 55652 -38854 40054 -52771
1385e2771J479J05369O339j18092N9897L0829m8558O7958r643J06849j13836o93
$$ -52771 -51292 54077 60416 -57676 2221 33050 -15508 52450 42807 149656 35820 35127
1373C5127K7881N577J3158K6140o7290o9029j5395J65846q3143l32k6163N8880
$$ 35127 63008 68585 81743 107883 40593 -28436 -43831 122015 38872 38540 12377 71257
1361G1257j04126L2496Q1139K1309J7208l0858k7925K3076m1338K733N9319j03897
$$ 71257 -32869 -373 80766 102075 119283 88425 60500 83576 42238 44971 104290 393
1349C93K6340R1198p1450p0333Q1659k4946r6838L2877k0223M1115M7330N0315
$$ 393 26733 117931 46481 -23852 57807 32861 -63977 -31100 -51323 -10208 37122 87437
1337H7437N3125l2969j88385n891L4706m2919R8645N1454J1541n5283L154o228
$$ 87437 140562 107593 -80792 -86683 -51977 -94896 3749 55203 66744 11461 14615 8387
1325H387J15637r7872O320q4373J5206L9122L2986k7322O3346K936J2291m4436
$$ 8387 124024 26152 32472 -51901 -36695 2427 35413 8091 71437 74373 86664 42228
1313D2228L4753K4396j36051m1019J6943P7471L019M1266M1720M6034j32803j0924
$$ 42228 76981 101377 -34674 -75693 -58750 18721 21740 63006 104726 150760 17957 7033
1301G033P3392J6032l4343K3604n2265M5333N5525O1613k3829r7893m9577N3846
$$ 7033 80425 96457 62114 85718 33453 78786 134311 195924 172095 74202 24625 78471
1289G8471l193j7839O4969j27265j9611Q8147R1641j5403m8234K3842k1843l3634
$$ 78471 75278 57439 122408 -4857 -24468 63679 155320 139917 91683 115525 93682 60048
1277F0048J6765J9878q7670L3340K0381n3301n161K0073j1246K9498p8529M8791
$$ 60048 76813 96691 9021 42361 62742 9441 4280 24353 13107 42605 -35924 12867
1265A2867j0811l9685J30777K5910o9815l8289R920N428r14p7769J22945L5970
$$ 12867 2056 -37629 93148 119058 49243 10954 20874 26302 25388 -52381 70564 106534
1253A06534l4916l5251J26769q0321j2309K6041m3776k1402K0222j0697M5488
$$ 106534 71618 36367 163136 82815 70506 96547 52771 31369 51591 40894 86382
1242H6382j28476k2474J02052q3424j1501R5407J5134r9278M8868l299k2210P8375
$$ 86382 -42094 -64568 37484 -45940 -57441 37966 53100 -46178 2690 -609 -22819 55556
1230E5556N0765L9807n7093R701k4706o753l3391K9932J0941j85112j8811J50591
$$ 55556 106321 146128 89035 98736 74030 67277 33886 63818 74759 -110353 -129164 21427
1218B1427P5884L2488l4544j02570n8195L6484k6278P0309J5695M5234J46156
$$ 21427 97311 129799 95255 -7315 -65510 -29026 -55304 15005 30700 75934 222090
1207B22090j2759n2009k2565M558j57095L4114j7867K9154J6019P363r1395k2234
$$ 222090 209331 157322 134757 139315 -17780 16334 -1533 27621 43640 51003 -40392 -62626
1195f2626j09093J10758O5581p423Q3181K6869j13802J7550R292p8046p017Q6397
$$ -62626 -171719 -60961 4620 -2803 80378 107247 -6555 10995 20287 -57759 -64776 21621
1183B1621P3785N3725j7636m356m9472p9428p8592n3030M6273q140M7043R3011
$$ 21621 95406 149131 131495 127139 77667 -1761 -80353 -133383 -87110 -95250 -48207 44804
1171D4804j3375l3517L6099o2958j2441k5517O8524J2333L1888p7797P4187j2454
$$ 44804 31429 -2088 34011 -28947 -41388 -66905 1619 13952 45840 -31957 42230 29776
1159B9776K3286j6216R320j17694J06164K4420r300o2196p217N567l7880k2188
$$ 29776 53062 36846 46166 -71528 34636 59056 49756 -12440 -19657 -14090 -51970 -74158
1147g4158Q1004R1373r2979K3502M929r2141o1884P6778p091R4370p5845J20189
$$ -74158 6846 98219 5240 28742 33671 -58470 -120354 -43576 -50667 43703 -32142 88047
1135H8047L778l5258j4027l6199j29069J09773O8743J4792k2403O7735l3667o8655
$$ 88047 91825 56567 42540 6341 -122728 -12955 55788 70580 48177 115912 82245 13590
1123A3590K5132q8674k1298K6421L1896O622J26583j2084j4689m4424p1323P1801
$$ 13590 38722 -49952 -71250 -44829 -12933 -6311 120272 108188 93499 49075 -22248 49553
1111D9553P8186q0532m9451J42874j33746n7076n2794M3326r064j5302N9286O4559
$$ 49553 127739 47207 -2244 140630 6884 -50192 -102986 -59660 -68724 -84026 -24740 39819
1099C9819J2480j03020J0221k3492j2510p478J43859J3550N332Q681k8135m4566
$$ 39819 52299 -50721 -40500 -63992 -76502 -83980 59879 73429 78761 87442 59307 14741
1087A4741k5178K0001O099j47603J07219L7876M9072k1769K0364p0508j36187
$$ 14741 -10437 9564 15663 -131940 -24721 13155 62227 40458 60822 -9686 -145873
1076a45873J3497R6549K4412J145J7785p7584O6544R25J184k3545M99j600R5057
$$ -145873 -132376 -35827 -11415 -10270 7515 -70069 -3525 -2600 -1416 -24961 -24462 -26062 68995
1063F8995n2258m8406l466n0877K8770P4226l305K1116J0782L7165M248j09499
$$ 68995 16737 -31669 -35135 -86012 -57242 16984 13679 34795 45577 82742 86990 -22509
1051b2509l6919Q1968j8434m82K5727P2510Q378q0836l5454j3675j2J6014K5714
$$ -22509 -59428 22540 4106 3624 29351 101861 110239 29403 -6051 -19726 -19738 -3724 21990
1038B1990J109j280N4197l0799l9526n1573k3621n0130M2383M6763J15348Q958
$$ 21990 23099 21819 76016 45217 5691 -45882 -69503 -119633 -77250 -30487 84861 93819
1026I3819j12479j0264q1945J21235k7519O2511J5806m0052L934P7886j26242
$$ 93819 -18660 -28924 -110869 10366 -17153 45358 61164 21112 25046 102932 -23310
1015b3310k158J88307j43682l4722R743N3914O278p8148j9782r9676l7206N3191
$$ -23310 -25468 162839 19157 -15565 -5822 48092 54370 -23778 -43560 -143236 -180442 -127251
1003a27251J07121j0245M3388P7426k0820o6207O0245J4024m6935j6638L2759
$$ -127251 -20130 -30375 13013 90439 69619 3412 63657 77681 30746 14108 46867
992D6867m4362O7881q791k5200p7482P6311o3326M8183j21489K3408J07372K5182
$$ 46867 2505 70386 61595 36395 -41087 35224 -28102 20081 -101408 -78000 29372 54554
980E4554j13302J1009K3088k3491K9364k4601J29980r7272Q1178J486L0614q1894
$$ 54554 -58748 -47739 -24651 -48142 -18778 -43379 86601 -10671 70507 71993 102607 20713
968B0713l767K1337p588k0536J42132n3896q1851j071M1517j11069K9144J71866
$$ 20713 16946 38283 30695 10159 152291 98395 16544 15473 56990 -54079 -24935 146931
956A46931O0493j03285m7670n9589l1939O2952K1632m2364m0309J26960N2036
$$ 146931 207424 104139 56469 -3120 -35059 27893 49525 7161 -33148 93812 145848
945A45848j12197J0988N244k8182p8694O4084J2567m115p292o2932L3261M6302
$$ 145848 33651 44639 49883 21701 -56993 7091 19658 15543 8251 -54681 -21420 24882
933B4882l8078k5319N0965r8834J68800J287m5304J8449L7542j313K7151q3390
$$ 24882 -13196 -38515 12450 -86384 82416 83703 38399 56848 94390 93077 120228 36838
921C6838M6683n103j7059p073O675o9666M7788O6924o8015n1871p1265R0182M4329
$$ 36838 83521 78418 61359 54286 60961 -8705 39083 106007 37992 -13879 -85144 5038 49367
908D9367m3155p1461J23786q2799M5204L9325K0461k1157M2822m4615J3703k5901
$$ 49367 6212 -65249 58537 -24262 20942 60267 80728 59571 102393 57778 71481 45580
896D5580N8478q7597q5046L3664L7338O6395q8036k9055J19587j5915o8334N6669
$$ 45580 104058 16461 -68585 -34921 2417 68812 -19224 -48279 71308 55393 -12941 43728
884D3728o54m0641R3125L7891k075j7460k1616m2672m0249n0361O3559l4969k490
$$ 43728 43074 2433 95558 133449 131374 113914 92298 49626 9377 -40984 22575 -12394 -14884
871a4884J6309l9192Q148M201J6607j6611j7788L3664J8612K70l770n329K9932
$$ -14884 1425 -37767 -29619 -25418 -8811 -25422 -43210 -9546 9066 9336 5566 237 30169
858C0169n8976M368Q0969K7275p327M0878o3851n9601j3477O3588q131N8430r951
$$ 30169 -28807 -24439 56530 83805 76478 117356 53505 -6096 -19573 44015 35884 94314 84363
845H4363Q4883n5595r3387j15338m3892n2575P2329J84367J1586Q866L7123o2036
$$ 84363 169246 113651 20264 -95074 -138966 -191541 -119212 65155 76741 85607 122730 60694
833F0694m573k7643k1667J5377O255n3194J13868p374K6428N1369l6772j56499
$$ 60694 56121 28478 6811 22188 28443 -24751 89117 81743 108171 159540 122768 -33731
821c3731n280m3321L6780Q1175l4549k8623L3680k5518K7086J1733p3684O6110
$$ -33731 -39011 -82332 -45552 35623 1074 -27549 6131 -19387 7699 19432 -54252 11858
809A1858O3886N0896o3011J3437j27257n536m1063O3689O3700N816J1959o0879
$$ 11858 75744 126640 63629 77066 -50191 -55727 -96790 -33101 30599 36415 48374 -12505
797a2505J3503j16684j2957J3454K0925J05790J26579J5323m5058j03386O239
$$ -12505 998 -115686 -128643 -115189 -94264 11526 138105 153428 108370 4984 11223
786A1223m1367j6408K351J04908J923o572j6344n3968k1690j5368q463n7149O7952
$$ 11223 -30144 -46552 -44201 60707 62630 56058 39714 -14254 -35944 -51312 -59775 -116924 -48972
773d8972P0087K6712n2399r949o6601j1612Q999Q3279j1127O6089K5160k3595
$$ -48972 21115 47827 -4572 -14521 -81122 -92734 -83735 -456 -11583 54506 79666 56071
761E6071l8070n2982k2003k7406M2870L5865O3011j5042j4825o2629r981j693
$$ 56071 18001 -34981 -56984 -84390 -41520 -5655 57356 42314 27489 -35140 -45121 -46814
749d6814L1650L8451j8665K8298M7963L5744k03295K7600K446n8667k0340J01566
$$ -46814 -15164 23287 4622 32920 80883 116627 -86668 -59068 -56622 -115289 -135629 -34063
737c4063O2209J00969r8758o1587p4339k4335Q6251N5091m0377M0960m1714p4293
$$ -34063 28146 129115 30357 -31230 -105569 -129904 -43653 11438 -28939 12021 -29693 -103986
725a03986J1458k10j572P3469l251j4577Q6963m3696l0525K1137o8660L7549M0570
$$ -103986 -92528 -92738 -94310 -20841 -24092 -38669 48294 4598 -25927 -4790 -73450 -35901 4669
712D669P5346j4703N6006K7876o0646r9297j02131j971k0223M701J35600J34834
$$ 4669 80015 65312 121318 149194 88548 -10749 -112880 -114851 -135074 -130373 5227 140061
700A40061o6556m0291j25403J8594j0754k2220Q6684M9364k2919P4229j766n473
$$ 140061 73505 33214 -92189 -73595 -84349 -106569 -19885 29479 6560 80789 79023 73550
688G3550p6562m5537l9096L0547P2135k2379k8520L9417Q933n6235L1255O8867
$$ 73550 -3012 -48549 -87645 -57098 15037 -7342 -35862 3555 12488 -43747 -12492 56375
676E6375O1504k3242m2291J0202M8122r0613L5010j8476p1313Q8205M8811k2634
$$ 56375 117879 94637 52346 62548 110670 20057 55067 36591 -34722 53483 102294 79660
664G9660j37689N3480p109r348L945J83368q8109j7386N551m97N6470p4948r8170
$$ 79660 -58029 -4549 -11658 -21006 -17061 166307 78198 60812 66363 65866 122336 47388 -50782
651e0782j8227l4704j9521J22852J1253l5993n578L1993j4056j7741J1301L1436
$$ -50782 -69009 -103713 -123234 -382 10871 -25122 -30700 1293 -12763 -30504 -19203 12233
639A2233k4953J263l2492Q146O51J7411l0958l3866J3331m25M5123L1244m712
$$ 12233 -12720 -11457 -43949 -35803 -35152 -17741 -48699 -82565 -69234 -69659 -24536 6708 1996
626A996l931n378j11552O2935L2864L1097m391k7629m2238K7694J0688j9457O5240
$$ 1996 -1935 -7313 -118865 -55930 -23066 8031 3640 -23989 -66227 -38533 -27845 -47302 17938
613A7938M7439L1843k0838l4756j1093o2331K9092l3569m0914J9642K8268J3214
$$ 17938 65377 97220 76382 41626 30533 -31798 -2706 -36275 -77189 -57547 -29279 -16065
601a6065P1170q387M1401N3038r4051N082l8260r393q0680O4144J268j9006L927
$$ -16065 55105 46718 88119 141157 47106 52188 13928 4535 -76145 -12001 -10733 -29739 -25812
588b5812J1081K0651R761o7820L0934o4740J01242q3871Q8600j4280J08505J2875
$$ -25812 -14731 5920 15681 -52139 -21205 -85945 15297 -68574 20026 5746 114251 127126
576A27126m8161j06191m4587R4805N564K8740j08564O7243L05q4011o6908J69103
$$ 127126 78965 -27226 -71813 22992 28556 57296 -51268 15975 16280 -67731 -134639 34464
564C4464l6432L3001n7700N4199M61m0458k2651J04973l6799O6997p300o0078
$$ 34464 -1968 31033 -26667 27532 27993 -12465 -35116 69857 33058 100055 92755 32677
552C2677L528k3234q2886k5628L6372n4500J57305j1183j4631L8426r4928l3712
$$ 32677 36205 12971 -69915 -95543 -59171 -113671 43634 32451 17820 56246 -38682 -72394
540g2394R1359m1060n2779J15053o336K1363J6661n5619j4630O2177m5077N5109
$$ -72394 18965 -22095 -74874 40179 33843 55206 71867 16248 1618 63795 18718 73827
528G3827m5021j3279J2511m8670K0919M8995J17267j09951J3042o2703L6375n6783
$$ 73827 28806 15527 28038 -20632 287 49282 166549 56598 69640 6937 43312 -13471
516a3471J0422j6070j6718l3644j24J7779J4518k7164J15445m0811o3600N6722
$$ -13471 -3049 -19119 -35837 -69481 -69605 -51826 -37308 -64472 50973 10162 -53438 3284
504C284p8660J9649J10041N152q720M1569j14357l5338J5435l0069P9218K9538
$$ 3284 -75376 -55727 54314 59466 50746 92315 -22042 -57380 -41945 -72014 7204 36742
492C6742k8095O6974n4429m2793N9595r491J01110r1548o4976O6902Q6179n6717
$$ 36742 8647 75621 21192 -21601 37994 28503 129613 38065 -26911 39991 126170 69453
480F9453j4591o2921k974L6947m9780P8555o0836j7920m5702K1834q9487J40023
$$ 69453 54862 -8059 -11033 25914 -23866 54689 -6147 -24067 -69769 -47935 -137422 2601
468B601J735o2798K5264M5266J7512M6777r0713l227l722l5277Q7048K2900k8121
$$ 2601 4336 -58462 -33198 12068 29580 76357 -14356 -17583 -21305 -56582 30466 53366 25245
455B5245K109l381j01804M0905L334J9789m1857m745N7256Q4921o9986r1667J3747
$$ 25245 27354 23973 -77831 -36926 -33592 -13803 -55660 -60405 -3149 81772 11786 -79881 -66134
442f6134j657P6024J6227l4629p7982K3895j3987N4676m6892p86M9747J5704J7754
$$ -66134 -67791 8233 24460 -10169 -88151 -64256 -78243 -23567 -70459 -71245 -21498 -5794 11960
429A1960J668O3603r7598L1578o3941Q1141r9360J20031L3219L3425j61502O4223
$$ 11960 13628 77231 -20367 11211 -52730 28411 -70949 49082 82301 115726 -45776 18447
417A8447j7494p9368P5518P4157l2354j5495P8019r9633J1845m8836M0666n0285
$$ 18447 953 -78415 -2897 71260 38906 23411 101430 1797 13642 -35194 5472 -44813
405d4813Q1651q6309J42476j03779j4450q2837Q7390K8556N7535j04946J6566
$$ -44813 36838 -49471 93005 -10774 -25224 -108061 -20671 7885 65420 -39526 -22960
394b2960p768m3874O7317k5246l6748K3560N9466Q81Q2880L7721j21946m4667
$$ -22960 -30728 -74602 -7285 -32531 -69279 -45719 13747 14628 97508 135229 13283 -31384
382c1384j2998J0948p596j3992O5750k7919K1539N9262R277n8703r1561R464Q4297
$$ -31384 -44382 -33434 -41030 -55022 10728 -17191 4348 63610 72887 14184 -77377 -67913 16384
369A6384P2853k3329J6931j19664l586O6489K7103n2043m5704K5136m9982J61150
$$ 16384 89237 65908 82839 -36825 -40411 26078 53181 1138 -44566 -19430 -69412 91738
357I1738r1915M465o5572Q9910m981N4192j02552J15449o9280k3965k1334k1803
$$ 91738 -177 4288 -61284 28626 23645 77837 -24715 90734 21454 -2511 -23845 -45648
345d5648n812N3838M0632L8956l1571k5323K303M945p9713j0536O9791P360O0946
$$ -45648 -51460 2378 43010 81966 50395 25072 27375 32320 -47393 -57929 11862 19222 80168
332H0168J7987l2725q0636K0245j11435N4711j5899j3557K5466K544k2528R0800
$$ 80168 98155 65430 -15206 5039 -106396 -51685 -67584 -81141 -55675 -53131 -75659 15141
320A5141Q015o1955k2763N0986Q0937j5120j1398p626p5429L0595l0656P0255
$$ 15141 23156 -38799 -61562 -10576 70361 55241 43843 36217 -39212 -8617 -39273 30982
308C0982r8766J01829o971j9389l3130K1071m3213n774j2750M7002P7824Q621
$$ 30982 -67784 34045 27074 7685 -25445 -4374 -47587 -53361 -66111 -19109 58715 67336
296F7336j9200m8621o0578M4492m2179N334L3391q4271J03597N159l3306m3212
$$ 67336 48136 -485 -61063 -16571 -58750 -53416 -20025 -104296 -699 4460 -28846 -72058
284g2058k939o9445L7351K085K490J7459O8666j26726J26886K3492J9046M9461
$$ -72058 -74997 -144442 -107091 -105006 -102516 -85057 -16391 -143117 -16231 7261 26307 75768
272G5768j5910m9311J4187r2946K5856q991L4006l7410l7194J423Q3169m4784
$$ 75768 59858 10547 24734 -68212 -42356 -51347 -17341 -54751 -91945 -90522 -7353 -52137
260e2137K8934l5013m8546j500J42641K265l1346P687n5070L1633k4136K4281
$$ -52137 -23203 -58216 -106762 -108262 34379 36644 5298 12985 -42085 -10452 -34588 -10307
248a0307l9623O45n2854M892O9508M9344m0402P5209p7769j6393K2168L3306p2050
$$ -10307 -49930 -49285 -102139 -97247 -27739 21605 -18797 56412 -21357 -37750 -15582 17724 -54326
235e4326K3210k4921L6232m9697P8355R818R347j01032P5867m3998j9648J995
$$ -54326 -31116 -56037 -19805 -69502 8853 18671 28018 -73014 2853 -41145 -60793 -58798
223e8798j0597N6751P7692J3477o6921n7899L285l8133M1637m515M3806N4105
$$ -58798 -69395 -12644 65048 78525 11604 -46295 -43010 -81143 -39506 -44021 -215 53890
211E3890j14187K0130l81j0420K5084O0398l0783k0536p970o393l3180J9518O6236
$$ 53890 -60297 -40167 -40548 -50968 -25884 34514 3731 -16805 -24775 -31168 -64348 -44830 21406
198B1406q612j4087R6921k4096r9793n8442r0441K3737R4984m6470O0154n2727
$$ 21406 12794 -1293 95628 71532 -28261 -86703 -177144 -153407 -58423 -104893 -44739 -97466
186i7466L6937J4018P898q805P5052o0203j1460o9911J5482M7924R052l6933L5275
$$ -97466 -60529 -46511 -38613 -47418 27634 -32569 -44029 -113940 -98458 -50534 -41482 -78415 -43140
173d3140m9874o862N6945k7694p0366O894L5338N9526N7130n1619N8067r124l1619
$$ -43140 -93014 -99876 -42931 -70625 -140991 -134097 -98759 -39233 17897 -33722 24345 15221 -16398
160a6398O687J434j09406K8559L7984L2284m3031J9727n8714j6571j3737N2411
$$ -16398 -9711 -8277 -117683 -89124 -51140 -18856 -61887 -42160 -100874 -117445 -131182 -78771
148g8771P2140l4863q0558j1741L8667l0846m547N9380k0817N5646K7856J8111
$$ -78771 -6631 -41494 -122052 -133793 -95126 -125972 -130519 -71139 -91956 -36310 -8454 9657
136I657o5865q0704j3863N9224k1537J4085J15213k2472k6891O5037q3041k9145
$$ 9657 -56208 -136912 -150775 -91551 -113088 -99003 16210 -6262 -33153 31884 -51157 -80302
124h0302Q210J5978l3636M7402m0697J4015K0467k5473j7064l3507k012k0017
$$ -80302 -72092 -56114 -89750 -42348 -83045 -69030 -48563 -74036 -91100 -124607 -126619 -146636
112a46636M1903L539M6331n7347N5571l6690n3216L6754K6394o8800M4819n2066
$$ -146636 -104733 -101194 -54863 -112210 -56639 -93329 -146545 -109791 -83397 -152197 -107378 -159444
100a59444N3664m0371k8911K3098J8479R961M8642o0466J6855J9864l0875j2985
$$ -159444 -105780 -146151 -175062 -151964 -133485 -123524 -74882 -135348 -118493 -98629 -129504 -142489
88a42489K0639k3607O2602N1439j2015N5677q4898r3275j7275j0286N845L5031
$$ -142489 -121850 -145457 -82855 -31416 -43431 12246 -72652 -165927 -183202 -193488 -187643 -152612
76a52612l2616M4402j505K0973J3981p7745l4735k405K9951Q0150L5477p737K6362
$$ -152612 -185228 -140826 -142331 -121358 -107377 -185122 -219857 -222262 -192311 -112161 -76684 -84421 -58059
63e8059l3596n7957j621q024j0859M739M1875n9976o2872J863P8456n4460L8096
$$ -58059 -91655 -149612 -151233 -159257 -170116 -165377 -123502 -183478 -246350 -244487 -166031 -220491 -182395
50a82395m4675N4037L433M2373K0008k4451k8308p5317J8665k9354N0711l2568
$$ -182395 -227070 -173033 -169600 -127227 -107219 -131670 -159978 -235295 -216630 -245984 -195273 -227841
38b27841P3458n6087l4806j7740N5326m8873O1622L1260l1462O8923L1951k7999
$$ -227841 -154383 -210470 -245276 -263016 -207690 -256563 -194941 -163681 -195143 -126220 -94269 -122268
26a22268p1921N896o0164j9522j1277k4085N7735M2903m9258L6832m0073l6890
$$ -122268 -194189 -188293 -248457 -267979 -279256 -303341 -245606 -202703 -251961 -215129 -255202 -292092
14b92092M4980P8157l4110J7803k6753M0522K3626p2329N8241n6115k0229O6655
$$ -292092 -247112 -168955 -203065 -185262 -212015 -171493 -147867 -220196 -161955 -218070 -238299 -171644
2a71644J7915o8818
$$ -171644 -153729 -222547
0b22547
$$ -222547
$$ Imaginary data points
##PAGE= N=2
##DATA TABLE= (X++(I..I)), XYDATA
16383a563779R741Q0819J6637P4523n0151m9510L2706N7442m7130J5840P2031
$$ -1563779 -1554038 -1473219 -1456582 -1382059 -1432210 -1481720 -1449014 -1391572 -1438702 -1422862 -1350831
16372a350831J2205Q7787n666n918K2530L6297J1713O796m3746K9364N1471L8523
$$ -1350831 -1338626 -1250839 -1256505 -1262423 -1239893 -1203596 -1191883 -1185087 -1228833 -1199469 -1147998 -1109475
16360a109475N5556j7001Q941K767J4984M4139J1113l0663N8892P181J5885R249
$$ -1109475 -1053919 -1070920 -1061979 -1059212 -1044228 -1000089 -988976 -1019639 -960747 -953566 -937681 -928432
16348i28432K4380l0486K7304R9491J10223l9881r4847O9981J8452k0172P653
$$ -928432 -904052 -934538 -907234 -807743 -697520 -737401 -832248 -762267 -743815 -763987 -756334
16337g56334P4058n834J04447N0281q0574r8110L8641L4998J1402M7373R5322
$$ -756334 -682276 -688110 -583663 -533382 -613956 -712066 -673425 -638427 -627025 -579652 -484330
16326d84330Q019L3323k8126M3258K686R086M1620R5031j4576l0058P0334j5276
$$ -484330 -476311 -442988 -471114 -427856 -425170 -416084 -374464 -279433 -294009 -324067 -253733 -269009
16314b69009o2015R625N9559J5974n489m99Q3115l920k6251r041M0891k0813Q6486
$$ -269009 -331024 -321399 -261840 -245866 -251355 -251854 -168739 -172659 -198910 -207951 -167060 -187873 -101387
16301a01387N7927j5364L5238K2373O5042p0698j8008k969l5783L0771Q9745l326
$$ -101387 -43460 -58824 -23586 -1213 63829 -6869 -24877 -27846 -63629 -32858 56887 53561
16289E3561N2496l9447K7378O152p4348P1305P9288n7741o304J30548p6897J9547
$$ 53561 106057 66610 93988 100140 25792 97097 176385 118644 112340 242888 165991 185538
16277A85538K0899l6319k7612J27430O578J16400p6490M2049O7990o4145m6257
$$ 185538 206437 170118 142506 269936 276514 392914 316424 358473 426463 362318 316061
16266C16061M4082j0547r347R5388J6983M8104l8516L3539k342p2494k2266R1023
$$ 316061 360143 349596 340249 435637 452620 500724 462208 495747 493405 420911 398645 489668
16254D89668N0708p0578p255L7700k5227l9343J03026O2270l9264j823Q7960k3929
$$ 489668 540376 469798 462543 500243 475016 435673 538699 600969 561705 559882 647842 623913
16242F23913k0356M1210J1805O937k6690J17882R21o8150L5814J7773q2724l6673
$$ 623913 603557 644767 656572 663509 636819 754701 755622 687472 723286 741059 658335 621662
16230F21662J390N2605M0043J09619j7068M4116k4570N875K4702m2575l1847J00158
$$ 621662 623052 675657 715700 825319 808251 852367 827797 833672 858374 815799 783952 884110
16218H84110O4390p5396m0596k8165L205L1257P6091L4517n9201j5175Q3332l2775
$$ 884110 948500 873104 832508 804343 807548 838805 914896 949413 890212 875037 958369 925594
16206I25594K1496J6141O4738M7112j0318j3832M20n4652M3611k6189j31579J05570
$$ 925594 947090 963231 1027969 1075081 1064763 1050931 1051351 996699 1040310 1014121 882542 988112
16194I88112j7423N4651R2898o5983J9427j2466q8225J04821R2413j05442R8947
$$ 988112 970689 1025340 1118238 1052255 1071682 1059216 970991 1075812 1168225 1062783 1161730
16183A161730K0118p6636j7470M3853o084O1016j56939L9120J63393j07266M1093
$$ 1161730 1181848 1105212 1087742 1131595 1125511 1186527 1029588 1068708 1232101 1124835 1165928
16172A165928J13903j70005m2103R2159J7038J2236r907J2431j7560p2193K417
$$ 1165928 1279831 1109826 1067723 1159882 1176920 1189156 1179249 1191680 1174120 1101927 1104344
16161A104344R8663l4666p874o627J10966k8449J6405l1803q2865J5853J03124
$$ 1104344 1203007 1168341 1160467 1153840 1264806 1236357 1252762 1220959 1138094 1153947 1257071
16150A257071j3711L9453l5708l2231K6456n1074l0908P6068j1412L7307L9861
$$ 1257071 1243360 1282813 1247105 1214874 1241330 1190256 1159348 1235416 1224004 1261311 1301172
16139A301172o3790j7890L8165O9833q1447q9338K7866J37122R487n8428K015
$$ 1301172 1237382 1219492 1257657 1327490 1246043 1156705 1184571 1321693 1331180 1272752 1274767
16128A274767P7478l2103k8622P945r5954l4310R2800Q8354n0886l2588M6645
$$ 1274767 1352245 1320142 1291520 1299465 1203511 1169201 1262001 1350355 1299469 1266881 1313526
$$ [...]
##END NTUPLES=NMR SPECTRUM
##END=
