##TITLE=1H_DE-80H_X3
 200.13MHz, d2o
 8 sc
 
 19ns.26.2.2025
##JCAMPDX= 6.0         $$ Bruker NMR JCAMP-DX V2.0
##DATA TYPE= NMR SPECTRUM
##DATA CLASS= NTUPLES
##ORIGIN= UXNMR, Bruker Analytische Messtechnik GmbH
##OWNER= pz
$$ XWIN-NMR		Version 3.5
$$ Thu Jul  9 11:17:56 2026 Russian Standard Time (UT+4h)  Yarkov@DPX200
##.OBSERVE FREQUENCY= 200.1313
##.OBSERVE NUCLEUS= ^1H
##.ACQUISITION MODE= SIMULTANEOUS
##.ACQUISITION SCHEME= undefined
##.AVERAGES= 8
##.DIGITISER RES= 18
##SPECTROMETER/DATA SYSTEM= spect
##.PULSE SEQUENCE= zg30
##.SOLVENT NAME= DMSO
##.SHIFT REFERENCE= (INTERNAL, DMSO, 0, 15.5023)
##AUDIT TRAIL= $$ (NUMBER, WHEN, WHO, WHERE, WHAT)
$$ ##TITLE= Audit trail, XWIN-NMR		Version 3.5
$$ ##JCAMPDX= 5.01
$$ ##ORIGIN= Bruker BioSpin GmbH
$$ ##OWNER= Yarkov
$$ C:/Bruker/XWIN-NMR/data/yarkov2/nmr/H-C/1/pdata/1/auditp.txt
$$ ##AUDIT TRAIL=  $$ (NUMBER, WHEN, WHO, WHERE, WHAT)
(   1,<2026-07-09 11:16:57.64 +0400>,<Yarkov>,<DPX200>,
      <created by zg, POWCHK disabled, PULCHK disabled
       configuration hash MD5:
       00 E9 B6 7A A2 85 ED C7 34 08 36 98 17 FE 4E 26
       data hash MD5: 16K
       1D F2 10 6B 85 3D 96 24 E3 2C 00 B3 AA CD 3D 89>)
(   2,<2026-07-09 11:17:23.90 +0400>,<Yarkov>,<DPX200>,
      <Start of raw data processing
       efp BC_mod = 2 LB = 0.25 FT_mod = 6 PKNL = 1 PHC0 = -7253.948 PHC1 = 6.42196 SI = 16K 
       data hash MD5: 16K
       F1 B7 56 38 4C AC 9A B8 3D CC E2 0F 37 11 1B F1>)
$$ ##END=
$$ 
$$ hash MD5
$$ 4B 1E 78 C8 54 83 79 24 A9 64 B7 92 79 D2 CD 67
##$RELAX= 
##$RELAX= 
##$RELAX= 
##$RELAX= 
##$RELAX= 
##$RELAX= 
$$ Bruker specific parameters
$$ --------------------------
##$DU= <C:/Bruker/XWIN-NMR>
##$EXPNO= 1
##$NAME= <H-C>
##$PROCNO= 1
##$TYPE= <nmr>
##$USER= <yarkov2>
##$AMP= (0..31)
100 100 100 100 100 100 100 100 100 100 100 100 100 100 100 100 100 100 
100 100 100 100 100 100 100 100 100 100 100 100 100 100 
##$AQSEQ= 0
##$AQ_mod= 1
##$AUNM= <au_zg>
##$AUTOPOS= <>
##$BF1= 200.13
##$BF2= 200.13
##$BF3= 200.13
##$BF4= 200.13
##$BF5= 200.13
##$BF6= 200.13
##$BF7= 200.13
##$BF8= 200.13
##$BYTORDA= 1
##$CFDGTYP= 0
##$CFRGTYP= 5
##$CHEMSTR= <none>
##$CNST= (0..31)
1 1 145 1 1 1 1 1 1 1 1 1 1 1 1 1 1 1 1 1 1 1 1 1 1 1 1 1 1 1 1 1 
##$CPDPRG= <>
##$CPDPRG1= <>
##$CPDPRG2= <>
##$CPDPRG3= <>
##$CPDPRG4= <mlev>
##$CPDPRG5= <mlev>
##$CPDPRG6= <mlev>
##$CPDPRG7= <mlev>
##$CPDPRG8= <mlev>
##$CPDPRGB= <>
##$CPDPRGT= <>
##$D= (0..31)
0 0.7 0 0 0 0 0 0 0 0 0 0.03 0 0 0 0 0 0 0 0 0 0 0 0 0 0 0 0 0 0 0 0 
##$DATE= 1783581417
##$DBL= (0..7)
120 120 120 120 120 120 120 120 
##$DBP= (0..7)
150 150 150 150 150 150 150 150 
##$DBP07= 0
##$DBPNAM0= <>
##$DBPNAM1= <>
##$DBPNAM2= <>
##$DBPNAM3= <>
##$DBPNAM4= <>
##$DBPNAM5= <>
##$DBPNAM6= <>
##$DBPNAM7= <>
##$DBPOAL= (0..7)
0.5 0.5 0.5 0.5 0.5 0.5 0.5 0.5 
##$DBPOFFS= (0..7)
0 0 0 0 0 0 0 0 
##$DE= 6
##$DECBNUC= <off>
##$DECIM= 32
##$DECNUC= <off>
##$DECSTAT= 4
##$DIGMOD= 1
##$DIGTYP= 9
##$DL= (0..7)
0 120 120 120 120 120 120 120 
##$DP= (0..7)
$$ [...]
##$SUBNAM2= <"">
##$SUBNAM3= <"">
##$SUBNAM4= <"">
##$SUBNAM5= <"">
##$SUBNAM6= <"">
##$SUBNAM7= <"">
##$SUBNAM8= <"">
##$SUBNAM9= <"">
##$SW= 18.0517328524113
##$SWIBOX= (0..15)
0 0 2 0 0 0 0 0 0 0 0 0 0 0 0 0 
##$SW_h= 3612.71676300578
##$TD= 16384
##$TD0= 1
##$TE= 0
##$TE2= 300
##$TE3= 300
##$TEG= 300
##$TL= (0..7)
0 120 120 120 120 120 120 120 
##$TP= (0..7)
150 150 150 150 150 150 150 150 
##$TP07= 0
##$TPNAME0= <>
##$TPNAME1= <>
##$TPNAME2= <>
##$TPNAME3= <>
##$TPNAME4= <>
##$TPNAME5= <>
##$TPNAME6= <>
##$TPNAME7= <>
##$TPOAL= (0..7)
0.5 0.5 0.5 0.5 0.5 0.5 0.5 0.5 
##$TPOFFS= (0..7)
0 0 0 0 0 0 0 0 
##$TUNHIN= 0
##$TUNHOUT= 0
##$TUNXOUT= 0
##$USERA1= <user>
##$USERA2= <user>
##$USERA3= <user>
##$USERA4= <user>
##$USERA5= <user>
##$V9= 5
##$VALIST= <valist>
##$VCLIST= <CCCCCCCCCCCCCCC>
##$VD= 0
##$VDLIST= <DDDDDDDDDDDDDDD>
##$VPLIST= <PPPPPPPPPPPPPPP>
##$VTLIST= <TTTTTTTTTTTTTTT>
##$WBST= 1024
##$WBSW= 4
##$XGAIN= (0..3)
0 0 0 0 
##$XL= 0
##$YL= 0
##$YMAX_a= 370937
##$YMIN_a= -309600
##$ZGOPTNS= <>
##$ZL1= 120
##$ZL2= 120
##$ZL3= 120
##$ZL4= 120
##$ABSF1= 0
##$ABSF2= 0
##$ABSG= 0
##$ABSL= 0
##$ALPHA= 0
##$AQORDER= 0
##$ASSFAC= 0
##$ASSFACI= 0
##$ASSFACX= 0
##$ASSWID= 0
##$AUNMP= <proc_1d>
##$AZFE= 0.1
##$AZFW= 0.1
##$BCFW= 0
##$BC_mod= 2
##$BYTORDP= 0
##$COROFFS= 0
##$CY= -3
##$DATMOD= 1
##$DC= 0
##$DFILT= <>
##$DTYPP= 0
##$F1P= 0
##$F2P= 0
##$FCOR= 1
##$FTSIZE= 16384
##$FT_mod= 6
##$GAMMA= 0
##$GB= 0
##$INTBC= 1
##$INTSCL= 3.241238e-09
##$ISEN= 128
##$LB= 0.25
##$LEV0= 0
##$LPBIN= 0
##$MAXI= 10000
##$MC2= 0
##$MEAN= 0
##$ME_mod= 0
##$MI= 1.114404
##$NCOEF= 0
##$NC_proc= -5
##$NLEV= 6
##$NOISF1= 3.799351
##$NOISF2= 2.8
##$NSP= 0
##$NTH_PI= 0
##$NZP= 0
##$OFFSET= 15.50229
##$PC= 1
##$PHC0= -7253.948
##$PHC1= 6.42196
##$PH_mod= 1
##$PKNL= yes
##$PPARMOD= 0
##$PSCAL= 0
##$PSIGN= 0
##$REVERSE= no
##$SF= 200.13000388432
##$SI= 16384
##$SIGF1= 3
##$SIGF2= 2
##$SINO= 0.751879
##$SIOLD= 32768
##$SREGLST= <19F.Aceton>
##$SSB= 0
##$STSI= 16384
##$STSR= 0
##$SW_p= 3612.71676300578
##$SYMM= 0
##$S_DEV= 0
##$TDeff= 16384
##$TDoff= 0
##$TI= <>
##$TILT= no
##$TM1= 0
##$TM2= 0
##$TOPLEV= 0
##$USERP1= <user>
##$USERP2= <user>
##$USERP3= <user>
##$USERP4= <user>
##$USERP5= <user>
##$WDW= 1
##$XDIM= 16384
##$YMAX_p= 360766005
##$YMIN_p= -366823
$$ End of Bruker specific parameters
$$ ---------------------------------
##NTUPLES= NMR SPECTRUM
##VAR_NAME=  FREQUENCY,     SPECTRUM/REAL,   SPECTRUM/IMAG
##SYMBOL=    X,             R,               I
##VAR_TYPE=  INDEPENDENT,   DEPENDENT,       DEPENDENT
##VAR_FORM=  AFFN,          ASDF,            ASDF
##VAR_DIM=   16384,         16384,           16384
##UNITS=     HZ,            ARBITRARY UNITS, ARBITRARY UNITS
##FACTOR=    0.220516191357247, 1,           1
##FIRST=     3102.47331229296, 0,            0
##LAST=      -510.243450712824, 0,           0
##MIN=       -510.243450712824, -366823,     0
##MAX=       3102.47331229296, 360766005,    0
$$ Real data points
##PAGE= N=1
##DATA TABLE= (X++(R..R)), XYDATA
$$ [...]
6216a18375L04k2196p380L090J9140M69L499j3474K4498K6097k1165M06M833J3262
6202h6992N0012j0953m3220l9464J6932K0056K894M150j3444j9202J7361J7828
6190h4042L722L5022j8581K2299J5582M421K329n0577m7109J8675q1n851K8328
6177g5863o528J4628n545j4098j8700M1329L2302j3753j4223p936O653L0096j4744
6164d6382k2624j4460J993K458j9510J402J5495L558k9842k3522N7013K9062J3668
6151c1691K9450k2312l3927j1307q3N91K8545j0919l5152k611K643J5761J5899
6138e5113m7673j0838L8512O00j3597J4062L234J4988K4952l3053l0371L539M904
6125h5854k0959r543k6133O569L1892K778q098J196K9730K3595m611J263J2872
$$ y = [-118375, -118071, -140267, -147647, -144557, -125417, -124948, -121449, -134923, -110425, -84328, -105493, -105087, -100254, -86992, -36980, -47933, -91153, -130617, -113685, -93629, -90735, -86585, -100029, -119231, -101870, -84042, -80320, -45298, -63879, -41580, -25998, -21577, -19248, -69825, -116934, -98259, -98340, -104191, -75863, -82391, -67763, -73308, -87406, -106106, -64777, -32475, -46228, -60451, -68387, -61734, -31638, -46382, -69006, -83466, -81473, -79015, -98525, -97123, -81628, -78070, -107912, -131434, -74421, -45359, -31691, -2241, -24553, -58480, -69787, -69870, -69279, -40734, -51653, -86805, -89416, -86773, -71012, -55113, -102786, -113624, -75112, -74512, -88109, -74047, -70813, -55825, -30873, -63926, -94297, -90758, -85854, -106813, -116356, -142489, -135920, -104028, -101250, -109348, -108152, -78422, -54827, -59438, -58175, -45303]
6112d5303P86k171k8468j8505n160N6660K734r149L999l7224k7495K2907J1376
6099g5013k765K1748N155o127N239j422m233J9894L6147j5401r271j1110k3944
6086f1103k3588m083j5863K2849J2996J9906J2988k6296k3582J5962N235o326
6074g0905L0959J8843P988j9890j4784L0108p639q985J6166j5149l0830p022O518
6061f4622j4837j2169K8537q568l279j007r420J5546k741l4412K3829J1532M5961
6048b5650J5926m3614l4384k3243l103r050J0713n313K6693L0509J0870L682K0149
6035b5815k0449j1943j7811j8772k957j381K5421m9638L2621L5657l7921p439
6023a00427K693k3037q240J2306j7673K5771Q203K8705R385o935k339K2843j445
$$ y = [-45303, -44517, -46688, -75156, -93661, -98821, -42161, -39427, -48576, -44577, -81801, -109296, -86389, -75013, -77778, -56030, -50875, -57002, -51763, -53185, -57418, -37524, -1377, -16778, -26049, -37159, -61103, -84691, -88774, -104637, -81788, -68792, -48886, -35898, -62194, -85776, -69814, -64579, -70905, -39946, -21103, -13115, -33005, -47789, -17681, -25320, -34305, -18139, -33288, -64118, -71140, -64622, -79459, -91628, -63091, -71659, -74938, -75945, -85365, -69819, -72560, -106972, -83143, -71611, -25650, -9724, -53338, -87722, -110965, -114068, -123118, -112405, -117718, -91025, -60516, -49646, -45964, -25815, -46264, -58207, -76018, -94790, -97747, -99128, -73707, -123345, -90724, -55067, -92988, -100427, -97734, -120771, -129011, -116705, -134378, -108607, -100404, -71699, -62314, -69249, -71588, -48745, -50190]
6010e0190k0888k6156J8546k6486K823j8655N926J1139P916k029J2867l331M6063
5997d2455J6357O877N551j4849m0494j9923J7481K4004j4209k1277K435p742K3985
5984f4259J1707N960m1808J0373J2054j7017m814J737L8977K8173m1378j3428
5972g3723K4992L740M88k4604K7667j4550k2492k0871k3695K8469K1722J9997
5960e2860n2185k0630M7128N5723r781j8779o262k3795K1354k3796k0035m564
5948a08482k6675J1426m924J8739K8837L8099K547J6476k2925k8401J172k1565
5936i5676M858M2289J2471j2152k568K5742k4650j0624J2890R31k2161n553q603
5923h2806l940N2572L291q24q220K176L5721j3471n3517J7357J1058n0406Q884
$$ y = [-50190, -71078, -97234, -78688, -105174, -102351, -121006, -115080, -103941, -96025, -98054, -85187, -88518, -42455, -26098, -19221, -13670, -28519, -69013, -88936, -71455, -47451, -61660, -82937, -80502, -88244, -64259, -52552, -46592, -88400, -78027, -65973, -82990, -87804, -86067, -47090, -18917, -60295, -73723, -48731, -44991, -44503, -69107, -41440, -55990, -78482, -99353, -123048, -94579, -72857, -52860, -105045, -125675, -78547, -22824, -32605, -51384, -57646, -81441, -60087, -83883, -103918, -108482, -135157, -123731, -128655, -109916, -81079, -42980, -40433, -23957, -46882, -75283, -74111, -95676, -90818, -48529, -36058, -48210, -50778, -25036, -49686, -60310, -47420, -46489, -68650, -74203, -82806, -86746, -34174, -30883, -31707, -39927, -37751, -2030, -15501, -69018, -51661, -40603, -91009, -82125]
5910h2125l845k812n675K1396J0678j3859J7664o33J4793K3226K9183m767l348
5897a24o1646k3418p725q70P813J164M9458K7257m888l6583J911j6467O229k1604
5883g9493R453K2540K6993n0387J6570L2852Q878J6919k3217j1193J8815k3953
5871c5223m2221K651j2393j0667r166N774J2034M1458O2270k0390j3538q281L8429
5858A0737J8953k7823n5242j9425L7474l5088r610K8187p45K0976l898J0771K4613
5845a20M092j3540m8298L0725o376N1j2003N675K5894M2982m0022M671K0260k3225
5831i234L795n1435j9564P7019j3092k6176l2589K9425K7073L5956L0859k1064
5819C0973J6112l1884k8047O31n68m1459lL4935M368J4829L059n456L0409l758
$$ y = [-82125, -85970, -88782, -94457, -73061, -62383, -76242, -58578, -59211, -44418, -21192, 7991, 3224, -124, -61770, -85188, -92913, -93783, -85970, -84806, -35348, -8091, -12979, -49562, -47651, -64118, -57889, -79493, -70040, -47500, -20507, -70894, -54324, -21472, -12594, 4325, -18892, -30085, -11270, -35223, -77444, -74793, -87186, -97853, -107019, -101245, -89211, -47753, 14517, -5873, -19411, -27692, 10737, 29690, 1867, -53375, -72800, -35326, -70414, -80024, -51837, -52582, -31606, -35504, -24733, -120, 3972, -9568, -57866, -27141, -33517, -33466, -45469, -39794, -13900, 29082, -10940, -6269, 13991, -9234, -5439, -56874, -76438, 581, -12511, -38687, -71276, -41851, -14778, 21178, 52037, 30973, 47085, 15201, -12846, -12215, -12783, -54242, -54245, -19310, -14942, -113, 2946, -2510, 27899, 24141]
5805B4141l4678L5390J8747N30J4799J9007l0855j8761K791k6155L1146L5227
5793G1329k230J4823M019l0980J1622L9621l2145M5314J3927j4966J8472J3010
5781A51816K640m0064J2677Q1848L9624j5385J5626k2470L6067N1904M0284L0157
5769C84724P7997N9855J3344R2616L0015P2544R0229P9438J35145K07302L03646
5758A546855N38096R46467J354915J709671J681049J101921K93649k45205q12458
5749H114960j144215j119452j023068r48776q12071p24282m95019k95886k49398
5740A302793j94500j75117j43822j19459o1637q0714p0264m6979m2710m7736j1367
5729C08488k9888K9575L099k2042k8068K1497K789q3206l4548l2189J3051K6224
$$ y = [24141, -10537, 24853, 43600, 44130, 58929, 77936, 47081, 28320, 31111, 4956, 36102, 71329, 69099, 83922, 87941, 56961, 68583, 108204, 76059, 121373, 135300, 120334, 138806, 151816, 154456, 114392, 127069, 208917, 248541, 233156, 248782, 226312, 262379, 314283, 354567, 384724, 462721, 522576, 535920, 628536, 658551, 731095, 821324, 900762, 1035907, 1243209, 1546855, 2084951, 3031418, 4386333, 6096004, 7777053, 8878974, 9172623, 8927418, 8114960, 6970745, 5851293, 4828225, 3879449, 3067378, 2343096, 1848077, 1552191, 1302793, 1108293, 933176, 789354, 669895, 608258, 527544, 457280, 410301, 367591, 319855, 308488, 278600, 308175, 311274, 289232, 261164, 282661, 285450, 202244, 167696, 135507, 148558, 174782]
5717A74782k1910m2568K3304K5619P999j195L705J6750l590k1407k5199K7489
5705A63779l0216n524l5944j4402L8746r944o010r727J0373K747m098k1665o739
5692G1376k6892j304K2766M3707L7301J2342n173p619k0551r608n383l3803n8619
5679A8540K2107l3137m306J3049k6488L241j4143L6641l713q415J5746M4185k883
5666F0424n9638L4680L057l6326l4225j1764K9077J7782k737j8919R128K7106
5654A7645m962j9841K0249J4088J5096o126j9567J3095L6103n777k8658L0287
5642F1632K9814j0641m6521l7213n16k728K6712L6332k8119M79J7730K7152j9293
5629E4820K6512r196j9607Q44j3025K8227j9427l7249J0572L9470j1877K778k209
$$ y = [174782, 152872, 110304, 133608, 159227, 167226, 166031, 169736, 186486, 182896, 161489, 136290, 163779, 133563, 128039, 92095, 77693, 116439, 106495, 100485, 90758, 101131, 103878, 99780, 78115, 71376, 44484, 43180, 65946, 109653, 146954, 159296, 154123, 146504, 125953, 116345, 110962, 77159, 18540, 40647, 7510, 3204, 16253, -10235, -6994, -21137, 15504, 11791, 3376, 19122, 63307, 60424, 786, 35466, 38523, 2197, -32028, -43792, -14715, 3067, 330, -18589, -9461, 17645, 12683, -7158, 13091, 27179, 42275, 36149, 16582, 29677, 65780, 60003, 31345, 61632, 91446, 80805, 34284, -2929, -3445, -6173, 20539, 56871, 28752, 29231, 46961, 74113, 54820, 81332, 72136, 52529, 53373, 40348, 68575, 49148, 11899, 22471, 61941, 50064, 52842, 50633]
5616E0633K6202J5941j5663k079P933R325L7449j3983Q899J323K0279L9218N6472
5603B41949O1210J2937M6007K0948l6519j6507m785j7302k0737L4868N4404L5383
5591D11856M0973L0613k3182k010p8659p6888l3698n8227k9951n96m4965k7801
5579A07465L8693j9422J996R118j560K9263J1187n8646k2488L2913J49J1280M283
5566A44231k387o326K4120L070N492m482m6783K6521N4237j1326K3029K216q995
5553B02617N2846M7055K456o722K2855j1607K4619L9204j0542n17L5280L4290
5541D31834M6964M3676N2923J03364J58021J23949J62816K64657K32233J39796
5531A760233J82195J51767P1697O8213k7822k7194Q520q438N5367K4424Q2983
$$ y = [50633, 76835, 92776, 77113, 75034, 82967, 92292, 129741, 115758, 124657, 125980, 146259, 185477, 241949, 303159, 316096, 362103, 383051, 346532, 330025, 325240, 307938, 287201, 322069, 376473, 411856, 452829, 483442, 460260, 458250, 379591, 302703, 269005, 210778, 180827, 180231, 135266, 107465, 146158, 126736, 128732, 137850, 136290, 165553, 176740, 118094, 95606, 128519, 128668, 139948, 144231, 141844, 135518, 159638, 162708, 168200, 163718, 116935, 143456, 197693, 186367, 209396, 211612, 202617, 255463, 302518, 304974, 298252, 321107, 309500, 334119, 373323, 362781, 362264, 397544, 431834, 478798, 522474, 575397, 678761, 836782, 960731, 1123547, 1388204, 1620437, 1760233, 1942428, 2094195, 2165892, 2234105, 2206283, 2179089, 2187609, 2179171, 2234538, 2258962, 2341945]
5520B341945N1749j7576q6107j38647j92271k48257k00350j79336j79938j46978
5510A004234j46708j37934q6877m1921n4287o4857q3655m5568j1742o6677k5361
5499B38647k3373L2198J2089m427P20Q835k653l0853N040l2119L119j5674j1779
5486A79770j8634K5385L7342k0063J0383k2437l21J3235O4619k0543k3747K1011
5474B46000l4552K0517M6200J7527k734L4589r198n0110K7678R719j6174n998
5462B83464J3972M8771J904k8426o80L7501o17J4067N421o0500k5587J3992k1956
5449B81326K8659k4442l9432J9892J7033L674Q190J7032j396J0466K702m52N969
5436C29221M655n335J2332j1035L6032N4684n146j6243J0974N722N285j5139k9484
$$ y = [2341945, 2393694, 2376118, 2290011, 2151364, 1959093, 1710836, 1510486, 1331150, 1151212, 1004234, 857526, 719592, 632715, 590794, 536507, 471650, 387995, 342427, 330685, 264008, 238647, 215274, 247472, 259561, 255134, 255854, 264689, 262036, 231183, 236223, 204104, 207223, 191549, 179770, 161136, 186521, 223863, 203800, 214183, 191746, 191425, 204660, 269279, 248736, 224989, 246000, 211448, 231965, 278165, 295692, 292958, 327547, 318349, 268239, 295917, 305636, 289462, 283464, 297436, 346207, 348111, 319685, 319005, 356506, 355889, 369956, 375377, 314877, 289290, 303282, 281326, 309985, 285543, 246111, 266003, 283036, 286710, 294900, 311932, 310536, 321002, 323704, 323252, 329221, 333876, 328541, 340873, 329838, 365870, 420554, 415408, 399165, 410139, 415861, 421146, 406007, 376523]
5423C76523R418L2702Q636J8442J829j0449J5148K1786J128J2296j1345r16O1796
5410E36994k4390l2776J0467K4110Q838k0388L6786L4581k3306J2184L0759O508
5398F00367L5028o924K143L7480k1431j9806J5656l369J124L7783J2855l1663
5386F59243K0897k5429N4978M6440k282K2426p024J8270K1847K5045J4527J0537
5374H59475K9428J6524J4162K6612J8336M9077L4484k9351J5202L6240J0762K4731
5362A105682K7871M2257j0607N6060L1214r04K6626N924J7242L0968m2750j3666
5350A275917J3661N7400P5255L5100K1507Q5121O2087L5445K6583j2187J0111
5339A686000M6218N2396P341N5064L6268Q2351R6288O2512N9885P6212R9480N7039
$$ y = [376523, 385941, 418643, 427279, 445721, 447550, 437101, 452249, 474035, 475163, 487459, 476114, 475198, 536994, 512604, 479828, 490295, 514405, 523243, 502855, 539641, 574222, 550916, 563100, 593859, 600367, 635395, 628471, 630614, 668094, 646663, 626857, 642513, 639144, 640268, 678051, 690906, 659243, 680140, 654711, 709689, 756129, 753847, 776273, 769249, 787519, 809366, 834411, 848938, 859475, 888903, 905427, 919589, 946201, 964537, 1013614, 1048098, 1018747, 1033949, 1070189, 1080951, 1105682, 1133553, 1175810, 1165203, 1221263, 1252477, 1251573, 1278199, 1284123, 1301365, 1332333, 1289583, 1275917, 1289578, 1346978, 1422233, 1457333, 1478840, 1563961, 1626048, 1661493, 1688076, 1675889, 1686000, 1732218, 1784614, 1791955, 1847019, 1883287, 1965638, 2061926, 2124438, 2184323, 2260535, 2360015, 2417054]
5327B417054P4874P1004Q3904J18060J20459J71622J96569J60474J31298J83471
5317C728789J91094K34516K69502K59808L30903L83754L82633M46008M46727M86072
5307G159806M97792N36451O40139P98069R71481J144955J440375J823110K351049
5298A7363227L308237M931467P189403R754063J1203500J0143578O697976K576026
5290G3167477q11496l540876m893788m521450k925771k60956K908308N875200
5282F4996648O855499M915294J147165k412855n513585p676634q305384q104158
5274D5901990p422361o610219n635145m554235l540883k659181k004197j659077
5266A1816692j401574j166335r65831p96666o21720n07994m15333l15371l03766
$$ y = [2417054, 2491928, 2562932, 2646836, 2764896, 2885355, 3056977, 3253546, 3414020, 3545318, 3728789, 3919883, 4154399, 4423901, 4683709, 5014612, 5398366, 5780999, 6227007, 6673734, 7159806, 7657598, 8194049, 8834188, 9632257, 10603738, 11748693, 13189068, 15012178, 17363227, 20671464, 25602931, 32792334, 42546397, 53749897, 63893475, 70591451, 73167477, 72355981, 68815105, 63921317, 59399867, 56474096, 56213140, 59121448, 64996648, 71852147, 76767441, 77914606, 75501751, 69988166, 62311532, 54006148, 45901990, 38479629, 31869410, 26234265, 21680030, 18139147, 15479966, 13475769, 11816692, 10415118, 9248783, 8282952, 7486286, 6864566, 6356572, 5941239, 5625868, 5322102]
5257E322102l04832k71584k34771k37505k03747j84105j33695r7103j05343j32620
5247C416797j12363r1680p5531q4824j79463j42439p9395n1852r8554o6914m2924
5236B390858l9289m9887q4882j20733k3988n7400n3569r1268p8896m8782l8572
5225A703592l8615n4317q419n3574m4799n8949q6466m5891j3028n8180l8782l1024
5213A171548n8670n2649r059o781J2984O464m3003o1065J69l5144j3926l6877
5201H73991k3256l774j7549K9617m2214l5180J6497K0649j8527l6162M0650J1423
5189H16165l3947k0038k9223J3296K6820m5592j4076R100o179j0079m1579n708
5177F58960l79k5300k6924n0356K5153O655j0765Q441j2358q53K2990L138p466
$$ y = [5322102, 5017270, 4745686, 4510915, 4273410, 4069663, 3885558, 3751863, 3654760, 3549417, 3416797, 3304434, 3212754, 3137223, 3052399, 2872936, 2730497, 2651102, 2599250, 2500696, 2433782, 2390858, 2351569, 2301682, 2216800, 2096067, 2072079, 2014679, 1961110, 1869842, 1790946, 1742164, 1703592, 1664977, 1610660, 1602241, 1548667, 1503868, 1444919, 1358453, 1312562, 1299534, 1241354, 1202572, 1171548, 1112878, 1060229, 1051170, 1044389, 1057373, 1063837, 1020834, 959769, 959938, 924794, 910868, 873991, 850735, 846961, 829412, 859029, 816815, 781635, 798132, 818781, 800254, 764092, 804742, 816165, 782218, 762180, 732957, 746253, 773073, 727481, 713405, 722505, 716326, 706247, 664668, 658960, 658581, 633281, 606357, 556001, 581154, 587809, 577044, 585485, 573127, 572274, 595264, 598402, 590936]
5164E90936l2905l7544k7457j839K052j7477L545j3682l5429L4126K3618p224
5152D80720j7150j9488J1972O137Q830q983l3980l4448L7703K795j0980K32L9082
5139D62442P717k9599M526J3383K1878m7530j5017P805N90J760k0394J9947n3809
5126C73699P704M3170l9845k2411N350Q305m675L6409p587j9219J9986n4034l0644
5113C16208M384j2481L9781J9071O758j3808l1580l2230L6108L1429o8955J0483
5101C05168K4028j293K5608N763n1188J7862L4654j181j3433L9030N08J2039L5629
5088D33194q656j4501q093J6315J0166k4211J2795K1696l008l1574P854L3314
5076D45291k340J0020K0503J2081J8391J2477m2005M684L464J8l2813J363j1760
$$ y = [590936, 558031, 520487, 493030, 491191, 493243, 475766, 479311, 465629, 430200, 464326, 487944, 480720, 463570, 444082, 456054, 462191, 471021, 462038, 428058, 393610, 431313, 434108, 423128, 423360, 462442, 470159, 440560, 445086, 458469, 480347, 432817, 417800, 425605, 426195, 427955, 407561, 427508, 373699, 381403, 424573, 384728, 362317, 367667, 375972, 371297, 407706, 400119, 380900, 400886, 346852, 316208, 320592, 308111, 347892, 366963, 373721, 359913, 328333, 296103, 332211, 363640, 294685, 305168, 329196, 327903, 353511, 359274, 308086, 325948, 360602, 359421, 345988, 385018, 385526, 397565, 433194, 424538, 410037, 401944, 418259, 428425, 404214, 417009, 438705, 435697, 404123, 411977, 445291, 442951, 452971, 473474, 485555, 503946, 516423, 474418, 479102, 482566, 482584, 449771, 451134, 439374]
5063D39374K910m177o509R493K5895J3485R914M2532K1686k0319k2535N604L3724
5050E51077J2391k8060l370K3402O1722q87k8270J0896J2269j24j3493n4843n2085
5037D90625J0215K8348l0876k3841j0490K4463L2948L227l3413l0910K0572p048
5025D73820j3910k8849k2929L4025k3441k6735o519K2737M8140J9777J0401j3673
5013D72844j4195n79j461l455j1250J2915O6910P449j3666J5993l301j4214K7651
5000E41641J9190p505J8472K0068L4438k167j2669K3574M4389O8236M6148N3640
4988H47455O9783J7803N7023N150l9917n37j1424J445N961M9011K0951N627j7583
4975A010748k8309k2481m7669J64J387J9239N7855M0174K141p980j3015k2509
$$ y = [439374, 442284, 438107, 431598, 441091, 466986, 480471, 490385, 532917, 554603, 534284, 511749, 517353, 551077, 563468, 535408, 532038, 555440, 617162, 616275, 588005, 598901, 611170, 611046, 597553, 542710, 490625, 500840, 529188, 498312, 474471, 463981, 488444, 521392, 524619, 491206, 460296, 480868, 473820, 459910, 431061, 408132, 442157, 418716, 391981, 385462, 408199, 456339, 476116, 486517, 472844, 458649, 458070, 456609, 453154, 441904, 454819, 521729, 529178, 515512, 531505, 528204, 513990, 541641, 560831, 553326, 571798, 591866, 626304, 624137, 611468, 635042, 679431, 747667, 793815, 847455, 917238, 935041, 992064, 997214, 957297, 956760, 945336, 946781, 952742, 1001753, 1022704, 1028331, 1010748, 982439, 959958, 912289, 912453, 913840, 933079, 990934, 1031108, 1033249, 1025269, 1012254, 989745]
4963I89745j1142m0655l1565m7355n6873n9647L4657p604k8900j501R457L026
4951G51643n856K7138j7185P829J5631j4073j8027m747K98L1110p437l0465J5191
4938G51050L4357J5238P336q825k1606K1053P522j4322J750J131J9003L3605l5998
4925H11294Q46n072o487l59K5997L8364k7398J0473M1521K9588K6906J8014j6502
4912I47185J7608M1463l1899J8112n17k9746j670J5974J5844K3060L7698j0779
4900A042333p221R683J9613L8211M492m1647K0099J1192m6093K2809k2157o640
4888A044674M4890R812K2343L2852l2855R184L9810j8794J6515k6956P0375J0354
4876A222204k2535j8545J1905J7241j5042N829M4342J8237K4538l219l7953J1231
$$ y = [989745, 978603, 937948, 906383, 859028, 802155, 742508, 777165, 769561, 740661, 739160, 748617, 751643, 745787, 772925, 755740, 763569, 779200, 765127, 747100, 742353, 742651, 773761, 766324, 735859, 751050, 785407, 800645, 807981, 799156, 777550, 798603, 806125, 791803, 793553, 794684, 813687, 847292, 811294, 812140, 807068, 800581, 800222, 826219, 864583, 837185, 847658, 889179, 918767, 945673, 963687, 947185, 964793, 1006256, 974357, 992469, 991952, 962206, 960536, 976510, 992354, 1015414, 1053112, 1042333, 1035112, 1044795, 1064408, 1102619, 1107111, 1065464, 1085563, 1096755, 1050662, 1073471, 1051314, 1044674, 1089564, 1099376, 1121719, 1154571, 1121716, 1130900, 1170710, 1151916, 1168431, 1141475, 1211850, 1222204, 1199669, 1181124, 1193029, 1210270, 1195228, 1201057, 1245399, 1263636, 1288174, 1284955, 1247002, 1258233]
4864A258233O8606J8205M1598j2902L0823K6758j738L3165K9566k191p07M7297
4852A536713M6276J9631N6315N1662R5555R8145J8042j5026o766L9293m1611K9968
4840A928197k0544l0141N5030M4143j5662N2331j926J7575Q7989M3016K2606P5593
4828B258207L4724N8986J09028R7812J37987K18530L12132M81625Q34136J107234
4818E650401J283003J067419M60700r493l47188o50617p44480p14750p00622o44067
4808D650306n06341l94810k86597k05658j40346j05135m9489j9136k2779m9434
4798B870581o3321J38j7860j3293J2536K648J0389J9684J9207J7135L8227O0215
4786B956286j7216K3226M0459K3975M7236J9624k8559N3993J05420L2126p535
$$ y = [1258233, 1326839, 1345044, 1386642, 1373740, 1404563, 1431321, 1429583, 1462748, 1492314, 1490123, 1489416, 1536713, 1582989, 1602620, 1658935, 1710597, 1806152, 1904297, 1922339, 1907313, 1900547, 1939840, 1898229, 1928197, 1907653, 1877512, 1932542, 1976685, 1961023, 2013354, 2011428, 2029003, 2116992, 2160008, 2182614, 2258207, 2292931, 2351917, 2460945, 2558757, 2696744, 2915274, 3227406, 3709031, 4543167, 5650401, 6933404, 8000823, 8461523, 8452030, 8104842, 7454225, 6709745, 5994995, 5294373, 4650306, 4143965, 3749155, 3462558, 3256900, 3116554, 3011419, 2961930, 2942794, 2920015, 2870581, 2807260, 2807398, 2789538, 2776245, 2788781, 2791429, 2801818, 2821502, 2840709, 2857844, 2896071, 2956286, 2939070, 2962296, 3002755, 3026730, 3073966, 3093590, 3065031, 3119024, 3224444, 3256570, 3249035]
4775C249035K8975N7756N8794J044J7277K7225L6341N5251P5745N3170N5261O0226
4763C776100l1486J4013R6022L3295N6315J01429P2099m97K7502J677M6822Q3443
4751D276734N9232P6931M9615P8447M8973R2067J4097J4368Q9938P8233O6932
4740D945567M8261J8044P4686J16546Q3271N2804R8999O6654L5903R1510P1285
4729E703530P9931J00010M0470N1922J21366N4739J05088J16662R9420J05071
4719F578209J08399R3585O1760Q9146P2608Q7788J14159J05889O4877J08302J04572
4708G589294J17265J30495R4919J15407J07770J07197J30235J07608J27890J25305
4698H753385J27907Q2227J19121J35462J13134J50585J23048R2505J60428J19629
$$ y = [3249035, 3278010, 3335766, 3394560, 3395604, 3412881, 3440106, 3476447, 3531698, 3607443, 3660613, 3715874, 3776100, 3744614, 3758627, 3854649, 3887944, 3944259, 4045688, 4117787, 4117290, 4144792, 4146469, 4193291, 4276734, 4335966, 4412897, 4462512, 4540959, 4589932, 4681999, 4696096, 4710464, 4800402, 4878635, 4945567, 4993828, 5011872, 5086558, 5203104, 5286375, 5339179, 5438178, 5504832, 5540735, 5632245, 5703530, 5783461, 5883471, 5923941, 5975863, 6097229, 6151968, 6257056, 6373718, 6473138, 6578209, 6686608, 6780193, 6841953, 6931099, 7003707, 7091495, 7205654, 7311543, 7376420, 7484722, 7589294, 7706559, 7837054, 7931973, 8047380, 8155150, 8262347, 8392582, 8500190, 8628080, 8753385, 8881292, 8963519, 9082640, 9218102, 9331236, 9481821, 9604869, 9697374, 9857802, 9977431]
4688I977431J40814J06204R2351J28992J65374J54673J23790J33849J05175J18991
4678A1247644J25986J15322J26858J58786J36099J26620J36502J28381R9447J27719
4668A2529364J25324J00854J19081R9148J11333J56672R6708R9714R0803Q8152
4658A3617153R6467J62082J10089J9817Q2628J11369P0713L8598N1510Q5277J14442
4647A4560145O9740K9412L7136O5651J07591J05961K5337M2692M1392p179M7544
4636A5125422P3287L0264L1007P9074M4107N5325R3848J48763K89201L63586L51725
4625A6685609K59187J32216m7077j69421k47933k81083k20721j91967j91602j54358
4615A5572850r3299n8632k3654K4465N4571J20416J40177J16073Q9365O7685Q958
$$ y = [9977431, 10118245, 10224449, 10316800, 10445792, 10611166, 10765839, 10889629, 11023478, 11128653, 11247644, 11373630, 11488952, 11615810, 11774596, 11910695, 12037315, 12173817, 12302198, 12401645, 12529364, 12654688, 12755542, 12874623, 12973771, 13085104, 13241776, 13338484, 13438198, 13529001, 13617153, 13713620, 13875702, 13985791, 14005608, 14088236, 14199605, 14270318, 14308916, 14360426, 14445703, 14560145, 14629885, 14659297, 14696433, 14762084, 14869675, 14975636, 15000973, 15043665, 15085057, 15077878, 15125422, 15198709, 15228973, 15259980, 15339054, 15383161, 15438486, 15532334, 15681097, 15970298, 16333884, 16685609, 16944796, 17077012, 17029935, 16860514, 16612581, 16331498, 16110777, 15918810, 15727208, 15572850, 15479551, 15420919, 15397265, 15421730, 15476301, 15596717, 15736894, 15852967, 15942332, 16010017, 16018975]
4604A6018975P8667J49438R8725J93188K29905J73634P9515n741m8209Q933P5581
4593A7052611J37696J67940Q7252q9135j54463k32737l00671k75405k25892j81371
4583A5985825j77922k29522l10410l68668l75995m22941m14097l52974l15406
4574A3017890k62804k93981l11989l38523l49859l24599k86500k87152k53207
4565A0309276k17423k60064j96419j40383j58664j55536j37291j42025j37409
4556H764062j06400j50321r8624p8264p9966r7590j07409m9605n6029l1031k5764
4545G883059j7579l2893n8594n8844l5055L009l079l0702l3837l6975M2115J0460
4533G631085Q009m992n9877o924p0626j37644p9418j02160j00467n5853q5590
$$ y = [16018975, 16097642, 16247080, 16345805, 16538993, 16768898, 16942532, 17022047, 17016306, 16968097, 16977030, 17052611, 17190307, 17358247, 17445499, 17356364, 17201901, 16969164, 16668493, 16393088, 16167196, 15985825, 15807903, 15578381, 15267971, 14899303, 14523308, 14100367, 13686270, 13333296, 13017890, 12755086, 12461105, 12149116, 11810593, 11460734, 11136135, 10849635, 10562483, 10309276, 10091853, 9831789, 9635370, 9494987, 9336323, 9180787, 9043496, 8901471, 8764062, 8657662, 8507341, 8408717, 8330453, 8250487, 8152897, 8045488, 7995883, 7939854, 7908823, 7883059, 7865480, 7832587, 7773993, 7715149, 7680094, 7683103, 7680024, 7649322, 7615485, 7578510, 7620625, 7631085, 7639094, 7634102, 7574225, 7567301, 7496675, 7359031, 7279613, 7177453, 7076986, 7021133, 6935543]
4522F935543p6855m3116o9964n9909m5207n9093o1580m040K2798L890J4138N4333
4510F610938M0113L2881J10931Q7992J68205K15057K53147L60431N27117O89802
4500I096614J086218J484452J885849K420978K568492K292119J664700P22175
4492B3221597K16914p7403l69801o392P36670J582639K773457L778792L512781
4483C5369254K470591O39662q73915j557674k481315l057360k826534k217684
4475B5465025j465615m89933M3149K4001m25546j022909j418422j752125k111506
4466A6846119k201250k047608j783678j535157j204705r08484o83751n01651l84495
4457E595340l58791l20794k16005k35837j96848j22218j36381j13092n0745r0680
$$ y = [6935543, 6858688, 6815572, 6745608, 6685699, 6640492, 6581399, 6519819, 6515779, 6538577, 6542467, 6556605, 6610938, 6651051, 6683932, 6794863, 6882855, 7051060, 7266117, 7519264, 7879695, 8406812, 9096614, 10182832, 11667284, 13553133, 15974111, 18542603, 20834722, 22499422, 23221597, 23438511, 23361108, 22991307, 22984915, 23721585, 25304224, 28077681, 31856473, 35369254, 37839845, 38479507, 37605592, 36047918, 33566603, 30509243, 27682709, 25465025, 23999410, 23509477, 23552626, 23576627, 23151081, 22128172, 20709750, 18957625, 16846119, 14644869, 12597261, 10813583, 9278426, 8073721, 7165237, 6481486, 5979835, 5595340, 5236549, 4915755, 4699750, 4463913, 4267065, 4144847, 4008466, 3895374, 3844629, 3753949]
4447C753949o0228m5183q3843l2417l3191m6111J8515Q3116Q4480J16809J25350
4436C881246J78104J41652P0584M4823P19q4617j75527j96622j94246j83065k38545
4425C244506j92830j78571j06546j43428r6641o1479o4237r7483p5049k4788m8384
4414B155070j5059l4969j1525m5132m8814j3074j1205p3481l6463j4910m197r869
4402A836372m4252l3587k9377L0389l1159l8131K751k3776L32N1936n5199l4814
4390A631485l761l6999L3346J0569P741m370J0775j0993j7442l0193k9185L8473
4378A599446J7661m4651l6210N0191L416N413J4950j9908m7028j293n524j5394
4366A521069l9791l0908M579k6375l4038O45J8089q706O108L4243K2719m8283
$$ y = [3753949, 3693721, 3648538, 3564695, 3532278, 3499087, 3452976, 3471491, 3554607, 3639087, 3755896, 3881246, 4059350, 4201002, 4271586, 4316409, 4317128, 4232511, 4056984, 3860362, 3666116, 3483051, 3244506, 3051676, 2873105, 2766559, 2623131, 2526490, 2465011, 2400774, 2303291, 2228242, 2203454, 2155070, 2140011, 2105042, 2093517, 2048385, 1999571, 1986497, 1975292, 1901811, 1865348, 1850438, 1846241, 1836372, 1792120, 1758533, 1729156, 1759545, 1728386, 1690255, 1693006, 1669230, 1669562, 1721498, 1666299, 1631485, 1627724, 1590725, 1624071, 1634640, 1642381, 1638011, 1648786, 1637793, 1620351, 1590158, 1560973, 1599446, 1617107, 1572456, 1536246, 1586437, 1589853, 1595266, 1610216, 1590308, 1543280, 1541987, 1536463, 1521069, 1481278, 1450370, 1454949, 1428574, 1394536, 1395181, 1413270, 1404564, 1410672, 1444915, 1467634, 1419351]
4354A419351k3048l4395l6528j9897J7761N396k3299m176K5657O8058K3556j5512
4342A402924K0234m0267Q868r734o6072M888l7804k3621J3264l450k5345P910
4330A251795J4717j8011j9238O122j7383l3604j0301k1550K7177J1239J5106P746
4318A213815j5635j8987L3281m701J401K8906l4465k5001K5168j3978n617K6048
4306A210235k4208J1671L8555K5001J1124j4418j2103M0304L1837J0709j7694
4295A311013L566j4878J4330L1807l918R382k1974K3266K7813K0884O381K3065
4283A430737L6066J2336L0928J6804J9806M3921R1008M9733M3728N8744N2022
4272A885833Q3330R3042M9613J28542J13546J04151J35297J48819J09185J74197
$$ y = [1419351, 1396303, 1361908, 1325380, 1305483, 1323244, 1328640, 1305341, 1301165, 1326822, 1394880, 1418436, 1402924, 1423158, 1382891, 1391759, 1382025, 1315953, 1320841, 1283037, 1259416, 1272680, 1269230, 1243885, 1251795, 1266512, 1248501, 1229263, 1235385, 1218002, 1184398, 1174097, 1152547, 1179724, 1190963, 1206069, 1213815, 1198180, 1179193, 1212474, 1207773, 1209174, 1238080, 1203615, 1178614, 1203782, 1189804, 1184187, 1210235, 1186027, 1197698, 1236253, 1261254, 1272378, 1257960, 1245857, 1286161, 1317998, 1328707, 1311013, 1314579, 1299701, 1314031, 1345838, 1341920, 1351302, 1329328, 1352594, 1380407, 1401291, 1407672, 1430737, 1466803, 1479139, 1510067, 1526871, 1546677, 1590598, 1681606, 1731339, 1775067, 1833811, 1885833, 1969163, 2062205, 2111818, 2240360, 2353906, 2458057, 2593354, 2742173, 2851358, 3025555]
4262C025555J74139J05063J50927J68577J96069K33981K88476L20398M14521M97397
4252E575103M87790N03473M61116M08434L54167K51431J92293J95920K45828L13636
4242H989191M34848N48177Q10329R30196J008547J033340R00804O59155M27545
4233A5742132J80905l6000j42638k21254j46149M25K37923N16210P78212J010855
4223A7920621J122126R71784O29724K54718j03609m80376q12059r21703q70796
4214A7710430p94059n82530k80387n305K79584M43923M27992K77298l678l79616
4204A7093652o20882q90419j087795j101866j043433q90961p21801n52153l84842
4195I799500j87651q9736r6354j97282l38790m65806n36728n59792o36482o18233
$$ y = [3025555, 3199694, 3304757, 3455684, 3624261, 3820330, 4054311, 4342787, 4663185, 5077706, 5575103, 6062893, 6566366, 7027482, 7435916, 7790083, 8041514, 8233807, 8429727, 8675555, 8989191, 9424039, 9972216, 10782545, 11712741, 12721288, 13754628, 14655432, 15314587, 15742132, 15923037, 15887037, 15744399, 15523145, 15376996, 15377421, 15615344, 16131554, 16909766, 17920621, 19042747, 20014531, 20644255, 20898973, 20795364, 20314988, 19502929, 18581226, 17710430, 16916371, 16333841, 16053454, 16048149, 16327733, 16771656, 17199648, 17476946, 17473268, 17093652, 16472770, 15582351, 14494556, 13392690, 12349257, 11458296, 10736495, 10184342, 9799500, 9611849, 9522113, 9425759, 9228477, 8889687, 8423881, 7887153, 7327361, 6690879, 6072646]
4185F072646n81205m89697m04405l05676k89716k19757j46580j58136j75140j96070
4175C106264j87852j72109j73855j89185j76503j44270r6302j38027j08708r4116
4165A625337p6265o5966q2894k3578m1059l6163m1263l0969m9477n9540o68k6132
4153A091363j3355n6579P796q985o0634m3857o630j6137j3191k0701l2532j792
4141H24766J0019k7218m5894J0167m0363j8128k6192l983j8427l5644m16J185
4129F29872J710l0564j6496L2208k423l497N198l3217N674J982j1438j292q888
4116E68829r205J2603l156m0132k0050M969M709K6824j1639l4520k1551M019k0258
4103D61442K4826O205j6326P160k9075K7306K0898q497j1700o750p412l4378k4139
$$ y = [6072646, 5491441, 5001744, 4597339, 4291663, 4001947, 3782190, 3635610, 3477474, 3302334, 3106264, 2918412, 2746303, 2572448, 2383263, 2206760, 2062490, 1966188, 1828161, 1719453, 1625337, 1549072, 1483106, 1400212, 1376634, 1335575, 1299412, 1258149, 1227180, 1177703, 1118163, 1117495, 1091363, 1078008, 1021429, 1029225, 1020240, 959606, 915749, 909119, 892982, 879791, 859090, 826558, 824766, 834785, 807567, 761673, 771840, 731477, 713349, 687157, 683174, 664747, 629103, 628687, 629872, 631582, 601018, 584522, 616730, 614307, 610810, 616008, 582791, 588465, 590447, 579009, 577717, 568829, 559624, 572227, 569071, 528939, 508889, 513858, 518567, 545391, 533752, 499232, 477681, 481700, 461442, 486268, 492473, 476147, 483307, 454232, 481538, 502436, 493939, 482239, 475489, 468077, 433699, 409560]
4090D09560J9514j5561K3841K7271n1697Q700L63j271K48k0402j9176K2230j6631
4077C86989j303L969l201R418M1448L39r047k0927Q560N856p554K975M6498J7515
4063D81535m3475m274j2678o980P792k2232J2457J9629j4682l519j4417J7357
4051D16513N106K1778J1025K9467J9743j6630k3899K6202k029k2618J6368K8676
4039E09702p182J282O745J2506K1817L3006K1425j6790m915M481k0798J003m0187
4026E22095j3618J2121J5461m4364K0510j6457J2310M8627k5451j4362P353k156
4014E22069m642m1874m8996K181J7438K1768K6296j4637n7859n806O884J1458
4002D34280J0180k6733m2012n265j4645m880N804j890q820K6474J7630j8819l0201
$$ y = [409560, 429074, 413513, 437354, 464625, 412928, 421628, 421991, 420720, 420968, 400566, 381390, 403620, 386989, 385686, 389655, 386454, 395872, 437320, 437659, 428612, 407685, 416245, 422101, 414547, 417522, 464020, 481535, 438060, 433786, 421108, 414128, 421920, 399688, 412145, 431774, 417092, 413573, 399156, 416513, 421619, 443397, 454422, 483889, 503632, 487002, 463103, 489305, 487276, 464658, 481026, 509702, 502520, 503802, 510547, 523053, 544870, 577876, 599301, 582511, 577596, 582077, 561279, 562282, 522095, 508477, 520598, 536059, 491695, 512205, 495748, 508058, 556685, 531234, 516872, 524225, 522069, 517427, 475553, 426557, 428738, 446176, 467944, 494240, 479603, 421744, 415938, 422822, 434280, 444460, 417727, 375715, 370450, 355805, 350925, 356729, 354839, 346019, 372493, 390123, 371304, 341103]
3989C41103k3059j6777j8587J0091L6798P473k2491J1650j8331j8513K5704j348
3977C13713l4707J8441L138j0418K6461j5783l3351J6337M533k1426L8810L6338
3965C42086L622j511J072l844M8464j3807l7291j3083j0323K0857M7798j6749
3953C67291k2477L2142K7038L2793K2698p927K3413O7218N5998L4279J58846K16905
3941A008217K15842J41501l966M373m8540j13735j17097j16740r4402o9103o3460
3930G42890k5863k5195O570k0800q876J0174q374N2120l7270J8087L0123N2765
3918G86351L2681K4112L1942N4684N0666O9301J19764J98550K20503R8580O7344
3907A754478r607l0442r6416j26711j17503r3507j25294j10731j04742l3992l3029
$$ y = [341103, 318044, 301267, 282680, 292771, 329569, 337042, 314551, 326201, 307870, 289357, 315061, 313713, 279006, 297447, 300585, 290167, 316628, 300845, 267494, 283831, 288364, 266938, 305748, 342086, 345708, 344197, 345269, 341425, 389889, 376082, 338791, 325708, 315385, 336242, 384040, 367291, 344814, 376956, 403994, 436787, 459485, 451558, 474971, 542189, 598187, 632466, 791312, 1008217, 1224059, 1365560, 1361594, 1365967, 1317427, 1203692, 1086595, 969855, 875453, 806350, 742890, 717027, 691832, 698402, 677602, 668726, 678900, 670526, 722646, 685376, 703463, 733586, 786351, 819032, 843144, 875086, 929770, 980436, 1049737, 1169501, 1368051, 1588554, 1687134, 1754478, 1744871, 1714429, 1618013, 1491302, 1373799, 1280292, 1154998, 1044267, 939525, 905533, 872504]
3896H72504j8462l2779l7349l289m3569L879R626j2478J3492M2394j0085m5160
3884G38724j8937O592k1429l308l2325k8449N896k6984m1325K5085o078k1872
3872E75590j1895k903K8075j0357N77j0278o759j3728j5952m833j2280N53j6413
3859D99397q718k8810m374K4228l5574k0489N804k7429J9005k8426j8264K8218
3847D04568J5185J0301J272O003j8100l4673k273o918J4356J6283K6028n500j4358
3834D12174L1552K351k5818j8204M1380L2539j4920l9239J778Q4218p372o4695
3822D35744K5761J2304R196K466J1460M2246L4788R071k6099j1114K0583K148
3810E68554J6330o2266Q495K4849J527O040M6971J7374L2075L3321J8089j9223
$$ y = [872504, 854042, 821263, 783914, 780625, 737056, 740935, 750561, 738083, 751575, 793969, 783884, 738724, 719787, 726379, 704950, 701642, 669317, 640868, 646764, 619780, 578455, 603540, 597462, 575590, 563695, 560792, 588867, 578510, 579087, 568809, 562050, 548322, 532370, 527537, 515257, 515810, 499397, 490679, 461869, 457495, 481723, 446149, 425660, 431464, 404035, 423040, 394614, 376350, 404568, 419753, 430054, 431326, 437329, 419229, 384556, 382283, 375365, 389721, 406004, 432032, 426532, 412174, 443726, 446077, 420259, 402055, 443435, 475974, 461054, 421815, 423593, 507811, 500439, 435744, 461505, 473809, 483005, 485471, 496931, 539177, 573965, 583036, 556937, 545823, 566406, 568554, 584884, 522618, 531113, 555962, 557489, 563529, 610500, 627874, 659949, 693270, 711359, 692136]
3798F92136M6722L4881L2872L821P402M9251Q3686M6751L7469O4582M8045N6001
3786A203619Q4610L9600K5927K8515K0103N3171K4276R167m2009P732K3171M439
3774A482321J1634j4130J1607N5433J3403j6023k6896o62J796J6994l3360J6087
3762A518204j3389m1578k7365k3015m2884l5764M5451j4967j0236J4213j80L2903
3750A401393L0884L0210j3941J2869j1682P3847J6698k6534k9160L9224l005L3818
3738A554621L114L4667R898l2244l9297R29k6229k1887L6221j8622n744q019q408
3725A479000k5429N806j1147J0421O267J5322q107M6637N4042J7649K9442K655
3713A622558J5332N0596L6527M8711K2529K6724K9078L9965L5451R180n265L6629
$$ y = [692136, 738858, 773739, 806611, 810432, 817834, 867085, 950771, 997522, 1034991, 1099573, 1147618, 1203619, 1288229, 1327829, 1353756, 1382271, 1402374, 1455545, 1479821, 1488988, 1446979, 1454711, 1477882, 1482321, 1493955, 1479825, 1491432, 1546865, 1560268, 1544245, 1517349, 1516687, 1518483, 1535477, 1502117, 1518204, 1504815, 1463237, 1435872, 1412857, 1369973, 1334209, 1379660, 1364693, 1354457, 1368670, 1368490, 1401393, 1432277, 1462487, 1448546, 1461415, 1449733, 1523580, 1540278, 1513744, 1484584, 1523808, 1520803, 1554621, 1557735, 1592402, 1602300, 1570056, 1530759, 1531688, 1505459, 1483572, 1519793, 1501171, 1495427, 1487408, 1479000, 1453571, 1459377, 1448230, 1458651, 1464918, 1480240, 1472133, 1518770, 1572812, 1590461, 1619903, 1622558, 1637890, 1688486, 1725013, 1773724, 1796253, 1822977, 1852055, 1892020, 1927471, 1936651, 1931386, 1968015]
3701A968015K4741R1043o235j6951N2984N2935M9542P5292K2108L257J9932P161
3689B343824m4433J9820N9749k7745K812j3030J713K4550J4473K9382P24l1970
3677B379869J2500L6982K6704M134J5635Q879M2237N5158P919K1336N1141M3858
3665B706352M4380M8986K4002P8812P9620M8620P9749R4993P5301R0259J42325
3654C513399O8861J03157J05104Q2428J31240J69578J42240K02948J77855J60009
3644D856819K42263K33544K60971L11927L16641L67986M25745M70325M91747N42781
3634H520749O22354P10137Q43944J005776J183998J436032J765597K212722K741149
3625B1042458L168063L725184M136744M319047M351190M123140L629367L024512
$$ y = [1968015, 1992756, 2083799, 2077564, 2060613, 2113597, 2166532, 2216074, 2291366, 2313474, 2316731, 2336663, 2343824, 2299391, 2319211, 2378960, 2351215, 2354027, 2340997, 2342710, 2367260, 2381733, 2411115, 2411839, 2379869, 2392369, 2429351, 2456055, 2460189, 2475824, 2484703, 2526940, 2582098, 2590017, 2611353, 2662494, 2706352, 2750732, 2799718, 2823720, 2902532, 2982152, 3030772, 3110521, 3205514, 3280815, 3371074, 3513399, 3582260, 3685417, 3790521, 3872949, 4004189, 4173767, 4316007, 4518955, 4696810, 4856819, 5099082, 5332626, 5593597, 5905524, 6222165, 6590151, 7015896, 7486221, 7977968, 8520749, 9143103, 9853240, 10697184, 11702960, 12886958, 14322990, 16088587, 18301309, 21042458, 24210521, 27935705, 32072449, 36391496, 40742686, 44865826, 48495193, 51519705]
3617E1519705K270985J430022N76751j10444n49124p92555p20434n01450r9442
3608E3024014M47187P90619R74039R26102O18367P8728n74132j355260k108847
3599E2820817k756061l375701l756326l905585l932665l795608l511685l178698
3591B4608488k765839k338317k023616j672876j388027j156176r40390q15187
3583A1508060p24455n75895m77051n35935m21954l09955l24069k19588k07664
3574G711494k92311k12415j71026j60194j69096j37705j39839n9336k1947n4534
3564F293091m6829q437q657L802L9304k5311J3239K7333r150P6744L3527K4520
3552F413176J18583R0800O0592J09869P8415O1600J26757L9087j7843L9565M8596
$$ y = [51519705, 53790690, 55220712, 55797463, 55687019, 55137895, 54345340, 53624906, 53123456, 53024014, 53471201, 54261820, 55235859, 56161961, 56780328, 56859056, 56284924, 54929664, 52820817, 50064756, 46689055, 42932729, 39027144, 35094479, 31298871, 27787186, 24608488, 21842649, 19504332, 17480716, 15807840, 14419813, 13263637, 12323247, 11508060, 10783605, 10207710, 9730659, 9194724, 8772770, 8462815, 8138746, 7919158, 7711494, 7419183, 7206768, 7035742, 6875548, 6706452, 6568747, 6428908, 6369572, 6347625, 6293091, 6246262, 6237825, 6229168, 6232970, 6272274, 6246963, 6260202, 6287535, 6278385, 6355129, 6388656, 6413176, 6531759, 6622559, 6683151, 6793020, 6871435, 6933035, 7059792, 7098879, 7081036, 7120601, 7169197]
3541G169197K4937M9499O0767N2585J47295J61180R3602K04739K48514K46832
3531H459147L02667K54884K49251K72435K39723J97089J37554J30000J32371J19458
3521A0494579M9647P5184J00213R2234J51164J81203J48156J32964J71208J28830
3511A1725382J28624R4151O1565M7580O8226K0667K6708O7065M4924J33997J82361
3500A2601250K18507K89528L72844M22398M74487N33729N78213P18451Q84463
3491A7093870R66461J080665J253311J399290J666895J833940K024564K318522
3483B9637518K526145K736770K896323L087248L315569L588642L833353M096999
3475E5718567M428545M654877M848696N035126N099525N020452M903710M637190
$$ y = [7169197, 7194134, 7243633, 7304400, 7356985, 7504280, 7665460, 7759062, 7963801, 8212315, 8459147, 8761814, 9016698, 9265949, 9538384, 9778107, 9975196, 10112750, 10242750, 10375121, 10494579, 10544226, 10619410, 10719623, 10811857, 10963021, 11144224, 11292380, 11425344, 11596552, 11725382, 11854006, 11948157, 12009722, 12057302, 12125528, 12146195, 12172903, 12239968, 12284892, 12418889, 12601250, 12819757, 13109285, 13482129, 13904527, 14379014, 14912743, 15490956, 16209407, 17093870, 18060331, 19140996, 20394307, 21793597, 23460492, 25294432, 27318996, 29637518, 32163663, 34900433, 37796756, 40884004, 44199573, 47788215, 51621568, 55718567, 60147112, 64801989, 69650685, 74685811, 79785336, 84805788, 89709498, 94346688]
3467I4346688M222032L916388L440604L016116K716766K477382K197517J930314
3459A18263807J650889J197083P08456J00316n79448j254640j984250k572165
3451A15530048l139095l667142m078979m319466m536357m689641m649613m590657
3443H1859098m443688m234941l969196l591000k929815k258922j402839m08947
3435E8619750N37736J651055K702679L598421M318432M825988N024553M876049
3427H6154663M508746L770417K878557J993462J063014K19758m81877j073434
3419I9033306j444151j523722j525016j375071j075539p77682m04889j66700j11295
3410I0629241j19633l24199p07583j241924j878319k613518l330197l868409m371407
$$ y = [94346688, 98568720, 102485108, 105925712, 108941828, 111658594, 114135976, 116333493, 118263807, 119914696, 121111779, 121820235, 121920551, 121341103, 120086463, 118102213, 115530048, 112390953, 108723811, 104644832, 100325366, 95789009, 91099368, 86449755, 81859098, 77415410, 73180469, 69211273, 65620273, 62690458, 60431536, 59028697, 58619750, 59157486, 60808541, 63511220, 67109641, 71428073, 76254061, 81278614, 86154663, 90663409, 94433826, 97312383, 99305845, 100368859, 100588617, 100106740, 99033306, 97589155, 96065433, 94540417, 93165346, 92089807, 91312125, 90907236, 90740536, 90629241, 90509608, 90185409, 89477826, 88235902, 86357583, 83744065, 80413868, 76545459, 72174052]
3401G2174052m702763m866460m894349m730084m523322m238780l928579l629001
3393C6660714l306149k928094k660145k366460k112389j847907j584075j439583
3385A8415912j263335j110554r55339p49363o85721o03714m93566m14687k94082
3376A1845551k90324k04364j45981q7056r6370J3918K9330O8784J69502K65927
3366A1568917K89097L75606M66636N54765O21076O45493O66862O59319O20118
3357A6467889N53695M34115K97607J50919P1599n1595k78580l58968m45511m64089
3347A6377081n04302n33033n68568n65508o55896p14861p02874p35071p11664
3338A0685304n78480m87906m47880l69067k82321k01473r0531r9778p6197k5278
$$ y = [72174052, 67471289, 62604829, 57710480, 52980396, 48457074, 44218294, 40289715, 36660714, 33354565, 30426471, 27766326, 25399866, 23287477, 21439570, 19855495, 18415912, 17152577, 16042023, 15086684, 14337321, 13651600, 13047886, 12554320, 12139633, 11845551, 11555227, 11350863, 11204882, 11117826, 11021456, 11035374, 11064704, 11133488, 11302990, 11568917, 11858014, 12233620, 12700256, 13255021, 13876097, 14521590, 15188452, 15847771, 16467889, 17021584, 17455699, 17753306, 17904225, 17975824, 17924229, 17645649, 17286681, 16841170, 16377081, 15872779, 15339746, 14771178, 14205670, 13549774, 12834913, 12132039, 11396968, 10685304, 10106824, 9618918, 9171038, 8801971, 8519650, 8318177, 8227646, 8127868, 8051671, 8026393]
3328H026393K9686Q2002J43783P9077K01536K72473K80519L63989L93403M45739
3318A0318600N59624O50172O95059Q10434J012788J172783J439874J729376K004323
3309B0393033K505587L067381L618985M137698M686403N084314N420914N561552
3301E4475867N550638N417279N033977M451428L560845K395530J023085l70671
3293H1537978j726943l032067m084810m932103n564152n887754n903749n772507
3285D4633893n435480m984585m450120l836085l392737k865606k380180k002454
3277A5286646j731516j469920j178994r92030p96236p41489o04507m75739m01929
3268F894286l36904k96314k73974k28605j59029j25570k02968j67628j32803j11601
$$ y = [8026393, 8056079, 8138081, 8281864, 8360941, 8562477, 8834950, 9115469, 9479458, 9872861, 10318600, 10878224, 11528396, 12223455, 13033889, 14046677, 15219460, 16659334, 18388710, 20393033, 22898620, 25966001, 29584986, 33722684, 38409087, 43493401, 48914315, 54475867, 60026505, 65443784, 70477761, 74929189, 78490034, 80885564, 81908649, 81537978, 79811035, 76778968, 72694158, 67762055, 62197903, 56310149, 50406400, 44633893, 39198413, 34213828, 29763708, 25927623, 22534886, 19669280, 17289100, 15286646, 13555130, 12085210, 10906216, 9914186, 9117950, 8376461, 7771954, 7296215, 6894286, 6557382, 6261068, 5987094, 5758489, 5599460, 5473890, 5270922, 5103294, 4970491, 4858890]
3258D858890l5215q3137r1401l8503n0768k6796R036n487j4297k662j8203J6543
3246D518000J5473q3291N667N8420N498P028M5321p456j4895m6140o4295q1878
3234D357452j04808n4380r5000j52460j32408j03766p4098j41908j57782j35663
3224C205179j21862o3172j02848j02091r7937p3785p6716m2102p684n2338J1530
3213B476174L8045p908O2538K1000k620P7807N5239K5230M9760J9614J8029L3556
3201B866464N6291p137K570M7751J0883L7229O8102j7870J3629P321o393L8792
3189C117632j4465K7436J02419L5595K0551J40179P6271N9471O8587K8215l275
3178C658616M5864j1427k7992M3761L2053j278K2670M3088Q5523R4268K6721R1750
$$ y = [4858890, 4823675, 4740538, 4649137, 4610634, 4559866, 4533070, 4542106, 4536619, 4522322, 4519660, 4501457, 4518000, 4533473, 4450182, 4455849, 4514269, 4519767, 4526795, 4572116, 4564660, 4549765, 4503625, 4439330, 4357452, 4252644, 4198264, 4103264, 3950804, 3818396, 3714630, 3640532, 3498624, 3340842, 3205179, 3083317, 3020145, 2917297, 2815206, 2717269, 2643484, 2566768, 2524666, 2516982, 2464644, 2476174, 2514219, 2506311, 2568849, 2589849, 2587229, 2665036, 2720275, 2745505, 2795265, 2814879, 2832908, 2866464, 2922755, 2915618, 2918188, 2965939, 2976822, 3014051, 3082153, 3064283, 3077912, 3085233, 3078840, 3117632, 3103167, 3130603, 3233022, 3268617, 3289168, 3429347, 3505618, 3565089, 3633676, 3661891, 3658616, 3704480, 3693053, 3665061, 3708822, 3740875, 3739597, 3762267, 3805355, 3890878, 3985146, 4011867, 4103617]
3166D103617J00394N4991N2648O6409K1676Q722N0514K6619R5690J21131J27457
3155D829868J42141J79498J68645K28439K10848J89451K68380L37194L35418L07609
3145G197491L65232L59229L19897K23161J06608Q2608J6038l7135M442L445k5323
3134H615693J6650Q1662J4202M9040Q5880Q9919J47557K17254J25599J69343K27160
3123I839959J84381K27820L47153L79746N66916P53860Q98531R80274Q00882N54404
3113A5533926K55618q7254l49425m46988n15001m71298m20074l15839k15885m3609
3103A2924171K4208J02514K35660J80334K01532L07007L42210M22461N30639O12646
3093A5883382O83345P03812P69601Q21662J007502J146072J255691J528582J696281
$$ y = [4103617, 4204011, 4259002, 4311650, 4378059, 4399735, 4408457, 4458971, 4485590, 4581280, 4702411, 4829868, 4972009, 5151507, 5320152, 5548591, 5759439, 5948890, 6217270, 6554464, 6889882, 7197491, 7562723, 7921952, 8241849, 8465010, 8571618, 8654226, 8670264, 8633129, 8637571, 8641016, 8615693, 8632343, 8714005, 8728207, 8777247, 8863127, 8953046, 9100603, 9317857, 9443456, 9612799, 9839959, 10024340, 10252160, 10599313, 10979059, 11545975, 12299835, 13198366, 14178640, 14979522, 15533926, 15789544, 15702290, 15352865, 14905877, 14390876, 13919578, 13499504, 13183665, 12967780, 12924171, 12948379, 13050893, 13286553, 13466887, 13668419, 13975426, 14317636, 14740097, 15270736, 15883382, 16566727, 17270539, 18040140, 18861802, 19869304, 21015376, 22271067, 23799649, 25495930]
3084B5495930J904606K137360K399515K654761K989049L439324L935204M553513
3076D9509262N288728O029544O901021P990856R808534J3112574J8596896K6866995
3068A44104410L7101750M6400599M9992441M3966161K8977990J0222654p544667
3061C53221338k2377252l2261686l6615597l6931284l4857459l1373549k6968944
3054A31835567k2060073j7429496j3720828j0935370q990939p630238o498166
3047D4570457n558449m755901l894208l127401k543806j999419j650328j442095
3039A9598850j182689j058459r79553q10318o80882o39367n62687m98356m61970
3030A2724569m53224m37769m27499l68326l88661l66576k92624k33620k28265
$$ y = [25495930, 27400536, 29537896, 31937411, 34592172, 37581221, 41020545, 44955749, 49509262, 54797990, 60827534, 67728555, 75719411, 85527945, 98640519, 117237415, 144104410, 181206160, 227606759, 277599200, 321565361, 350543351, 360766005, 353221338, 330844086, 298582400, 261966803, 225035519, 190178060, 158804511, 131835567, 109775494, 92345998, 78625170, 67689800, 58698861, 51068623, 44570457, 39012008, 34256107, 30361899, 27234498, 24690692, 22691273, 21040945, 19598850, 18416161, 17357702, 16378149, 15567831, 14886949, 14247582, 13684895, 13186539, 12724569, 12271345, 11833576, 11406077, 11037751, 10649090, 10282514, 9989890, 9756270, 9528005]
3021I528005j97877k09915j96996k22969k72435k49658k44821k81119k43824k35010
3011G173381k74664k37130k01329j83381j96176j36742j98562k25006j63592j66856
3001E189943k12142j69483j30418j41438j20850j51175j14139n2907j22468j49825
2991C825098j25858j63249j43733j72070j87214j63548j22845j44121j02183o4783
2981B435494l2641j9904L3211N638K1745j0994k0072L5197l268l7668m8737J564
2969B359565o5843m5458l362q2602r1384l2923p0997o4528p6136n7066n610m090
2957A759566n1449p131J7925K0175o443m2633o9724p8940o7976p8724k0856n8022
2945A315768n5533J2368M873k4415L875k298j476M3145o208l9489l4428n7245
$$ y = [9528005, 9330128, 9120213, 8923217, 8700248, 8427813, 8178155, 7933334, 7652215, 7408391, 7173381, 6898717, 6661587, 6460258, 6276877, 6080701, 5943959, 5745397, 5520391, 5356799, 5189943, 4977801, 4808318, 4677900, 4536462, 4415612, 4264437, 4150298, 4097391, 3974923, 3825098, 3699240, 3535991, 3392258, 3220188, 3032974, 2869426, 2746581, 2602460, 2500277, 2435494, 2402853, 2382949, 2416160, 2421798, 2443543, 2432549, 2412477, 2447674, 2444406, 2406738, 2358001, 2359565, 2293722, 2248264, 2244902, 2162300, 2070916, 2037993, 1966996, 1902468, 1826332, 1769266, 1763656, 1759566, 1708117, 1700986, 1718911, 1739086, 1732643, 1690010, 1620286, 1541346, 1473370, 1394646, 1373790, 1315768, 1260235, 1272603, 1277476, 1253061, 1256936, 1254638, 1253162, 1296307, 1290099, 1250610, 1216182, 1158937]
2933A158937p2737j7668l8710p4665j4158o676m7907O904P681j4767J9718j1687
2921H94265l1895J8934L348k8741m100K8989N538K2383k184J3026K5620K6016
2909I71199l896o018n0844q6071j7744j1537j5632m2069q9952n6033k4432n2712
2897E14259q7004k3114K7501j0063Q62l5473l498L3973j7305j4503n955j7999
2885C61681k4381l2244k5730j5098p522m7164P495J8031K1058K4530k5925l04
2873B54427N5707L7276K4044J3078O0205N625J1478Q477j6980M4287M957j5240
2861D87341q548Q121M0471J8958L4588j7803k0576P256j2143q469J1030k257l627
2848E34342k1983n2866j3737K4252n567J7970R846k4180l963l8340l3671j0161
$$ y = [1158937, 1086200, 1068532, 1029822, 955157, 940999, 934323, 886416, 893320, 901001, 886234, 905952, 894265, 862370, 881304, 884652, 855911, 851811, 880800, 886338, 908721, 906537, 919563, 945183, 971199, 967303, 961285, 910441, 824370, 806626, 795089, 779457, 737388, 647436, 591403, 566971, 514259, 427255, 404141, 431642, 421579, 422441, 386968, 383470, 417443, 400138, 385635, 379680, 361681, 337300, 305056, 279326, 264228, 256706, 209542, 217037, 235068, 256126, 280656, 254731, 254427, 310134, 347410, 371454, 384532, 444737, 450362, 461840, 470317, 453337, 497624, 502581, 487341, 478793, 486914, 527385, 546343, 580931, 563128, 542552, 549808, 537665, 529196, 540226, 537969, 534342, 512359, 459493, 445756, 470008, 464441, 482411, 492257, 468077, 464114, 425774, 392103, 381942]
2836C81942J2211l3417L7597j631L489K2649L1187K7100K9162J7946r362l8934
2824D79939n2794n9668j4517q202j7992j8044r359j6311l987J5246J5088J0961
2812C20360k0990N504K5568k2113J2901k7832k0383N2463Q260P60J9194J6799
2800C70491K391M8253N467m5834Q848L5586J1602L2761Q89K5676L9212Q2598Q0826
2787F98766J41649J13772J49568K79290K69172K25361J59560Q9307j3783q9138
2777B023524j59758k20360j49434j45369j90203j35545j23717r7770n2099o8640
2767F80629K084Q230l7871o3264k1278O077k5480O119k5158l9322m9073m1158
2755D00535o985R343j0582o0114K1248J2113N670M540r470n2733M390J1553j4603
$$ y = [381942, 394153, 360736, 398333, 396702, 400191, 422840, 454027, 481127, 510289, 528235, 518873, 479939, 427145, 367477, 352960, 344758, 326766, 308722, 299363, 283052, 279065, 294311, 309399, 320360, 299370, 304874, 330442, 308329, 321230, 293398, 273015, 325478, 333738, 334498, 353692, 370491, 372882, 421135, 426602, 380768, 389616, 425202, 436804, 469565, 470454, 496130, 535342, 617940, 698766, 840415, 954187, 1103755, 1383045, 1652217, 1877578, 2037138, 2126445, 2112662, 2023524, 1863766, 1643406, 1493972, 1348603, 1158400, 1022855, 899138, 801368, 749269, 680629, 682713, 690943, 653072, 589808, 568530, 574607, 549127, 555246, 530088, 490766, 441693, 400535, 393550, 402893, 392311, 332197, 353445, 365558, 371228, 375768, 366298, 313565, 317955, 329508, 314905]
2742C14905K389j9885r868M8047l766J3814K0750O34P224J7711J7146j4371j7147
2729C77583J2530J5170o056o7895r378N530j9586k3227l4250j343j5573J319m7248
2716A87576o140l8539P1K6444K9627k1930L3134K2581P264k0781R694j8730N547
2703B15818m4783j2977P300n701J9008L3108k1788JM0311q837J2257K4244j1687
2690B46274K0931J5201m0411k551Q234k779J0700J7660J184l7006P111l4452m1192
2677A68904J7819k3736k4450K357K948j0166Q016l7053N400k693q0059m3101L7038
2664B1224L8773o4158K5487L8046l3111n535k1559j8034J2406O6400k9201L055
2652C3793K1573q730m372j0906j423K1502k8727L6702q67j3741j5764L5952L6579
$$ y = [314905, 317294, 297409, 287541, 335588, 331822, 345636, 366386, 367020, 374244, 391955, 409101, 394730, 377583, 390113, 405283, 399227, 331332, 321954, 327484, 307898, 284671, 250421, 249078, 233505, 234824, 187576, 181436, 142897, 142968, 169412, 199039, 177109, 210243, 232824, 240088, 219307, 229001, 210271, 215818, 171035, 158058, 165358, 159657, 178665, 211773, 189985, 189986, 230297, 221460, 233717, 257961, 246274, 267205, 282406, 241995, 239444, 247678, 244899, 255599, 273259, 274443, 237437, 244548, 210096, 168904, 186723, 162987, 138537, 140894, 143842, 133676, 141692, 104639, 110039, 107346, 27287, -15814, 21224, 59997, -4161, 21326, 59372, 26261, 20726, -833, -18867, -6461, 59939, 30738, 33793, 55366, 46636, 42264, 31358, 29935, 51437, 22710, 59412, 58545, 44804, 29040, 64992, 101571]
2639A01571j7186j0146N98q718K973k5590K0769N1014r774m319K927l0979m0053
2626C3087j3191J1299K2168K5501J652r00L947l7109j4282K4609L507L2106J1665
2613A04059m6030r637J0007o522N337m6397k9944M1765K0865J0201L551q419J5924
2600F4760J0933J6879J6956J6934j9933k6511J9528o11K0135K4066L072K128K788
2587A51124l7771L5390K2274k1180J7541L4228k8703j1087K2385M3678O2190L5129
2575C25198m8081j6743k172J984m1113q618l7164m0935j1346J7889q293j5626
2563A14980l8399j3166K7264J7224N664j193j3437j8528K689m3241O328J1879
2551E8064n290J647Q375l148K5214J0313j8782j8426p409j2844N170q600J0531
$$ y = [101571, 84385, 74239, 74837, 66119, 69092, 43502, 64271, 115285, 105511, 101192, 104119, 73140, 33087, 19896, 31195, 53363, 78864, 80516, 79616, 83563, 46454, 32172, 56781, 60288, 92394, 104059, 58029, 48392, 58399, 51877, 57214, 10817, -19127, 22638, 43503, 53704, 57255, 48836, 64760, 75693, 92572, 109528, 126462, 106529, 80018, 99546, 98935, 119070, 143136, 146208, 148336, 151124, 113353, 148743, 171017, 149837, 167378, 201606, 172903, 161816, 184201, 227879, 290069, 325198, 277117, 260374, 258202, 260186, 219073, 210455, 173291, 132356, 121010, 138899, 130606, 114980, 76581, 63415, 90679, 107903, 113567, 112374, 98937, 80409, 83098, 39857, 46185, 58064, 52774, 54421, 62796, 59648, 84862, 95175, 76393, 57967, 50558, 37714, 42884, 34284, 44815]
2538D4815K0520j8995L0694M632p128J2350r335m833l010J5875n3456k1503J3752
2525B4378K1143N575q042O54m1670K6829P8303j4379r097j1027j5490L9302l3995
2512F2484j4371J4453j8018J2209M2196j6485k2275K892j0319R855P044K5302
2500I4967l2884J3180K4509J1730j0600J722L1918M6438k1036o642j9621J3978
2488A47659K272k2668j3996j017o321k7852K6627N3410l3843k0794M7697k3609
2476A27565N118l992j9694N1730o571k5779Q747K6205l55m1687r431j5414m25
2463I6017j3102l388j3243K9273J5654n947K1877q565Q777J3038k1249j9812N568
2450A04898n398j5484K9730l1559J9957L5737j7552k6817K8094K4219j4958l4395
$$ y = [44815, 65335, 46340, 77034, 81666, 74538, 86888, 77553, 72720, 69710, 85585, 32129, 10626, 24378, 45521, 51096, 43054, 43708, 2038, 28867, 107170, 92791, 83694, 72667, 57177, 96479, 62484, 48113, 62566, 44548, 56757, 98953, 82468, 60193, 63085, 52766, 62621, 69665, 94967, 62083, 75263, 99772, 111502, 100902, 102624, 134542, 180980, 159944, 153302, 133681, 147659, 149931, 127263, 113267, 112250, 105929, 78077, 104704, 158114, 124271, 103477, 151174, 127565, 132683, 128691, 108997, 160727, 154156, 128377, 137124, 163329, 162974, 121287, 111856, 96442, 96017, 82915, 79527, 66284, 95557, 111211, 105264, 127141, 118576, 127353, 140391, 119142, 99330, 104898, 99500, 84016, 113746, 82187, 102144, 137881, 120329, 93512, 121606, 145825, 130867, 96472]
2438I6472j3468O638l112m122J2824J0760L4391j1835J2459J0058J912j4324j9676
2425A18977L5516j3029N581k090k1236l695O928K3949Q05j2246K0547Q48J6913
2412A77768M5255k7093R88k0370P153K0209J1637k7364L805J2092M071J1378R545
2399B29074k621M4941k553k705J4537k0344J1569M6963J8760k6792N2507J6681
2387C80017L854n205l9146O61J6640k7941L7457R270k7377j7413j4221l729K6218
2374C39085J7413N338M6346j2058l4803O224Q811K3429Q627J2047k4868M7153
2362D42744K9239K633K7619R07R611K3065k1486J1075j4865L4266L1903M4183
2350F20894q263j0052O1065N1029O4981M485J5865L8849O1442M2060N4816O3132
$$ y = [96472, 83004, 89642, 86530, 82408, 95232, 105992, 140383, 128548, 141007, 151065, 152977, 138653, 118977, 154493, 141464, 147045, 144955, 123719, 120024, 126952, 150901, 151706, 139460, 160007, 160855, 177768, 223023, 195930, 196918, 176548, 183701, 203910, 215547, 188183, 191988, 204080, 208151, 219529, 229074, 226453, 271394, 268841, 266136, 280673, 260329, 271898, 318861, 337621, 310829, 363336, 380017, 383871, 378666, 339520, 340181, 356821, 328880, 366337, 375607, 348230, 330817, 316596, 312867, 339085, 356498, 361836, 408182, 396124, 361321, 367545, 376356, 399785, 408412, 420459, 395591, 442744, 471983, 474616, 502235, 503142, 512753, 535818, 514332, 525407, 510542, 544808, 576711, 620894, 612631, 602579, 663644, 714673, 779654, 784139, 800004, 838853, 900295, 942355, 997171, 1060303]
2338A060303M5530L0056M2558O4548R0131J33957O9576J81372K13314K85349L36857
2327B553551L91355L51378L11617K31121J81274J84756K51844L49040N22023P52006
2317F079965J075784J701766K981828M779551P016037Q137616O610878L039525
2309D1422950j40047k204830m510352n076487m803238m412182l857988l487417
2301A2930409k791515j980403j353344q17743n82905m69428m67475m25025m03012
2292C639559m06784l56636l13096k24940k26746j97974j30885j41118j05031o6458
2282A469891l6406p628m4152o4366m3158p6136p024k3776o7729l8546p6671J7324
2270A001623j8381l7802r3l1528J272l1143m4451k3843m596k3969p5250l4408
$$ y = [1060303, 1105833, 1135889, 1178447, 1242995, 1333126, 1467083, 1536659, 1718031, 1931345, 2216694, 2553551, 2944906, 3296284, 3607901, 3839022, 4020296, 4205052, 4456896, 4805936, 5327959, 6079965, 7155749, 8857515, 11839343, 16618894, 23634931, 31772547, 38383425, 41422950, 41282903, 39078073, 34567721, 29491234, 24687996, 20275814, 16417826, 12930409, 10138894, 8158491, 6805147, 5987404, 5404499, 4935071, 4467596, 4042571, 3639559, 3232775, 2876139, 2563043, 2338103, 2111357, 1913383, 1782498, 1641380, 1536349, 1469891, 1433485, 1425857, 1381705, 1317339, 1274181, 1198045, 1191021, 1167245, 1099516, 1060970, 984299, 1001623, 983242, 945440, 945347, 913819, 915091, 883948, 839497, 815654, 811058, 787089, 711839, 677431]
2258F77431k4303k3213l1695o165m1669l372l6681j2741j366m4545k4125j2165
2246D15391J5463K982J3052p321L09j990l3688J391j3485k549l376m0298l1330
2233C14551l8223j4489l5385j9354M4512j2698O948k732l3382N6746M5534l1789
2221B80239k3497K0321k4464r686j1639j1572j1894j8020L882P674J6365k7167
2209A90542j7726K6423j7349J3265k156m2457P550N2778k7148j6400P463r263
2197A65522K9152j8089m3077J4067m066j9187N296m6232n848O350K9551L019K9150
2184A45608K564j3192m569l1581o921j7772m5947M6794J7471n591m8466K2681
2172F1079P729J1367K6131K39k4156Q716L1168k039l4887l2940J1297J7591k917
$$ y = [677431, 653128, 629915, 598220, 592055, 550386, 547014, 510333, 497592, 496226, 451681, 427556, 415391, 430854, 433836, 446888, 439567, 439876, 437886, 404198, 405589, 392104, 389555, 386179, 345881, 314551, 276328, 261839, 226454, 207100, 251612, 238914, 245862, 243130, 209748, 266494, 312028, 280239, 256742, 277063, 252599, 242913, 231274, 219702, 207808, 189788, 193670, 201344, 217709, 190542, 172816, 199239, 181890, 195155, 192999, 150542, 158092, 210870, 183722, 167322, 174785, 165522, 194674, 176585, 133508, 147575, 143509, 124322, 129618, 83386, 77538, 83888, 113439, 116458, 145608, 148172, 134980, 130411, 98830, 91909, 74137, 28190, 74984, 92455, 86864, 38398, 61079, 68808, 80175, 106306, 106545, 82389, 91105, 122273, 120234, 85347, 52407, 63704, 81295, 78378]
2159G8378l5467O8521J1056l794J2424J6980m1540k5994k5043j631K8302k0423
2147F1769j6842k4506k4828N1766O8010n0119k0111L4247l0662M662j6478l8660
2135a752K8529L2909q527m468K0794M142k1633K5138k7066L298M411j3571l778
2122C8426k820m5202J1858M7537J9048p483J6031k0299k3244L8647k079j7933
2110E2487n2534J3128K6833j9510j3599J5685J2550p951M7254m923l13R611k9676
2097D9042m1394J0526R277L307J0299Q07L445n253L1587O775r866j9190r714j684
2083C7964j5768l3620q46j441P668n56J0598K1242M1835K445l170j1136J6115
2070G1330j0229m5359k0828l199R920P45k0815N132J916q132k941L6939r847J0636
$$ y = [78378, 42911, 111432, 122488, 118694, 131118, 148098, 106558, 80564, 55521, 53890, 82192, 61769, 44927, 20421, -4407, 47359, 115369, 65250, 45139, 79386, 48724, 53386, 36908, -1752, 26777, 59686, 51159, 46691, 67485, 71627, 49994, 75132, 48066, 51364, 55775, 42204, 38426, 35606, -9596, 2262, 49799, 68847, 61364, 77395, 57096, 33852, 72499, 70420, 52487, -47, 13081, 39914, 20404, 6805, 22490, 35040, 27089, 74343, 69420, 69107, 78718, 49042, 7648, 18174, 27451, 30758, 41057, 41864, 45309, 40056, 71643, 78418, 68552, 49362, 39648, 37964, 22196, -11424, -12270, -13711, -6043, -6599, 3999, 25241, 67076, 69521, 66351, 55215, 71330, 61101, 15742, -5086, -8285, 1635, 2380, -18435, -13303, -11387, -19519, -22460, 14479, 4632, 15268]
2056A5268m7139N471K2544m727j8327l834J8527M7633K3550j3847K0876j3293
2044E2702K8878O0832J2293J9192M9404j4169k5944k7679j1927l2061k9448m9058
2032C3015K3333j0843l3960k3726J3295K3476p824j9567o364L3807L3734k7451
2020C0925l6909O333O515L0882m408l0422n295J7935J6090j7542O063R588N159
2007C4914k552J3315k7490j2627L232J9701R328M327m1175O81K5556J8227J1566
1994E7003m5342j1238L3772K1299n4748J1775q416j0061j4310l022J3883J3096
1982C691M973m773L4247L9935j0504j6167j3821j1614k2678J04J355k46j5807
1969a1305j5737K9840o23K1826p866M585K1217k5473j4229L0954l1889l3309M932
$$ y = [15268, -31871, -26400, -3856, -8583, -26910, -30744, -12217, 35416, 58966, 45119, 65995, 52702, 81580, 142412, 154705, 173897, 223301, 209132, 183188, 155509, 143582, 111521, 82073, 33015, 56348, 45505, 11545, -12181, 1114, 24590, 16766, -2801, -9165, 24642, 58376, 30925, -5984, 349, 6864, 37746, 33338, 2916, -2379, 15556, 31646, 14104, 20167, 29755, 34914, 32362, 45677, 18187, 5560, 8792, 28493, 37821, 42148, 973, 1654, 27210, 45437, 57003, 11661, 423, 34195, 55494, 746, 12521, 4105, -5956, -20266, -23288, -9405, 3691, 8664, 3891, 38138, 78073, 67569, 51402, 37581, 25967, 3289, 3393, 4748, 4502, -11305, -27042, 2798, 2175, 24001, 16135, 20720, 41937, 16464, 2235, 33189, 1300, -32009, -27077]
1956b7077J6345m221O951J8946K569K0362p699o911N196P886l1195k1251L2063
1943A1964J3486j3670k1941J5131L1719J9703j2568r482k8382N323J3534k1312
1931C505l0664K6216n036J2407L3448j8318J6776K1979J4869n2162k1146k1389
1919a9515j0440J8494O383j6571j4775p423L3288p965Q682l6309M825K0782p338
1906b7882M5134m3878l0395J4768p069K5153J5959k5274J7545L4114k2729k5731
1894c0285K4703r072o786j6960J5955J9688m644l2129l232J0183Q927M1486o430
1881A1404j9191j7926J0860k2809K3587l299j3104m630p892J0200O874Q278p456
1868b5104N791l2269J3664L3503R049l1729J1378j7335j2296l144L614l275K8381
$$ y = [-27077, -10732, -14953, -8002, 10944, 13513, 33875, 26176, 19265, 24461, 32347, 1152, -20099, 11964, 25450, 11780, -10161, 4970, 36689, 56392, 43824, 34342, 5960, 11283, 24817, 3505, -27159, -943, -5979, 6428, 39876, 21558, 38334, 60313, 75182, 23020, 1874, -19515, -29955, -11461, -5078, -21649, -36424, -43847, -10559, -18524, -9842, -46151, -41326, -20544, -27882, 17252, -26626, -57021, -42253, -49322, -24169, -8210, -33484, -15939, 18175, -4554, -30285, -5582, -14654, -21440, -38400, -22445, -2757, -7401, -39530, -42762, -32579, -23652, 17834, 11404, -7787, -25713, -14853, -37662, -14075, -17374, -30478, -35108, -43000, -32800, -25926, -17648, -25104, -19313, -51582, -37918, -4415, 4634, -27095, -15717, -33052, -45348, -48492, -44878, -48153, -19772]
1855a9772J2987j3034p498j7394J2804N432R619M155J6736j8783k0961P819J2145
1842a5745P356J9620J8434j9533l1546L9312j6633m740K3044j166m6934j5120
1830d3651j1815K3664K7619J2079j9347j0755K83q433N158J6976J3820l4599R603
1817a9398k4572n016o072j93N489j7510j8767K365N5458R600m7893j1595J5732
1804f2372J9460J4049K1096r115K2621k1411m2496K3146r530l4286j813L818K5145
1791e1688R938K4263K4827R406Q89r021l5430m0301J0120K5185q395j3480p932
1778f1619M139L7220r293P32J5675L8524n0707k0422j2941R288N1200n7842r599
1765f5645L6108j313M051m2544K4147N1163p57J4626j8060j5202K9377j4658l8340
$$ y = [-19772, -6785, -19819, -27317, -44711, -31907, -26475, -16856, -12701, 4035, -14748, -35709, -27890, -15745, -8389, 11231, 29665, 10132, -21414, 17898, 1265, -3475, 19569, 18403, -28531, -43651, -55466, -31802, -4183, 7896, -11451, -22206, -21923, -30356, -25198, -8222, 5598, -29001, -19398, -43970, -48986, -55058, -55251, -49762, -67272, -86039, -83674, -28216, -18616, -66509, -78104, -62372, -42912, -28863, -7767, -16882, 5739, -15672, -58168, -35022, -44552, -78838, -80651, -76833, -51688, -41750, -17487, 7340, 16746, 17635, 8614, -26816, -67117, -56997, -31812, -40207, -53687, -61619, -57480, -20260, -29553, -28821, -13146, 25378, -25329, -45751, -58692, -49404, 1796, -56046, -65645, -29537, -30850, -26799, -69343, -45196, 5967, 5210, 19836, 1776, -13426, 15951, 1293, -37047]
1752c7047O704J303J5465j6312L395Q472j775L244Q005j1401j8550K5939k4626
1739c7184k0737K4237J8702N553O273j921j5089N1615M0308k8167m1302k0883
1727a8595O688R944l7735J4541J6737J376Q265l3983l993K4325R32n918l4556
1714e1972k1554j7424K4436L2230K483L159j9772j7844K824R091L7564P769J5434
1701F424L38j5920l957P197J4623j1211k5377R032K88l368l674q973L5592j0059
1687i045k811K4783J0227l3500k0327j0591K0125K9095j5241J2037k2766l757
1675b1771K1294j4414j54k668l3768K3464N176j2782m550l2492K2653J9075L1757
1662H20k8096l83L5431N43m2187j2937n045K0386M119J5495r819J1596K3108l8595
$$ y = [-37047, -30343, -29040, -13575, -29887, -26492, -18020, -19795, -16551, -8546, -19947, -38497, -12558, -37184, -57921, -33684, -14982, -9429, -3156, -5077, -20166, 31449, 71757, 43590, 2288, -18595, -11907, -1963, -39698, -25157, -8420, -7044, 1221, -32762, -36755, -12430, -11498, -17416, -51972, -73526, -90950, -66514, -34284, -31801, -28642, -48414, -66258, -63434, -54343, -16779, -9010, 6424, 6762, -9158, -13115, -5918, 8705, -2506, -27883, -18851, -18563, -21931, -25605, -34578, 1014, -9045, -11856, 12927, 23154, -10346, -30673, -41264, -21139, 7956, -7285, 4752, -18014, -21771, -477, -14891, -15045, -17713, -51481, -28017, -22841, -35623, -40173, -72665, -50012, -30937, 820, -27276, -27659, 7772, 8315, -33872, -46809, -51854, -31468, -27349, -11854, -21673, -10077, 13031, -25564]
1648b5564K074J8742M855j4590K599J9557l5163r177Q367J2313l034j7985L188
1635c3818L9614J0492l7961k0793K5149o739J1633l200m6759k9605M1580N069
1623d5338N061L3221n937p228J1562O026k5500r600o638n414O358K924k0870N0471
1609a0902J8357R679k4568p124k5585j8019l5932J3986N0861L331k6411J1584
1597d0743j9766n181N1888m4K209j2369j9365J7376J1832J1722j7160j7336n580
1584d2517L4107L126j6605o767L4848o548j5478p163k5983J1032Q012J9077J1642
1571G83q390j6912K1147l0506M8765k4213l0447J9486M106K7136k0453k1217l847
1558c4562J1238K5008Q266o6075K7388K7850k0224k0470k7788K2933K1313J1390
$$ y = [-25564, -23490, -4748, 107, -14483, -11884, 7673, -27490, -36667, -28300, -15987, -19021, -37006, -33818, 5796, 16288, -21673, -42466, -17317, -24056, -12423, -15623, -62382, -91987, -50407, -45338, -40277, -7056, -12993, -20221, -8659, -2633, -28133, -37733, -44371, -49785, -43427, -40503, -61373, -10902, 7455, 17134, -7434, -14558, -40143, -58162, -94094, -80108, -29247, -25916, -52327, -40743, -60509, -65690, -13802, -13846, -11637, -24006, -43371, -25995, -14163, -2441, -19601, -36937, -42517, -8410, -5284, -21889, -28656, 6192, -356, -15834, -22997, -48980, -37948, -29936, -10859, 783, -7607, -24519, -3372, -33878, 14887, -9326, -39773, -20287, -16181, 10955, -9498, -30715, -34562, -23324, 1684, 9950, -56125, -28737, -887, -21111, -41581, -69369, -46436, -25123, -13733]
1546a3733j8890Q784P164K6445k2821l6354L0084j5613J5580K5143n009m5026
1534d4246K3066L6947l9516J989m839L3289j6011L065j9987J2344L9671l3185
1522g413R917L96j2439m687J4534k9019j4051M3597p431J0015J3019j1182n312
1509e6K9881l1713k3134K2381k7433j3090Q498O147l945j6331K9943j7544N988
1496c0408K6888p445J3450l8268L0409O202K5456j3698m7012J0557J8371K7826
1484B2328K2680j3865k7842j7500J601j5413j1499j0141O234P524L704j23N928
1471b6384L449J4369J6800j9128k0482k2112K34q58J9031J9757k8634j0085K0294
1458c3749n420J2867k0786J409K802K0382r251k3136L036l166l603J0767J4457
$$ y = [-13733, -32623, -23839, -16675, 9770, -13051, -49405, -19321, -34934, -19354, 5789, 780, -44246, -21180, 15767, -23749, -21760, -26599, 6690, -9321, -6256, -26243, -13899, 25772, -7413, 2504, 2900, -9539, -14226, 308, -28711, -42762, 835, -6596, 3419, 16438, 5256, -56, 29825, -1888, -25022, -2641, -30074, -43164, -34666, -28519, -32464, -48795, -18852, -36396, -30408, -3520, -10965, 2485, -35783, -5374, 828, 26284, 12586, -34426, -23869, -5498, 22328, 45008, 31143, 3301, -14199, -12598, -28011, -39510, -49651, -43417, -35893, -32189, -32312, -26384, -22935, -8566, 8234, -10894, -31376, -53488, -53254, -54112, -35081, -15324, -43958, -54043, -33749, -39169, -26302, -47088, -45679, -42877, -22495, -31746, -54882, -51846, -55012, -58615, -47848, -33391]
1445c3391r10L9885J0837q027k2007N304k0765j4017j4023j3445K8953K4845J7576
1432H15k68j4467K3359j3562r750k358j9424M24N551J601j6682n116l103J6898
1418c6082M6436j958j4635j5525m061J3109N878P541j5011p520K1708j59q630
1405h909k6854L537M1261L410l1251K0524L8281j0443p7814j7453N1466K0326
1393F081k2932j6856J8696J1645K0466k6327J6178k816J335j2966P861J0938l3621
1380b2318K5488K5258j6314r750L213L7991m2717k6820q988J8442r244l804q952
1367c8515J2458k3578M2585P082l3774j41l7791J4828M7391n14j3212j6967L014
1354c7134K2963j8382j2372R367J5788J0636j1705j7797n823N749J5295j7349
$$ y = [-33391, -34301, 5584, 16421, 8394, -13613, -8309, -29074, -43091, -57114, -70559, -41606, -16761, 815, 547, -13920, 9439, -4123, -13873, -16231, -35655, -35231, -29680, -28079, -44761, -49877, -52980, -36082, 10354, 8396, -6239, -21764, -25825, -12716, -6838, 703, -14308, -21828, -120, -279, -8909, -35763, -32226, 9035, 12445, -18806, 1718, 39999, 29556, -48258, -65711, -14245, 6081, -16851, -33707, -15011, -3366, 17100, -9227, 6951, 4135, 5470, -7496, 365, 11303, -22318, 3170, 28428, 12114, 2364, 5577, 43568, 851, -25969, -34957, -16515, -25759, -29563, -38515, -26057, -49635, -7050, 32, -33742, -33883, -71674, -56846, -9455, -9969, -23181, -40148, -37134, -14171, -32553, -44925, -35558, -19770, -9134, -20839, -38636, -44459, -38710, -23415, -40764]
1342d0764R326o699q403J3370n671Q700J3962k6825K9682k675J9375N386k5548
1329a6784k738R110k9786K5330k0265k9327K9417K6163j8733K0064J4468k4219
1317a7300q368j6834J6357K9647j2212l4257j76J3752L6197k4761l7103k6071
1305h1129M615K1883M958K2456n572o627P15o26l7534M946J7571Q442M278k6943
1291f8567O494L4448k07J8167r062n0791Q832L0129j7177j1225J8299l2453j306
1278g4419M2934L3981q817m4853M169L1821o199k5349P355M612J1532k6845M118
1265d5960J5740N2150r802o3669K170K7986j472j4419j8979K2514N4990l6439
1253a5190m5330K7184L1529j9991Q560l1066Q435j5730J0786Q443L0564O418m148
$$ y = [-40764, -31438, -38137, -46540, -33170, -38841, -30141, -16179, -43004, -13322, -15997, 3378, 8764, -16784, -19522, -10412, -40198, -14868, -35133, -64460, -35043, -8880, -27613, -7549, 6919, -17300, -25668, -42502, -26145, 3502, -8710, -42967, -43143, -29391, 6806, -17955, -55058, -81129, -76514, -54631, -49673, -27217, -32789, -39416, -38701, -39327, -76861, -71915, -54344, -45902, -41624, -68567, -62073, -27625, -27832, -9665, -18727, -69518, -60686, -30557, -47734, -58959, -40660, -73113, -74419, -31485, 2496, -6321, -51174, -47005, -15184, -21383, -46732, -39377, -34765, -23233, -50078, -45960, -30220, 21930, 12128, -51541, -49371, -21385, -22857, -37276, -56255, -33741, 21249, -15190, -60520, -33336, -1807, -21798, -13238, -44304, -35869, -51599, -40813, -32370, -1806, 4612, 464]
1240D64k200J1790L4285k1988l5352K482K7851l5625j6808l6389l0668J431K0085
1227h0642M0219J5000j8700q577l143P461j3494m254L4497k340k2093J839n483
1214e9710R734L9209j331k2198L1485j3642l601l2312m6696L7385K783M403l2416
1201h6907O130L2000L8486M814j3135k3948R7r721K3150N965k7288j0271K13n759
1187f6174K5051N351M275K4208k38j8182n756J1037J4351j9887o895K3926l2829
1174d1762J4285K096r459j0669J1793M5674l7757j8878Q737M0668r45r901J9550
1161A3432n3976J2973J7040l1227j9048O7193J6597j8725j7304j7327j816K0502
1149a1686m1422J5256r437k5066J3073L155J9184M997m249j3947J6372j0678M552
$$ y = [464, -1736, 10054, 44339, 22351, -13001, -10519, 17332, -18293, -35101, -71490, -102158, -100727, -80642, -40423, -25423, -44123, -52700, -55843, -48382, -61876, -66130, -31633, -33973, -56066, -54227, -59710, -49976, -10767, -12098, -34296, -2811, -16453, -20054, -52366, -99062, -61677, -58894, -54491, -86907, -80777, -48777, -10291, -5477, -18612, -42560, -42463, -52184, -29034, -23069, -50357, -60628, -60415, -66174, -41123, -35772, -31497, -7289, -7527, -25709, -31465, -20428, -6077, -25964, -32859, -8933, -41762, -27477, -25381, -34840, -45509, -33716, 11958, -25799, -44677, -35940, 4728, 3783, -6118, 13432, -40544, -27571, -10531, -41758, -60806, 6387, 22984, 4259, -13045, -30372, -32188, -11686, -53108, -37852, -47289, -72355, -59282, -56127, -36943, -31946, -36195, -50142, -33770, -44448, -39896]
1136c9896K762j3422K1908J608J4895m4k456j840m482j0032j3165K2650J8983
1123b531o086j3112k4406K4124k330l5705J1577k523O775p475R333j2741J2112
1110d2988J8879o466k3618K611K4047k37o96K3397j4466k6546k2519O728N7193
1097d681j3892m5932q200M5671q608K3670k4892m3825M0707K7624M944O966L7995
1084C7547qj9766l5817k0271M131k114j5064r460k753P797J5465K2535N213j9934
1070c2499j2183j4004o630J1658Q003O3300k3526j1724M5370m1771l8100p176
1058e9282m189Q1178k4590j6830j9696J8709j2563k337j212Q271J4471j3303L90
1045c0983J045K2712j5245R897M577O6l5031o411J3347j447j6449M873j3886J4386
$$ y = [-39896, -37134, -50556, -28648, -27040, -12145, -12189, -14645, -16485, -20967, -30999, -44164, -21514, -2531, -8617, -21729, -46135, -22011, -24341, -60046, -48469, -50992, -44217, -51692, -42359, -55100, -42988, -24109, -30575, -54193, -51582, -27535, -27772, -28468, -5071, -19537, -46083, -68602, -61874, -4681, -18573, -64505, -72705, -27034, -35642, -11972, -36864, -80689, -39982, -12358, -7414, -448, 37547, 37539, 17773, -18044, -38315, -34184, -36298, -51362, -60822, -63575, -55778, -40313, -17778, -12565, -32499, -44682, -58686, -65316, -53658, -45655, 17645, -5881, -17605, 27765, -14006, -52106, -59282, -63471, 17707, -6883, -23713, -43409, -24700, -37263, -39600, -40812, -32541, -18070, -31373, -30983, -29938, -7226, -22471, -12574, -7997, -7931, -42962, -49373, -36026, -37473, -53922, -49049, -62935, -48549]
1031d8549j0053J8494J3905K4175l9777R008N485K290q433J5661j4554M0711q801
1018d38q972L9174k4158l4943k1515P907L786R771k9005J1465K3990J0994K1333
1005I389L0596l9681k4851J2599l0797J5734L540j544l0866k1721J4290J3138
993e0174K4734k5112n125K3347J7645Q37l4427k4909M3898L1086n3916p303P276
980e2143K8228M6164k7868o052J3368J689j0381k1171k3674J5720K2678j1700
968b5142j7331J4282J3111J5240j8155m866J9505L451j3745j877L108Q484k0979
955b4914k8717L178Q074k0091L2842P374J484j5001p497L801J1862K538j730J2534
941a4263q391j3837k4777J2187M761J972j1805K7053J193j5032J6691j7083L090
$$ y = [-48549, -58602, -40108, -26203, -2028, -41805, -32797, -27312, -25022, -33455, -17794, -32348, 8363, -438, -9410, 29764, 5606, -29337, -50852, -42945, -39159, -29388, -58393, -46928, -22938, -11944, 9389, 39985, 304, -24547, -11948, -42745, -27011, -23471, -25015, -55881, -77602, -63312, -50174, -25440, -50552, -55677, -32330, -14685, -13848, -48275, -73184, -29286, 1800, -52116, -59419, -52143, -23915, 22249, -5619, -11671, 1697, 3386, -6995, -28166, -51840, -36120, -13442, -25142, -42473, -28191, -15080, 160, -17995, -22861, -3356, 95, -13650, -15527, -12419, -3935, -24914, -53631, -50453, -42379, -62470, -29628, -22254, -20770, -35771, -43268, -39467, -27605, -25067, -26797, -14263, -22654, -36491, -61268, -49081, -44320, -42348, -54153, -27100, -25907, -40939, -24248, -41331, -38241]
928c8241L6544k903k3337K1568J1786l6787l5995M2804k0647k1260j4470J5870
916f5068R725J5687L5373n043m0439M742J4732n532j0208J6041l546n930J084
903c8382r941p168q765M2831J8049j3622l012r979L0767k491j4074R689M048j7793
889a9843k8696j9473L0190K7394j3429K2582m9354O200J9689n177K0847j2190
877b1260k3598k5574q96q089o735O2747K8000J2575m7968k7519p593K7041j9035
864e7904N2091k3113k592j6850r441Q177m9989J9389J1391L5691K6774J7660j6096
851d812q275J3272l2096k3489P65J9085J2684L619m424J0082m182J102O077j7814
837b8406m237R990k357l907J7075L0220J3591m863j8038k6715m0313j6551L3223
$$ y = [-38241, -1697, -4600, -27937, -6369, 5417, -31370, -67365, -24561, -45208, -66468, -80938, -65068, -55343, -39656, -4283, -9326, -49765, -45023, -30291, -35823, -46031, -29990, -33536, -39466, -38382, -48323, -55491, -64256, -21425, -3376, -16998, -20010, -29989, 778, -1713, -15787, -6098, -2050, -19843, -48539, -68012, -37822, -10428, -23857, -1275, -50629, -44429, -24740, -29917, -9070, -21260, -44858, -70432, -71328, -79417, -86152, -23405, 4595, 17170, -30798, -58317, -65910, -38869, -57904, -5813, -28926, -31518, -48368, -57809, -49632, -99621, -80232, -68841, -33150, -6376, 11284, -4812, -13087, 185, -31911, -55400, -54635, -35550, -22866, -19247, -23671, -13589, -17771, -16669, -10592, -28406, -32643, -22653, -25010, -28917, -11842, 18378, 31969, 27106, 9068, -17647, -57960, -74511, -41288]
824d1288L8945m0893j7623J7196L3188q553l6326n864j422L6346L383J4165j9129
811b7875k0476j3723M3535J5612k9867j8351J2735m3539J2485O764J5222J6154
799c1324K2191n461m2654k677N1890l683N69K4396q258l717j2775m432j0740Q382
785a8293k4846m7398J4419k498K4083J5768l536l3727L4914K5600k5434K771J1518
772b6659L5587J35p640k2713K8361l1808l5200j6985J8607M8521J77k4965M2042
759G460J7928l98m9394k1443K4740j3425Q981j7540k4707J9738m576j9322O17
746g1341N0705J6155j0035k3762K417M6565j4469m1610J3125L9728k4817m0730
734e8069o094M703M0868J1574O749l4941J2108J5228j2979l5207J6454J2529n561
$$ y = [-41288, -2343, -43236, -60859, -43663, -10475, -19028, -55354, -61218, -62640, -26294, -22911, -8746, -27875, -48351, -62074, -18539, -2927, -32794, -51145, -38410, -81949, -69464, -62700, -47478, -31324, -9133, -14594, -57248, -59925, -8035, -11718, -11149, 13247, 4989, 1272, -11503, -15935, -26675, -18293, -43139, -90537, -76118, -78616, -54533, -38765, -42301, -76028, -41114, -15514, -40948, -38177, -26659, 8928, 9063, 1423, -21290, 7071, -24737, -59937, -76922, -58315, -9794, -9617, -34582, 7460, 25388, 24990, -24404, -45847, -21107, -34532, -25551, -43091, -67798, -48060, -52636, -71958, -71341, -20636, -4481, -14516, -38278, -35861, 10704, -3765, -45375, -32250, 7478, -17339, -58069, -64163, -59460, -18592, -7018, -269, -35210, -23102, -7874, -20853, -56060, -39606, -27077, -32638]
721c2638J5756q146m439K6566k4690j7969j892j7458o101N26k2559r085K4322
708g7807j1807M0266J7771L1183J7500j592l4376J11j9095O332q425R158j3539
695d4320j6746K0164J9382j7663K8419l4230j8557L2990J6631j2536m2464j3454
683h2384J8248J4409J1689j2079M3509j636L825M804l6922M319k2089M723J2433
670c7151k9853L034J779k0301K1011J1850K3729j2345k1000M9237J4645j2630
658g995L276k9036J4437P016n0471j12K2621K3156j5389N554J6719O116j7875
645b1983j3541K4894O007J8351m368l6822P457L5631N381k5820j750J3256k2535
632a5842j736p285n717m476J3886k9050J6107J7142J5278R846k9841j5767k208
$$ y = [-32638, -16882, -25028, -29467, -2901, -27591, -45560, -47452, -64910, -71011, -70485, -93044, -102129, -77807, -89614, -49348, -31577, -394, 17106, 15514, -18862, -18751, -37846, -31514, -39939, -30781, -44320, -61066, -40902, -21520, -39183, -10764, -44994, -63551, -30561, -13930, -26466, -68930, -82384, -64136, -49727, -38038, -50117, -6608, -8244, -4419, 385, -36537, -32218, -54307, -49584, -37151, -67004, -63970, -62191, -82492, -61481, -49631, -25902, -38247, -59247, -10010, 4635, -7995, -4719, -33755, -19318, -12302, -62773, -62885, -40264, -17108, -32497, -26943, -10224, -4108, -21983, -35524, -10630, -4623, 13728, 9360, -27462, -20005, 15626, 21007, -4813, -6563, 6693, -15842, -17578, -24863, -30580, -35056, -21170, -50220, -34113, -16971, -1693, 8153, -21688, -37455, -39663]
619c9663j6145M559J5333M0759k0548j5161j2537l128R92j5906L959L0575K3113
606c798K4242j5479n0955l0235O1408l029j4939l022J3966L4858k853l3067l4033
593e6936J0975k0685J2074j4967l0347M7935M5222j7981l9323o07J1077L8604
581a4959m305j2543j808k065k2540K583j5310K0121J6268P359j1016M419M5313
568A1517J108j7876r572j9882j2680j2417k1035J5961J728Q974k0974j0980K4081
555f2047J3253l365p173L1885j920m0686j6004n879J1124R925J2736j673L1998
542b7826P227Q981p496k6117j1664L5709j8339l123P903M5857k490k6444j9673
529c7495J0655J9610j2824m113K8742j8004k6450K3J4319q857J8152m8041K6808
$$ y = [-39663, -55808, -51249, -35916, 4843, -15705, -30866, -43403, -46531, -45539, -61445, -57486, -26911, -3798, 20444, 4965, -45990, -76225, -14817, -17846, -32785, -35807, -21841, 13017, 10164, -22903, -56936, -45961, -66646, -54572, -69539, -99886, -51951, -6729, -24710, -64033, -64640, -53563, -14959, -19264, -31807, -33615, -35680, -58220, -55637, -70947, -50826, -34558, -27199, -38215, -33796, 11517, 12625, -5251, -14823, -34705, -47385, -59802, -80837, -64876, -63148, -54174, -75148, -86128, -62047, -48794, -52159, -59332, -27447, -29367, -70053, -86057, -91936, -80812, -70887, -58151, -59824, -27826, -20599, -11618, -19114, -45231, -56895, -21186, -39525, -42648, -34745, 11112, 8622, -17822, -37495, -26840, -7230, -20054, -24167, 4575, -13429, -39879, -39856, -25537, -34394, -16242, -64283, -37475]
516c7475K3323k5558o155j9419K4316K254k5790P368J8610k928k6609k4859J8335
503g4587M5048M0155K3210o8353l278J5398j1581K9985m9000j3735N3943O406
491f389m8547k564J9014K470M3358k5055o5388N0043R783l6874K0937J4392l1184
478e6004K5823J1610N800m7107N253J7438k0399L404K8491R517k1948j0748J7960
465c0910K0724k9311J7783K7333n861l8142j2317L4071J0009k5388j8706j62j5249
452f6126j9192J1517j8031M5939L7518m0098k614J2052k2550L36K4772j4985K7978
439b3484j3899K2390k6594j3406J1145L8622j0108M280o0612o993L0046K2945
427b5668K6399k9594P2L5114k2653k5759J7727j3989N728K8799L560P311l2873
$$ y = [-37475, -14152, -39710, -45865, -65284, -40968, -38714, -64504, -57136, -38526, -41454, -68063, -92922, -74587, -29539, 10616, 33826, -34527, -37805, -22407, -33988, -4003, -53003, -66738, -12795, -6389, -54936, -57500, -38486, -36016, 7342, -17713, -83101, -33058, -23275, -60149, -39212, -24820, -56004, -30181, -18571, -12771, -59878, -54625, -37187, -57586, -54182, -25691, -16174, -38122, -48870, -30910, -10186, -39497, -21714, 5619, -242, -38384, -50701, -16630, -6621, -32009, -50715, -50877, -66126, -85318, -73801, -91832, -45893, -8375, -48473, -51087, -39035, -61585, -61249, -36477, -51462, -23484, -37383, -14993, -41587, -54993, -43848, -5226, -15334, -11054, -71666, -78659, -48613, -25668, 731, -28863, -28791, 6323, -16330, -42089, -24362, -38351, -32623, -3824, -264, 7047, -25826]
414b5826o1351K762M2644L0749l6975J0366K5016K0230j8617r030J7151j4915
402a7796o259K7024n3740J670K5148l930k6622j1035L7085M5497k2168q32k0297
389b6255k4235N578P995l958n0104l4685K5723J6773m248L374M5354J2271m2301
376f8718N6642j606k1498k7607M064j1106m254o08L5316O653l1141m47J1214O821
362d6275o795K629k7388P190k2644L6264K8252l0540J5251p852K3756j2466k8793
349f9411J3127N2150r97k8931m728M1634k8152l3965j2141l2058J7109O1730M913
336a9720k5186K3682P515r250k7100j1340j0292o589n55L7002O190J1692l8832
323f2783k302J6312J9321j3840J2483J2270K0740k3100j8023K2746M069j4104
$$ y = [-25826, -87177, -84415, -41771, -11022, -47997, -37631, -12615, 7615, -11002, -20032, -2881, -17796, -24055, 2969, -50771, -49101, -23953, -27883, -54505, -65540, -28455, 17042, -5126, -5958, -26255, -50490, -44912, -36917, -40875, -90979, -125664, -99941, -83168, -87416, -84042, -38688, -26417, -68718, -12076, -13682, -35180, -62787, -58723, -69829, -74083, -74691, -39375, -32722, -63863, -64310, -53096, -46275, -53070, -50441, -77829, -70639, -93283, -57019, -28767, -59307, -44056, -51908, -28152, -40618, -69411, -56284, -4134, -5131, -34062, -38790, 2844, -25308, -59273, -71414, -103472, -86363, -24633, -19720, -44906, -21224, -13709, -22959, -50059, -61399, -71691, -78280, -78835, -41833, -35643, -23951, -62783, -65085, -48773, -29452, -43292, -30809, -18539, 2201, -20899, -38922, -16176, -12107, -26211]
311b6211k4293Q893k5926J5618L3367l1818l3566L1498J3857k4303m843J1789
299e5938K3254p035Q399p624m69k5347J7936L2308M567L948M756l3879k4072P676
285e1520j8191N201M0765J3596m7156J9994p839J1486J899l1101m165J4871M9024
272c136Q158m1485J6915K8557R934k7868m7547j0296R21J4369l943O115J3808
259c5498j8149j4435L1278P172k2901M808J1541k0656k3357J4741K7671L9446
247A661m7825j3780K4868j3940J1524N288l1268L5567M2852m8352k772k9351j800
234f7328k0203K168K99j0594K4383L7024n069k6845j5655j8696K9968N996k2476
221h7028j8592m308M0196K8854J9343Q499l2806L4461J7199j8181m8573k2733
$$ y = [-26211, -50504, -41611, -67537, -51919, -18552, -50370, -83936, -52438, -38581, -62884, -67727, -55938, -32684, -39719, -31320, -38944, -39413, -64760, -46824, -14516, -9949, -6001, -1245, -35124, -59196, -51520, -69711, -64510, -23745, -10149, -57305, -37311, -45150, -33664, -31765, -62866, -67031, -52160, -3136, 5022, -36463, -19548, 9009, 18943, -8925, -56472, -66768, -65847, -51478, -55421, -49306, -35498, -53647, -68082, -36804, -29632, -52533, -47725, -36184, -56840, -80197, -65456, -37785, 1661, -46164, -59944, -35076, -49016, -37492, -32204, -63472, -27905, 14947, -33405, -36177, -65528, -67328, -87531, -85363, -85064, -95658, -71275, -34251, -39320, -66165, -81820, -100516, -70548, -64552, -87028, -105620, -109928, -69732, -40878, -21535, -13036, -45842, -11381, 5818, -12363, -60936, -83669]
209h3669M0229K0633m5542J6114P265N599k9057K0752P803O292r198k2342J3278
196e1843Q624r908L929j003J0205K9808k9006j8094K1626L1k391J6075j9871o3150
182a04968k19O475J0010L2048k603j8006M8269r897m6242K6069l206l263k8210
169i3743J4013O230J0152l7013k7496K4957N5413j1350k6490J7011K8552O19o466
156d5611j294N088K8861j2866l2457n0570J2583K3384J3585j7587q783J7286j290
143f9671J0153J952l0960J7496J7267n9217J5669m33j9408R148K4527J3405k217
130g2289j1890r322n214Q398j1558J6198N859N24n446p840l5140K1158M2796j1853
116g5619j141J1333j3553N728l541k6018L4709M678j2508k3260J6526N757j9147
$$ y = [-83669, -43440, -22807, -68349, -52235, -44970, -39371, -68428, -47676, -39873, -33581, -42779, -65121, -51843, -43219, -53127, -49198, -50201, -39996, -10188, -39194, -57288, -35662, -35631, -38022, -21947, -41818, -104968, -105187, -98712, -88702, -56654, -59257, -77263, -28994, -38891, -85133, -59064, -62270, -65533, -93743, -79730, -73500, -63348, -100361, -127857, -102900, -47487, -58837, -85327, -68316, -39764, -39145, -45611, -46905, -41817, -12956, -25822, -58279, -108849, -96266, -72882, -59297, -76884, -85667, -68381, -69671, -59518, -57566, -88526, -71030, -53763, -112980, -97311, -97744, -117152, -108004, -83477, -70072, -72289, -84179, -93501, -98715, -90317, -101875, -85677, -79818, -79294, -84740, -92580, -127720, -106562, -63766, -75619, -76760, -65427, -78980, -73252, -76793, -102811, -68102, -63424, -75932, -99192, -82666, -76909, -96056]
103i6056P840J4851j859j9029J1166P928J7179q521K2131r532k2057j7349K9279
90f4029N864l6406J299k98L483k7836L738Q718q684K682j0173n615K3631j4282
76a17908k57n460J5135J6737j7773j7792R296P022j2463Q482J2500j2894J7644
63i7731J8044j8353n097n582K3541K4157k7854m1788j6416L9068k952k5151N216
50a30898o162J9574K444j6121r178p865m206J3012K5181k7969K970O749J8727
37a13742J0824l1563j1288L0773P165k1469m429k596j152J5246j1750m638R332
24a29287J3606l147p040j1060o895N941j2785j548J018l644K0898p593j055j6147
10a58738K468O66j2581L652J839J9679J2926j200l5197J4362
$$ y = [-96056, -88216, -73365, -75224, -94253, -83087, -75159, -57980, -66501, -44370, -53902, -75959, -93308, -64029, -58165, -94571, -93272, -93570, -90087, -117923, -114185, -105467, -114151, -111469, -121642, -127257, -103626, -117908, -118165, -123625, -108490, -91753, -109526, -127318, -118022, -111000, -123463, -114981, -102481, -115375, -97731, -79687, -98040, -103137, -108719, -85178, -61021, -88875, -130663, -147079, -108011, -110963, -136114, -130898, -137060, -117486, -115042, -131163, -140341, -148206, -152412, -139400, -114219, -142188, -139218, -132469, -113742, -102918, -134481, -145769, -114996, -107831, -129300, -133729, -136325, -137477, -122231, -133981, -138619, -129287, -115681, -118828, -125868, -136928, -143823, -137882, -150667, -152215, -151197, -154841, -133943, -141536, -142591, -158738, -156270, -155604, -168185, -164533, -162694, -143015, -130089, -131289, -166486, -152124]
0a52124
$$ y = [-152124]
$$ Imaginary data points
##PAGE= N=2
##DATA TABLE= (X++(I..I)), XYDATA
16383i13005P54m617J9779L2017J1381R314K4721k544J5398L849K2948o538m076
16370g90619J5199q606K8732L378N738N0593K0244K355m861L697K4880L647l766
16357f49389j5017L0414O0128j9869J0454L1707J495L6062j7842k332J4222J9467
16345e00500L899o223K1092L2231M760J3761J5398K162P964J7987K9578L3201
16333c24690K811P754l5693j725O2668K1816k4091Q708K6550k1870K4042m022
16321b57742J9629l613M017J456J9634O696k4422R023K9710K9087r786n43K4959
16308a51895K6192K4889j9381K8856n547n751J8703M920J7753L1646P680J3779
16296h156O659j0124K0133o530K4337J4440r230l873K2879J4591J1370k2437M7835
$$ y = [-913005, -912251, -916868, -897089, -865072, -853691, -844377, -819656, -822200, -806802, -802953, -780005, -786543, -790619, -775420, -784026, -755294, -751916, -746178, -695585, -675341, -672986, -677847, -674150, -649270, -645623, -649389, -664406, -633992, -573864, -593733, -583279, -551572, -550077, -514015, -531857, -534189, -519967, -500500, -496601, -502824, -481732, -449501, -444741, -430980, -415582, -413420, -405456, -387469, -357891, -324690, -321879, -314125, -349818, -351543, -288875, -267059, -291150, -282442, -255892, -277762, -253720, -257742, -238113, -241726, -237709, -236253, -216619, -209923, -234345, -225322, -195612, -166525, -176311, -176854, -151895, -125703, -100814, -120195, -91339, -96886, -102637, -83934, -79014, -61261, -29615, -21935, -8156, -1497, -11621, 8512, 1982, 26319, 40759, 31529, 27656, 50535, 65126, 76496, 54059, 101894]
16283A01894l604J3066K6685k0536J4154K64N491J4377J1613J447K440J5802K4238
16270B07331j9244J4317J3027M932J2019J5779j6486j7951J0653K2874J96l257
16258B44190J200K6275K700K894L044K4499J7418L5905j4182k0888k8573J0908
16246C05390K4888Q57R174J4007R003K0672J8221k637M230j0944o23L69L1373
16233D23980q36o713m234J4062p967J5728Q753N367L1400J6421j1226j1838j6150
16220D56747R121j2580K166O438K7839K5888n385L6115J2264L852j2041n3408
16208D97016J3006J8948q119j4006j144j3166K6009K1979J5133l177J1518J9842
16196E83839J2909k154m0190K2299K8377k4112k037J8538k2534L1266K2081O414
$$ y = [101894, 98290, 111356, 138041, 117505, 131659, 131923, 137414, 151791, 163404, 164851, 167291, 183093, 207331, 188087, 202404, 215431, 220363, 232382, 248161, 231675, 213724, 224377, 247251, 247447, 244190, 245390, 271665, 274365, 277259, 280303, 304802, 322220, 358125, 343943, 323055, 294482, 305390, 330278, 331135, 340309, 354316, 363319, 383991, 402212, 399575, 403805, 392861, 392238, 392607, 423980, 423144, 416431, 412197, 426259, 418292, 434020, 442773, 448140, 479540, 495961, 484735, 472897, 456747, 465868, 453288, 455454, 461892, 489731, 515619, 510234, 546349, 558613, 562465, 550424, 497016, 510022, 528970, 520851, 506845, 505701, 492535, 518544, 540523, 555656, 552479, 563997, 583839, 596748, 594594, 554404, 576703, 605080, 580968, 578931, 597469, 574935, 606201, 628282, 634696]
16184F34696J0402k8808j8995L494L0315J4036L2529p41J1621j0563k9161k8983
16172F19842O453K7143q630J438j8532M945K9092L4521k49K5520k1978l034K0217
16159G16748n4478J295M8579Q476l8756O630n350k3599M0534K1339L048m754j4898
16146G04814k1757L507L5976m342N072P339K5131J262k1951j5306k4212l888L1362
16133G23007M6803j0896N826k2321j3637K7603J1225J3043P275r586k4175k9695
16121G24472L3366P058O99O746j0532J8081m1850m373M3741K6901l2702m7938
16109G23669J1067j989M7119l0012j4682j1044J4574N4033m279l0863k2868Q975
16097G43700J7489J2336m5850M934L5838o300K7284L33K7224j0762o2146J9565
$$ y = [634696, 645098, 616290, 597295, 600789, 631104, 645140, 677669, 676928, 688549, 677986, 648825, 619842, 626295, 653438, 644808, 646246, 627714, 632659, 661751, 696272, 696023, 721543, 699565, 696531, 716748, 662270, 663565, 712144, 720620, 681864, 688494, 683144, 659545, 700079, 721418, 724466, 719712, 704814, 683057, 686564, 722540, 718198, 723270, 730609, 755740, 757002, 735051, 719745, 695533, 691645, 723007, 769810, 758914, 764740, 742419, 728782, 756385, 767610, 780653, 787928, 778342, 754167, 724472, 757838, 764896, 765595, 772341, 761809, 779890, 738040, 733667, 777408, 804309, 771607, 723669, 734736, 732747, 779866, 749854, 735172, 724128, 738702, 792735, 788456, 757593, 734725, 743700, 761189, 773525, 727675, 732609, 768447, 762147, 789431, 789764, 816988, 806226, 744080, 763645]
16085G63645K2345R959M983l3220j2407K3294N07j5796K6374P584J0725k2769
16073G85224l3103J2294M3582l220k1900L8080N139L889k1112l1789k134p585
16061G67365K5384n123j5164K616j5355J8606r539r468J7803k58l5360K9210J9966
16048G90683k503n351Q524J8415m079j6308m533K4860k1072k9481K7568K7272
16036H13995j6460L2705o202k3344k372k4261p96l1200M7493O2879j2222m1033
16024G99182n545J7933K9972j388r341n6905k8176K4286N105K377K4553M7554
16012H49607j0585k7269J6755J7604j3722K700K9638l0210l9034J5262K4088m1930
16000G92904j4999J6362n14J1748Q981r51j9423R206K358P900j4830j1316M589
$$ y = [763645, 785990, 795949, 800932, 767712, 755305, 778599, 779106, 763310, 789684, 797268, 807993, 785224, 752121, 764415, 807997, 804777, 782877, 820957, 826096, 829985, 808873, 777084, 774950, 767365, 792749, 787626, 772462, 775078, 759723, 778329, 768790, 759322, 777125, 776867, 741507, 770717, 790683, 788180, 782829, 791353, 809768, 805689, 789381, 784848, 809708, 788636, 759155, 786723, 813995, 797535, 830240, 824038, 800694, 798322, 774061, 773265, 742065, 789558, 852437, 840215, 799182, 793637, 811570, 841542, 840154, 830813, 773908, 745732, 770018, 775123, 777500, 802053, 849607, 839022, 811753, 828508, 846112, 832390, 835090, 864728, 834518, 795484, 810746, 834834, 792904, 777905, 794267, 793753, 805501, 814482, 813531, 794108, 803314, 805672, 813572, 798742, 787426, 792015]
15987G92015J257L4084l027o866J7682m476j4353m6520j3418M3464j2210J7730
15975H05362l523k6629J589O586K3022J6777k2980j1995K1908R488j6381R75J5294
15962H19493q059l296p498R775j3214J9353J4409J2566l7496J9370N478m8106
$$ y = [792015, 793272, 827356, 824329, 817463, 835145, 830669, 816316, 769796, 756378, 799842, 787632, 805362, 801839, 775210, 776799, 783385, 806407, 823184, 800204, 788209, 810117, 819605, 803224, 804199, 819493, 811434, 808138, 800640, 810415, 797201, 816554, 830963, 843529, 806033, 825403, 830881, 782775]
$$ [...]
##END NTUPLES=NMR SPECTRUM
##END=
