##TITLE=1H_DE-80H_X3
 200.13MHz, d2o
 8 sc
 
 19ns.26.2.2025
##JCAMPDX= 6.0         $$ Bruker NMR JCAMP-DX V2.0
##DATA TYPE= NMR SPECTRUM
##DATA CLASS= NTUPLES
##ORIGIN= UXNMR, Bruker Analytische Messtechnik GmbH
##OWNER= pz
$$ XWIN-NMR		Version 3.5
$$ Tue Jul  7 10:59:00 2026 Russian Standard Time (UT+4h)  Yarkov@DPX200
##.OBSERVE FREQUENCY= 200.1313
##.OBSERVE NUCLEUS= ^1H
##.ACQUISITION MODE= SIMULTANEOUS
##.ACQUISITION SCHEME= undefined
##.AVERAGES= 8
##.DIGITISER RES= 18
##SPECTROMETER/DATA SYSTEM= spect
##.PULSE SEQUENCE= zg30
##.SOLVENT NAME= DMSO
##.SHIFT REFERENCE= (INTERNAL, DMSO, 0, 15.5023)
##AUDIT TRAIL= $$ (NUMBER, WHEN, WHO, WHERE, WHAT)
$$ ##TITLE= Audit trail, XWIN-NMR		Version 3.5
$$ ##JCAMPDX= 5.01
$$ ##ORIGIN= Bruker BioSpin GmbH
$$ ##OWNER= Yarkov
$$ C:/Bruker/XWIN-NMR/data/yarkov2/nmr/H-C/1/pdata/1/auditp.txt
$$ ##AUDIT TRAIL=  $$ (NUMBER, WHEN, WHO, WHERE, WHAT)
(   1,<2026-07-07 10:58:00.67 +0400>,<Yarkov>,<DPX200>,
      <created by zg, POWCHK disabled, PULCHK disabled
       configuration hash MD5:
       00 E9 B6 7A A2 85 ED C7 34 08 36 98 17 FE 4E 26
       data hash MD5: 16K
       B7 01 21 81 D9 3A 06 CD EE AB 84 B2 6C 42 07 B4>)
(   2,<2026-07-07 10:58:21.29 +0400>,<Yarkov>,<DPX200>,
      <Start of raw data processing
       efp BC_mod = 2 LB = 0.25 FT_mod = 6 PKNL = 1 PHC0 = -6894.148 PHC1 = 6.42196 SI = 16K 
       data hash MD5: 16K
       FF 54 BF 70 1C E4 5C 3B E2 7A A5 92 42 AD E2 CE>)
$$ ##END=
$$ 
$$ hash MD5
$$ 3C 9E 44 02 95 AB 72 77 12 AF E0 01 B8 EB DC 59
##$RELAX= 
##$RELAX= 
##$RELAX= 
##$RELAX= 
##$RELAX= 
##$RELAX= 
$$ Bruker specific parameters
$$ --------------------------
##$DU= <C:/Bruker/XWIN-NMR>
##$EXPNO= 1
##$NAME= <H-C>
##$PROCNO= 1
##$TYPE= <nmr>
##$USER= <yarkov2>
##$AMP= (0..31)
100 100 100 100 100 100 100 100 100 100 100 100 100 100 100 100 100 100 
100 100 100 100 100 100 100 100 100 100 100 100 100 100 
##$AQSEQ= 0
##$AQ_mod= 1
##$AUNM= <au_zg>
##$AUTOPOS= <>
##$BF1= 200.13
##$BF2= 200.13
##$BF3= 200.13
##$BF4= 200.13
##$BF5= 200.13
##$BF6= 200.13
##$BF7= 200.13
##$BF8= 200.13
##$BYTORDA= 1
##$CFDGTYP= 0
##$CFRGTYP= 5
##$CHEMSTR= <none>
##$CNST= (0..31)
1 1 145 1 1 1 1 1 1 1 1 1 1 1 1 1 1 1 1 1 1 1 1 1 1 1 1 1 1 1 1 1 
##$CPDPRG= <>
##$CPDPRG1= <>
##$CPDPRG2= <>
##$CPDPRG3= <>
##$CPDPRG4= <mlev>
##$CPDPRG5= <mlev>
##$CPDPRG6= <mlev>
##$CPDPRG7= <mlev>
##$CPDPRG8= <mlev>
##$CPDPRGB= <>
##$CPDPRGT= <>
##$D= (0..31)
0 0.7 0 0 0 0 0 0 0 0 0 0.03 0 0 0 0 0 0 0 0 0 0 0 0 0 0 0 0 0 0 0 0 
##$DATE= 1783407480
##$DBL= (0..7)
120 120 120 120 120 120 120 120 
##$DBP= (0..7)
150 150 150 150 150 150 150 150 
##$DBP07= 0
##$DBPNAM0= <>
##$DBPNAM1= <>
##$DBPNAM2= <>
##$DBPNAM3= <>
##$DBPNAM4= <>
##$DBPNAM5= <>
##$DBPNAM6= <>
##$DBPNAM7= <>
##$DBPOAL= (0..7)
0.5 0.5 0.5 0.5 0.5 0.5 0.5 0.5 
##$DBPOFFS= (0..7)
0 0 0 0 0 0 0 0 
##$DE= 6
##$DECBNUC= <off>
##$DECIM= 32
##$DECNUC= <off>
##$DECSTAT= 4
##$DIGMOD= 1
##$DIGTYP= 9
##$DL= (0..7)
0 120 120 120 120 120 120 120 
##$DP= (0..7)
$$ [...]
##$SUBNAM2= <"">
##$SUBNAM3= <"">
##$SUBNAM4= <"">
##$SUBNAM5= <"">
##$SUBNAM6= <"">
##$SUBNAM7= <"">
##$SUBNAM8= <"">
##$SUBNAM9= <"">
##$SW= 18.0517328524113
##$SWIBOX= (0..15)
0 0 2 0 0 0 0 0 0 0 0 0 0 0 0 0 
##$SW_h= 3612.71676300578
##$TD= 16384
##$TD0= 1
##$TE= 0
##$TE2= 300
##$TE3= 300
##$TEG= 300
##$TL= (0..7)
0 120 120 120 120 120 120 120 
##$TP= (0..7)
150 150 150 150 150 150 150 150 
##$TP07= 0
##$TPNAME0= <>
##$TPNAME1= <>
##$TPNAME2= <>
##$TPNAME3= <>
##$TPNAME4= <>
##$TPNAME5= <>
##$TPNAME6= <>
##$TPNAME7= <>
##$TPOAL= (0..7)
0.5 0.5 0.5 0.5 0.5 0.5 0.5 0.5 
##$TPOFFS= (0..7)
0 0 0 0 0 0 0 0 
##$TUNHIN= 0
##$TUNHOUT= 0
##$TUNXOUT= 0
##$USERA1= <user>
##$USERA2= <user>
##$USERA3= <user>
##$USERA4= <user>
##$USERA5= <user>
##$V9= 5
##$VALIST= <valist>
##$VCLIST= <CCCCCCCCCCCCCCC>
##$VD= 0
##$VDLIST= <DDDDDDDDDDDDDDD>
##$VPLIST= <PPPPPPPPPPPPPPP>
##$VTLIST= <TTTTTTTTTTTTTTT>
##$WBST= 1024
##$WBSW= 4
##$XGAIN= (0..3)
0 0 0 0 
##$XL= 0
##$YL= 0
##$YMAX_a= 227318
##$YMIN_a= -186050
##$ZGOPTNS= <>
##$ZL1= 120
##$ZL2= 120
##$ZL3= 120
##$ZL4= 120
##$ABSF1= 0
##$ABSF2= 0
##$ABSG= 0
##$ABSL= 0
##$ALPHA= 0
##$AQORDER= 0
##$ASSFAC= 0
##$ASSFACI= 0
##$ASSFACX= 0
##$ASSWID= 0
##$AUNMP= <proc_1d>
##$AZFE= 0.1
##$AZFW= 0.1
##$BCFW= 0
##$BC_mod= 2
##$BYTORDP= 0
##$COROFFS= 0
##$CY= -3
##$DATMOD= 1
##$DC= 0
##$DFILT= <>
##$DTYPP= 0
##$F1P= 0
##$F2P= 0
##$FCOR= 1
##$FTSIZE= 16384
##$FT_mod= 6
##$GAMMA= 0
##$GB= 0
##$INTBC= 1
##$INTSCL= 3.241238e-09
##$ISEN= 128
##$LB= 0.25
##$LEV0= 0
##$LPBIN= 0
##$MAXI= 10000
##$MC2= 0
##$MEAN= 0
##$ME_mod= 0
##$MI= 1.114404
##$NCOEF= 0
##$NC_proc= -6
##$NLEV= 6
##$NOISF1= 3.799351
##$NOISF2= 2.8
##$NSP= 0
##$NTH_PI= 0
##$NZP= 0
##$OFFSET= 15.50229
##$PC= 1
##$PHC0= -6894.148
##$PHC1= 6.42196
##$PH_mod= 1
##$PKNL= yes
##$PPARMOD= 0
##$PSCAL= 0
##$PSIGN= 0
##$REVERSE= no
##$SF= 200.130003884492
##$SI= 16384
##$SIGF1= 3
##$SIGF2= 2
##$SINO= 0.751879
##$SIOLD= 32768
##$SREGLST= <19F.Aceton>
##$SSB= 0
##$STSI= 16384
##$STSR= 0
##$SW_p= 3612.71676300578
##$SYMM= 0
##$S_DEV= 0
##$TDeff= 16384
##$TDoff= 0
##$TI= <>
##$TILT= no
##$TM1= 0
##$TM2= 0
##$TOPLEV= 0
##$USERP1= <user>
##$USERP2= <user>
##$USERP3= <user>
##$USERP4= <user>
##$USERP5= <user>
##$WDW= 1
##$XDIM= 16384
##$YMAX_p= 301346096
##$YMIN_p= -417643
$$ End of Bruker specific parameters
$$ ---------------------------------
##NTUPLES= NMR SPECTRUM
##VAR_NAME=  FREQUENCY,     SPECTRUM/REAL,   SPECTRUM/IMAG
##SYMBOL=    X,             R,               I
##VAR_TYPE=  INDEPENDENT,   DEPENDENT,       DEPENDENT
##VAR_FORM=  AFFN,          ASDF,            ASDF
##VAR_DIM=   16384,         16384,           16384
##UNITS=     HZ,            ARBITRARY UNITS, ARBITRARY UNITS
##FACTOR=    0.220516191357247, 1,           1
##FIRST=     3102.47331229562, 0,            0
##LAST=      -510.243450710157, 0,           0
##MIN=       -510.243450710157, -417643,     0
##MAX=       3102.47331229562, 301346096,    0
$$ Real data points
##PAGE= N=1
##DATA TABLE= (X++(R..R)), XYDATA
$$ [...]
$$ plain form
6203 -134199 -126945 -90458 -62012 -51765 -84815 -77871 -67573 -53765 -62001 -66283 -90336 -81565 -73552
6190 -73552 -58845 -11002 -4202 -55102 -70368 -69372 -50432 -39214 -17307 -2450 -53468 -80389
6178 -80389 -68590 4008 -4854 -9245 -2360 -10024 -55779 -69607 -55509 -82488 -60035 -63133 -71702
6165 -71702 -64662 -78561 -98546 -78347 -11991 -12989 -27803 -41007 -46207 -57918 -70487 -58385 -54538
6152 -54538 -74348 -85372 -33361 -77378 -107155 -97444 -79636 -24466 27452 -11303 -10302 -93207
6140 -93207 -112960 -74960 -81719 -79951 -68904 -83802 -90992 -102985 -80014 -57692 -19091 -37967
6128 -37967 -48502 -50939 -38695 -22490 -37818 -61209 -57355 -33979 -76607 -101392 -90188 -64812
6116 -64812 -33637 -14838 -38062 -47075 -64655 -56442 -51960 -65263 -33882 6558 7375 -30281 -46227
$$ packed form
6203a34199P254L6487K8446J0247l3050O944J0298J3808q236m282k4053Q771Q013
6190g3552J4707M7843O800n0900j5266R96J8940J1218K1907J4857n1018k6921
6178h0389J1799P2598q862m391O885p664m5755j3828J4098k6979K2453l098q569
6165g1702P040j3899j9985K0199O6356r98j4814j3204n200j1711j2569J2102L847
6152e4538j9810j1024N2011m4017k9777R711J7808N5170N1918l8755J001q2905
6140i3207j9753L8000o759J768J1047j4898p190j1993K2971K2322L8601j8876
6128c7967j0535k437J2244J6205j5328k3391L854K3376m2628k4785J1204K5376
6116f4812L1175J8799k3224r013j7580Q213M482j3303L1381M0440Q17l7656j5946
$$ plain form
6103 -46227 -83101 -72958 -68948 -33139 14024 -12489 -39065 -87877 -36359 -49129 -69699 -62987
6091 -62987 -102408 -89288 -130670 -152260 -126072 -76907 -70018 -89692 -38540 -54766 -59874 -96289
6079 -96289 -102591 -64930 -47536 -50809 6111 35015 -43836 -101856 -66680 -39224 -3118 -19908
6067 -19908 -47060 -32082 -115212 -79410 -39346 -36217 -63712 -72424 -31389 -43059 -15263 -73896
6055 -73896 -100046 -32635 -16762 -40402 -56909 -49306 -64188 -88759 -101860 -90566 -80142 -90542
6043 -90542 -60072 -43969 -49271 4512 24030 14098 48158 12030 -7110 -37144 -77087 -95550
6031 -95550 -65173 -74662 -49261 -64971 -77507 -66428 -66465 -55031 -39096 -12950 -741 -35586 -26262
6018 -26262 -11356 -31971 -49666 -79089 -58127 -47298 -37440 -34963 -32976 -64577 -37120 -70508
$$ packed form
6103d6227l6874J0143M010L5809M7163k6513k6576m8812N1518j2770k0570O712
6091f2987l9421J3120m1382k1590K6188M9165O889j9674N1152j6226n108l6415
6079i6289o302L7661J7394l273N6920K8904p8851n8020L5176K7456L6106j6790
6067a9908k7152J4978q3130L5802M0064L129k7495q712M1035j1670K7796n8633
6055g3896k6150O7411J5873k3640j6507P603j4882k4571j3101J1294J0424j0400
6043i0542L0470J6103n302N3783J9518r932L4060l6128j9140l0034l9943j8463
6031i5550L0377r489K5401j5710j2536J1079l7J1434J5935K6146J2209l4845R324
6018b6262J4906k0615j7695k9423K0962J0829R858K477J987l1601K7457l3388
$$ plain form
6006 -70508 -14790 29369 -24805 -46506 -28342 -51760 -41592 -37235 -64333 -59619 -5237 10406
5994 10406 3666 21538 31834 26207 24790 9482 -18512 -10190 -61738 -42754 -7382 16847 25459
5981 25459 3260 986 14001 8836 8191 49511 69801 113171 126125 176236 154576 146027 136911
5968 136911 97356 144987 144558 149082 133785 174631 190793 207707 214300 244635 271769 247021
5956 247021 239333 236997 229206 273853 259730 274485 327122 335962 395697 424636 495967 566408
5944 566408 632940 725501 701412 665214 657387 614870 590778 633343 706154 739629 700352 695610
5932 695610 717466 668441 626678 566239 524209 518365 409215 308234 244859 257459 228341
5921 228341 173491 199559 205813 131377 53394 53860 114604 131319 108776 110752 59969 8307
$$ packed form
6006g0508N5718M4159n4174k1701J8164k3418J0168M357k7098M714N4382J5643
5994A0406o740J7872J0296n627j417j5308k7994Q322n1548J8984L5372K4229Q612
5981B5459k2199k274J3015n165o45M1320K0290M3370J2954N0111k1660q549r116
5968A36911l9555M7631m29M524j5297M0846J6162J6914O593L0335K7134k4748
5956B47021p688k336p791M4647j4123J4755N2637Q840N9735K8939P1331P0441
5944E66408O6532R2561k4089l6198p827m2517k4092M2565P2811L3475l9277m742
5932F95610K1856m9025m1763o0439m2030n844j09150j00981o3375J2600k9118
5921B28341n4850K6068O254p4436p7983M66O0744J6715k2543J976n0783n1662
$$ plain form
5909 8307 -51346 -43366 33314 68625 34292 58188 67006 51655 -194 -9602 307 1271 28594
5896 28594 20208 10528 -33298 -48405 -34466 -8850 55345 63512 69039 43975 26235 56043 -24556
5883 -24556 -34797 -43355 -45842 -43547 -61334 -30714 932 39823 72923 50453 11905 20895 53255
5870 53255 19720 -15363 31180 42684 27421 6257 8374 -29930 -2676 -41738 -46861 5845
5858 5845 52802 13882 6572 10884 6896 -18856 -17155 19543 19578 21379 4114 -5278 20953 41699
5844 41699 17489 -5170 9472 13253 26078 45381 48246 16931 19643 -11178 -47101 3517
5832 3517 -10409 -14494 8576 15274 17888 1624 836 30566 36314 15375 4611 30971 51459
5819 51459 66623 12316 -16423 24690 18536 -11665 -11265 8650 55535 45292 53691 32221 16469
$$ packed form
5909H307n9653P980P6680L5311l4333K3896Q818j5351n1849r408R909R64K7323
5896B8594q386r680m3826j5107J3939K5616O4195Q167N527k5064j7740K9808q0599
5883b4556j0241q558k487K295j7787L0620L1646L8891L3100k2470l8548Q990L2360
5870E3255l3535l5083M6543J1504j5263k1164K117l8304K7254l9062n123N2706
5858E845M6957l8920p310M312l988k5752J701L6698L5J801j7265r392K6231K0746
5844D1699k4210k2659J4642L781J2825J9303K865l1315K712l0821l5923N0618
5832C517j3926m085K3070O698K614j6264p88K9730N748k0939j0764K6360K0488
5819E1459J5164n4307k8739M1113o154l0201M00J9915M6885j0243Q399k1470j5752
$$ plain form
5806 16469 8877 -2322 51011 57736 54245 52662 6260 24014 44734 71123 53408 58962 75994
5793 75994 79720 68757 69186 62436 104223 127153 115478 120862 99563 114600 127547 111992 187088
5780 187088 227489 214906 203646 180764 201222 235068 231866 273204 320972 327584 360867 428590
5768 428590 486416 492655 461530 600389 736167 878748 1006060 1162692 1443712 1960503
5758 1960503 2907395 4315646 6023164 7467764 8260780 8490550 8468067 7889615 6754245
5749 6754245 5724831 4718293 3797564 3083346 2418450 1888785 1549640 1349262 1180367
5740 1180367 1056808 963497 887979 741914 697035 640716 594701 582419 470274 383808 372515
5729 372515 298577 291215 308840 326536 315498 326022 276383 271099 294538 330574 306887 310790
$$ packed form
5806A6469p592j1199N3333O725l491j583m6402J7754K0720K6389j7715N554J7032
5793G5994L726j0963M29o750M1787K2930j1675N384k1299J5037J2947j5555P5096
5780A87088M0401j2583j1260k2882K0458L3846l202M1338M7768O612L3283O7723
5768D28590N7826O239l1125J38859J35778J42581J27312J56632K81020N16791
5758A960503R46892J408251J707518J444600P93016K29770k2483n78452j135370
5749F754245j029414j006538r20729p14218o64896n29665l39145k00378j68895
5740A180367j23559r3311p5518j46065m4879n6319m6015j2282j12145q6466j1293
5729C72515p3938p362J7625J7696j1038J0524m9639n284K3439L6036k3687L903
$$ plain form
5717 310790 294043 287613 233841 172638 194508 202876 229859 164494 176261 237856 261371 219245
5705 219245 176390 196492 235111 184066 133039 128512 122868 119752 127761 140893 154682 162387 124447
5692 124447 115731 120046 133358 160828 144568 168262 172707 129227 116106 120807 116939 126758 95408
5679 95408 127131 138996 144452 118116 87661 142032 176882 123743 82575 94215 115001 130212
5667 130212 93261 63156 78968 115323 82630 75502 70602 67233 64648 78315 135065 163377
5655 163377 138959 108202 61316 64253 100640 146516 142502 132465 148978 151246 108112 113348
5643 113348 124954 101129 99136 136676 163783 168021 124746 60655 69478 161766 184396 162925
5631 162925 178791 176745 142187 89457 97350 130419 117112 105246 80811 126270 205036 150232
$$ packed form
5717C10790j6747o430n3772o1203K1870Q368K6983o5365J1767O1595K3515m2126
5705B19245m2855K0102L8619n1045n1027m527n644l116Q009J3132J3789P705l7940
5692A24447q716M315J3312K7470j6260K3694M445m3480j3121M701l868R819l1350
5679I5408L1723J1865N456k6336l0455N4371L4850n3139m1168J1640K0786J5211
5667A30212l6951l0105J5812L6355l2693p128m900l369k585J3667N6750K8312
5655A63377k4418l0757m6886K937L6387M5876m014j0037J6513K268m3134N236
5643A13348J1606k3825j993L7540K7107M238m3275o4091Q823R2288K2630k1471
5631A62925J5866k046l4558n2730P893L3069j3307j1866k4435M5459P8766n4804
$$ plain form
5619 150232 115044 143210 213624 177181 163784 154741 112415 85370 82369 86527 110145 140566
5607 140566 151643 104245 155325 172608 200241 260757 359980 409416 395697 384223 382908 309981
5595 309981 281414 299646 286616 321780 299672 248677 285550 383907 433147 432713 389890 363486
5583 363486 309738 325776 292039 214813 237378 216106 144466 74408 106597 140866 146251 194471
5571 194471 203062 212182 227306 158724 67323 103165 164519 124088 140542 187313 134285 125886
5559 125886 119429 116816 127510 191734 165216 168471 166353 159280 128222 91439 136495 167340 192201
5546 192201 148818 119266 140554 165528 174091 140344 156172 193231 155285 161431 213014 258008
5534 258008 283123 261601 256636 258217 244604 218997 175950 209214 278407 297514 271092 263866
$$ packed form
5619A50232l5188K8166P0414l6443j3397r043m2326k7045l001M158K3618L0421
5607A40566J1077m7398N1080J7283K7633O0516R9223M9436j3719j1474j315p2927
5595C09981k8567J8232j3030L5164k2108n0995L6873R8357M9240m34m2823k6404
5583C63486n3748J6038l3737p7226K2565k1272p1640p0058L2189L4269N385M8220
5571A94471Q591R120J5124o8582r1401L5842O1354m0431J6454M6771n3028q399
5559A25886o457k613J0694O4224k6518L255k118p073l1058l6783M5056L0845K4861
5546A92201m3383k9552K1288K4974Q563l3747J5828L7059l7946O146N1583M4994
5534B58008K5115k1522m965J581j3613k5607m3047L3264O9193J9107k6422p226
$$ plain form
5522 263866 258532 210544 204442 248029 266443 280564 244136 168610 199760 233011 156709 174943
5510 174943 244404 221525 182298 141274 137721 124176 129589 176529 264879 283445 263395 222496
5498 222496 218287 198250 222148 265857 245741 246383 231637 157848 174479 192261 209166 276275
5486 276275 268085 242299 229739 235686 208415 163751 170244 253453 261719 195697 173521 206472
5474 206472 174263 217377 156652 132836 225263 248337 228416 278929 330368 294681 239392 216330
5462 216330 203781 223791 200071 143530 140043 217842 217141 218017 238827 253223 234531 202714 270498
5449 270498 264761 273062 294610 329257 296842 261179 286653 247961 203138 247541 294344 354340
5437 354340 326837 303251 321225 350471 382292 396805 404722 383718 325607 337010 363933 322171
$$ packed form
5522B63866n334m7988o102M3587J8414J4121l6428p5526L1150L3251p6302J8234
5510A74943O9461k2879l9227m1024l553j3545N413M6940Q8350J8566k0050m0899
5498B22496m209k0037K3898M3709k0116O42j4746p3789J6631J7782J6905O7109
5486B76275q190k5786j2560N947k7271m4664O493Q3209Q266o6022k2176L2951
5474B06472l2209M3114o0725k3816R2427K3074j9921N0513N1439l5687n5289k3062
5462B16330j2549K0010k3720n6541l487P7799p01Q76K0810J4396j8692l1817O7784
5449B70498n737Q301K1548L4647l2415l5663K5474l8692m4823M4403M6803N9996
5437C54340k7503k3586J7974K9246L1821J4513P917k1004n8111J1403K6923m1762
$$ plain form
5425 322171 338004 365013 359900 388756 392862 343854 346405 380624 423266 402770 428724 429633 369028
5412 369028 343954 404362 434988 451039 470261 468339 485576 481167 503466 465058 516896 541377
5400 541377 495542 452575 514056 470063 417940 417818 459463 513367 561944 570523 508768 519142
5388 519142 567160 538648 542954 633516 635384 615330 642794 574445 561424 627238 617157 668263
5376 668263 686060 705872 696896 693306 711128 747746 763827 769674 746630 767202 783518 727966
5364 727966 702074 813929 880915 850934 824768 819480 776430 812918 851210 897473 960410 978866
5352 978866 982077 981190 960028 1046707 1109908 1132342 1152852 1168898 1136139 1137243 1150717 1187601
5340 1187601 1245804 1270065 1277523 1297126 1359028 1365430 1409159 1451159 1548201 1569995 1615294 1581695
$$ packed form
5425C22171J5833K7009n113K8856M106m9008K551L4219M2642k0496K5954R09o0605
5412C69028k5074O0408L0626J6051J9222j922J7237m409K2299l8408N1838K4481
5400E41377m5835m2967O1481m3993n2123j22M1645N3904M8577Q579o1755J0374
5388E19142M8018k8512M306R0562J868k0054K7464o8349j3021O5814j0081N1106
5376F68263J7797J9812q976l590J7822L6618J6081N847k3044K0572J6316n5552
5364G27966k5892J11855O6986k9981k6166n288m3050L6488L8292M6263O2937J8456
5352I78866L211q87k1162Q6679O3201K2434K0510J6046l2759J104J3474L6884
5340A187601N8203K4261P458J9603O1902O402M3729M2000R7042K1794M5299l3599
$$ plain form
5328 1581695 1561623 1584994 1617788 1729478 1852124 1925789 2015714 2050132 2113862 2254103 2414586
5317 2414586 2535816 2658462 2812952 2933517 3067250 3211091 3441277 3687503 3879936 4120345
5307 4120345 4393108 4678143 4994403 5415826 5984737 6645202 7420716 8340890 9454533
5298 9454533 10778011 12452153 14719001 18135204 23291099 30276691 38253345 45553708
5290 45553708 50813476 53709153 54751657 53883734 51247461 48174535 45796767 45123846
5282 45123846 46774474 50518498 54833963 58002620 59280685 58672002 56273750 51840895
5274 51840895 46113237 40092005 34337888 29094866 24475391 20455944 17198480 14732528
5266 14732528 12924742 11489672 10308249 9357004 8529838 7854352 7224617 6678260 6234680
$$ packed form
5328A581695k0072K3371L2794J11690J22646P3665Q9925L4418O3730J40241J60483
5317B414586J21230J22646J54490J20565J33733J43841K30186K46226J92433K40409
5307D120345K72763K85035L16260M21423N68911O60465P75514R20174J113643
5298I454533J323478J674142K266848L416203N155895O985592P976654P300363
5290D5553708N259768K895677J042504q67923k636273l072926k377768o72921
5282D5123846J650628L744024M315465L168657J278065o08683k398252m432855
5274E1840895n727658o021232n754117n243022m619475m019447l257464k465952
5266A4732528j807786j435070j181423r51245q27166o75486o29735n46357m43580
$$ plain form
5257 6234680 5872316 5524803 5233878 4971112 4667329 4428709 4205097 4035445 3892881 3771789
5247 3771789 3734203 3671913 3565813 3480791 3435418 3379829 3347981 3244751 3171475 3164651 3131394
5236 3131394 3077682 3052472 3011817 2990870 2934712 2876502 2809282 2785433 2772142 2678373 2612719
5225 2612719 2587249 2536919 2511036 2407652 2380327 2370732 2236211 2140199 2076942 2083249 2037210
5214 2037210 1941461 1833274 1817948 1778057 1724654 1713656 1637417 1567668 1518200 1449407 1404283
5203 1404283 1390334 1389949 1334546 1317494 1316159 1301568 1276789 1194912 1155547 1096020 1130485 1142417
5191 1142417 1093724 1063259 1073479 1070336 1016033 1029801 1078229 1075911 1077729 1090386 1062196 1075929
5179 1075929 1044969 1024547 1064170 1077218 1023789 952486 993049 984017 942119 949927 970264 964518
$$ packed form
5257F234680l62364l47513k90925k62766l03783k38620k23612j69652j42564j21092
5247C771789l7586o2290j06100q5022m5373n5589l1848j03230p3276o824l3257
5236C131394n3712k5210m0655k0947n6158n8210o7220k3849j3291r3769o5654
5225B612719k5470n0330k5883j03384k7325r595j34521r6012o3257O307m6039
5214B037210r5749j08187j5326l9891n3403j0998p6239o9749m9468o8793m5124
5203A404283j3949l85n5403j7052j335j4591k4779q1877l9365n9527L4465J1932
5191A142417m8693l0465J0220l143n4303J3768M8428k318J818J2657k8190J3733
5179A075929l0960k0422L9623J3048n3429p1303M0563r032m1898P808K0337n746
$$ plain form
5167 964518 973478 980626 928359 882420 880443 882801 870623 927313 909876 850504 831549 833205 831398
5154 831398 814175 851369 877686 885082 887586 863149 848390 852371 881855 823531 812299 836243
5142 836243 790232 745115 786141 767561 759559 766795 735014 704026 727872 755658 752899 786505
5130 786505 778835 806431 791520 756756 724061 767650 776829 730841 715341 752260 744872 659659
5118 659659 655492 690079 746916 740637 732294 726790 721651 719344 687953 668087 684164 738049 725213
5105 725213 653124 643565 651828 651854 636927 620514 642717 654805 613099 608795 646372 651759 693177
5092 693177 697934 684628 702595 691636 664831 673680 648331 672430 687596 663738 651739 660407
5080 660407 649685 664216 661837 681583 698965 679375 729695 720364 725024 713523 701103 746363
$$ packed form
5167I64518Q960P148n2267m5939j977K358j2178N6690j7437n9372j8955J656j807
5154H31398j7223L7194K6317P396K504k4437j4759L981K9484n8324j1232K3944
5142H36243m6011m5117M1026j8580q002P236l1781l0988K3846K7786k759L3606
5130G86505p670K7596j4911l4764l2695M3589R179m5988j5500L6919p388q5213
5118F59659m167L4587N6837o279q343n504n139k307l1391j9866J6077N3885j2836
5105G25213p2089r559Q263K6j4927j6413K2203J2088m1706m304L7577N387M1418
5092F93177M757j3306J7967j0959k6805Q849k5349K4099J5166k3858j1999Q668
5080F60407j0722J4531k379J9746J7382j9590N0320r331M660j1501j2420M5260
$$ plain form
5068 746363 726706 718486 780973 747577 720177 712896 700071 776868 794614 786431 800629 793068
5056 793068 768340 759999 749991 809166 841369 827366 840491 839142 857078 868054 899427 890972
5044 890972 905065 898803 871800 824509 837599 865398 899960 894463 865440 845272 857083 844464
5032 844464 799713 814849 847438 885917 866123 823178 800462 804342 757476 732640 729897 772836
5020 772836 769707 764588 774109 805219 845932 805573 780750 847369 877437 876316 805555 814249 814937
5007 814937 815675 819203 832132 866769 849368 853777 889134 916245 885237 903799 900553 924938 958227
4994 958227 938163 971968 1037521 1068863 1100164 1157290 1239122 1213969 1185578 1205216 1257141 1257374
4982 1257374 1244638 1244946 1209355 1199161 1251129 1251125 1245956 1272816 1258608 1216130 1208644 1177032 1191908
$$ packed form
5068G46363j9657q220O2487l3396k7400p281j2825P6797J7746q183J4198p561
5056G93068k4728q341j0008N9175L2203j4003J3125j349J7936J0976L1373q455
5044H90972J4093o262k7003m7291J3090K7799L4562n497k9023k0168J1811j2619
5032H44464m4751J5136L2589L8479j9794m2945k2716L880m6866k4836k743M2939
5020G72836l129n119R521L1110M0713m0359k4823O6619L0068j121p0761Q694O88
5007H14937P38L528J2929L4637j7401M409L5357K7111l1008J8562l246K4385L3289
4994I58227k0064L3805O5553L1342L1301N7126Q1832k5153k8391J9638N1925K33
4982A257374j2736L08l5591j0194N1968mn169K6860j4208m2478p486l1612J4876
$$ plain form
4969 1191908 1253801 1240746 1212110 1259997 1288178 1242746 1221200 1235670 1226699 1190837 1181964 1179355
4957 1179355 1137461 1085662 1048589 1026078 1090111 1144377 1132918 1069058 1006612 1035875 1036166 1027280
4945 1027280 1053873 1084640 1108230 1114009 1038198 1045440 1109843 1139020 1149038 1136552 1135821 1130007
4933 1130007 1113377 1116289 1114663 1125090 1156437 1161183 1164239 1167825 1217449 1193548 1152932 1181985
4921 1181985 1213270 1222364 1210902 1192885 1218893 1147219 1186521 1271201 1264442 1275622 1276824 1242348
4909 1242348 1252090 1274377 1312381 1344416 1339723 1252519 1222634 1247944 1260668 1227971 1243437 1279992
4897 1279992 1302536 1294532 1319678 1354707 1395274 1379714 1391938 1398204 1390375 1383039 1355420 1371080
4885 1371080 1383630 1436935 1423206 1455706 1437055 1414294 1395768 1425795 1461194 1512673 1532827
$$ packed form
4969A191908O1893j3055k8636M7887K8181m5432k1546J4470q971l5862q873k609
4957A179355m1894n1799l7073k2511O4033N4266j1459o3860o2446K9263K91q886
4945A027280K6593L0767K3590N779p5811P242O4403K9177J0018j2486p31n814
4933A130007j6630K912j626J0427L1347M746L056L586M9624k3901m0616K9053
4921A181985L1285R094j1462j8017K6008p1674L9302Q4680o759J1180J202l4476
4909A242348R742K2287L8004L2035m693q7204k9885K5310J2724l2697J5466L6555
4897A279992K2544q004K5146L5029M0567j5560J2224O266p829p336k7619J5660
4885A371080J2550N3305j3729L2500j8651k2761j8526L0027L5399N1479K0154
$$ plain form
4874 1532827 1576877 1514195 1470529 1470872 1519665 1538056 1521332 1540373 1501546 1530154 1562310 1543179
4862 1543179 1642297 1652422 1582677 1596545 1652844 1673930 1680920 1696316 1714918 1721093 1747432 1795167
4850 1795167 1827275 1892174 1940400 2032147 2117311 2153194 2173898 2197112 2201469 2171322 2121951 2149290
4838 2149290 2191988 2182404 2217662 2249324 2246860 2242426 2233615 2286983 2394764 2525892 2552991 2681477
4826 2681477 2853263 3013098 3129669 3294759 3611116 4179591 5055728 6183606 7169090
4817 7169090 7789026 7977293 8007491 7773021 7157040 6486656 5713022 5032315 4446118 3980647
4807 3980647 3650585 3380420 3175036 3026410 2916731 2876272 2767259 2746416 2677887 2631491
4797 2631491 2585039 2573433 2508231 2491377 2503809 2462339 2422004 2461672 2519856 2488923 2483664 2488750
$$ packed form
4874A532827M4050o2682m3666L43M8793J8391j6724J9041l8827K8608L2156j9131
4862A543179R9118J0125o9745J3868N6299K1086O990J5396J8602O175K6339M7735
4850A795167L2108O4899M8226R1747Q5164L5883K0704K3214M357l0147m9371K7339
4838B149290M2698r584L5258L1662k464m434q811N3368J07781J31128K7099J28486
4826B681477J71786J59835J16571J65090L16357N68475Q76137J127878R85484
4817G169090O19936J88267L0198k34470o15981o70384p73634o80707n86197m65471
4807C980647l30062k70165k05384j48626j09679m0459j09013k0843o8529m6396
4797B631491m6452j1606o5202j6854J2432m1470m0335L9668N8184l0933n259N086
$$ plain form
4785 2488750 2437718 2432254 2511937 2469988 2477170 2530259 2523482 2478743 2496162 2487839 2543501 2579731
4773 2579731 2633693 2588744 2601980 2595564 2568758 2581731 2620729 2657642 2672369 2691320 2693722 2679890
4761 2679890 2681650 2749713 2738246 2740223 2797166 2806083 2762596 2756507 2799277 2869499 2945410 3006488
4749 3006488 2979670 3003156 3054306 3074812 3091106 3179363 3254496 3214696 3189992 3226106 3224773 3201864
4737 3201864 3215479 3227757 3229270 3276471 3251839 3228282 3324740 3387467 3399605 3424339 3476928 3497746
4725 3497746 3562632 3668833 3790190 3861744 3929694 3967692 3909967 3894037 3848795 3821737 3850171
4714 3850171 3818567 3754978 3752096 3753619 3738903 3682512 3713586 3771458 3777328 3803196 3799184 3834815
4702 3834815 3907509 3903849 3904165 3982027 4090049 4097400 4113448 4165458 4169965 4108150 4088923 4114502
$$ packed form
4785B488750n1032n464P9683m1949P182N3089o777m4739J7419q323N5662L6230
4773B579731N3962m4949J3236o416k6806J2973L8998L6913J4727J8951K402j3832
4761B679890J760O8063j1467J977N6943Q917m3487o089M2770P0222P5911O1078
4749C006488k6818K3486N1150K0506J6294Q8257P5133l9800k4704L6114j333k2909
4737C201864J3615J2278J513M7201k4632k3557R6458O2727J2138K4734N2589K0818
4725C497746O4886J06201J21357P1554O7950L7998n7725j5930m5242k7058K8434
4714C850171l1604o3589k882J523j4716n6391L1074N7872N870K5868m012L5631
4702C834815P2694l660L16P7862J08022P351J6048N2010M507o1815j9227K5579
$$ plain form
4690 4114502 4114486 4099839 4106674 4084435 4076926 4101609 4076421 4102534 4163748 4162814 4191621 4173728 4149358
4677 4149358 4143416 4140303 4278376 4292917 4297271 4295184 4252430 4284346 4330145 4381337 4405680 4462069
4665 4462069 4483776 4439616 4468730 4486653 4488912 4495343 4540867 4585916 4606835 4625128 4643756 4634121
4653 4634121 4725785 4814530 4806180 4778979 4789311 4875188 4877783 4895161 4941335 4986701 4962170 4957637
4641 4957637 4990175 5038667 5122155 5144682 5203012 5254199 5298509 5336722 5370476 5404342 5518941
4630 5518941 5728345 5948273 6242497 6550296 6920492 7203124 7312752 7308937 7213944 7059296
4620 7059296 6850774 6701791 6569430 6483738 6425484 6412891 6393824 6488893 6662241 6855355
4610 6855355 7038674 7228687 7437893 7625050 7778545 7925900 8120311 8296643 8575545 8862530
$$ packed form
4690D114502j6j4647O835k2239p509K4683k5188K6113O1214r34K8807j7893k4370
4677D149358n942l113J38073J4541M354k087m2754L1916M5799N1192K4343N6389
4665D462069K1707m4160K9114J7923K259O431M5524M5049K0919J8293J8628r635
4653D634121R1664Q8745q350k7201J0332Q5877K595J7378M6174M5366k4531m533
4641D957637L2538M8492Q3488K2527N8330N1187M4310L8213L3754L3866J14599
4630E518941K09404K19928K94224L07799L70196K82632J09628l815r4993j54648
4620G059296k08522j48983j32361q5692n8254j2593j9067R5069J73348J93114
4610F855355J83319J90013K09206J87157J53495J47355J94411J76332K78902K86985
$$ plain form
4600 8862530 9173985 9508013 9650748 9809512 9925573 10024522 10173866 10452505 10767384 10971076
4590 10971076 11043206 11045655 10962864 10816766 10700097 10612067 10614570 10536014 10426795 10270551 10069763
4579 10069763 9854375 9635656 9368253 9241572 9101355 8932414 8743029 8587901 8460223
4570 8460223 8264387 8119017 7926738 7795381 7691570 7512650 7398639 7383539 7330602 7243876
4560 7243876 7237658 7218327 7191771 7203347 7215846 7172401 7176653 7218243 7221551 7233446 7208425 7223576
4548 7223576 7292087 7318983 7313859 7265801 7320067 7371612 7365660 7355026 7392419 7427406 7363153 7346311
4536 7346311 7400803 7482703 7538344 7504792 7501019 7559624 7601211 7632823 7705227 7692463 7710047 7710026
4524 7710026 7699406 7754451 7782394 7838153 7956376 8030179 8081253 8129452 8207923 8281992 8332096
$$ packed form
4600H862530L11455L34028J42735J58764J16061R8949J49344K78639L14879K03692
4590A0971076P2130K449q2791j46098j16669q8030K503p8556j09219j56244k00788
4579A0069763k15388k18719k67403j26681j40217j68941j89385j55128j27678
4570H460223j95836j45370j92279j31357j03811j78920j14011j5100n2937q6726
4560G243876o218j9331k6556J1576J2499m3445M252M1590L308J1895k5021J5151
4548G223576O8511K6896n124m8058N4266N1545n952j0634L7393L4987o4253j6842
4536G346311N4492Q1900N5641l3552l773N8605M1587L1612P2404j2764J7584k1
4524G710026j0620N5045K7943N5759J18223P3803N1074M8199P8471P4069N0104
$$ plain form
4513 8332096 8419405 8530817 8735193 8864535 9052822 9305636 9578242 9988991 10540940 11223215
4503 11223215 12336724 13969232 16070336 18289047 20315922 21725884 22507226 22645474
4495 22645474 22134801 21533956 21262417 21713381 23317072 26053588 29387919 32553023 34620361
4486 34620361 35335920 34876126 32841825 30045334 27352924 25130598 23728702 23107941 23073869
4477 23073869 23346414 23642147 23431118 22681228 21318984 19564653 17767562 16078463 14508166
4468 14508166 13258031 12230244 11369945 10684957 10181489 9825630 9595676 9354332 9098535
4459 9098535 8917996 8755775 8608981 8470859 8338986 8275191 8223626 8054016 7949872 7901833
4449 7901833 7830949 7759415 7720063 7609667 7602762 7563238 7474966 7406955 7377038 7352935 7294101
$$ packed form
4513H332096Q7309J11412K04376J29342J88287K52814K72606M10749N51949O82275
4503A1223215J113509J632508K101104K218711K026875J409962P81342J38248
4495B2645474n10673o00845k71539M50964J603691K736516L334331L165104K067338
4486C4620361P15559m59794k034301k796491k692410k222326j401896o20761l4072
4477B3073869K72545K95733k11029p49890j362244j754331j797091j689099j570297
4468A4508166j250135j027787q60299o84988n03468l55859k29954k41344k55797
4459I098535j80539j62221j46794j38122j31873o3795n1565j69610j04144m8039
4449G901833p0884p1534l9352j10396o905l9524q8272o8011k9917k4103n8834
$$ plain form
4438 7294101 7209598 7174033 7125612 7077162 7009256 6967111 6893903 6835618 6807138 6731501 6687576
4427 6687576 6666157 6636020 6579413 6553803 6484447 6452964 6445374 6421497 6338622 6270515 6247119 6254204
4415 6254204 6212660 6174097 6107461 6048415 5988346 5971082 5984117 5999291 5986910 5915554 5828874
4404 5828874 5801475 5777607 5743657 5725073 5690883 5640395 5678913 5691617 5587250 5581758 5560439
4393 5560439 5549168 5519969 5499324 5442575 5436014 5459493 5432749 5436847 5452538 5457815 5395037 5322168
4381 5322168 5361881 5400282 5372822 5342418 5336876 5353540 5380113 5357021 5295189 5309057 5282281 5236385
4369 5236385 5225330 5236972 5211587 5212181 5151644 5144052 5162208 5164712 5122486 5038695 5019712 5001479
4357 5001479 4952307 4913688 4873329 4887808 4847620 4886092 4892376 4827585 4844827 4843943 4810191 4850379
$$ packed form
4438G294101q4503l5565m8421m8450o7906m2145p3208n8285k8480p5637m3925
4427F687576k1419l0137n6607k5610o9356l1483p590k3877q2875o8107k3396P085
4415F254204m1544l8563o6636n9046o0069j7264J3035J5174j2381p1356q6680
4404E828874k7399k3868l3950j8584l4190n0488L8518J2704j04367n492k1319
4393E560439j1271k9199k0645n6749o561K3479k6744M098J5691N277o2778p2869
4381E322168L9713L8401k7460l0404n542J6664K6573k3092o1832J3868k6776m5896
4369E236385j1055J1642k5385N94o0537p592J8156K504m2226q3791j8983j8233
4357E001479m9172l8619m0359J4479m0188L8472O284o4791J7242q84l3752M0188
$$ plain form
4345 4850379 4871739 4860699 4848111 4844253 4815188 4788410 4772569 4759122 4706809 4662466 4661190 4651594
4333 4651594 4683532 4650459 4618777 4611672 4636519 4616648 4577205 4529957 4528625 4536902 4540268 4542289
4321 4542289 4548889 4512477 4510256 4491844 4483004 4494085 4525949 4494722 4469493 4465010 4510251 4506523
4309 4506523 4481022 4530318 4587847 4588193 4569892 4557241 4562738 4580974 4580534 4554050 4566992 4545900
4297 4545900 4523587 4546616 4574855 4668110 4720710 4648983 4645657 4699634 4697722 4671581 4645949 4658139
4285 4658139 4654986 4704059 4718330 4718426 4721473 4740179 4778710 4836045 4884105 4935796 4950809 4932502
4273 4932502 4934682 4951418 5010577 5060527 5118319 5163495 5260743 5352032 5454303 5542886 5630352
4262 5630352 5773291 5878475 5957050 6005546 6058744 6190473 6370272 6620645 6917697 7295395
$$ packed form
4345D850379K1360j1040j2588l858k9065k6778j5841j3447n2313m4343j276r596
4333D651594L1938l3073l1682p105K4847j9871l9443m7248j332Q277L366K021
4321D542289O600l6412k221j8412q840J1081L1864l1227k5229m483M5241l728
4309D506523k5501M9296N7529L46j8301j2651N497J8236m40k6484J2942k1092
4297D545900k2313K3029K8239R3255N2600p1727l326N3977j912k6141k5632J2190
4285D658139l153M9073J4271R6L047J8706L8531N7335M8060N1691J5013j8307
4273D932502K180J6736N9159M9950N7792M5176R7248R1289J02271Q8583Q7466
4262E630352J42939J05184P8575M8496N3198J31729J79799K50373K97052L77698
$$ plain form
4252 7295395 7624431 7993814 8399460 8701598 8975739 9249366 9474862 9657161 9863833 10033686
4242 10033686 10360482 10736258 11301280 12005763 12843577 13653161 14364043 14974999 15500721
4233 15500721 15872201 15993566 16029396 16114299 16209551 16346028 16600272 17124796 17884622 18722834
4223 18722834 19615878 20476117 21187688 21582698 21672640 21531743 21253456 20888667 20545852 20317304
4213 20317304 20249881 20341990 20633846 21029424 21482825 21887860 22123427 22035418 21743925 21222474
4203 21222474 20579373 19895595 19278189 18802423 18458683 18354222 18298559 18245143 18165362 17959915
4193 17959915 17638881 17173517 16536025 15800098 15079440 14332260 13692882 13223565 12901943
4184 12901943 12735624 12569745 12392200 12177198 11842923 11400575 10881308 10305062 9741964
$$ packed form
4252G295395L29036L69383M05646L02138K74141K73627K25496J82299K06672J69853
4242A0033686L26796L75776N65022P04483Q37814Q09584P10882O10956N25722
4233A5500721L71480J21365L5830Q4903R5252J36477K54244N24524P59826Q38212
4223A8722834Q93044Q60239P11571L95010Q9942j40897k78287l64789l42815k28548
4213B0317304o7423R2109K91856L95578M53401M05035K35567q8009k91493n21451
4203B1222474o43101o83778o17406m75766l43740j04461n5663n3416p9781k05447
4193A7959915l21034m65364o37492p35927p20658p47180o39378m69317l21622
4184A2901943j66319j65879j77545k15002l34275m42348n19267n76246n63098
$$ plain form
4175 9741964 9091359 8533108 8053856 7690818 7416241 7259606 7186361 7022614 6784598 6575107
4165 6575107 6379684 6053537 5724281 5467653 5163094 4890507 4647517 4399062 4253319 4157269
4155 4157269 4022626 3872014 3836007 3786762 3670528 3546346 3422331 3286033 3229772 3169662
4145 3169662 3090395 3013963 2932085 2854217 2742503 2726215 2751859 2744684 2659608 2595823 2535197
4134 2535197 2529511 2505942 2427909 2426923 2445460 2442767 2392314 2366444 2325292 2296771 2288264 2263480
4122 2263480 2259069 2227248 2204020 2160214 2097532 2112390 2099429 2086164 2115136 2051400 2063109 2088433
4110 2088433 2072509 2001433 1976380 1964568 1948617 1930378 1886288 1893037 1888803 1901229 1868855 1892492
4098 1892492 1889864 1863759 1843841 1832784 1831285 1809586 1804153 1791301 1751365 1758268 1730338 1709835
$$ packed form
4175I741964o50605n58251m79252l63038k74577j56635p3245j63747k38016k09491
4165F575107j95423l26147l29256k56628l04559k72587k42990k48455j45743r6050
4155D157269j34643j50612l6007m9245j16234j24182j24015j36298n6261o0110
4145C169662p9267p6432q1878p7868j11714j6288K5644p175q5076o3785o0626
4134B535197n686k3569p8033r86J8537k693n0453k5870m1152k8521q507k4784
4122B263480m411l1821k3228m3806o2682J4858j2961j3265K8972o3736J1709K5324
4110B088433j5924p1076k5053j1812j5951j8239m4090O749m234J2426l2374K3637
4098A892492k628k6105j9918j1057j499k1699n433j2852l9936O903k7930k0503
$$ plain form
4086 1709835 1692247 1668740 1669515 1689880 1686274 1659843 1619086 1650635 1635319 1588520 1611975 1657947
4074 1657947 1683341 1669221 1595193 1572398 1633685 1623217 1589434 1566999 1576003 1536135 1506122 1552096
4062 1552096 1571886 1564251 1559630 1493839 1505234 1519515 1467282 1435164 1479219 1527424 1522768 1494281
4050 1494281 1458127 1435988 1439871 1436927 1467000 1468994 1478696 1482144 1408653 1418632 1390173 1393605 1410491
4037 1410491 1383825 1380020 1372622 1377742 1370998 1288164 1333080 1371388 1352975 1335337 1344016 1350817 1352132
4024 1352132 1330870 1270365 1271271 1320644 1312340 1264351 1295581 1314496 1282739 1279350 1315284 1354270
4012 1354270 1337019 1289641 1255834 1236911 1263780 1277146 1334911 1333815 1297020 1279151 1289055 1276008
4000 1276008 1312692 1355486 1340810 1333395 1295881 1259736 1250600 1244461 1286324 1309702 1289157 1296346
$$ packed form
4086A709835j7588k3507P75K0365l606k6431m0757L1549j5316m6799K3455M5972
4074A657947K5394j4120p4028k2795O1287j0468l3783k2435R004l9868l0013M5974
4062A552096J9790p635m621o5791J1395J4281n2233l2118M4055M8205m656k8487
4050A494281l6154k2139L883k944L0073J994R702L448p3491R979k8459L432J6886
4037A410491k6666l805p398N120o744q2834M4916L8308j8413j7638Q679O801J315
4024A352132k1262o0505R06M9373q304m7989L1230J8915l1757l389L5934L8986
4012A354270j7251m7378l3807j8923K6869J3366N7765j096l6795j7869R904j3047
4000A276008L6684M2794j4676p415l7514l6145r136o139M1863K3378k0545P189
$$ plain form
3988 1296346 1270168 1185559 1173596 1250881 1271501 1299230 1288752 1271148 1262573 1267055 1282522 1315040
3976 1315040 1364736 1331997 1281097 1297978 1271471 1255766 1291554 1297419 1340738 1385270 1367483 1292674
3964 1292674 1267113 1296209 1341618 1349588 1426369 1397312 1357538 1362954 1367011 1367884 1361937 1418224 1421557
3951 1421557 1410732 1466256 1466890 1485554 1507446 1571166 1654098 1824628 1972430 2140948 2350455
3940 2350455 2560263 2705701 2817823 2837176 2782857 2729098 2645411 2646715 2610350 2660814 2690432
3929 2690432 2667172 2747780 2864827 2918481 3006727 3161671 3255644 3368674 3472973 3475029 3457805
3918 3457805 3405673 3344529 3317929 3350346 3323462 3336212 3471729 3631122 3785105 3893629 3949401
3907 3949401 3919533 3824023 3712045 3518036 3346009 3165266 3006934 2812538 2694311 2526707
$$ packed form
3988A296346k6178q4609j1963P7285K0620K7729j0478j7604q575M482J5467L2518
3976A315040M9696l2739n0900J6881k6507j5705L5788N865M3319M4532j7787p4809
3964A292674k5561K9096M5409P970P6781k9057l9774N416M057Q73n947N6287L333
3951A421557j0825N5524O34J8664K1892O3720Q2932J70530J47802J68518K09507
3940B350455K09808J45438J12122J9353n4319n3759q3687J304l6365N0464K9618
3929B690432k3260Q0608J17047N3654Q8246J54944R3973J13030J04299K056j7224
3918C457805n2132o1144k6600L2417k6884J2750J35517J59393J53983J08524N5772
3907C949401k9868r5510j11978j94009j72027j80743j58332j94396j18227j67604
$$ plain form
3897 2526707 2328072 2231401 2180882 2137134 2097052 2109721 2067200 2015758 1985181 1975857 1981279 1978598
3885 1978598 1984604 1929269 1899405 1919328 1938938 1959913 1942415 1915055 1907379 1915652 1951489 1965583
3873 1965583 1921761 1904300 1928967 1897073 1907298 1847132 1794614 1814438 1801712 1735314 1796183
3862 1796183 1779503 1697628 1685546 1702657 1675572 1608942 1542042 1502575 1537534 1517119 1486040
3851 1486040 1479288 1500281 1475286 1419691 1413147 1441309 1414925 1443208 1439102 1435097 1465116 1454584
3839 1454584 1446580 1419988 1407211 1461706 1451027 1475004 1457901 1469051 1542248 1593583 1634566 1649996
3827 1649996 1607872 1623619 1673425 1700741 1718232 1720366 1715099 1699450 1759587 1772612 1822235 1868596
3815 1868596 1882310 1931580 2024152 2102751 2148334 2189067 2224711 2242201 2303094 2394291 2395185 2383935
$$ packed form
3897B526707j98635r6671n0519m3748m0082J2669m2521n1442l0577r324N422k681
3885A978598O006n5335k9864J9923J9610K0975j7498k7360p676Q273L5837J4094
3873A965583m3822j7461K4667l1894J0225o0166n2518J9824j2726o6398O0869
3862A796183j6680q1875j2082J7111k7085o6630o6900l9467L4959k0415l1079
3851A486040o752K0993k4995n5595o544K8162k6384K8283m106m005L0019j0532
3839A454584q004k6592j2777N4495j0679K3977j7103J1150P3197N1335M0983J5430
3827A649996m2124J5747M9806K7316J7491K134n267j5649O0137J3025M9623M6361
3815A868596J3714M9270R2572P8599M5583M0733L5644J7490O0893R1197Q94j1250
$$ plain form
3803 2383935 2407304 2425544 2448097 2442077 2440174 2402193 2392878 2432388 2439905 2458098 2483680 2479681
3791 2479681 2460957 2532325 2577775 2594248 2513180 2493511 2505655 2507573 2444484 2410813 2361376 2327033
3779 2327033 2318430 2245573 2258857 2313588 2213221 2248862 2263270 2260138 2276099 2250413 2263096 2353255
3767 2353255 2443581 2473310 2482078 2500475 2563799 2620960 2789665 2895791 3031747 3158405 3333884
3756 3333884 3560520 3856749 4100728 4433595 4699973 4956274 5240372 5509164 5705301 5863995
3746 5863995 5924053 6033190 6135878 6101803 6045718 5976791 5879733 5827320 5739316 5612404 5477516
3735 5477516 5352880 5261339 5121481 5037118 4925435 4781576 4632154 4601562 4513976 4486230
3725 4486230 4448959 4398470 4277981 4264195 4238160 4261720 4268058 4203120 4170506 4127601 4150227
$$ packed form
3803B383935K3369J8240K2553o020j903l7981r315L9510P517J8193K5582l999
3791B479681j8724P1368M5450J6473q1068j9669J2144J918o3089l3671m9437l4343
3779B327033q603p2857J3284N4731j00367L5641J4408l132J5961k5686J2683R0159
3767B353255R0326K9729Q768J8397O3324N7161J68705J06126J35956J26658J75479
3756C333884K26636K96229K43979L32867K66378K56301K84098K68792J96137J58694
3746E863995O0058J09137J02688l4075n6085o8927r7058n2413q8004j26912j34888
3735E477516j24636r1541j39858q4363j11683j43859j49422l0592q7586k7746
3725D486230l7271n0489j20489j3786k6035K3560O338o4938l2614m2905K2626
$$ plain form
3714 4150227 4033724 3949958 3967319 3980803 3913775 3860548 3850056 3807629 3802886 3814440 3817030 3846555
3702 3846555 3847264 3795330 3755943 3799432 3805468 3742936 3705757 3740288 3695258 3717536 3785667 3762593
3690 3762593 3746323 3784000 3753287 3748348 3782685 3783363 3777083 3788134 3857190 3840063 3808763 3807979 3770174
3677 3770174 3762784 3825339 3835829 3839335 3824323 3835510 3828739 3847645 3874771 3844070 3804909 3802649
3665 3802649 3849390 3925320 3929949 3916683 3903641 3896699 3944439 3989019 4066176 4129818 4173313 4190162
3653 4190162 4309935 4380177 4410478 4496640 4641305 4759454 4911936 5051319 5077858 5162550
3643 5162550 5308901 5506279 5671665 5877340 6058088 6257539 6517729 6788845 7215806 7655589
3633 7655589 8179244 8722211 9354860 10189324 11189843 12368883 13775851 15539197 17660413
$$ packed form
3714D150227j16503q3766J7361J3484o7028n3227j0492m2427m743J1554K590K9525
3702C846555P09n1934l9387M3489O036o2532l7179L4531m5030K2278O8131k3074
3690C762593j6270L7677l0713m939L4337O78o280J1051O9056j7127l1300p84l7805
3677C770174p390O2555J0490L506j5012J1187o771J8906K7126l0701l9161k260
3665C802649M6741P5930M629j3266j3042o942M7740M4580P7157O3642M3495J6849
3653D190162J19773P0242L0301Q6162J44665J18149J52482J39383K6539Q4692
3643E162550J46351J97378J65386K05675J80748J99451K60190K71116M26961M39783
3633G655589N23655N42967O32649Q34464J000519J179040J406968J763346K121216
$$ plain form
3624 17660413 20142112 22960467 26098720 29458081 32847487 36054053 38995317 41563655
3616 41563655 43520508 44845777 45623182 45869485 45710616 45322215 44867978 44541551 44444473
3607 44444473 44639617 45075755 45678427 46315561 46796296 47000988 46801423 46101653 44792276
3598 44792276 42978287 40702570 38005345 35156160 32251666 29332708 26517519 24003692
3590 24003692 21791446 19789849 18100221 16657323 15451254 14500563 13638409 12920131 12267067
3581 12267067 11717154 11272480 10851415 10543091 10303040 10007863 9758539 9619859 9478662
3572 9478662 9397555 9320990 9220955 9218112 9210378 9217451 9305698 9454070 9570944 9670956 9909116
3561 9909116 10167681 10427131 10724141 11146785 11632145 12292494 13056587 14024695 15148647
$$ packed form
3624A7660413K481699K818355L138253L359361L389406L206566K941264K568338
3616D1563655J956853J325269P77405K46303j58869l88401m54237l26427r7078
3607D4444473J95144M36138O02672O37134M80735K04692j99565o99770j309377
3598D4792276j813989k275717k697225k849185k904494k918958k815189k513827
3590B4003692k212246k001597j689628j442898j206069r50691q62154p18278o53064
3581A2267067n49913m44674m21065l08324k40051k95177k49324j38680j41197
3572I478662q1107p6565j00035k843p734P073Q8247J48372J16874J00012K38160
3561I909116K58565K59450K97010M22644M85360O60349P64093R68108J123952
$$ plain form
3552 15148647 16481053 18033338 19703125 21445754 23243800 24836983 26244722 27459259
3544 27459259 28388240 29009054 29367987 29511621 29520686 29524348 29581776 29704056 29992785 30462143
3534 30462143 31036159 31668489 32241767 32775664 33113872 33158583 32914611 32391753 31573758 30573088
3524 30573088 29357109 28138015 26868913 25730935 24652331 23619133 22839253 22246121
3516 22246121 21763298 21388703 21034610 20777454 20614253 20428767 20315887 20181303 19993964
3507 19993964 19781108 19510040 19232114 19074423 18936471 18771299 18650931 18618143 18597678 18628031
3497 18628031 18719208 18936458 19244845 19568669 20013575 20448911 20932551 21531249 22194259 23003073
3487 23003073 23991661 25089909 26342495 27717975 29358802 31242960 33315993 35631704
$$ packed form
3552A5148647J332406J552285J669787J742629J798046J593183J407739J214537
3544B7459259R28981O20814L58933J43634R065L662N7428J22280K88729M69358
3534C0462143N74016O32330N73278N33897L38208M4711k43972n22858q17995j000670
3524C0573088j215979j219094j269102j137978j078604j033198p79880n93132
3516B2246121m82823l74595l54093k57156j63201j85486j12880j34584j87339
3507A9993964k12856k71068k77926j57691j37952j65172j20368l2788k0465L0353
3497A8628031R1177K17250L08387L23824M44906M35336M83640N98698O63010Q08814
3487B3003073R88588J098248J252586J375480J640827J884158K073033K315711
$$ plain form
3479 35631704 38158088 40878790 43800876 46897227 50321240 53875192 57531173 61315571
3471 61315571 65157329 68993178 72576442 75917628 79082823 82076386 84797138 87180803
3463 87180803 89470094 91756361 94013229 96291863 98725677 101180806 103555188 105754025
3455 105754025 107685446 109324323 110452159 111051188 111059860 110531550 109482423 108005137 106189050
3446 106189050 104084145 101789974 99436483 97068158 94757453 92470837 90411382 88509950
3438 88509950 86804827 85425246 84543911 84145224 84271324 84965756 86209557 88007593 90200753
3429 90200753 92612682 95120128 97548504 99743254 101488862 102544254 102964603 102742414
3421 102742414 101956378 100583243 98841716 96850422 94685844 92474477 90431335 88623953
$$ packed form
3479C5631704K526384K720702K922086L096351L424013L553952L655981L784398
3471F1315571L841758L835849L583264L341186L165195K993563K720752K383665
3463H7180803K289291K286267K256868K278634K433814K455129K374382K198837
3455A05754025J931421J638877J127836N99029Q672n28310j049127j477286j816087
3446A06189050k104905k294171k353491k368325k310705k286616k059455j901432
3438H8509950j705123j379581q81335l98687J26100O94432J243801J798036K193160
3429I0200753K411929K507446K428376K194750J745608J055392M20349k22189
3421A02742414p86036j373135j741527j991294k164578k211367k043142j807382
$$ plain form
3413 88623953 87104769 85858246 84844929 83992833 83227334 82295032 81125658 79642350 77705830
3404 77705830 75378460 72591168 69471514 65937108 62217182 58383149 54545700 50886373
3396 50886373 47394085 44145429 41159800 38334626 35799106 33551854 31601657 29928820
3388 29928820 28497654 27246334 26189476 25311013 24677954 24262072 23902215 23719840 23748948
3379 23748948 23925294 24325024 25057200 26102524 27518783 29342796 31433488 33777849 36295289
3370 36295289 38808540 41231540 43383646 45344955 46936740 48169303 49066211 49660169
3362 49660169 49990794 50135253 50146776 50050729 50021237 50073364 50140880 50214771 50322518 50494673
3352 50494673 50663427 50688731 50515320 50216995 49590660 48744521 47573658 46132401 44469170
$$ packed form
3413H8623953j519184j246523j013317q52096p65499r32302j169374j483308j936520
3404G7705830k327370k787292l119654l534406l719926l834033l837449l659327
3396E0886373l492288l248656k985629k825174k535520k247252j950197j672837
3388B9928820j431166j251320j056858q78463o33059m15882l59857j82375K9108
3379B3748948J76346L99730P32176J045324J416259J824013K090692K344361K517440
3370C6295289K513251K423000K152106J961309J591785J232563Q96908N93958
3362D9660169L30625J44459J1523r6047k9492N2127O7516P3891J07747J72155
3352E0494673J68754K5304j73411k98325o26335q46139j170863j441257j663231
$$ plain form
3343 44469170 42491653 40310562 38054685 35808097 33503337 31228482 29149417 27265628
3335 27265628 25506330 23998372 22552804 21303369 20213696 19167388 18294390 17579496
3327 17579496 16965767 16488114 16071956 15774302 15514055 15314974 15238798 15245476 15229413 15369839
3317 15369839 15629276 15971918 16439365 17050743 17811947 18835838 20150182 21704474 23619908
3308 23619908 25989255 28819087 32062345 35794461 39799211 44114068 48593476 53175247
3300 53175247 57705434 62048959 65868127 69065047 71421224 72806683 73218708 72606974
3292 72606974 70995632 68640141 65684765 62375419 58984576 55632458 52568383 49996361
3284 49996361 48012018 46600358 45728149 45333211 45238861 45422578 45583365 45523064 45307399
$$ packed form
3343D4469170j977517k181091k255877k246588k304760k274855k079065j883789
3335B7265628j759298j507958j445568j249435j089673j046308q72998p14894
3327A7579496o13729m77653m16158k97654k60247j99081p6176O678j6063J40426
3317A5369839K59437L42642M67447O11378P61204J023891J314344J554292J915434
3308B3619908K369347K829832L243258L732116M004750M314857M479408M581771
3300E3175247M530187M343525L819168L196920K356177J385459M12025o11734
3292G2606974j611342k355491k955376l309346l390843l352118l064075k572022
3284D9996361j984343j411660q72209l94938r4350J83717J60787o0301k15665
$$ plain form
3275 45307399 44711412 43610540 42027520 40096310 37768744 35197552 32419646 29555708
3267 29555708 26802391 24234862 21819592 19670380 17792177 16148731 14709874 13481857
3259 13481857 12406681 11541526 10729585 10073644 9530894 9010942 8587442 8171726 7816980
3250 7816980 7520115 7282500 7111195 6956787 6770649 6689379 6604263 6520409 6476213 6386637
3240 6386637 6351114 6311268 6209074 6077705 5962227 5876713 5752720 5548247 5431738 5312915
3230 5312915 5172009 4991808 4824809 4727534 4676711 4619946 4563424 4524414 4487632 4479020 4441771
3219 4441771 4366321 4363929 4300372 4220118 4198004 4159121 4041600 4030787 3980251 3893615 3855381
3208 3855381 3827022 3755447 3667597 3640463 3543881 3523278 3494943 3474201 3475458 3500834 3514924 3508320
$$ packed form
3275D5307399n95987j100872j583020j931210k327566k571192k777906k863938
3267B9555708k753317k567529k415270k149212j878203j643446j438857j228017
3259A3481857j075176q65155q11941o55941n42750n19952m23500m15716l54746
3250G816980k96865k37615j71305j54408j86138q1270q5116q3854m4196q9576
3240F386637l5523l9846j02194j31369j15478q5514j23993k04473j16509j18823
3230E312915j40906j80201j66999r7275n0823n6765n6522l9010l6782q612l7249
3219D441771p5450k392o3557q0254k2114l8883j17521j0813n0536q6636l8234
3208C855381k8359p1575q7850k7134r6582k0603k8335k0742J257K5376J4090o604
$$ plain form
3196 3508320 3464934 3483421 3491740 3559346 3595945 3577377 3551162 3605358 3665426 3698804 3722306 3782721
3184 3782721 3801284 3819713 3824305 3863181 3936115 3978665 3992092 4011812 4011081 4044875 4082188 4074212
3172 4074212 4119059 4107493 4138705 4180935 4244461 4316805 4377336 4413965 4522966 4638102 4765075
3161 4765075 4933708 5026334 5110068 5222275 5337222 5436491 5505337 5543804 5650749 5795152
3151 5795152 5904531 6049038 6247320 6527585 6845454 7266390 7779178 8270928 8708725 9083194
3141 9083194 9306248 9442974 9438870 9254578 9133182 8958027 8790051 8612406 8502095 8491428
3131 8491428 8546035 8671890 8894908 9151205 9469289 9793491 10101039 10361309 10555272 10750221
3121 10750221 10891601 11015474 11203434 11366410 11633226 11997228 12318898 12758618 13252335
$$ packed form
3196C508320m3386J8487Q319O7606L6599j8568k6215N4196O0068L3378K3502O0415
3184C782721J8563J8429M592L8876P2934M2550J3427J9720p31L3794L7313p976
3172D074212M4847j1566L1212M2230O3526P2344O0531L6629J09001J15136J26973
3161D765075J68633R2626Q3734J12207J14947R9269O8846L8467J06945J44403
3151E795152J09379J44507J98282K80265L17869M20936N12788M91750M37797L74469
3141I083194K23054J36726m104j84292j21396j75155j67976j77645j10311j0667
3131H491428N4607J25855K23018K56297L18084L24202L07548K60270J93963J94949
3121A0750221J41380J23873J87960J62976K66816L64002L21670M39720M93717
$$ plain form
3112 13252335 13730686 14095089 14366548 14559927 14642610 14660808 14658228 14687695 14732976 14787723 14960233
3101 14960233 15281803 15763704 16373338 17155144 18119667 19358559 20656513 21946680 23200724
3092 23200724 24292777 25235680 26108186 26918861 27778440 28711016 29856143 31051080 32441729
3083 32441729 34053383 35756975 37826880 40398514 43473378 46929012 50807313 54985112
3075 54985112 59565810 64681634 70593027 77824710 87532176 101397595 121550876 149767804
3067 149767804 185393795 223879199 258460750 283747954 297861242 301346096 295295991
3060 295295991 282180431 267119648 255082844 248112995 244700605 241195752 234999784 225552889
3052 225552889 213100673 197000743 177544551 156667368 136211464 117233790 100327323
$$ packed form
3112A3252335M78351L64403K71459J93379Q2683J8198k580K9467M5281N4747J72510
3101A4960233L21570M81901O09634P81806R64523J238892J297954J290167J254044
3092B3200724J092053R42903Q72506Q10675Q59579R32576J145127J194937J390649
3083C2441729J611654J703592K069905K571634L074864L455634L878301M177799
3075E4985112M580698N115824N911393P231683R707466J3865419K0153281K8216928
3067A49767804L5625991L8485404L4581551K5287204J4113288L484854o050105
3060B95295991j3115560j5060783j2036804o969849l412390l504853o195968r446895
3052B25552889j2452216j6099930j9456192k0877183k0455904j8977674j6906467
$$ plain form
3045 100327323 85690207 73466400 63693106 55968395 49870174 44904409 40662172 37042574
3037 37042574 33886606 31099249 28664180 26572204 24737014 23205147 21910246 20815822
3029 20815822 19782409 18896727 18092246 17318185 16623385 15993237 15413422 14863344 14377861
3020 14377861 13906036 13472820 13093163 12720880 12321580 11995663 11700308 11373655 11006068
3011 11006068 10620904 10289375 10028091 9725749 9431354 9160824 8933528 8630936 8357743
3002 8357743 8101587 7875904 7625276 7372003 7155956 7027384 6817141 6603446 6466858 6315387
2992 6315387 6187160 6057494 5939094 5797993 5720165 5571575 5502567 5428997 5314020 5194293
2982 5194293 5018441 4915524 4820280 4729417 4631700 4498271 4403867 4339902 4254029 4193497 4061188
$$ packed form
3045A00327323j4637116j2223807r773294p724711o098221m965765m242237l619598
3037C7042574l155968k787357k435069k091976j835190j531867j294901j094424
3029B0815822j033413q85682q04481p74061o94800o30148n79815n50078m85483
3020A4377861m71825m33216l79657l72283l99300l25917k95355l26653l67587
3011A1006068l85164l31529k61284l02342k94395k70530k27296l02592k73193
3002H357743k56156k25683k50628k53273k16047j28572k10243k13695j36588j51471
2992F315387j28227j29666j18400j41101p7828j48590o9008p3570j14977j19727
2982E194293j75852j02917r5244r0863r7717j33429r4404o3965q5873o0532j32309
$$ plain form
2971 4061188 3835867 3748454 3691252 3617337 3560570 3477895 3489861 3458688 3349007 3314838 3286975
2960 3286975 3213153 3185561 3176452 3175626 3119335 3091348 3008602 2955188 2935807 2861185 2829838 2811770
2948 2811770 2743686 2687124 2663895 2620164 2521455 2446839 2436232 2423271 2377559 2350186 2308153
2937 2308153 2266956 2235508 2237972 2190648 2143598 2128792 2062635 2022772 2050666 2061378 1993426 1973578
2925 1973578 1973566 1948819 1916013 1891670 1815650 1760339 1766812 1784757 1752500 1736824 1748393 1701751
2913 1701751 1638888 1615429 1567927 1566355 1491212 1374966 1361060 1409541 1482149 1444631 1450447 1500880
2901 1500880 1440436 1415506 1453231 1373919 1358986 1343381 1289559 1265869 1253084 1278521 1228687
2890 1228687 1214475 1259468 1237594 1228786 1205553 1100565 1163663 1172799 1171488 1150864 1088498 1065004
$$ packed form
2971D061188k25321q7413n7202p3915n6767q2675J1966l1173j09681l4169k7863
2960C286975p3822k7592r109q26n6291k7987q2746n3414j9381p4622l1347j8068
2948B811770o8084n6562k3229m3731r8709p4616j0607j2961m5712k7373m2033
2937B308153m1197l1448K464m7324m7050j4806o6157l9863K7894J0712o7952j9848
2925A973578j2k4747l2806k4343p6020n5311O473J7945l2257j5676J1569m6642
2913A701751o2863k3459m7502j572p5143j16246j3906M8481P2608l7518N816N0433
2901A500880o0444k4930L7725p9312j4933j5605n3822k3690j2785K5437m9834
2890A228687j4212M4993k1874q808k3233j04988O3098R136j311k0624o2366k3494
$$ plain form
2878 1065004 1025811 1008265 1021262 1026759 1025995 1018397 965138 927987 964648 937045 899955 894028
2866 894028 883790 856140 836949 814466 842511 839185 878638 900487 854120 869989 864802 858462
2854 858462 891151 894487 863160 833358 771972 760880 732597 746363 764620 707901 675744 697461
2842 697461 707520 718909 659545 662102 667899 659513 633829 622925 608627 594179 607401 621568
2830 621568 635560 650082 679453 708125 751716 712965 737695 748130 721462 695706 714622 771728
2818 771728 749277 682283 653533 688442 709430 705670 703904 720227 730204 641024 630008 646154
2806 646154 700184 715136 682786 736637 788951 763589 735602 705807 740496 757920 741558 762907
2794 762907 745557 788444 826380 860467 847949 885460 916575 1001491 1090605 1240976 1424533
$$ packed form
2878A065004l9193j7546J2997N497p64p598n3259l7151L6661k7603l7090n927
2866H94028j0238k7650j9191k2483K8045l326L9453K1849m6367J5869n187o340
2854H58462L2689L336l1327k9802o1386j1092k8283J3766J8257n6719l2157K1717
2842F97461J0059J1389n9364K557N797q386k5684j0904j4298j4448J3222J4167
2830F21568J3992J4522K9371K8672M3591l8751K4730J0435k6668k5756J8916N7106
2818G71728k2451o6994k8750L4909K0988l760j766J6323R977q9180j1016J6146
2806F46154N4030J4952l2350N3851N2314k5362k7987k9795L4689J7424j6362K1349
2794G62907j7350M2887L7936L4087j2518L7511L1115Q4916Q9114J50371J83557
$$ plain form
2783 1424533 1598569 1725641 1818637 1856225 1916920 1913460 1862175 1778977 1778055 1760681 1752637 1661737
2771 1661737 1598015 1579266 1510371 1478523 1329599 1244333 1175480 1054077 972872 916567 822533
2760 822533 761314 672316 653941 636052 642498 611385 621585 621651 601268 623152 623291 570030 546390
2747 546390 498612 482446 499821 447312 433548 412469 393250 405932 384596 381263 359556 389596
2735 389596 432759 438710 432156 367477 390415 354396 355440 369861 364320 323449 311901 386498
2723 386498 389427 390033 399377 390177 379280 390912 337354 325609 304921 286174 269607 296524 300159
2710 300159 290150 278899 275400 277591 278484 306553 291650 284540 250999 258917 291971 306379 335757
2697 335757 299521 299057 289693 252581 256661 257711 304549 305185 276250 317272 346459 268118 232912
$$ packed form
2783A424533J74036J27072R2996L7588O0695l460n1285q3198r22j7374q044r0900
2771A661737o3722j8749o8895l1848j48924q5266o8853j21403q1205n6305r4034
2760H22533o1219q8998j8375j7889O446l1113J0200O6k0383K1884J39n3261k3640
2747E46390m7778j6166J7375n2509j3764k1079j9219J2682k1336l333k1707L0040
2735C89596M3163N951o554o4679K2938l6019J044J4421n541m0871j1548P4597
2723C86498K929O06R344r200j0897J1632n3558j1745k0688j8747j6567K6917L635
2710C00159j0009j1251l499K191Q93K8069j4903p110l3541P918L3054J4408K9378
2697C35757l6236m64r364l7112M080J050M6838O36k8935M1022K9187p8341l5206
$$ plain form
2684 232912 224010 239891 284162 273710 236434 280547 293969 239866 194146 211259 232752 222761
2672 222761 243398 243914 178436 188021 184864 227966 283155 338278 356057 312487 302852 337440 334202
2659 334202 358939 371736 338573 365824 326874 318681 279806 299767 364915 375380 356992 344846
2647 344846 340154 334643 295273 322493 354093 330138 314843 313192 305315 327240 282656 284952 306794
2634 306794 328901 335488 318181 323184 342156 324833 268009 314755 302354 267548 292925 302934
2622 302934 280970 239008 259241 306150 323009 324983 278343 307525 347589 295311 239090 270159
2610 270159 269592 255038 235896 230792 222196 229296 234059 232747 219663 237099 224673 220266 195414
2597 195414 215458 262177 255022 245472 207945 196695 185791 168809 216010 281142 313403 324774
$$ packed form
2684B32912q902J5881M4271j0452l7276M4113J3422n4103m5720J7113K1493r991
2672B22761K0637N16o5478R585l157M3102N5189N5123J7779m3570r635L4588l238
2659C34202K4737J2797l3163K7251l8950q193l8875J9961O5148J0465j8388j2146
2647C44846m692n511l9370K7220L1600k3955j5295j651p877K1925m4584K296K1842
2634C06794K2107O587j7307N003J8972j7323n6824M6746j2401l4806K5377J0009
2622C02934k1964m1962K0233M6909J6859J974m6640K9182M0064n2278n6221L1069
2610B70159n67j4554j9142n104q596P100M763j312j3084J7436j2426m407k4852
2597A95414K0044M6719p155r550l7527j1250j0904j6982M7201O5132L2261J1371
$$ plain form
2585 324774 294665 300913 303074 366092 391977 390410 371332 376516 351091 353470 376455 359487 388156
2572 388156 390346 360313 305031 290495 283430 232687 262996 254222 235715 237164 259546 204684
2560 204684 173985 201178 228748 272031 272119 260175 232022 235587 248046 202029 203702 240528 293070
2547 293070 274648 265618 270754 200455 192133 170581 180116 240962 205147 182953 197834 214610
2535 214610 203192 155088 198262 228277 265055 271519 257653 263031 245483 257301 258657 276430
2523 276430 302020 259761 237104 283982 351504 306265 288367 281602 262081 264761 276617 276417
2511 276417 289657 274276 270853 244724 223509 179432 205197 184807 220472 253420 240519 252056
2499 252056 182576 165194 214715 256092 236370 173715 190989 202111 156467 140402 135556 164428
$$ packed form
2585C24774l0109O248K161O3018K5885j567j9078N184k5425K379K2985j6968K8669
2572C88156K190l0033n5282j4536p065n0743L0309q774j8507J449K2382n4862
2560B04684l0699K7193K7570M3283Q8j1944k8153L565J2459m6017J673L6826N2542
2547B93070j8422r030N136p0299q322k1552R535O0846l5815k2194J4881J6776
2535B14610j1418m8104M3174L0015L6778O464j3866N378j7548J1818J356J7773
2523B76430K5590m2259k2657M6878O7522m5239j7898o765j9521K680J1856k00
2511B76417J3240j5381l423k6129k1215m4077K5765k0390L5665L2948j2901J1537
2499B52056o9480j7382M9521M1377j9722o2655J7274J1122m5644j6065m846K8872
$$ plain form
2487 164428 189945 181799 105483 153119 178328 162372 141700 213130 221247 171415 149033 138669
2475 138669 114732 85098 130773 134523 133232 169093 166102 155828 197118 194705 195243 178615 187370
2462 187370 197786 184565 211284 159217 152893 200187 194483 254018 220387 208493 224394 222358
2450 222358 276486 280595 285512 289123 227312 247825 286132 243757 247181 268430 268716 238239 200669
2437 200669 221397 241379 232781 293843 305552 265981 210943 185430 221299 277996 306680 275867
2425 275867 295393 298102 259247 267727 257301 278036 322896 348812 288206 291967 300512 281723
2413 281723 268227 285861 308187 311320 285252 268961 320450 382940 390035 340011 298312 301318
2401 301318 317924 267447 234355 287097 322085 282151 273067 284293 329748 341702 346232 307887
$$ packed form
2487A64428K5517q146p6316M7636K5209j5956k0672P1430Q117m9832k2382j0364
2475A38669k3937k9634M5675L750j291L5861k991j0274M1290k413N38j6628Q755
2462A87370J0416j3221K6719n2067o324M7294n704N9535l3631j1894J5901k036
2450B22358N4128M109M917L611o1811K0513L8307m2375L424K1249K86l0477l7570
2437B00669K0728J9982q598O1062J1709l9571n5038k5513L5869N6697K8684l0813
2425B75867J9526K709l8855Q480j0426K0735M4860K5916o0606L761Q545j8789
2413B81723j3496J7634K2326L133k6068j6291N1489O2490P095n0024m1699L006
2401C01318J6606n0477l3092N2742L4988l9934r084J1226M5455J1954M530l8345
$$ plain form
2389 307887 345248 331686 305191 265642 277232 335285 345468 349253 320190 334116 345643 330331
2377 330331 343673 426646 402400 438323 423672 400418 420614 458130 445544 410913 423497 459829
2365 459829 422213 451736 430078 406502 446685 449736 491935 564718 572605 512598 499957 521123
2353 521123 572281 593632 650575 667535 664431 685793 643892 642201 690541 724121 782781 805200
2341 805200 870690 877708 920109 1007091 1107937 1154066 1216214 1285508 1380903 1452354 1563582
2330 1563582 1705546 1924218 2214903 2462855 2698469 3016457 3309472 3525544 3744872 4152161
2320 4152161 4685186 5418221 6279146 7451553 9392654 13008312 18794596 25991211 32508093
2311 32508093 36506913 37600535 37752066 36251727 32101513 27662476 23152703 19003207
$$ packed form
2389C07887L7361j3562k6495l9549J1590N8053J0183L785k9063J3926J1527j5312
2377C30331J3342Q2973k4246L5923j4651k3254K0196L7516j2586l4631J2584L6332
2365D59829l7616K9523k1658k3576M0183L051M2199P2783P887o0007j2641K1166
2353E21123N1158K1351N6943J6960l104K1362m1901j691M8340L3580N8660K2419
2341H05200O5490P018M2401Q6982J00846M6129O2148O9294R5395P1451J11228
2330A563582J41964K18672K90685K47952K35614L17988K93015K16072K19328M07289
2320D152161N33025P33035Q60925J172407J941101L615658N786284P196615O516882
2311C2508093L998820J093622J51531j500339m150214m439037m509773m149496
$$ plain form
2303 19003207 15448773 12520089 9941535 8052120 6911814 6277608 5784398 5329771 4896427
2294 4896427 4511779 4168858 3740184 3275247 2901458 2628634 2389086 2151121 1986484 1869060
2284 1869060 1729332 1638740 1531203 1515422 1474149 1432184 1390237 1320045 1309797 1280993 1263597
2273 1263597 1220793 1196341 1160143 1087701 1060432 1034218 1011085 937339 889455 862604 933971
2262 933971 901495 820554 804291 790673 799300 806497 807783 738791 714341 733427 651388 618854
2250 618854 609479 603214 602350 572659 597968 564636 536716 551365 563947 542897 518496 498193
2238 498193 482525 481520 443534 432751 441813 459550 425774 393727 419728 443250 439919 440129 391013
2225 391013 404115 374812 355268 333779 326934 316892 312778 288929 280762 243313 307328 344524
$$ packed form
2303A9003207l554434k928684k578554j889415j140306o34206m93210m54627m33344
2294D896427l84648l42921m28674m64937l73789k72824k39548k37965j64637j17424
2284A869060j39728r0592j07537j5781m1273m1965m1947p0192j0248k8804j7396
2273A263597m2804k4452l6198p2442k7269k6214k3133p3746m7884k6851P1367
2262I33971l2476q0941j6263j3618Q627P197J286o8992k4450J9086q2039l2534
2250F18854r375o265q64k9691K5309l3332k7920J4649J2582k1050k4401k0303
2238D98193j5668j005l7986j0783R062J7737l3776l2047K6001K3522l331K10m9116
2225C91013J3102k9303j9544k1489o845j0042m114k3849q167l7449O4015L7196
$$ plain form
2213 344524 303206 318764 354065 351995 312611 297072 297592 306953 302594 281293 249811 338754 317931
2200 317931 225088 259135 312863 320113 275604 277423 290520 285012 248819 206221 237618 266990
2188 266990 240938 221533 223647 250894 266636 245255 282418 263201 269604 255330 242031 246546
2176 246546 230077 229160 216426 200226 216604 203828 226070 276846 225475 229892 267438 225294
2164 225294 231870 243694 254590 214526 201502 223302 179885 157056 167803 185038 225646 211546
2152 211546 186436 150798 189506 199666 121397 138545 210855 154853 145840 150288 159358 141529
2140 141529 165351 148982 152876 195805 173679 126672 143758 174846 139129 106076 119116 173768
2128 173768 169823 176328 159823 128895 143935 188712 150282 125984 146313 144871 109995 111388
$$ packed form
2213C44524m1318J5558L5301k070l9384j5539N20R361m359k1301l1482Q8943k0823
2200C17931r2843L4047N3728P250m4509J819J3097n508l6193m2598L1397K9372
2188B66990k6052j9405K114K7247J5742k1381L7163j9217O403j4274j3299M515
2176B46546j6469r17j2734j6200J6378j2776K2242N0776n1371M417L7546m2144
2164B25294O576J1824J0896m0064j3024K1800m3417k2829J0747J7235M0608j4100
2152B11546k5110l5638L8708J0160p8269J7148P2310n6002r013M448R070j7829
2140A41529K3822j6369L894M2929k2126m7007J7086L1088l5717l3053J3040N4652
2128A73768l945O505j6505l0928J5040M4777l8430k4298K0329j442l4876J393
$$ plain form
2116 111388 138051 92624 85865 84657 71702 75529 92009 111696 81006 166993 196990 183227
2104 183227 153691 120144 115835 82778 120247 143065 93021 96675 90775 97274 130573 152056
2092 152056 126932 164354 134578 105091 121677 120484 88592 48738 48901 89252 107542 102748
2080 102748 109957 119473 115206 151291 174002 135272 96505 90154 128269 110017 80870 59871
2068 59871 112147 111645 103705 91648 89501 90513 73765 118409 167299 183410 121528 67361 99585
2055 99585 155243 139005 121051 115705 167309 164134 133121 144309 191838 195815 210473 243904
2043 243904 304418 315423 297744 224710 193785 236621 257566 237717 176581 164734 158176 174520
2031 174520 180567 239042 186482 145085 122773 72939 82888 112520 96643 47060 79607 157750
$$ packed form
2116A11388K6663m5427o759j208j2955L827J6480J9687l0690Q5987K9997j3763
2104A83227k9536l3547m309l3057L7469K2818n0044L654n900O499L3299K1483
2092A52056k5124L7422k9776k9487J6586j193l1892l9854J63M0351J8290m794
2080A02748P209R516m267L6085K2711l8730l8767o351L8115j8252k9147k0999
2068E9871N2276n02p940j2057k147J012j6748M4644M8890J6111o1882n4167L2224
2055I9585N5658j6238j7954n346N1604l175l1013J1188M7529L977J4658L3431
2043B43904O0514J1005j7679p3034l0925M2836K0945j9849o1136j1847o558J6344
2031A74520O047N8475n2560m1397k2312m9834R949K9632j5877m9583L2547P8143
$$ plain form
2019 157750 137020 128096 111487 76074 138353 135426 117445 101612 111360 123301 78471 114833
2007 114833 98765 94627 92504 78677 99493 134869 124779 111198 119291 96545 100659 88693
1995 88693 72036 47606 27210 76883 124475 102786 78652 60657 70813 75984 92585 117241
1983 117241 80120 112936 141142 81188 8925 9324 20792 66423 91622 139253 190866 136312
1971 136312 19626 30904 87335 95455 76624 40590 32830 52403 61046 21202 5569 50605
1959 50605 66985 87894 79390 76538 88844 46209 34029 43485 101092 69349 20043 -8174
1947 -8174 34046 62937 63858 56752 83562 120840 90987 83222 92793 72760 20088 -34098 1099
1934 1099 80559 91718 50404 -8373 -32402 81046 130440 85299 56322 64936 72902 36004
$$ packed form
2019A57750k0730q924j6609l5413O2279k927j7981j5833R748J1941m4830L6362
2007A14833j6068m138k123j3827K0816L5376j0090j3581Q093k2746M114j1966
1995H8693j6657k4430k0396M9673M7592k1689k4134j7995J0156N171J6601K4656
1983A17241l7121L2816K8206n9954p2263L99J1468M5631K5199M7631N1613n4554
1971A36312j16686J1278N6431Q120j8831l6034p760J9573Q643l9844j5633M5036
1959E0605J6380K0909q504k852J2306m2635j2180R456N7607l1743m9306k8217
1947h174M2220K8891R21p106K6810L7278k9853p765R571k0033n2672n4186L5197
1934A099P9460J1159m1314n8777k4029J13448M9394m5141k8977Q614P966l6898
$$ plain form
1922 36004 -7844 26860 48428 24491 58268 51743 59438 54155 26319 57656 110277 136453
1910 136453 95063 76798 80239 42956 63245 70239 61605 28236 41014 45154 108281 134282
1898 134282 103768 118283 117597 98812 68334 37201 73206 96370 48635 78464 64025 36321
1886 36321 49204 76317 94353 123144 112081 83937 45520 34415 53378 84342 109517 32156
1874 32156 -27073 8688 42821 22303 19533 65064 55273 56597 86504 99143 123946 97433
1862 97433 39063 24064 74624 74265 11306 13683 76445 71035 47464 25956 30891 77110 49963
1849 49963 38212 71246 49625 -1111 -50988 -29932 52726 66844 31599 23611 22451 38321
1837 38321 66391 46696 63529 50291 53253 47183 43292 34739 27169 16954 -19478 11153 76528
$$ packed form
1922C6004m3848L4704K1568k3937L3777o525P695n283k7836L1337N2621K6176
1910A36453m1390j8265L441l7283K0289O994q634l3369J2778M140O3127K6001
1898A34282l0514J4515o86j8785l0478l1133L6005K3164m7735K9829j4439k7704
1886C6321J2883K7113J8036K8791j1063k8144l8417j1105J8963L0964K5175p7361
1874C2156n9229L5761L4133k0518k770M5531r791J324K9907J2639K4803k6513
1862I7433n8370j4999N0560l59o2959K377O2762n410k3571k1508M935M6219k7147
1849D9963j1751L3034k1621n0736m9877K1056Q2658J4118l5245p988j160J5870
1837C8321K8070j9695J6833j3238K962o070l891q553p570j0215l6432L0631O5375
$$ plain form
1824 76528 90793 61704 26641 41275 72958 99238 76374 39513 36341 34239 37599 60279
1812 60279 47049 66439 103753 101202 101354 89108 32676 25515 95886 124882 84800 59478 34631
1799 34631 -1783 38143 7461 66480 82054 101718 97950 85651 84944 58191 49515 23402 69922
1786 69922 91996 72936 34353 -15682 -12252 32092 45442 54747 77311 90946 47916 24575
1774 24575 60008 114085 88261 26188 40783 21760 24505 35427 10740 33377 73944 37876
1762 37876 24756 40347 25919 16352 10076 19871 56132 57838 16104 -31744 15192 88713 72688
1749 72688 13088 35223 79180 52238 79967 50516 -22090 16953 47972 27983 18232 36012
1737 36012 11624 -50529 -23473 27107 69134 97358 60880 94184 104236 85205 66797 42085
$$ packed form
1824G6528J4265k9089l5063J4634L1683K6280k2864l6861l172k102L360K2680
1812F0279j3230J9390L7314k551J52j2246n6432p161P0371K8996m0082k5322k4847
1799C4631l6414L9926l0682N9019J5574J9664l768j2299p07k6753q676k6113M6520
1786F9922K2074j9060l8583n0035L430M4344J3350R305K2564J3635m3030k3341
1774B4575L5433N4077k5824o2073J4595j9023K745J0922k4687K2637M0567l6068
1762C7876j3120J5591j4428r567o276R795L6261J706m1734m7848M6936P3521j6025
1749G2688n9600K2135M3957k6942K7729k9451p2606L9043L1019j9989r751J7780
1737C6012k4388o2153K7056N0580M2027K8224l6478L3304J0052j9031j8408k4712
$$ plain form
1725 42085 46115 21915 18225 75573 36663 4390 8961 9394 52356 21251 31386 46750 39193
1712 39193 53080 84929 71753 86633 58069 24906 31603 92053 141525 72338 55317 56262
1700 56262 41514 30274 7392 54356 32536 42456 65319 28805 50818 43400 30471 74822
1688 74822 115918 102387 97507 34531 4130 54171 88232 93726 47442 -20509 -12679 31594
1676 31594 46896 63621 76574 86399 80043 85848 90301 100540 88655 49816 36552 48557 76442
1663 76442 75765 36136 37835 83153 90407 19959 25209 -13496 -25518 18017 34026 51678 60578
1650 60578 -3355 4346 18006 57902 8973 -7366 33666 16634 44497 36339 18326 55587
1638 55587 77860 79990 125198 75884 57612 53570 5137 -11193 21463 3328 -6180 44175
$$ packed form
1725D2085M030k4200l690N7348l8910l2273M571M33M2962l1105J0135J5364p557
1712C9193J3887L1849j3176J4880k8564l3163O697O0450M9472o9187j7021R45
1700E6262j4748j1240k2882M6964k1820R920K2863l6514K2013p418j2929M4351
1688G4822M1096j3531m880o2976l0401N0041L4061N494m6284o7951P830M4273
1676C1594J5302J6725J2953R825o356N805M453J0239j1885l8839j3264J2005K7885
1663G6442o77l9629J699M5318P254p0448N250l8705j2022M3535J6009J7652Q900
1650F0578o3933P701J3660L9896m8929j6339M1032j7032K7863q158j8013L7261
1638E5587K2273K130M5208m9314j8272m042m8433j6330L2656j8135r508N0355
$$ plain form
1626 44175 102195 105867 128224 77257 43783 69227 71156 77762 62462 -18755 -35223 -1452
1614 -1452 50638 32588 33628 35658 86531 103715 48646 28165 23178 -4797 -235 54584 40346
1601 40346 27258 5727 -17147 23904 44574 100291 134808 73829 28864 23569 47399 52746
1589 52746 28242 30831 67898 32745 -6993 -20070 29432 40210 47142 36027 24184 36539
1577 36539 -2992 -7601 -18258 51272 63752 -106 -18298 43149 48711 50647 66471 49500
1565 49500 70519 43897 52097 59402 36685 -24460 -81616 -43809 46142 65001 79789 80438 24231
1552 24231 18569 22016 31442 60649 49397 43092 28275 3520 -13452 32167 68615 44481 38746
1539 38746 36560 22815 -15262 -37391 35718 110682 86405 59695 26254 20284 -14762 9900
$$ packed form
1626D4175N8020L672K2357n0967l3474K5444J929O606j5300q1217j6468L3771
1614a452N2090j8050J040K030N0873J7184n5069k0481m987k7975M562N4819j4238
1601D0346j3088k1531k2874M1051K0670N5717L4517o0979m4965n295K3830N347
1589E2746k4504K589L7067l5153l9738j3077M9502J0778O932j1115j1843J2355
1577C6539l9531m609j0657O9530J2480o3858j8192O1447N562J936J5824j6971
1565D9500K1019k6622Q200P305k2717o1145n7156L7807Q9951J8859J4788O49n6207
1552B4231n662L447R426K9207j1252o305j4817k4755j6972M5619L6448k4134n735
1539C8746k186j3745l8077k2129P3109P4964k4277k6710l3441n970l5046K4662
$$ plain form
1527 9900 16148 37539 53517 17821 30579 41075 13905 -24999 26440 42700 46618 14777
1515 14777 -5672 9328 10428 -10401 37709 60492 58728 57065 42500 68174 79281 11743
1503 11743 29762 38455 17806 -4541 12947 -31049 -32814 -29801 15152 30816 48799 77624
1491 77624 17334 26196 22775 52876 101460 62202 31690 -2051 -32920 -21775 -31169 -6052
1479 -6052 23349 14986 8072 14896 30491 30592 20109 59434 83504 78021 10616 -11278 -14680
1466 -14680 19288 53282 82555 64456 89468 70124 40059 26622 56966 77803 67517 59602
1454 59602 31843 -6771 42411 14413 -648 27992 32223 92322 61594 53357 57858 84980
1442 84980 58687 36581 17199 31917 25687 56812 41738 -692 11970 24499 52517 71794
$$ packed form
1527I900O248K1391J5978l5696J2758J0496k7170l8904N1439J6260L918l1841
1515A4777k0449J5000J100k0829M8110K2783j764j663j4565K5674J1107o7538
1503A1743J8019Q693k0649k2347J7488m3996j765L013M4953J5664J7983K8825
1491G7624o0290Q862l421L0101M8584l9258l0512l3741l0869J1145r394K5117
1479f052K9401q363o914O824J5595J01j0483L9325K4070n483o7405k1894l402
1466a4680L3968L3994K9273j8099K5012j9344l0065j3437L0344K0837j0286p915
1454E9602k7759l8614M9182k7998j5061K8640M231O0099l0728q237M501K7122
1442H4980k6293k2106j9382J4718o230L1125j5074m2430J2662J2529K8018J9277
$$ plain form
1430 71794 83354 46969 24386 22080 28074 -10083 -512 -22151 -23155 -20198 -33272 10473 22138
1417 22138 37850 46869 87691 73014 36042 12745 4559 18714 4157 -4045 -9586 4243 -19715
1404 -19715 -8217 45077 40356 44030 55532 47929 46478 7347 -4063 15719 54123 5789 26210
1391 26210 62037 34680 -10798 18322 21929 36184 20590 49548 23205 39031 11172 -4824
1379 -4824 62715 41364 36109 4010 33664 20635 -11265 -631 84425 72978 34348 47781
1367 47781 42561 7345 -38611 -90735 -36819 27898 53852 8601 11925 -3338 -25293 9496
1355 9496 36497 30158 59220 61768 105033 66634 24365 12054 17474 58063 75030 48037 58224
1342 58224 43685 -13722 12799 66897 60438 9196 8848 -26857 -12033 18333 -2455 -43465
$$ packed form
1430G1794J1560l6385k2583k306N994l8157R571k1639j004K957j3074M3745J1665
1417B2138J5712R019M0822j4677l6972k3297q186J4155j4557q202n541J3829k3958
1404a9715J1498N3294m721L674J1502p603j451l9131j1410J9782L8404m8334K0421
1391B6210L5827k7357m5478K9120L607J4255j5594K8958k6343J5826k7859j5996
1379d824O7539k1351n255l2099K9654j3029l1900J0634Q5056j1447l8630J3433
1367D7781n220l5216m5956n2124N3916O4717K5954m5251L324j5263k1955L4789
1355I496K7001o339K9062K548M3265l8399m2269j2311N420M0589J6967k6993J0187
1342E8224j4539n7407K6521N4098o459n1242l48l5705J4824L0366k0788m1010
$$ plain form
1330 -43465 18549 40193 19317 12046 -2700 16845 26830 -3082 5197 -43204 -40420 -48584 -10692
1317 -10692 51137 50840 49795 -15181 9651 -5714 22494 51150 45656 15076 12652 43487 15198
1304 15198 -23218 -30739 -28455 13795 2364 -4711 13682 28462 -34713 -34824 96 35448 26046
1291 26046 -13659 1527 -24200 9265 -16343 -37230 35039 88827 49231 11119 -27355 -21651
1279 -21651 11626 31768 11291 -32484 -9653 -29109 -10930 -3190 27675 32675 41063 63333
1267 63333 37634 43289 42284 37594 -20540 29422 49292 18847 3862 -26531 -46331 27275
1255 27275 44995 28361 36903 35504 15765 5875 10252 66363 55541 47634 39404 31873 35111
1242 35111 16802 -22528 -21265 -703 62581 87846 90582 85111 62246 74048 66639 49356 25441
$$ packed form
1330d3465O2014K1644k0876p271j4746J9545R985k9912Q279m8401K784q164L7892
1317a0692O1829k97j045o4976K4832j5365K8208K8656n494l0580k424L0835k8289
1304A5198l8416p521K284M2250j1431p075J8393J4780o3175j11L4920L5352r402
1291B6046l9705J5186k5727L3465k5608k0887P2269N3788l9596l8112l8474N704
1279b1651L3277K0142k0477m3775K2831j9456J8179P740L0865N000Q388K2270
1267F3333k5699N655j005m690n8134M9962J9870l0445j4985l0393j9800P3606
1255B7275J7720j6634Q542j399j9739r890M377N6111j0822p907q230p531L238
1242C5111j8309l9330J263K0562O3284K5265K736n471k2865J1802p409j7283k3915
$$ plain form
1229 25441 37491 30909 -1179 -1037 8149 -6486 39403 34796 33244 64357 33608 -13735 34721
1216 34721 20863 -13152 3447 165 10962 10544 4288 -23347 6981 64561 53982 45309 36093
1203 36093 39702 9004 -22414 -25970 25221 9483 -6213 3933 -41662 -14113 44793 82167
1191 82167 64484 1731 1365 27401 29909 27585 830 20391 35779 -20166 -6640 26584 40598
1178 40598 38880 -11936 -1976 21594 27453 19065 368 29100 21084 18872 -874 -21134 4817
1165 4817 41607 28040 27290 58954 31190 32933 30289 17421 16958 46349 12787 21091 65040
1152 65040 55875 3979 -17033 5318 39470 65811 101858 20722 -14203 32106 -4225 20382
1140 20382 11932 48508 27704 11174 12402 -53178 -14982 37541 -15668 896 34866 57295
$$ packed form
1229B5441J2050o582l2088J42R186j4635M5889m607j552L1113l0749m7343M8456
1216C4721j3858l4015J6599l282J0797m18o256k7635L0328N7580j0579q673r216
1203C6093L609l0698l1418l556N1191j5738j5696J0146m5595K7549N8906L7374
1191H2167j7683o2753l66K6036K508k324k6755J9561J5388n5945J3526L3224J4014
1178D0598j718n0816R960K3570N859q388j8697K8732q016k212j9746k0260K5951
1165D817L6790j3567p50L1664k7764J743k644j2868m63K9391l3562Q304M3949
1152F5040r165n1896k1012K2351L4152K6341L6047q1136l4925M6309l6331K4607
1140B0382q450L6576k0804j6530J228o5580L8196N2523n3209J6564L3970K2429
$$ plain form
1128 57295 -9110 -43512 -12755 4578 37499 -339 -29689 -370 20711 23479 11379 -11876
1116 -11876 52716 47712 -3962 16392 13346 -3508 15836 13021 -2130 9671 -5797 -32197
1104 -32197 -27400 -7136 -12333 34884 -14975 -49415 -55812 -21908 -36813 -75583 -29210 -23903 -34876
1091 -34876 -70524 -35023 -14142 -4386 -27067 -12509 10258 33544 29506 8632 5574 -4760
1079 -4760 -13555 20738 9045 -33763 8671 55882 46083 -37835 7184 59640 63250 38050 13287
1066 13287 2283 -3024 -7678 -29083 16601 76982 45583 -38498 -18240 5649 31763 65675
1054 65675 8942 -8985 40001 -1799 -17679 -42191 1502 27586 22352 33073 14320 6521
1042 6521 14592 -13739 7468 43532 42514 23121 -4523 -9652 27978 51806 -865 14865 -19217
$$ packed form
1128E7295o6405l4402L0757J7333L2921l7838k9350K9319K1081K768j2100k3255
1116a1876O4592n004n1674K0354l046j6854J9344k815j5151J1801j5468k6400
1104c2197M797K0264n197M7217m9859l4440o397L3904j4905l8770M6373N307j0973
1091c4876l5648L5501K0881R756k2681J4558K2767K3286m038k0874l058j0334
1079d760q795L4293j1693m2808M2434M7211r799q3918M5019N2456L610k5200k4763
1066A3287j1004n307m654k1405M5684O0381l1399q4081K0258K3889K6114L3912
1054F5675n6733j7927M8986m1800j5880k4512M3693K6084n234J0721j8753p799
1042F521Q071k8331K1207L6064j018j9393k7644n129L7630K3828n2671J5730l4082
$$ plain form
1029 -19217 3926 -5006 -40947 -42778 -13094 -17502 -38471 1649 40270 20148 -42041 -57810
1017 -57810 -71525 -14529 -12454 10003 2735 -32896 -31647 -36752 -41228 -47976 -44588 -24481 2290
1004 2290 -18758 -66672 -83540 -39833 28038 10373 24476 59838 30097 13229 -9810 -22316
992 -22316 2527 -35835 -32649 -6415 -6889 -20357 -51174 10424 44669 16035 -12542 -59452 -66617
979 -66617 2343 -12824 -4327 16499 19123 12548 -31871 -8878 24108 25352 41035 1292 35836
966 35836 46351 3759 -4861 -5626 -706 31148 11862 -27746 -29808 -31491 -23234 -12214 -8374 30604
952 30604 47629 34765 12960 -6471 -5963 44197 20679 22332 65094 8300 1316 -13635 -52573
939 -52573 -7316 42414 19497 3776 26941 40318 -32547 3628 39496 -14043 -17796 -52836
$$ packed form
1029a9217K3143q932l5941j831K9684m408k0969M0120L8621k0122o2189j5769
1017e7810j3715N6996K075K2457p268l5631J249n105m476o748L388K0107K6771
1004B290k1048m7914j6868M3707O7871j7665J4103L5362k9741j6868k3039j2506
992b2316K4843l8362L186K6234m74j3468l0817O1598L4245k8634k8577m6910p165
979f6617O8960j5167Q497K0826K624o575m4419K2993L2986J244J5683l9743L4544
966C5836J0515m2592q620p65M920L1854j9286l9608k062j683Q257J1020L840L8978
952C0604J7025j2864k1805j9431N08N0160k3518J653M2762n6794o984j4951l8938
939e2573M5257M9730k2917j5721K3165J3377p2865L6175L5868n3539l753l5040
$$ plain form
927 -52836 -30890 -28927 -33850 6421 -17245 33343 -6378 -55104 -15011 17937 -51820 -50613 -25544
914 -25544 -7522 -57985 -82042 -44692 -59304 -29725 -21677 -13196 -10530 -25380 -94222 -101466 -38773
901 -38773 -5517 -23247 4088 7712 -22760 -47570 -34234 13877 21528 14232 7517 11968 16519
888 16519 -23169 -16903 19913 12648 -13556 7990 39899 36477 40471 22741 8968 29069 30703
875 30703 45521 43574 -14980 -26694 -17583 26184 -8385 -56882 -4445 23255 21232 -17724 -24242
862 -24242 -28509 42099 23369 1801 33527 53430 33913 -44079 -11691 -13850 -57073 -21461
850 -21461 16020 -1811 7841 10687 52255 85643 109958 81175 42882 7228 20440 9286
838 9286 203 13190 -28578 18462 5965 -2448 24738 16487 19468 -7178 -33954 -56128 -57272
$$ packed form
927e2836K1946J963m923M0271k3666N0588l9721m8726M0093L2948o9757J207K5069
914b5544J8022n0463k4057L7350j4612K9579Q048Q481K666j4850o8842p244O2693
901c8773L3256j7730K7335L624l0472k4810J3336M8111P651p296o715M451M551
888A6519l9688O266L6816p265k6204K1546L1909l422L994j7730j3773K0101J634
875C0703J4818j947n8554j1714R111M3767l4569m8497N2437K7700k023l8956o518
862b4242m267P0608j8730k1568L1726J9903j9517p7992L2388k159m3223L5612
850b1461L7481j7831R652K846M1568L3388K4315k8783l8293l5654J3212j1154
838I286r083J2987m1768M7040j2497q413K7186q251K981k6646k6776k2174j144
$$ plain form
825 -57272 -34457 -50747 -33394 -22892 2080 -26130 -24185 15342 -34077 -63552 -26705 -45271
813 -45271 -36332 506 -16123 21396 68180 44680 20693 32304 -27361 -29069 3196 40105
801 40105 41514 -18649 -36019 -41494 -26443 -37395 -28078 -55822 -20695 42332 -14125 -21514 -14760
788 -14760 3484 11388 18584 -19167 -25821 34202 -9356 -8730 22254 22037 -24225 -39521 -8685
775 -8685 12529 29676 -48301 -44946 -12442 23274 26911 11518 21108 10251 -39959 -8221 21758
762 21758 58188 58774 8602 -40001 -42322 1623 -15515 -26059 -9657 -13272 -19036 -19766 -46136
749 -46136 -38412 8724 9292 -9883 -31847 -35249 -26417 -73058 -44929 4881 68405 34638 -18347
736 -18347 -24550 -11230 -2278 -25943 5243 49476 8990 -6507 -1020 -19361 -24789 -6119 1364
$$ packed form
825e7272K2815j6290J7353J0502K4972k8210J945L9527m9419k9475L6847j8566
813d5271Q939L6838j6629L7519M6784k3500k3987J1611n9665j708L2265L6909
801D0105J409o0163j7370n475J5051j0952R317k7744L5127O3027n6457p389O754
788a4760J8244P904P196l7751o654O0023m3558O26L0984k17m6262j5296L0836
775h685K1214J7147p7977L355L2504L5716L637j5393R590j0857n0210L1738K9979
762B1758L6430N86n0172m8603k321M3945j7138j0544J6402l615n764p30k6370
749d6136P724M7136N68j9175k1964l402Q832m6641K8129M9810O3524l3767n2985
736a8347o203J3320Q952k3665L1186M4233m0486j5497N487j8341n428J8670P483
$$ plain form
723 1364 4846 -29544 -88404 -69563 4368 -38241 -51551 30439 41297 -30844 -65906 -38947
711 -38947 -30199 3916 -46083 -64485 -25993 28397 -20415 -15607 -15585 -21015 -1207 -8187 24401
698 24401 -789 -26778 -40036 -38962 1667 30303 -5725 4526 -12720 -15562 4903 14613 7703
685 7703 -9893 41013 62468 -11818 -58740 -31275 -18756 -4442 20712 18065 45179 8230
673 8230 -40590 1646 66004 93890 25942 5692 22595 29281 9368 -7979 7735 6912 62991
660 62991 29951 2638 -18357 -7522 6290 2705 29445 12733 -46008 -75203 -97160 -41574
648 -41574 3769 5749 14130 0 5172 -2313 20560 -5201 -35667 2110 29558 -3474 -52688
635 -52688 -53445 -41550 -50528 -58726 -30678 -10201 25817 49479 22494 20080 41735 37417 4706
$$ packed form
723A364L482l4390n8860J8841P3931m2609j3310Q1990J0858p2141l5062K6959
711c8947Q748L4115m9999j8402L8492N4390m8812M808K2n430J9808o980L2588
698B4401k5190k5989j3258J074M0629K8636l6028J0251j7246k842K0465R710o910
685G703j7596N0906K1455p4286m6922K7465J2519J4314K5154k647K7114l6949
673H230m8820M2236O4358K7886o7948k0250J6903O686j9913j7347J5714q23N6079
660F2991l3040k7313k0995J0835J3812l585K6740j6712n8741k9195k1957N5586
648d1574M5343J980Q381j4130N172p485K2873k5761l0466L7777K7448l3032m9214
635e2688p57J1895q978q198K8048K0477L6018K3662k6985k414K1655m318l2711
$$ plain form
622 4706 -33143 -6394 19835 -3219 -30611 -43922 9471 8182 16065 -1881 4097 -8546 -4764
609 -4764 -4533 7735 -11833 -23915 -37868 -18319 -17739 -331 -34197 -30298 -6721 -7129 15500 -11612
595 -11612 -51400 -33149 44212 76626 19364 -41829 -26374 35401 22085 -23420 7854 3098
583 3098 -47628 -71663 -12870 3704 5058 -26496 -53959 1297 75322 -7265 -57698 -34684
571 -34684 981 -39649 -39524 -27750 -49710 -24887 -8741 -2993 7132 -3683 -8371 -32513 -1802
558 -1802 -34301 -29249 -13563 -24715 -71630 -59151 8026 -3664 -8813 -4171 36639 3891 -6098
545 -6098 -13443 -32045 -48134 -42079 -63939 -38313 -12165 -13837 -26638 -23005 -5402 3497 -212
532 -212 15573 -29144 -8004 58149 29987 -13945 -37238 -16260 -3437 46034 -15844 -28432
$$ packed form
622D706l7849K6749K6229k3054k7392j3311N3393j289P883j7946N978j2643L782
609d764K31J2268j9568j2082j3953J9549N80J7408l3866L899K3577m08K2629k7112
595a1612l9788J8251P7361L2414n7262o1193J5455O1775j3316m5505L1274m756
583C098n0726k4035N8793J6574J354l1554k7463N5256P4025q2587n0433K3014
571c4684L5665m0630J25J1774k1960K4823J6146N748J0125j0815m688k4142L0711
558a802l2499N052J5686j1152m6915J2479O7177j1690n149M642M0810l2748r989
545f098p345j8602j6089O055k1860K5626K6148j672j2801L633J7603Q899l709
532b12J5785m4717K1140O6153k8162m3932k3293K0978J2823M9471o1878j2588
$$ plain form
520 -28432 -9735 9005 1095 -5218 3997 3285 -19759 -32379 15195 11280 21174 -33816 -32662 -5759
506 -5759 2524 -11745 -36701 -15255 14812 2786 -9438 -31692 -1529 1258 -17985 -28991 -14371
493 -14371 5247 383 -19335 -59671 -48053 -60864 -69019 -33223 16441 48695 -6599 -33026
481 -33026 -47117 -33712 175 24945 43162 -7094 -19750 -10050 -1864 -6363 -47832 -38701 -65295
468 -65295 -61139 -30802 380 -26116 -56145 -49919 -4747 -1547 -17540 5216 -28933 1268 23589
455 23589 17669 -10345 7366 -75708 -102049 -47703 1091 -33125 -19629 -30103 -41688 -77294
443 -77294 -74538 -59030 -18956 -2599 -31926 -34567 -18910 -72362 -115763 -45283 17270 25780 -14033
430 -14033 -15006 -41423 -83953 -73580 -28052 8008 46808 36511 -2420 -5200 -10037 -17795 -40883
$$ packed form
520b8432J8697J8740p910o313R215p12k3044j2620M7574l915R894n4990J154K6903
506e759Q283j4269k4956K1446L0067j2026j2224k2254L0163K787j9243j1006J4620
493a4371J9618m864j9718m0336J1618j2811q155L5796M9664L2254n5294k6427
481c3026j4091J3405L3887K4770J8217n0256j2656R700Q186m499m1469R131k6594
468f5295M156L0337L1182k6496l0029O226M5172L200j5993K2756l4149L0201K2321
455B3589n920k8014J7711q3074k6341N4346M8794l4216J3496j0474j1585l5606
443g7294K756J5508M0074J6357k9327k641J5657n3452m3401P0480O2553Q510l9813
430a4033r73k6417m2530J0373M5528L6060L8800j0297l8931k780m837p758k3088
$$ plain form
417 -40883 -8036 46386 27937 15438 -32443 -61461 -55855 15355 -7643 -22759 -47089 -46284 -11286
404 -11286 24112 1952 34937 49916 30768 -16108 -25533 -21058 -28714 -51200 -33093 17954 14668
391 14668 -9083 -61008 -41793 -35064 -11287 -32241 -45135 -229 -18624 -61880 -23916 15573
379 15573 5321 35970 5902 -43264 -56986 -55472 -25928 4743 5725 -12021 -17962 -46421 -49916
366 -49916 -50601 -32042 26291 7010 -8863 -27895 -53067 -47331 -48490 -9303 4489 -13570 -16832
353 -16832 2563 -8481 -8237 -64118 -50084 -5647 30731 11863 -19331 -55081 -65251 -31610
341 -31610 -9581 -10065 -29925 -34416 -59026 -47035 -72896 -54741 -22662 -36413 -7348 -23229 -31687
328 -31687 -41873 -20057 -36911 -20386 29674 -3730 -61760 -47537 -35942 -27688 -22067 9885
$$ packed form
417d0883L2847N4422j8449j2499m7881k9018N606P1210k2998j5116k4330Q05L4998
404a1286L5398k2160L2985J4979j9148m6876r425M475p656k2486J8107N1047l286
391A4668k3751n1925J9215O729K3777k0954j2894M4906j8395m3256L7964L9489
379A5573j0252L0649l0068m9166j3722J514K9544L0671R82j7746n941k8459l495
366d9916o85J8559N8333j9281j5873j9032k5172N736j159L9187J3792j8059l262
353a6832J9395j1044K44n5881J4034M4437L6378j8868l1194l5750j0170L3641
341c1610K2029m84j9860m491k4610J1991k5861J8155L2079j3751K9065j5881q458
328c1687j0186K1816j6854J6525N0060l3404n8030J4223J1595Q254N621L1952
$$ plain form
316 9885 27739 33754 39548 -3398 -14358 -37457 -46653 -23643 13135 619 9506 -18759 -64228
303 -64228 -47805 53298 50940 17309 1713 42226 22496 8093 17384 33141 9146 -30920
291 -30920 -7327 -6731 -15536 -57411 -51402 -9448 21165 26281 1491 -31027 -52367 -101151 -56249
278 -56249 1014 -16867 -6920 -12124 -47294 -27289 -19542 -63009 -4845 56976 33715 15003 -31461
265 -31461 -52216 -51552 -80810 -32838 -19471 -48426 -52391 -96874 -84811 -71904 -30060 -8311 -17531
252 -17531 -40841 -20325 4638 -37830 -77890 -40078 22784 17636 -22819 -72142 -79801 -64436
240 -64436 -77028 -40257 41025 26864 -54657 -109263 -48668 -17244 17613 -11507 -34101 -20321
228 -20321 -26381 -24447 -43573 3431 -33072 -66027 -1623 -4688 -70897 -73066 -52391 -27874 -20035
$$ packed form
316I885J7854O015N794m2946j0960k3099r196K3010L6778j2516Q887k8265m5469
303f4228J6423J01103k358l3631j5596M0513j9730j4403R291J5757k3995m0066
291c0920K3593N96q805m1875O009M1954L0613N116k4790l2518k1340m8784M4902
278e6249N7263j7881R947n204l5170K0005P747m3467N8164O1821k3261j8712m6464
265c1461k0755O64k9258M7972J3367k8955l965m4483J2063J2907M1844K1749r220
252a7531k3310K0516K4963m2468m0060L7812O2862n148m0455m9323p659J5365
240f4436j2592L6771Q1282j4161q1521n4606O0595L1424L4857k9120k2594J3780
228b0321o060J934j9126M7004l6503l2955O4404l065o6209k169K0675K4517P839
$$ plain form
215 -20035 -13716 -16620 -35889 -40961 -18305 -35844 8751 4965 -23045 5600 -15213 -35278 -22090
202 -22090 -12132 -70806 -56464 -14335 -22270 -39984 -96699 -63746 -12559 -21736 -16754 -42609 -49269
189 -49269 -22638 -65729 -80199 -43940 -29746 -36198 -24766 -2783 -35216 -47829 -52974 -17071
177 -17071 -28689 8707 2959 -32283 -24291 -53406 -52431 -48246 -30326 -38728 -80778 -92865 -102674
164 -102674 -52719 -63151 -82676 -76804 -24736 -33172 -81360 -98656 -99549 -60067 -48632 -29605 -5238
151 -5238 -32122 -99335 -109520 -88506 8774 -38866 -81181 -69274 -40176 -8866 -28393 -66893
139 -66893 -61544 -46903 -96449 -62020 -52948 -72088 -94186 -77689 -57559 -25367 -5664 -36336
127 -36336 -82473 -107729 -91333 -63080 -40433 -94728 -101046 -61434 -34729 -41113 -72397 -82952
$$ packed form
215b0035O319k904j9269n072K2656j7539M4595l786k8010K8645k0813k0065J3188
202b2090R958n8674J4342M2129p935j7714n6715L2953N1187r177M982k5855o660
189d9269K6631m3091j4470L6259J4194o452J1432K1983l2433j2613n145L5903
177a7071j1618L7396n748l5242P992k9115R75M185J7920q402m2050j2087r809
164a02674M9955j0432j9525N872N2068q436m8188j7296q93L9482J1435J9027K4367
151e238k6884o7213j0185K1014R7280m7640m2315J1907K9098L1310j9527l8500
139f6893N349J4641m9546L4429R072j9140k2098J6497K0130L2192J9703l0672
127c6336m6137k5256J6396K8253K2647n4295o318L9612K6705o384l1284j0555
$$ plain form
115 -82952 -78651 -61968 -21234 -18970 -44447 -93927 -101624 -92145 -75066 -55602 -56669 -134789 -101456
102 -101456 -64577 -57104 -27491 -77510 -81096 -76426 -78001 -91118 -92819 -55124 -82010 -79407 -38308
89 -38308 -67234 -119854 -113086 -79095 -89835 -71713 -93045 -106076 -115950 -123882 -94208 -49059 -75503
76 -75503 -81164 -59430 -23307 -34940 -88308 -129042 -130637 -88188 -86026 -104887 -122448 -128272 -136950
63 -136950 -114306 -111143 -77682 -56811 -112407 -115238 -93866 -100373 -94192 -121609 -144516 -110832 -94856
50 -94856 -86574 -112692 -164121 -161621 -177904 -135390 -105092 -110207 -137317 -148555 -141840 -122506 -76511
37 -76511 -97745 -141634 -170610 -129190 -125160 -138380 -158775 -126190 -113528 -118590 -146086 -158700 -129679
24 -129679 -140425 -138638 -63135 -69273 -136079 -185873 -191131 -152658 -150352 -140807 -138031 -148612 -155432
$$ packed form
115h2952M301J6683M0734K264k5477m9480p697R479J7079J9464j067p8120L3333
102a01456L6879P473K9613n0019l586M670j575j3117j701L7695k6886K603M1099
89c8308k8926n2620O768L3991j0740J8122k1332j3031r874p932K9674M5149k6444
76g5503n661K1734L6123j1633n3368m0734j595M2449K162j8861j7561n824q678
63a36950K2644L163L3461K0871n5596k831K1372o507O181k7417k2907L3684J5976
50i4856Q282k6118n1429K500j6283M2514L0298n115k7110j1238O715J9334M5995
37g6511k1234m3889k8976M1420M030j3220k0395L2585J2662n062k7496j2614K9021
24a29679j0746J787P5503o138o6806m9794n258L8473K306R545K776j0581o820
$$ plain form
11 -155432 -141398 -147560 -167530 -161051 -169954 -143124 -103405 -132574 -182521 -197479 -145658
0 -145658
$$ packed form
11a55432J4034o162j9970O479q903K6830L9719k9169m9947j4958N1821
0a45658
$$ Imaginary data points
##PAGE= N=2
##DATA TABLE= (X++(I..I)), XYDATA
$$ plain form
16383 -1098854 -1126141 -1114253 -1095144 -1071128 -1058156 -1033374 -995354 -1017385 -1024434 -986503 -957332
16372 -957332 -939071 -969057 -931980 -885687 -901569 -898927 -867441 -890895 -850228 -843701 -822399 -798230
16360 -798230 -784922 -785086 -824327 -792744 -735452 -715129 -705394 -707916 -722767 -669385 -667347 -675966 -683413
16347 -683413 -652011 -553828 -545612 -583900 -607039 -583938 -578539 -552956 -513487 -478340 -470496 -537655
16335 -537655 -552863 -442490 -394255 -420479 -449888 -451592 -365472 -323584 -370721 -369808 -375120 -343847
16323 -343847 -309265 -301898 -289473 -294670 -292925 -290582 -248286 -215516 -220792 -234953 -233082 -215139 -164632
16310 -164632 -181453 -191280 -206965 -174451 -152128 -141724 -124809 -131046 -136267 -100467 -66853 -25955
16298 -25955 -12262 -32087 -36522 -34133 -41591 -36732 -6714 -5833 -36994 -43185 -12858 16921 6534
$$ packed form
16383a098854k7287J1888J9109K4016J2972K4782L8020k2031p049L7931K9171
16372i57332J8261k9986L7077M6293j5882K642L1486k3454M0667O527K1302K4169
16360g98230J3308j64l9241L1583N7292K0323R735k522j4851N3382K038q619p447
16347f83413L1402R8183Q216l8288k3139K3101N399K5583L9469L5147P844o7159
16335e37655j5208J10373M8235k6224k9409j704Q6120M1888m7137R13n312L1273
16323c43847L4582P367J2425n197J745K343M2296L2770n276j4161J871J7943N0507
16310a64632j6821r827j5685L2514K2323J0404J6915o237n221L5800L3614M0898
16298b5955J3693j9825m435K389p458M859L0018Q81l1161o191L0327K9779j0387
$$ plain form
16285 6534 -6365 65999 124620 97853 75521 39554 94545 141681 167593 147249 143508 141623
16273 141623 153441 150940 180922 206698 214963 180953 189810 224829 255236 240513 189400 194855
16261 194855 208884 288996 296332 245657 181110 268221 334453 302355 314186 375926 383025 349915
16249 349915 348375 390626 409828 375737 364683 360762 414828 471830 391237 377310 398801 475625
16237 475625 470153 443763 416791 421326 446858 486043 502923 506998 523718 501200 501432 499872 513349
16224 513349 508552 514937 486372 532317 594044 589695 542701 502918 558630 619119 589099 589770
16212 589770 584829 582997 632488 639012 601622 618020 596112 589059 616214 609452 616203 606799 674593
16199 674593 691109 709509 745319 707961 638747 620453 667454 727421 760033 737170 673955
$$ packed form
16285F534j2899P2364N8621k6767k2332l5967N4991M7136K5912k0344l741j885
16273A41623J1818k501K9982K5776Q265l4010Q857L5019L0407j4723n1113N455
16261A94855J4029Q0112P336n0675o4547Q7111O6232l2098J1831O1740P099l3110
16249C49915j540M2251J9202l4091j1054l921N4066N7002q0593j3927K1491P6824
16237D75625n472k6390k6972M535K5532L9185J6880M075J6720k2518K32j560J3477
16224E13349m797O385k8565M5945O1727m349m6994l9783N5712O0489l0020O71
16212E89770m941j832M9491O524l7390J6398k1908p053K7155o762O751r404O7794
16199F74593J6516J8400L5810l7358o9214j8294M7001N9967L2612k2863o3215
$$ plain form
16188 673955 649347 682491 704602 704984 726760 753609 747974 713728 723065 736044 727786 696437
16176 696437 707577 729034 773303 765381 682943 672168 731422 753981 758640 776982 756968 807831
16164 807831 845989 773860 741010 758128 784075 794455 782421 820609 767942 739451 766932
16153 766932 782906 847884 857614 791390 748784 792438 825943 855569 851212 823376 810123 825319
16141 825319 818072 828865 832511 848611 855231 822441 869372 841503 800763 841473 867368 862298
16129 862298 918355 927563 888028 854341 911959 909793 892357 884449 858710 833134 872952 844236
16117 844236 844166 886519 898009 869693 880824 893077 903936 916175 929848 896484 890345 909610
16105 909610 915873 930302 874104 869768 874209 896325 913410 882319 917861 954310 917360 890564
$$ packed form
16188F73955k4608L3144K2111L82K1776K6849n635l4246R337J2979q258l1349
16176F96437J1140K1457M4269p922q2438j0775N9254K2559M659J8342k0014N0863
16164H07831L8158p2129l2850J7118K5947J0380j2034L8188n2667k8491K7481
16153G66932J5974O4978R730o6224m2606M3654L3505K9626m357k7836j3253J5196
16141H25319p247J0793L646J6100O620l2790M6931k7869m0740M0710K5895n070
16129H62298N6057R208l9535l3687N7618k166j7436p908k5739k5576L9818k8716
16117H44236p0M2353J1490k8316J1131J2253J0859J2239J3673l3364o139J9265
16105I09610O263J4429n6198m336M441K2116J7085l1091L5542L6449l6950k6796
$$ plain form
16093 890564 915673 889063 844634 895676 966005 998897 922756 910768 867956 903808 936855
16082 936855 907451 916500 920132 908113 917751 894425 897150 933083 978816 999034 972274 922516
16070 922516 882381 881712 895015 850912 893423 897820 924622 912354 854843 924612 942571 904432
16058 904432 868114 868289 896822 890643 868573 820993 855756 920085 914858 905988 937891 883363
16046 883363 843312 874357 920908 957986 887084 901011 899322 887087 888906 876281 881778 897819
16034 897819 876328 894946 897046 879534 866570 908899 960458 965609 923905 936021 935011 895410
16022 895410 883353 943454 987717 975989 926543 885545 869117 916397 972886 954303 954342 1005032
16010 1005032 970310 920342 895951 891038 929242 940023 960651 983958 988731 883009 890777 887197
$$ packed form
16093H90564K5109k6610m4429N1042P0329L2892p6141j1988m2812L5852L3047
16082I36855k9404R049L632j2019R638k3326K725L5933M5733K0218k6760m9758
16070I22516m0135o69J3303m4103M2511M397K6802j2268n7511O9769J7959l8139
16058I04432l6318J75K8533o179k2070m7580L4763O4329n227q870L1903n4528
16046H83363m0051L1045M6551L7078p0902J3927j689j2235J819j2625N497J6041
16034H97819k1491J8618K100j7512j2964M2329N1559N151m1704J2116j010l9601
16022H95410j2057O0101M4263j1728m9446m0998j6428M7280N6489j8583L9N0690
16010A005032l4722m9968k4391m913L8204J0781K0628K3307M773j05722P768l580
$$ [...]
##END NTUPLES=NMR SPECTRUM
##END=
