##TITLE=1H_DE-80H_X3
 200.13MHz, d2o
 8 sc
 
 19ns.26.2.2025
##JCAMPDX= 6.0         $$ Bruker NMR JCAMP-DX V2.0
##DATA TYPE= NMR SPECTRUM
##DATA CLASS= NTUPLES
##ORIGIN= UXNMR, Bruker Analytische Messtechnik GmbH
##OWNER= pz
$$ XWIN-NMR		Version 3.5
$$ Mon Jul  6 11:07:04 2026 Russian Standard Time (UT+4h)  Yarkov@DPX200
##.OBSERVE FREQUENCY= 200.1313
##.OBSERVE NUCLEUS= ^1H
##.ACQUISITION MODE= SIMULTANEOUS
##.ACQUISITION SCHEME= undefined
##.AVERAGES= 8
##.DIGITISER RES= 18
##SPECTROMETER/DATA SYSTEM= spect
##.PULSE SEQUENCE= zg30
##.SOLVENT NAME= DMSO
##.SHIFT REFERENCE= (INTERNAL, DMSO, 0, 15.5023)
##AUDIT TRAIL= $$ (NUMBER, WHEN, WHO, WHERE, WHAT)
$$ ##TITLE= Audit trail, XWIN-NMR		Version 3.5
$$ ##JCAMPDX= 5.01
$$ ##ORIGIN= Bruker BioSpin GmbH
$$ ##OWNER= Yarkov
$$ C:/Bruker/XWIN-NMR/data/yarkov2/nmr/H-C/1/pdata/1/auditp.txt
$$ ##AUDIT TRAIL=  $$ (NUMBER, WHEN, WHO, WHERE, WHAT)
(   1,<2026-07-06 11:06:19.54 +0400>,<Yarkov>,<DPX200>,
      <created by zg, POWCHK disabled, PULCHK disabled
       configuration hash MD5:
       00 E9 B6 7A A2 85 ED C7 34 08 36 98 17 FE 4E 26
       data hash MD5: 16K
       A4 CD E5 46 20 09 C1 65 EF D2 FD 47 36 73 16 12>)
(   2,<2026-07-06 11:06:24.89 +0400>,<Yarkov>,<DPX200>,
      <Start of raw data processing
       efp BC_mod = 2 LB = 0.25 FT_mod = 6 PKNL = 1 PHC0 = -6894.148 PHC1 = 6.42196 SI = 16K 
       data hash MD5: 16K
       B3 E9 4C 2B 5E C5 06 AB AB 97 8B E0 B5 9D 43 8D>)
$$ ##END=
$$ 
$$ hash MD5
$$ 2B AA A9 89 28 27 CD CB D7 4E D6 E6 DA 88 07 CF
##$RELAX= 
##$RELAX= 
##$RELAX= 
##$RELAX= 
##$RELAX= 
##$RELAX= 
$$ Bruker specific parameters
$$ --------------------------
##$DU= <C:/Bruker/XWIN-NMR>
##$EXPNO= 1
##$NAME= <H-C>
##$PROCNO= 1
##$TYPE= <nmr>
##$USER= <yarkov2>
##$AMP= (0..31)
100 100 100 100 100 100 100 100 100 100 100 100 100 100 100 100 100 100 
100 100 100 100 100 100 100 100 100 100 100 100 100 100 
##$AQSEQ= 0
##$AQ_mod= 1
##$AUNM= <au_zg>
##$AUTOPOS= <>
##$BF1= 200.13
##$BF2= 200.13
##$BF3= 200.13
##$BF4= 200.13
##$BF5= 200.13
##$BF6= 200.13
##$BF7= 200.13
##$BF8= 200.13
##$BYTORDA= 1
##$CFDGTYP= 0
##$CFRGTYP= 5
##$CHEMSTR= <none>
##$CNST= (0..31)
1 1 145 1 1 1 1 1 1 1 1 1 1 1 1 1 1 1 1 1 1 1 1 1 1 1 1 1 1 1 1 1 
##$CPDPRG= <>
##$CPDPRG1= <>
##$CPDPRG2= <>
##$CPDPRG3= <>
##$CPDPRG4= <mlev>
##$CPDPRG5= <mlev>
##$CPDPRG6= <mlev>
##$CPDPRG7= <mlev>
##$CPDPRG8= <mlev>
##$CPDPRGB= <>
##$CPDPRGT= <>
##$D= (0..31)
0 0.7 0 0 0 0 0 0 0 0 0 0.03 0 0 0 0 0 0 0 0 0 0 0 0 0 0 0 0 0 0 0 0 
##$DATE= 1783321579
##$DBL= (0..7)
120 120 120 120 120 120 120 120 
##$DBP= (0..7)
150 150 150 150 150 150 150 150 
##$DBP07= 0
##$DBPNAM0= <>
##$DBPNAM1= <>
##$DBPNAM2= <>
##$DBPNAM3= <>
##$DBPNAM4= <>
##$DBPNAM5= <>
##$DBPNAM6= <>
##$DBPNAM7= <>
##$DBPOAL= (0..7)
0.5 0.5 0.5 0.5 0.5 0.5 0.5 0.5 
##$DBPOFFS= (0..7)
0 0 0 0 0 0 0 0 
##$DE= 6
##$DECBNUC= <off>
##$DECIM= 32
##$DECNUC= <off>
##$DECSTAT= 4
##$DIGMOD= 1
##$DIGTYP= 9
##$DL= (0..7)
0 120 120 120 120 120 120 120 
##$DP= (0..7)
$$ [...]
##$SUBNAM2= <"">
##$SUBNAM3= <"">
##$SUBNAM4= <"">
##$SUBNAM5= <"">
##$SUBNAM6= <"">
##$SUBNAM7= <"">
##$SUBNAM8= <"">
##$SUBNAM9= <"">
##$SW= 18.0517328524113
##$SWIBOX= (0..15)
0 0 2 0 0 0 0 0 0 0 0 0 0 0 0 0 
##$SW_h= 3612.71676300578
##$TD= 16384
##$TD0= 1
##$TE= 0
##$TE2= 300
##$TE3= 300
##$TEG= 300
##$TL= (0..7)
0 120 120 120 120 120 120 120 
##$TP= (0..7)
150 150 150 150 150 150 150 150 
##$TP07= 0
##$TPNAME0= <>
##$TPNAME1= <>
##$TPNAME2= <>
##$TPNAME3= <>
##$TPNAME4= <>
##$TPNAME5= <>
##$TPNAME6= <>
##$TPNAME7= <>
##$TPOAL= (0..7)
0.5 0.5 0.5 0.5 0.5 0.5 0.5 0.5 
##$TPOFFS= (0..7)
0 0 0 0 0 0 0 0 
##$TUNHIN= 0
##$TUNHOUT= 0
##$TUNXOUT= 0
##$USERA1= <user>
##$USERA2= <user>
##$USERA3= <user>
##$USERA4= <user>
##$USERA5= <user>
##$V9= 5
##$VALIST= <valist>
##$VCLIST= <CCCCCCCCCCCCCCC>
##$VD= 0
##$VDLIST= <DDDDDDDDDDDDDDD>
##$VPLIST= <PPPPPPPPPPPPPPP>
##$VTLIST= <TTTTTTTTTTTTTTT>
##$WBST= 1024
##$WBSW= 4
##$XGAIN= (0..3)
0 0 0 0 
##$XL= 0
##$YL= 0
##$YMAX_a= 179406
##$YMIN_a= -154771
##$ZGOPTNS= <>
##$ZL1= 120
##$ZL2= 120
##$ZL3= 120
##$ZL4= 120
##$ABSF1= 0
##$ABSF2= 0
##$ABSG= 0
##$ABSL= 0
##$ALPHA= 0
##$AQORDER= 0
##$ASSFAC= 0
##$ASSFACI= 0
##$ASSFACX= 0
##$ASSWID= 0
##$AUNMP= <proc_1d>
##$AZFE= 0.1
##$AZFW= 0.1
##$BCFW= 0
##$BC_mod= 2
##$BYTORDP= 0
##$COROFFS= 0
##$CY= -3
##$DATMOD= 1
##$DC= 0
##$DFILT= <>
##$DTYPP= 0
##$F1P= 0
##$F2P= 0
##$FCOR= 1
##$FTSIZE= 16384
##$FT_mod= 6
##$GAMMA= 0
##$GB= 0
##$INTBC= 1
##$INTSCL= 3.241238e-09
##$ISEN= 128
##$LB= 0.25
##$LEV0= 0
##$LPBIN= 0
##$MAXI= 10000
##$MC2= 0
##$MEAN= 0
##$ME_mod= 0
##$MI= 1.114404
##$NCOEF= 0
##$NC_proc= -7
##$NLEV= 6
##$NOISF1= 3.799351
##$NOISF2= 2.8
##$NSP= 0
##$NTH_PI= 0
##$NZP= 0
##$OFFSET= 15.50229
##$PC= 1
##$PHC0= -6894.148
##$PHC1= 6.42196
##$PH_mod= 1
##$PKNL= yes
##$PPARMOD= 0
##$PSCAL= 0
##$PSIGN= 0
##$REVERSE= no
##$SF= 200.130003884418
##$SI= 16384
##$SIGF1= 3
##$SIGF2= 2
##$SINO= 0.751879
##$SIOLD= 32768
##$SREGLST= <19F.Aceton>
##$SSB= 0
##$STSI= 16384
##$STSR= 0
##$SW_p= 3612.71676300578
##$SYMM= 0
##$S_DEV= 0
##$TDeff= 16384
##$TDoff= 0
##$TI= <>
##$TILT= no
##$TM1= 0
##$TM2= 0
##$TOPLEV= 0
##$USERP1= <user>
##$USERP2= <user>
##$USERP3= <user>
##$USERP4= <user>
##$USERP5= <user>
##$WDW= 1
##$XDIM= 16384
##$YMAX_p= 521838497
##$YMIN_p= -794507
$$ End of Bruker specific parameters
$$ ---------------------------------
##NTUPLES= NMR SPECTRUM
##VAR_NAME=  FREQUENCY,     SPECTRUM/REAL,   SPECTRUM/IMAG
##SYMBOL=    X,             R,               I
##VAR_TYPE=  INDEPENDENT,   DEPENDENT,       DEPENDENT
##VAR_FORM=  AFFN,          ASDF,            ASDF
##VAR_DIM=   16384,         16384,           16384
##UNITS=     HZ,            ARBITRARY UNITS, ARBITRARY UNITS
##FACTOR=    0.220516191357247, 1,           1
##FIRST=     3102.47331229448, 0,            0
##LAST=      -510.243450711304, 0,           0
##MIN=       -510.243450711304, -794507,     0
##MAX=       3102.47331229448, 521838497,    0
$$ Real data points
##PAGE= N=1
##DATA TABLE= (X++(R..R)), XYDATA
$$ [...]
$$ plain form
5946 179758 160117 56249 41666 54864 139708 89167 22544 17345 10241 -145322 -239776 -205607
5934 -205607 -134935 -75504 44722 26824 28757 69004 126728 185504 131706 67242 59652 145320
5922 145320 99391 59089 46876 16557 44242 30393 -24652 -2366 30953 103257 30904 15118
5910 15118 68108 107386 146591 92637 -13807 49127 101207 16144 -7705 -58895 -17309 -54934
5898 -54934 -76502 -153746 -104021 43875 28417 8746 47694 20377 41114 37488 56183 62569
5886 62569 65482 106635 -17840 -17079 -10470 79746 112151 77651 43803 124703 162380 190453
5874 190453 126793 70115 64861 171213 225195 179490 141447 180677 216883 236055 191638 172397
5862 172397 203702 227870 229763 199431 225943 333000 371750 446852 558618 612749 677318
$$ packed form
5946A79758j9641j03868j4583J3198Q4844n0541o6623n199p104j55563r4454L4169
5934b05607P0672N9431J20226j7898J933M0247N7724N8776n3798o4464p590Q5668
5922A45320m5929m0302j2213l0319K7685j3849n5045K2286L3319P2304p2353j5786
5910A5118N2990L9278L9205n3954j06444O2934N2080q5063k3849n1190M1586l7625
5898e4934k1568p7244M9725J47896j5458j9671L8948k7317K0737l626J8695O386
5886F2569K913M1153j24475P61O609R0216L2405l4500l3848Q0900L7677K8073
5874A90453o3660n6678n254J06352N3982m5705l8043L9230L6206J9172m4417j9241
5862A72397L1305K4168J893l0332K6512J07057L8750P5102J11766N4131O4569
$$ plain form
5851 677318 778461 826314 800412 821680 939944 1010643 993095 1018513 1043311 1031065 1034359
5840 1034359 990262 1004652 1021241 1056300 1051725 1010436 941396 925053 941012 882120 788071 719245
5828 719245 683388 623141 543964 426524 401965 439695 390046 271771 175531 264185 329561
5817 329561 303169 289986 290098 311349 338845 356141 323188 411409 397745 417372 455922 415077
5805 415077 357903 419282 334407 253191 264480 335406 371411 385271 304033 361865 456497 468549
5793 468549 443229 492472 510623 574154 630734 641280 602782 580210 596341 613392 610275 643209
5781 643209 637298 642257 695713 754992 766708 817577 925624 1029607 1160208 1292751 1505459
5770 1505459 1686288 1746120 1940601 2240553 2526082 2814533 3299610 4088328 5708823 8556534
$$ packed form
5851F77318J01143M7853k5902K1268J18264P0699j7548K5418K4798j2246L294
5840A034359m4097J4390J6589L5059m575m1289o9040j6343J5959n8892r4049o8826
5828G19245l5857o0247p9177j17440k4559L7730m9649j18275r6240Q8654O5376
5817C29561k6392j3183J12K1251K7496J7296l2953Q8221j3664J9627L8550m0845
5805D15077n7174O1379q4875q1216J1289P0926L6005J3860q1238N7832R4632J2052
5793D68549k5320M9243J8151O3531N6580J0546l8498k2572J6131J7051l117L2934
5781F43209n911M959N3456N9279J1716N0869J08047J03983J30601J32543K12708
5770A505459J80829N9832J94481K99952K85529K88451M85077P88718J620495K847711
$$ plain form
5760 8556534 12110998 15542189 17686473 18018709 17580008 16447831 14499764 12277669 10211123
5751 10211123 8418279 6694719 5327344 4288543 3514887 2974575 2618644 2371432 2122498
5742 2122498 1884732 1705469 1444848 1367403 1232348 1151810 1008815 965834 1007510 1028658
5732 1028658 1047897 1069360 1040314 946987 879823 887256 870757 836525 871112 879071 857239 917420
5720 917420 915959 972358 1038583 1029128 945218 923993 995763 1000072 1006806 977956 989478 1080399
5708 1080399 1075104 1026166 989312 979653 1014857 1021915 1026314 1006565 1010076 992592 961693 956050 908310
5695 908310 876125 892616 916737 914952 882806 839268 837547 785113 785967 796305 828919 917872
5683 917872 940166 921493 939818 906657 925295 908208 913880 970793 959205 951472 924605 912378
$$ packed form
5760H556534L554464L431191K144284L32236m38701j132177j948067k222095k066546
5751A0211123j792844j723560j367375j038801p73656n40312l55931k47212k48934
5742B122498k37766j79263k60621p7445j35055q0538j42995m2981M1676K1148
5732A028658J9239K1463k9046r3327o7164P433j6499l4232L4587P959k1832O0181
5720I17420j461N6399O6225r455q3910k1225P1770M309O734k8850J1522R0921
5708A080399n295m8938l6854r659L5204P058M399j9749L511j7484l0899n643m7740
5695I08310l2185J6491K4121j785l2146m3538j721n2434Q54J0338L2614Q8953
5683I17872K2294j8673J8325l3161J8638j7087N672N6913j1588p733k6867j2227
$$ plain form
5671 912378 1012712 1050436 1090885 1055068 986575 1001579 1140207 1189901 1098802 1224504 1325215
5660 1325215 1323044 1279339 1337256 1363724 1435914 1426646 1411689 1460031 1495252 1491928 1510442 1567317
5648 1567317 1552192 1572236 1618704 1624382 1562504 1631679 1674144 1641934 1646107 1599822 1605764 1558347
5636 1558347 1608117 1655184 1660435 1636102 1672036 1714508 1749081 1796425 1864312 1887844 1941353 2044900
5624 2044900 2090647 2182187 2247380 2287568 2421890 2547961 2643413 2671895 2700932 2698166 2761049
5613 2761049 2824052 2890928 3031007 3157092 3249948 3297623 3346078 3442523 3436313 3488816 3585602
5602 3585602 3601864 3585091 3599747 3766422 3767210 3666187 3750698 3824445 3844138 3905025 3904058 3905524
5590 3905524 3911557 3995388 4018111 4031684 4080834 4180760 4307439 4412450 4523153 4686656 4848772
$$ packed form
5671I12378J00334L7724M0449l5817o8493J5004J38628M9694r1099J25702J00711
5660A325215k171m3705N7917K6468P2190r268j4957M8342L5221l324J8514N6875
5648A567317j5125K0044M6468N678o1878O9175M2465l2210M173m6285N942m7417
5636A558347M9770M7067N251k4333L5934M2472L4573M7344O7887K3532N3509J03547
5624B044900M5747R1540O5193M0188J34322J26071R5452K8482K9037k766O2883
5613B761049O3003O6876J40079J26085R2856M7675M8455R6445o210N2503R6786
5602C585602J6262j6773J4656J66675P88j01023Q4511P3747J9693O0887r67J466
5590C905524O033Q3831K2723J3573M9150R9926J26679J05011J10703J63503J62116
$$ plain form
5579 4848772 4982969 5123173 5262784 5473056 5671165 5879156 6105661 6372262 6697952 6965547
5569 6965547 7294939 7598363 7973101 8399699 8852802 9223176 9612856 10192390 10868597 11500794
5559 11500794 12148746 12898136 13720517 14741873 15844512 16942573 18125552 19603227 21275493
5550 21275493 23221202 25404843 28034111 31169073 34966755 39515039 45258063 52700186
5542 52700186 62169312 74386687 89753781 108124614 128426710 148292283 165073976
5535 165073976 176966174 183706466 186061105 185381764 183608146 182866847 184646227 189071089
5527 189071089 194849519 199813169 201618004 198836982 191383942 179690071 164839647 148008439
5519 148008439 130762595 113942243 98250427 84307601 72285351 62371969 54320909
$$ packed form
5579D848772J34197J40204J39611K10272J98109K07991K26505K66601L25690K67595
5569F965547L29392L03424L74738M26598M53103L70374L89680N79534O76207O32197
5559A1500794O47952P49390Q22381J021356J102639J098061J182979J477675J672266
5550B1275493J945709K183641K629268L134962L797682M548284N743024P442123
5542E2700186R469126J2217375J5367094J8370833K0302096J9865573J6781693
5535A65073976J1892198O740292K354639o79341j773618p41299J779380M424862
5527A89071089N778430M963650J804835k781022p453040j1693871j4850424j6831208
5519A48008439j7245844j6820352j5691816j3942826j2022250r913382q051060
$$ plain form
5512 54320909 47778149 42484730 38074553 34394079 31257286 28474204 26019678 23912100
5504 23912100 22069852 20479559 19074824 17912395 16855648 15896790 15043740 14292431 13681918
5495 13681918 13033214 12482236 12105374 11586391 11142301 10790208 10363286 9993633 9687976
5486 9687976 9409378 9144533 8888959 8617296 8412715 8176621 7934154 7722925 7478964 7257805
5476 7257805 7162434 6928651 6781219 6612910 6385202 6204473 6021962 5860652 5599901 5407847
5466 5407847 5247406 5062588 4959152 4690865 4480559 4408849 4241256 4165536 3978241 3831173
5456 3831173 3788181 3684905 3475260 3328584 3246408 3196782 3110139 3012218 2934822 2872394 2856915
5445 2856915 2681071 2465348 2410551 2450175 2443529 2358505 2292510 2296201 2375707 2388940 2375546
$$ packed form
5512E4320909o542760n293419m410177l680474l136793k783082k454526k107578
5504B3912100j842248j590293j404735j162429j056747r58858q53050p51309o10513
5495A3681918o48704n50978l76862n18983m44090l52093m26922l69653l05657
5486I687976k78598k64845k55574k71663k04581k36094k42467k11229k43961k21159
5476G257805r5371k33783j47432j68309k27708j80729j82511j61310k60751j92054
5466E407847j60441j84818j03436k68287k10306p1710j67593p5720j87295j47068
5456C831173m2992j03276k09645j46676q2176m9626q6643r7921p7396o2428j5479
5445B856915j75844k15723n4797L9624o646q5024o5995L691P9506J3233j3394
$$ plain form
5434 2375546 2377903 2390968 2404192 2392213 2299093 2255361 2249866 2242288 2173041 2130777 2200680 2216384
5422 2216384 2182058 2118182 2070345 2033116 2033525 2032027 2012107 1911455 1893665 1897644 1832142 1718689
5410 1718689 1741682 1755277 1714630 1707586 1656900 1590053 1627061 1579924 1567066 1566674 1556390 1638033
5398 1638033 1701064 1645704 1600727 1578092 1682993 1671122 1596037 1644681 1791199 1787790 1773866
5387 1773866 1831451 1829719 1838674 1933834 1878399 1764004 1712505 1687230 1746798 1603781 1531534
5376 1531534 1552122 1663438 1705960 1652019 1611841 1633639 1626986 1690200 1619951 1539673 1496106
5365 1496106 1520377 1527868 1478833 1473776 1433926 1445108 1470006 1427676 1349644 1411034 1407269 1387906
5353 1387906 1326854 1375981 1425341 1475015 1446404 1396954 1478577 1552080 1568019 1512847 1543898
$$ packed form
5434B375546K357J3065J3224j1979r3120m3732n495p578o9247m2264O9903J5704
5422B216384l4326o3876m7837l7229M09j498j9920j00652j7790L979o5502j13453
5410A718689K2993J3595m0647p044n0686o6847L7008m7137j2858l92j0284Q1643
5398A638033O3031n5360m4977k2635J04901j1871p5085M8644J46518l409j3924
5387A773866N7585j732Q955R5160n5435j14395n1499k5275N9568j43017p2247
5376A531534K0588J11316M2522n3941m0178K1798o653O3214p0249q0278m3567
5365A496106K4271P491m9035n057l9850J1182K4898m2330p8032O1390l765j9363
5353A387906o1052M9127M9360M9674k8611m9450Q1623P3503J5939n5172L1051
$$ plain form
5342 1543898 1636284 1669065 1662268 1733856 1734684 1855122 1921353 1993470 2089751 2164632 2214381 2336446
5330 2336446 2412934 2553277 2629154 2764967 2909313 2926471 3015226 3114374 3427331 3637406
5320 3637406 3712428 3941940 4159406 4425927 4584525 4815415 5187637 5589804 6145881 6715853
5310 6715853 7358418 8199004 9133876 10337008 11849333 13887380 17152135 22236511 29469357
5301 29469357 37949898 45999193 51676616 54085117 53984494 52073981 48928833 45449936
5293 45449936 42828087 42254454 44231513 48501800 53590019 57549173 58768506 57366459
5285 57366459 54120262 49170564 43127523 37082433 31403341 26337933 21849474 18109751
5277 18109751 15288476 13056970 11431926 10185648 9207986 8344426 7538548 6816427 6229202
$$ packed form
5342A543898R2386L2781o797P1588Q28J20438O6231P2117R6281P4881M9749J22065
5330B336446P6488J40343P5877J35813J44346J7158Q8755R9148L12957K10075
5320C637406P5022K29512K17466K66521J58598K30890L72222M02167N56077N69972
5310F715853O42565Q40586R34872J203132J512325K038047L264755N084376P232846
5301B9469357Q480541Q049295N677423K408501j00623j910513l145148l478897
5293D5449936k621849n73633J977059M270287N088219L959154J219333j402047
5285E7366459l246197m949698o043041o045090n679092n065408m488459l739723
5277A8109751k821275k231506j625044j246278r77662q63560q05878p22121n87225
$$ plain form
5268 6229202 5706313 5293344 4922955 4722315 4516712 4156913 4028362 3872770 3827518 3724837
5258 3724837 3486750 3344149 3191020 3090462 3007012 2868897 2806918 2782849 2712841 2536527
5248 2536527 2425759 2377345 2400999 2372849 2278011 2232218 2276556 2249397 2219733 2155442 2121196
5237 2121196 2081088 2016504 1998597 1883556 1789995 1735676 1662599 1660798 1610765 1642153 1665461
5226 1665461 1629574 1709718 1749034 1855187 1979128 2005591 2010806 2030366 1997313 2019080 2004114
5215 2004114 1938866 1913479 1889535 1956202 1859105 1807411 1790027 1814793 1876955 1792723 1783021 1718076
5203 1718076 1694217 1658287 1603079 1572547 1459376 1422878 1424322 1170526 1111212 1057678 1077676
5192 1077676 1035738 920251 853116 896503 935857 941856 919676 936074 967720 939922 925811
$$ packed form
5268F229202n22889m12969l70389k00640k05603l59799j28551j55592m5252j02681
5258C724837k38087j42601j53129j00558q3450j38115o1979k4069p0008j76314
5248B536527j10768m8414K3654k8150r4838m5793M4338k7159k9664o4291l4246
5237B121196m0108o4584j7907j15041r3561n4319p3077j801n0033L1388K3308
5226A665461l5887Q0144L9316J06153J23941K6463N215J9560l3053K1767j4966
5215B004114o5248k5387k3944O6667r7097n1694j7384K4766O2162q4232r702o4945
5203A718076k3859l5930n5208l0532j13171l6498J444k53796n9314n3534J9998
5192A077676m1938j15487o7135M3387L9354N999k2180J6398L1646k7798j4111
$$ plain form
5181 925811 845936 814211 876133 861994 774866 741843 884485 853079 737901 686216 622315
5170 622315 650850 611406 638416 680284 612125 697107 733106 678536 634376 661778 759487 833041
5158 833041 758135 679340 667926 679377 661216 570027 561631 534446 612634 529443 570057 616810
5146 616810 587991 627926 590982 592898 625372 667528 681885 653333 707335 738153 729924 735435
5134 735435 712057 605320 593335 607209 624645 531907 530298 570714 664046 725088 733512 682531
5122 682531 717836 778619 765115 772561 860341 880859 883542 956587 966059 960675 959988 884611 899369
5109 899369 964218 972616 964131 973910 1105882 1058912 1113330 1216631 1167409 1116305 1147494 1168569
5097 1168569 1207632 1108008 1089468 1109990 1073255 970966 915436 850304 797330 791372 796665 797543
$$ packed form
5181I25811p9875l1725O1922j4139q7128l3023J42642l1406j15178n1685o3901
5170F22315K8535l9444K7010M1868o8159Q4982L5999n4570m4160K7402R7709P3554
5158H33041p4906p8795j1414J1451j8161r1189q396k7185P8188q3191M0614M6753
5146F16810k8819L9935l6944J916L2474M2156J4357k8552N4002L0818q229N511
5134G35435k3378j06737j1985J3874J7436r2738j609M0416R3332O1042Q424n0981
5122F82531L5305O0783j3504P446Q7780K0518K683P3045R472n384o87p5377J4758
5109H99369O4849Q398q485R779J31972m6970N4418J03301m9222n1104L1189K1075
5097A168569L9063r9624j8540K0522l6735j02289n5530o5132n2974n958N293Q78
$$ plain form
5085 797543 738902 721800 781290 759740 721515 718714 713925 808048 793990 760610 787995 777249
5073 777249 765077 753309 696482 706215 731058 779212 735299 645909 739225 821954 762161 761912
5061 761912 800050 860378 806502 791003 859734 858880 919522 935840 971298 942379 886606 981509
5049 981509 965896 870590 778935 846108 773408 711562 726260 687333 674843 748772 783029 752769
5037 752769 780834 857940 926503 891233 834126 786981 777371 819897 829251 804185 768174 748528
5025 748528 777178 741451 764245 824282 810947 694782 713800 758616 803496 818452 936942
5014 936942 951334 969308 1012341 1054814 1024156 899862 911748 966459 930988 885672 882611 962311
5002 962311 954026 916103 981600 1019263 998621 1062536 1162279 1247712 1277400 1466716 1616894
$$ packed form
5085G97543n8641j7102N9490k1550l8225k801m789R4123j4058l3380K7385j0746
5073G77249j2172j1768n6827R733K4843M8154m3913q9390R3316Q2729n9793k49
5061G61912L8138O0328n3876j5499O8731q54O0642J6318L5458k8919n5773R4903
5049I81509j5613r5306r1655O7173p2700o1846J4698l8927j2490P3929L4257l0260
5037G52769K8065P7106O8563l5270n7107m7145r610M2526R354k5066l6011j9646
5025G48528K8650l5727K2794O0037j3335j16165J9018M4816M4880J4956J18490
5014I36942J4392J7974M3033M2473l0658j24294J1886N4711l5471m5316l061P9700
5002I62311q285l7923O5497L7663k0642O3915R9743Q5433K9688J89316J50178
$$ plain form
4991 1616894 1634319 1703970 1718320 1691631 1594036 1589550 1491455 1411731 1358426 1310148 1246673 1249079
4979 1249079 1270185 1350203 1421161 1410104 1382423 1443275 1547318 1601798 1452000 1306653 1328136
4968 1328136 1280919 1266919 1244887 1243214 1211279 1202918 1261150 1286239 1216468 1285085 1321649 1303335
4956 1303335 1295834 1249845 1316809 1324349 1324611 1362478 1405809 1401276 1364582 1354728 1393887 1344699 1415393
4943 1415393 1437950 1442867 1527647 1527482 1550993 1557139 1597431 1631897 1665158 1655287 1613189 1634920
4931 1634920 1588162 1626971 1626236 1614752 1627035 1656712 1744635 1739587 1640789 1617657 1667329 1677622
4919 1677622 1746470 1722544 1751439 1896733 1986523 1884482 1849419 1916310 1959342 1887961 1870927
4908 1870927 1905227 1902268 1932884 1931888 1948404 1985690 1946307 2057533 2153176 2157996 2188891 2254505
$$ packed form
4991A616894J7425O9651J4350k6689r7595m486r8095p9724n3305m8278o3475K406
4979A249079K1106Q0018P0958j1057k7681O0852J04043N4480j49798j45347K1483
4968A328136m7217j4000k2032j673l1935q361N8232K5089o9771O8617L6564j8314
4956A303335p501m5989O6964P540K62L7867M3331m533l6694r854L9159m9188P0694
4943A415393K2557M917Q4780j65K3511O146M0292L4466L3261r871m2098K1731
4931A634920m6758L8809p35j1484J2283K9677Q7923n048r8798k3132M9672J0293
4919A677622O8848k3926K8895J45294Q9790j02041l5063O6891M3032p1381j7034
4908A870927L4300k959L0616r96J6516L7286l9383J11226R5643M820L0895O5614
$$ plain form
4896 2254505 2317074 2314219 2328710 2292358 2309786 2315289 2370004 2395580 2367483 2396929 2438516 2401703
4884 2401703 2366438 2412088 2532270 2606667 2566674 2663326 2715612 2705529 2694089 2752463 2818442
4873 2818442 2777239 2854563 2864934 2832680 2813229 2855162 2994257 2996713 2982810 3076306 3149473
4862 3149473 3265213 3309428 3435013 3469906 3473125 3583896 3693815 3744519 3898444 3972458 4114220
4851 4114220 4238409 4317113 4318083 4373913 4359718 4321797 4334227 4342833 4448466 4481521 4518499 4626074
4839 4626074 4707580 4800153 4904947 4991113 5154235 5362832 5499936 5672832 5922130 6216626
4829 6216626 6684822 7261209 8407759 10380526 12986150 15496750 17283170 17688924 17413446
4820 17413446 16621996 15358028 13970108 12584179 11331073 10266535 9307099 8616639 8177127
$$ packed form
4896B254505O2569k855J4491l6352J7428N503N4715K5576k8097K9446M1587l6813
4884B401703l5265M5650J20182P4397l9993R6652N2286j0083j1440N8374O5979
4873B818442m1203P7324J0371l2254j9451M1933J39095K456j3903R3496P3167
4862C149473J15740M4215J25585L4893L219J10771J09919N0704J53925P4014J41762
4851D114220J24189P8704R70N5830j4195l7921J2430Q606J05633L3055L6978J07575
4839D626074Q1506R2573J04794Q6166J63122K08597J37104J72896K49298K94496
4829F216626M68196N76387J146550J972767K605624K510600J786420M05754k75478
4820A7413446p91450j263968j387920j385929j253106j064538r59436o90460m39512
$$ plain form
4811 8177127 7861404 7681164 7532387 7402586 7281535 7200973 7183358 7068119 7000341 7090219
4801 7090219 7118055 7175904 7231190 7277209 7368773 7425996 7512545 7514620 7661648 7706279 7742239
4790 7742239 7832415 7936489 8094816 8191284 8244413 8244064 8221299 8279741 8385823 8426160 8565454
4779 8565454 8730830 8845117 8958222 9005596 9066143 9165820 9276291 9378968 9422835 9567135
4769 9567135 9625600 9757383 9835671 9908843 10001506 10080460 10077910 10128928 10145698 10166022 10194794
4758 10194794 10276989 10350861 10368871 10407849 10484115 10626818 10725082 10750051 10844085 10928582 11050758
4747 11050758 11039125 11032853 11073647 11080940 11110848 11094346 11075502 11143359 11174921 11198037 11272446 11295402
4735 11295402 11367732 11419890 11480689 11508635 11557854 11631363 11776677 11795309 11747768 11811947 11859121
$$ packed form
4811H177127l15723j80240j48777j29801j21051q0562j7615j15239o7778Q9878
4801G090219K7836N7849N5286M6019R1564N7223Q6549K075J47028M4631L5960
4790G742239R0176J04074J58327R6468N3129l49k2765N8442J06082M0337J39294
4779H565454J65376J14287J13105M7374O0547R9677J10471J02677M3867J44300
4769I567135N8465J31783P8288P3172R2663P8954k550N1018J6770K0324K8772
4758A0194794Q2195P3872J8010L8978P6266J42703R8264K4969R4034Q4497J22176
4747A1050758j1633o272M0794P293K9908j6502j8844O7857L1562K3116P4409K2956
4735A1295402P2330N2158O0799K7946M9219P3509J45314J8632m7541O4179M7174
$$ plain form
4724 11859121 11847089 11723257 11669101 11684306 11668379 11629944 11683504 11617941 11623887 11728032 11689951
4713 11689951 11734650 11736605 11758103 11762024 11610327 11629199 11567370 11542684 11507050 11481171 11451834
4702 11451834 11314526 11293430 11280473 11123276 11021348 11037952 10975095 11003488 10915070 10847596 10853602
4691 10853602 10820308 10794404 10805745 10771556 10702774 10573599 10508718 10416791 10369170 10236012 10232050
4680 10232050 10147540 10060934 10056608 10014760 10028340 9975660 9799499 9827905 9783418 9724070 9652617
4669 9652617 9603591 9562993 9491795 9496581 9425495 9389879 9404752 9420624 9392194 9251653 9119187
4658 9119187 9061435 8971554 8910195 8828015 8877600 8916997 8797927 8698512 8668941 8504088 8446356
4647 8446356 8316326 8267038 8161648 8090374 8105850 8063401 7989614 7939468 7867252 7842701 7819634
$$ packed form
4724A1859121j2032j23832n4156J5205j5927l8435N3560o5563N946J04145l8081
4713A1689951M4699J955K1498L921j51697J8872o1829k4686l5634k5879k9337
4702A1451834j37308k1096j2957j57197j01928J6604o2857K8393q8418o7474O006
4691A0853602l3294k5904J1341l4189o8782j29175o4881r1927m7621j33158l962
4680A0232050q4510q6606m326m1848J3580n2680j76161K8406m4487n9348p1453
4669I652617m9026m0598p1198M786p1086l5616J4873J5872k8430j40541j32466
4658I119187n7752q9881o1359q2180M9585L9397j19070r9415k9571j64853n7732
4647H446356j30030m9288j05390p1274J5476m2449p3787n0146p2216k4551k3067
$$ plain form
4636 7819634 7786744 7774087 7716223 7736067 7710861 7807870 7987600 8419529 9059026 9735372 10386887
4625 10386887 10768003 10820145 10723224 10414007 9987726 9531751 9182446 8844809 8432777 8251804
4615 8251804 8104448 8073033 8110621 8239846 8515451 8843411 9195415 9522119 9754214 10033192
4605 10033192 10358549 10710813 11146718 11618889 12176860 12656461 13018554 13272716 13387991
4596 13387991 13553819 13751150 14149170 14702965 15249480 15656913 15834493 15712628 15482807
4587 15482807 15267162 15138282 15036253 14993306 14898425 14639846 14398425 13980429 13569330 13234400
4577 13234400 12881460 12683253 12480247 12258967 12056541 11844404 11723279 11599164 11571105 11573712
4567 11573712 11687940 11960263 12332307 12879490 13753170 14812487 16312260 18187473 20586308
$$ packed form
4636G819634l2890j2657n7864J9844k5206R7009J79730M31929O39497O76346O51515
4625A0386887L81116N2142r6921l09217m26281m55975l49305l37637m12032j80973
4615H251804j47356l1415L7588J29225K75605L27960L52004L26704K32095K78978
4605A0033192L25357L52264M35905M72171N57971M79601L62093K54162J15275
4596A3387991J65828J97331L98020N53795N46515M07433J77580j21865k29821
4587A5482807k15645j28880j02029m2947r4881k58579k41421m17996m11099l34930
4577A3234400l52940j98207k03006k21280k02426k12137j21125j24115k8059K607
4567A1573712J14228K72323L72044N47183Q73680J059317J499773J875213K398835
$$ plain form
4558 20586308 23781115 27608822 32358877 37638544 43143119 48442756 53064449 57014289
4550 57014289 60268619 63436172 66964386 71295364 77079977 84009185 91205512 97174708
4542 97174708 100814361 101886468 100894899 98180469 94032175 89320094 84716210 80492560
4534 80492560 76658068 72823057 68864685 64734620 60367991 55698080 50797599 45667094
4526 45667094 40487836 35693953 31321629 27378774 23880578 21074144 18775147 17054408
4518 17054408 15604723 14514809 13695676 13045104 12637439 12384844 12132966 12314822 13038111
4509 13038111 14324714 16084125 17939747 19481977 20300590 20674263 20652869 20349233 19970924
4500 19970924 19695755 20080057 21530435 24134042 27227815 29799038 31136742 31007658 30417035
$$ packed form
4558B0586308L194807L827707M750055N279667N504575N299637M621693L949840
4550E7014289L254330L167553L528214M330978N784613O929208P196327N969196
4542I7174708L639653J072107r91569k714430m148294m712081m603884m223650
4534H0492560l834492l835011l958372m130065m366629m669911m900481n130505
4526D5667094n179258m793883m372324l942855l498196k806434k298997j720739
4518A7054408j449685j089914q19133o50572m07665k52595k51878J81856P23289
4509A3038111J286603J759411J855622J542230Q18613L73673k1394l03636l78309
4500A9970924k75169L84302J450378K603607L093773K571223J337704j29084n90623
$$ plain form
4491 30417035 29157135 27093242 24870070 22837548 21344142 20595075 20276216 20156460 19892674
4482 19892674 19237312 18480843 17415901 15988253 14365035 12834191 11467727 9980603
4474 9980603 8700473 7590183 6772432 6212764 5661790 5345118 4972231 4712090 4623850
4465 4623850 4399287 4240277 4032392 3886995 3800664 3623254 3482512 3401436 3344534 3271491
4455 3271491 3173379 3054934 3077526 3035169 2962174 2894173 2929409 2856654 2858356 2928056 2932271 2989334
4443 2989334 3018130 3115139 3104331 3005173 3004499 3004079 2964778 2748704 2706269 2695341 2763785 2755961
4431 2755961 2683016 2689094 2711628 2678235 2577398 2550955 2458251 2450702 2408418 2325559 2187682
4420 2187682 2155990 2147337 2098806 1989298 1990267 1970261 1939537 1872459 1731423 1683923 1623934 1636010
$$ packed form
4491C0417035j259900k063893k223172k032522j493406p49067l18859j19756k63786
4482A9892674o55362p56469j064942j427648j623218j530844j366464j487124
4474I980603j280130j110290q17751n59668n50974l16672l72887k60141q8240
4465D623850k24563j59010k07885j45397q6331j77410j40742q1076n6902p3043
4455C271491r8112j18445K2592m2357p2995o8001L5236p2755J702O9700M215N7063
4443B989334K8796R7009j0808r9158o74m20l9301k16074m2435j0928O8444p824
4431B755961p2945O078K2534l3393j00837k6443r2704p549m2284q2859j37877
4420B187682l1692q653m8531j09508R69k0006l0724o7078j41036m7500n9989J2076
$$ plain form
4408 1636010 1606460 1614534 1616138 1635888 1733889 1694949 1654426 1633874 1649753 1633562 1558215 1551458
4396 1551458 1622122 1627363 1630854 1553647 1455643 1465925 1562168 1517870 1442029 1397916 1436206 1480112
4384 1480112 1536808 1484348 1488169 1596902 1694659 1607598 1561430 1509760 1413202 1426675 1368662
4373 1368662 1270188 1258775 1244688 1300216 1284823 1262502 1365536 1384077 1427101 1377523 1367457
4362 1367457 1412638 1410669 1563619 1531562 1426651 1488467 1535834 1631132 1745173 1878311 2102824
4351 2102824 2376089 2520565 2528290 2475039 2493247 2424701 2321778 2204973 2107592 2105827 2037330
4340 2037330 1930859 1871412 1776601 1742233 1727433 1639390 1587393 1618564 1654907 1681475 1683855
4329 1683855 1668678 1679233 1682967 1711042 1698782 1702758 1811356 1792140 1743628 1766276 1767028 1754166
$$ packed form
4408A636010k9550Q074J604J9750R8001l8940m0523k0552J5879j6191p5347o757
4396A551458P0664N241L491p7207r8004J0282R6243m4298p5841m4113L8290M3906
4384A480112N6696n2460L821J08733R7757q7061m6168n1670r6558J3473n8013
4373A368662r8474j1413j4087N5528j5393k2321J03034J8541M3024m9578j0066
4362A367457M5181j969J52950l2057j04911O1816M7367R5298J14041J33138K24513
4351B102824K73265J44476P725n3251J8208o8546j02923j16805r7381j765o8497
4340B037330j06471n9447r4811l4368j4800q8043n1997L1171L6343K6568K380
4329A683855j5177J0555L734K8075j2260L976J08598j9216m8512K2648P52j2862
$$ plain form
4317 1754166 1756126 1709252 1709540 1668727 1794474 1859608 1829429 1848607 1935325 2093071 2047985 2044383
4305 2044383 2141351 2207837 2234429 2255075 2278928 2307034 2373523 2439183 2557409 2618439 2779902
4294 2779902 2978266 3164259 3332826 3589053 3854526 4121929 4292387 4459142 4625335 4959987
4284 4959987 5223607 5437571 5731415 6192909 6732441 7381692 8084845 8787780 9618064 10392570
4274 10392570 11049493 11540703 12020847 12515959 12940562 13391763 13858480 14516533 15428853
4265 15428853 16575468 17948390 19448479 21024270 22525609 23878460 24855322 25529146
4257 25529146 25991762 26247556 26342315 26493911 26811242 27304836 28191443 29388197 30802601
4248 30802601 32544677 34265623 35801289 36907311 37533270 37788413 37621444 37127696 36357111
$$ packed form
4317A754166J960m6874K88m0813J25747O5134l0179J9178Q6718J57746m5086l602
4305B044383R6968O6486K6592K0646K3853K8106O6489O5660J18226O1030J61463
4294B779902J98364J85993J68567K56227K65473K67403J70458J66755J66193L34652
4284D959987K63620K13964K93844M61494N39532O49251P03153P02935Q30284P74506
4274A0392570O56923M91210M80144M95112M24603M51201M66717O58053R12320
4265A5428853J146615J372922J500089J575791J501339J352851R76862O73824
4257B5529146M62616K55794R4759J51596L17331M93594Q86607J196754J414404
4248C0802601J742076J720946J535666J106022O25959K55143j66969m93748p70585
$$ plain form
4239 36357111 35427565 34699141 34197444 34040603 34202746 34669517 35317934 36065530 36565263
4230 36565263 36877548 36836572 36508991 35702971 34542874 33081394 31538286 30057340 28566076
4221 28566076 27301780 26343942 25644784 25202707 24878024 24691709 24465079 24122543 23539128
4212 23539128 22649900 21568487 20278683 18915164 17646687 16382113 15180455 14159744
4204 14159744 13325003 12718587 12132481 11681979 11269405 10975744 10663673 10157114 9547796
4195 9547796 8988257 8368230 7777609 7093947 6468536 6026136 5518221 5168633 4871825 4630882
4185 4630882 4435201 4261033 4159950 3984003 3743120 3610474 3538273 3302922 3077842 2888986
4175 2888986 2779550 2655279 2535663 2400366 2301681 2210469 2113789 2087561 2021652 1927041 1987443
$$ packed form
4239C6357111r29546p28424n01697j56841J62143M66771O48417P47596M99733
4230C6565263L12285m0976l27581q06020j160097j461480j543108j480946j491264
4221B8566076j264296r57838o99158m42077l24683j86315k26630l42536n83415
4212B3539128q89228j081413j289804j363519j268477j264574j201658j020711
4204A4159744q34741o06416n86106m50502m12574k93661l12071n06559o09318
4195I547796n59539o20027n90621o83662o25411m42400n07915l49588k96808k40943
4185D630882j95681j74168j01083j75947k40883j32646p2201k35351k25080j88856
4175B888986j09436j24271j19616j35297r8685r1212r6680k6228o5909r4611O0402
$$ plain form
4164 1987443 1963065 1847217 1756402 1756884 1848834 1813349 1736195 1656095 1578406 1528167 1491156 1397639
4152 1397639 1326594 1279141 1280862 1216870 1145692 1188858 1262045 1284515 1221766 1207312 1194743 1268731
4140 1268731 1254034 1190416 1145741 1117594 1050497 976900 917811 833717 888615 907738 870655
4129 870655 799699 858818 910083 895098 854143 786977 769536 853536 941456 884222 825680 822380
4117 822380 810058 734497 658679 665464 639850 626097 624008 582733 609025 610065 739648 751695
4105 751695 715381 775545 783691 821068 843109 752326 761535 797700 810521 818421 772506 760556
4093 760556 788539 831739 768972 723604 726272 767313 834046 794370 877827 947951 921191 960509
4081 960509 977825 1055538 1120260 1087624 1152657 1076500 1096431 1179189 1144030 1163982 1147491 1170466
$$ packed form
4164A987443k4378j15848r0815M82R1950l5485p7154q0100p7689n0239l7011r3517
4152A397639p1045m7453J721o3992p1178M3166P3187K2470o2749j4454j2569P3988
4140A268731j4697o3618m4675k8147o7097p3597n9089q4094N4898J9123l7083
4129H70655p0956N9119N1265j4985m0955o7166j7441Q4000Q7920n7234n8542l300
4117H22380j2322p5561p5818O785k5614j3753k089m1275K6292J040J29583J2047
4105G51695l6314O0164Q146L7377K2041r0783R209L6165J2821P900m5915j1950
4093G60556K7983M3200o2767m5368K668M1041O6733l9676Q3457P0124k6760L9318
4081I60509J7316P7713O4722l2636O5033p6157J9931Q2758l5159J9952j6491K2975
$$ plain form
4069 1170466 1189963 1167752 1144729 1120257 1161850 1176712 1134094 1059621 1055036 1168159 1314283
4058 1314283 1346425 1359843 1361123 1316892 1349538 1148470 1123477 1095103 1105966 1105793 1056598 1135445
4046 1135445 1132679 1177335 1209933 1134147 1165774 1242442 1309664 1311581 1215197 1226594 1263181 1244093
4034 1244093 1258548 1253045 1311362 1308327 1199257 1197682 1135126 1161025 1130481 1042049 1032275 1043081
4022 1043081 1101572 1133598 1175739 1143939 1034368 1062627 1006256 963093 856867 779935 874877
4011 874877 851094 781507 746365 784442 849516 864188 821714 749483 666308 721204 687522 669661
3999 669661 683878 742674 872879 817291 745868 758088 834799 843640 809611 844075 804471 817664
3987 817664 952683 956759 888651 905580 990002 1144055 1113846 1099460 1140190 1251734 1311382
$$ packed form
4069A170466J9497k2211k3023k4472M1593J4862m2618p4473m585J13123J46124
4058A314283L2142J3418J280m4231L2646k01068k4993k8374J0863j73m9195P8847
4046A135445k766M4656L2598p5786L1627P6668O7222J917r6384J1397L6587j9088
4034A244093J4455n503N8317l035j09070j575o2556K5899l0544q8432r774J0806
4022A043081N8491L2026M2141l1800j09571K8259n6371m3163j06226p6932R4942
4011H74877k3783o9587l5142L8077O5074J4672m2474p2231q3175N4896l3682j7861
3999F69661J4217N8796J30205n5588p1423J2220P6711Q841l4029L4464l9604J3193
3987H17664J35019M076o8108J6929Q4422J54053l0209j4386M0730J11544N9648
$$ plain form
3976 1311382 1282436 1323407 1414184 1457875 1466674 1452043 1468530 1496556 1512493 1519609 1433657 1354273
3964 1354273 1348910 1345451 1322599 1188944 1173265 1238478 1262798 1288369 1242684 1337495 1413156 1408578
3952 1408578 1407814 1505543 1717091 2078507 2459242 2758280 2967839 3077743 3033189 2882953
3942 2882953 2631002 2338254 2160822 1950009 1681391 1613069 1592197 1565992 1615747 1561256
3932 1561256 1611925 1669368 1760788 1808320 1633762 1546337 1458785 1548565 1546989 1466753 1565526
3921 1565526 1662888 1797575 1873138 2117614 2605341 3064310 3432585 3495297 3389427 3221364
3911 3221364 3105797 2920510 2731443 2506495 2374850 2194328 2010813 1771043 1654781 1670529
3901 1670529 1654224 1689753 1704294 1767513 1824416 1836851 1860061 1820926 1763889 1872491 1837584
$$ packed form
3976A311382k8946M0971R0777M3691Q799j4631J6487K8026J5937P116q5952p9384
3964A354273n363l459k2852j33655j5679O5213K4320K5571m5685R4811P5661m578
3952A408578p64R7729K11548L61416L80735K99038K09559J09904m4554j50236
3942B882953k51951k92748j77432k10813k68618o8322k0872k6205M9755n4491
3932A561256N0669N7443R1420M7532j74558q7425q7552Q9780j576q0236R8773
3921A565526R7362J34687P5563K44476M87727M58969L68275O2712j05870j68063
3911C221364j15567j85287j89067k24948j31645j80522j83515k39770j16262J5748
3901A670529j6305L5529J4541O3219N6903J2435K3210l9135n7037J08602l4907
$$ plain form
3890 1837584 1855452 1795711 1784557 1890536 1879711 1811179 1817165 1819412 1890971 1863189 1838696 1889456
3878 1889456 1938825 2040915 2091948 2159635 2236863 2341923 2373333 2283948 2306653 2340460 2439094
3867 2439094 2480772 2372696 2330829 2386467 2433988 2468924 2456214 2450832 2500581 2572915 2625943
3856 2625943 2616367 2575875 2712138 2863757 2782918 2787641 2889934 2960308 3085898 3130098 3164673
3845 3164673 3210509 3320907 3411027 3414914 3399682 3502054 3714417 3764878 3720232 3669038 3811599
3834 3811599 4004426 4072433 4009060 4123510 4284023 4279132 4334588 4476380 4578796 4800201
3824 4800201 4962203 5004546 5104125 5308834 5482651 5659314 5836446 5988630 6190427 6502679
3814 6502679 6865486 7197943 7533790 8111470 8730970 9356858 10103734 10880433 11822777 12928327
$$ packed form
3890A837584J7868n9741j1154J05979j0825o8532N986K247P1559k7782k4493N0760
3878A889456M9369J02090N1033O7687P7228J05060L1410q9385K2705L3807R8634
3867B439094M1678j08076m1867N5638M7521L4936j2710n382M9749P2334N3028
3856B625943r576m0492J36263J51619q0839M723J02293P0374J25590M4200L4575
3845C164673M5836J10398R0120L887j5232J02372K12363N0461m4646n1194J42561
3834C811599J92827O8007o3373J14450J60513m891N5456J41792J02416K21405
3824D800201J62002M2343R9579K04709J73817J76663J77132J52184K01797L12252
3814F502679L62807L32457L35847N77680O19500O25888P46876P76699R42344J105550
$$ plain form
3804 12928327 14257085 15768786 17638783 19897598 22630028 25757653 29423206 33744210
3796 33744210 38671115 43651151 48691340 53826468 58722202 63272742 67001489 70004548
3788 70004548 72230867 73622027 74364604 74542939 74297204 73861074 73551247 73362322 73247434
3779 73247434 73323369 73681789 74085443 74189730 73972547 73243031 71979472 69913980 67186713
3770 67186713 63769135 59700106 55269926 50633394 46008702 41405412 37138875 33214595
3762 33214595 29707070 26552750 23808439 21559688 19550022 17823933 16252675 14915430
3754 14915430 13958391 13067987 12147886 11343059 10700644 10227083 9928004 9598396 9322149
3745 9322149 9044399 8903350 8779876 8607557 8382114 8230897 8104241 7970843 7863040 7675290
$$ packed form
3804A2928327J328758J511701J869997K258815K732430L127625L665553M321004
3796C3744210M926905M980036N040189N135128M895734M550540L728747L003059
3788G0004548K226319J391160P42577J78335k45735m36130l09827j88925j14888
3779G3247434P5935L58420M03654J04287k17183p29516j263559k065492k727267
3770F7186713l417578m069029m430180m636532m624692m603290m266537l924280
3762C3214595l507525l154320k744311k248751k009666j726089j571258j337245
3754A4915430r57039q90404r20101q04827o42415m73561k99079l29608k76247
3745I322149k77750j41049j23474j72319k25443j51217j26656j33398j07803j87750
$$ plain form
3735 7675290 7572947 7412867 7266303 7059660 6894007 6708511 6495602 6397599 6301790 6190713
3725 6190713 6148694 6202012 6235654 6165041 6053823 6059406 5977110 5857458 5735625 5643908 5615225
3714 5615225 5437416 5330361 5278774 5171679 5152506 5137105 5112853 5036904 5051427 5120972 5084886
3703 5084886 5050628 5075315 5169563 5187421 5136051 5160681 5164186 5070846 5072322 5000713 4930634 4896594
3691 4896594 4944457 5059986 5065993 5018966 5067763 5255775 5341133 5338907 5390461 5502012 5587519
3680 5587519 5568083 5628624 5710118 5759399 5867057 5821219 5903921 5978904 6061778 6235683 6355253
3669 6355253 6426882 6630828 6868910 7069528 7283711 7470144 7835890 8190677 8610651 9047820
3659 9047820 9484591 10054117 10773983 11688667 12589626 13633023 15030663 16560733 18265309
$$ packed form
3735G675290j02343j60080j46564k06643j65653j85496k12909r8003r5809j11077
3725F190713m2019N3318L3642p0613j11218N583q2296j19652j21833r1717k8683
3714E615225j77809j07055n1587j07095j9173j5401k4252p5949J4523O9545l6086
3703E084886l4258K4687R4248J7858n1370K4630L505r3340J476p1609p0079l4040
3691D896594M7863J15529O007m7027M8797J88012Q5358k226N1554J11551Q5507
3680E587519j9436O0541Q1494M9281J07658m5838Q2702P4983Q2874J73905J19570
3669F355253P1629K03946K38082K00618K14183J86433L65746L54787M19974M37169
3659I047820M36771N69526P19866R14684R00959J043397J397640J530070J704576
$$ plain form
3650 18265309 20210376 22309395 24504614 26676477 28679200 30453740 31973155 33219521
3642 33219521 33938516 34313542 34275627 33920537 33336909 32539592 31734514 31048154 30695288 30760389
3632 30760389 31314162 32488932 34175015 36346540 38870913 41517745 44089143 46547361
3624 46547361 48624880 50245398 51208614 51622329 51650422 51335558 51036589 50704590 50604430
3615 50604430 50871376 51490573 52413306 53672912 54953741 56172457 57149515 57890408 58174876
3606 58174876 58227376 58093875 57845972 57775704 58087276 59046787 60812063 63480622 66859487
3597 66859487 70957861 75704217 80886586 85988367 90731068 95020926 98396657 100686493
3589 100686493 101771443 101500342 100023739 97201655 93245038 88441696 83062782 77382833
$$ packed form
3650A8265309J945067K099019K195219K171863K002723J774540J519415J246366
3642C3219521P18995L75026l7915l55090n83628p97317q05078o86360l52866O5101
3632C0760389N53773J174770J686083K171525K524373K646832K571398K458218
3624D6547361K077519J620518R63216M13715K8093l14864k98969l31999j00160
3615E0604430K66946O19197R22733J259606J280829J218716R77058P40893K84468
3606E8174876N2500j33501k47903p0268L11572R59511J765276K668559L378865
3597F6859487M098374M746356N182369N101781M742701M289858L375731K289836
3589A00686493J084950k71101j476603k822084l956617m803342n378914n679949
$$ plain form
3581 77382833 71666379 66085845 60763993 55817189 51413983 47655460 44499097 41812521
3573 41812521 39808041 38386510 37444055 36978307 37014296 37631197 38719417 40327898 42457310
3564 42457310 45139164 48296081 51900842 55804920 60069567 64490863 68926950 73433680
3556 73433680 77651318 81511623 84785246 87369178 89154757 90076228 90193385 89378745 87742137
3547 87742137 85254627 82046383 78366841 74317541 69989771 65686447 61426225 57283556
3539 57283556 53474186 50059447 47019620 44338929 42051045 40179379 38544674 37138770
3531 37138770 35925701 34840738 33919090 33031038 32176758 31454172 30811588 30298594 30000878
3522 30000878 29775378 29593073 29584886 29697714 29788592 29858384 30064828 30267836 30363535 30500314
$$ packed form
3581G7382833n716454n580534n321852m946804m403206l758523l156363k686576
3573D1812521k004480j421531r42455m65748L5989O16901J088220J608481K129412
3564D2457310K681854L156917L604761L904078M264647M421296M436087M506730
3556G3433680M217638L860305L273623K583932J785579R21471J17157q14640j636608
3547H7742137k487510l208244l679542m049300m327770m303324m260222m142669
3539E7283556l809370l414739l039827k680691k287884j871666j634705j405904
3531C7138770j213069j084963r21648q88052q54280p22586o42584n12994k97716
3522C0000878k25500j82305q187J12828R0878O9792K06444K03008R5699J36779
$$ plain form
3512 30500314 30827466 31140975 31487864 32056827 32876711 33859423 34961809 36252565 37695099
3503 37695099 39348433 41060773 42832800 44606496 46336496 47938003 49510868 51056801
3495 51056801 52436924 53737921 55019697 56349262 57867546 59600745 61508493 63680496
3487 63680496 66279040 69551914 73425202 78082675 83593728 90101543 97560785 105822703
3479 105822703 114719691 124196774 133932961 143503426 152836995 161628141 169817823 177325814
3471 177325814 184182312 190496462 196484628 202116549 207566312 212769296 217598971 221762639
3463 221762639 225226273 227687029 228810930 228605222 226991432 224087581 219715768 214122861
3455 214122861 207619971 200262933 192319906 183964201 175341962 166595063 157948675 149395622
$$ packed form
3512C0500314L27152L13509L46889N68963Q19884R82712J102386J290756J442534
3503C7695099J653334J712340J772027J773696J730000J601507J572865J545933
3495E1056801J380123J300997J281776J329565J518284J733199J907748K172003
3487F3680496K598544L272874L873288M657473N511053O507815P459242Q261918
3479A05822703Q896988R477083R736187R570465R333569Q791146Q189682P507991
3471A77325814O856498O314150N988166N631921N449763N202984M829675M163668
3463B21762639L463634K460756J123901k05708j613790k903851m371813n592907
3455B14122861o502890p357038p943027q355705q622239q746899q646388q553053
$$ plain form
3447 149395622 140971407 132819806 125105134 117928372 111417689 105676379 100759352 96916872
3439 96916872 94175119 92467153 91703622 91656463 92169949 92964148 93865147 94620766 94996175
3430 94996175 94859338 94375488 93462423 92174198 90577049 88899972 87260615 85635929 84293947
3421 84293947 83145223 82395081 81873189 81673409 81638407 81590979 81423294 81025431 80250100 79012691
3411 79012691 77200395 74947567 72091086 68854518 65393982 61810567 58242084 54646562
3403 54646562 51175544 47881051 44808928 41998533 39414907 37022035 34804197 32717028
3395 32717028 30922307 29198965 27666612 26328032 25155310 24059309 23005256 21901529
3387 21901529 20937861 20039260 19210336 18407146 17749094 17073969 16408230 15948846 15531119
$$ packed form
3447A49395622q424215q151601p714672p176762o510683n741310m917027l842480
3439I6916872k741753j707966p63531m7159N13486P94199R00999P55619L75409
3430I4996175j36837m83850r13065j288225j597149j677077j639357j624686j341982
3421H4293947j148724p50142n21892j99780l5002m7428j67685l97863p75331j237409
3411G9012691j812296k252828k856481l236568l460536l583415l568483l595522
3403E4646562l471018l294493l072123k810395k583626k392872k217838k087169
3395C2717028j794721j723342j532353j338580j172722j096001j054053j103727
3387B1901529r63668q98601q28924q03190o58052o75125o65739m59384m17727
$$ plain form
3378 15531119 15212831 14946229 14833463 14855026 14932235 15078531 15348794 15685187 16010945 16494771
3368 16494771 17144659 17964398 18694181 19432394 20262508 21109382 21867553 22421648 22886162
3359 22886162 23071386 23063899 22716569 22265028 21615074 20931873 20234183 19563544 18798974 18002082
3349 18002082 17141286 16342533 15603621 14830462 14153720 13645394 13123430 12746964 12452610
3340 12452610 12181251 12025383 12059558 12147462 12168856 12253733 12415657 12648118 12965711 13310047
3330 13310047 13740572 14296683 14775846 15401395 16112610 17113434 18133442 19254420 20520814
3321 20520814 21980874 23704285 25734896 28275542 31399533 35078465 39540075 44908512
3313 44908512 51295493 58680811 66998692 76227087 86172852 96619310 107396485 118172552
$$ packed form
3378A5531119l18288k66602j12766K1563P7209J46296K70263L36393L25758M83826
3368A6494771O49888Q19739P29783P38213Q30114Q46874P58171N54095M64514
3359B2886162J85224p487l47330m51541o49954o83201o97690o70639p64570p96892
3349A8002082q60796p98753p38912p73159o76742n08326n21964l76466k94354
3340A2452610k71359j55868L4175Q7904K1394Q4877J61924K32461L17593L44336
3330A3310047M30525N56111M79163O25549P11215J000824J020008J120978J266394
3321B0520814J460060J723411K030611K540646L123991L678932M461610N368437
3313D4908512O386981P385318Q317881R228395R945765J0446458J0777175J0776067
$$ plain form
3305 118172552 128877979 138835234 147674945 154981678 160188395 163190361 163712841 161822710
3297 161822710 157460892 151054353 142898213 133412265 123009337 112179776 101345327 90710715
3289 90710715 80605055 71350804 62909288 55319578 48757883 43086959 38141925 33885176
3281 33885176 30313479 27288138 24665897 22436704 20691194 19171853 17887223 16711692
3273 16711692 15759760 14986971 14211576 13584036 13107214 12690474 12250353 11816958 11569237
3264 11569237 11316147 11056312 10947337 10813774 10610332 10461280 10262677 10109578 10027063 9966404
3254 9966404 9888507 9894527 9866806 9851416 9918043 9901214 9953699 9910571 9910850 9985765 9867327 9765128
3242 9765128 9719232 9670070 9508078 9225676 9033985 8782125 8511785 8167351 7741059 7346164
$$ packed form
3305A18172552J0705427R957255Q839711P306733N206717L001966N22480j890131
3297A61822710m361818o406539q156140r485948j0402928j0829561j0834449j0634612
3289I0710715j0105660r254251q441516p589710o561695n670924m945034m256749
3281C3885176l571697l025341k622241k229193j745510j519341j284630j175531
3273A6711692r51932p72789p75395o27540m76822m16740m40121m33395k47721
3264A1569237k53090k59835j08975j33563k03442j49052j98603j53099q2515o0659
3254I966404p7897O020k7721j5390O6627j6829N2485m3128K79P4915j18438j02199
3242I765128m5896m9162j61992k82402j91691k51860k70340l44434m26292l94895
$$ plain form
3232 7346164 7074913 6698729 6334598 6032605 5739401 5628859 5642721 5576750 5448016 5382254
3222 5382254 5252576 5098979 5037892 4982405 4904878 4780186 4760994 4753597 4845234 4833432 4847665
3211 4847665 5020244 5093303 5060625 5143757 5129228 5288432 5373832 5414219 5538861 5651133 5763947
3200 5763947 5856274 6007916 6089148 6143046 6126329 6200111 6111861 6115629 6153848 6184917 6207049
3189 6207049 6253856 6294841 6322504 6293469 6308164 6325599 6338961 6377777 6388011 6478074 6457596
3178 6457596 6615721 6722799 6796739 6910376 7033246 7300605 7431609 7647048 7930585 8182934
3168 8182934 8399868 8597989 8897624 9086063 9243007 9430976 9666157 9806748 10021939 10194350
3158 10194350 10356944 10524372 10648484 10828468 10974179 11289592 11535357 11792292 12040899
$$ packed form
3232G346164k71251l76184l64131l01993k93204j10542J3862o5971j28734o5762
3222E382254j29678j53597o1087n5487p7527j24692j9192p397R1637j1802J4233
3211D847665J72579P3059l2678Q3132j4529J59204Q5400M0387J24642J12272J12814
3200E763947R2327J51642Q1232N3898j6717P3782q8250L768L8219L1069K2132
3189F207049M6807M0985K7663k9035J4695J7435J3362L8816J0234R0063k0478
3178F457596J58125J07078P3940J13637J22870K67359J31004K15439K83537K52349
3168H182934K16934J98121K99635J88439J56944J87969K35181J40591K15191J72411
3158A0194350J62594J67428J24112J79984J45711L15413K45765K56935K48607
$$ plain form
3149 12040899 12256420 12388255 12555236 12655007 12766706 12782080 12779911 12842271 12895804 12981238 13117901
3138 13117901 13199040 13426708 13551373 13656586 13814089 13958773 14078484 14172933 14344006 14626417
3128 14626417 15130406 15676468 16341201 17264113 18436269 19728323 20949438 21948605 22734483
3119 22734483 23265517 23626979 23863724 23997269 24099640 24343414 24572043 24988836 25462629
3110 25462629 26068660 26811481 27729452 28748453 29917377 31268980 32865089 34689823 36798475
3101 36798475 39161982 41773534 44666661 47907213 51667828 55992199 61315652 67546865
3093 67546865 74812276 83172793 92835905 104051986 117288165 133765463 155146664 183994306
3085 183994306 223234219 274690960 336529361 401526858 459214895 500202568 520536729
$$ packed form
3149A2040899K15521J31835J66981R9771J11699J5374k169O2360N3533Q5434J36663
3138A3117901Q1139K27668J24665J05213J57503J44684J19711R4449J71073K82411
3128A4626417N03989N46062O64733R22912J172156J292054J221115R99167P85878
3119B2734483N31034L61462K36745J33545J02371K43774K28629M16793M73793
3110B5462629O06031P42821R17971J019001J168924J351603J596109J824734K108652
3101C6798475K363507K611552K893127L240552L760615M324371N323453O231213
3093F7546865P265411Q360517R663112J1216081J3236179J6477298K1381201K8847642
3085A83994306L9239913N1456741O1838401O4997497N7688037M0987673K0334161
$$ plain form
3078 520536729 521838497 508830569 487995395 467268626 453181702 447342620 445811174
3071 445811174 442012225 430564750 410128467 382224002 348380069 310794111 272501811
3064 272501811 236099519 202796451 173147767 147803077 127035913 110516060 97417504
3057 97417504 86882963 78229367 70680341 64206490 58592891 53619349 49266936 45498249
3049 45498249 42373543 39650116 37248537 35174145 33352513 31870235 30431537 29071274
3041 29071274 27858104 26800379 25844755 24891432 24064004 23370403 22746625 22054146 21380622
3032 21380622 20724789 20121242 19504821 18902756 18304444 17829008 17322758 16919868 16596629
3023 16596629 16243734 15895474 15544669 15119060 14737783 14284004 13847781 13376697 12943643
$$ packed form
3078E20536729J301768j3007928k0835174k0726769j4086924n839082j531446
3071D45811174l798949j1447475k0436283k7904465l3843933l7585958l8292300
3064B72501811l6402292l3303068k9648684k5344690k0767164j6519853j3098556
3057I7417504j0534541q653596p549026o473851n613599m973542m352413l768687
3049D5498249l124706k723427k401579k074392j821632j482278j438698j360263
3041B9071274j213170j057725r55624r53323q27428o93601o23778o92479o73524
3032B1380622o55833o03547o16421o02065n98312m75436n06250m02890l23239
3023A6596629l52895l48260l50805m25609l81277m53779m36223m71084m33054
$$ plain form
3014 12943643 12537794 12039633 11591347 11235945 10821773 10450016 10034753 9577607 9161986
3005 9161986 8725561 8405072 8017549 7734405 7437777 7132847 6897279 6660318 6345174 6162311
2995 6162311 5887783 5664423 5471661 5249922 5137047 5033250 4877110 4795205 4740539 4581172
2985 4581172 4505487 4505044 4508027 4518252 4472850 4503479 4460822 4470876 4459437 4461099 4387636 4265836
2973 4265836 4242125 4143262 4004842 3855855 3778971 3738408 3616792 3505499 3423389 3303722
2963 3303722 3190840 3180182 3085929 2995165 2945567 2807371 2643615 2521683 2462682 2416009 2363383
2952 2363383 2311896 2179520 2143524 2116927 2034345 1975777 1947214 1952613 1994834 1988913 1999368 2028640
2940 2028640 2049481 2143441 2162484 2232431 2137269 2072114 2038845 1972207 1870034 1832563 1758161
$$ packed form
3014A2943643m05849m98161m48286l55402m14172l71757m15263m57146m15621
3005I161986m36425l20489l87523k83144k96628l04930k35568k36961l15144j82863
2995F162311k74528k23360j92762k21739j12875j03797j56140q1905n4666j59367
2985D581172p5685m43K983J0225m5402L0629m2657J0054j1439J662p3463j21800
2973D265836k3711r8863j38420j48987p6884m0563j21616j11293q2110j19667
2963C303722j12882j0658r4253r0764m9598j38196j63756j21932n9001m6673n2626
2952B363383n1487j32376l5996k6597q2582n8568k8563N399M2221n921J0455K9272
2940B028640K0841R3960J9043O9947r5162o5155l3269o6638j02173l7471p4402
$$ plain form
2929 1758161 1698466 1682855 1725727 1773435 1737818 1642659 1619595 1638792 1624044 1581519 1515912
2918 1515912 1344999 1295694 1272377 1219403 1180389 1117643 1075851 1013885 924486 821104 756289
2907 756289 726461 673327 619581 626366 652019 600135 605479 592814 514651 444351 479234 537097
2895 537097 491404 433006 397180 495441 474176 478878 461095 417859 445188 508298 597068 662921
2883 662921 562973 626619 686249 764336 807437 760406 809232 869241 936520 958416 893543 846890
2871 846890 893931 871158 870143 812684 751390 799825 820600 821846 898599 892046 877393 795573
2859 795573 788096 794935 753794 698224 727122 669479 622351 617282 613939 504936 469421 398733
2847 398733 329361 248546 152401 106566 129090 137715 150149 149402 160840 178068 203628 160911
$$ packed form
2929A758161n9695j5611M2872M7708l5617r5159k3064J9197j4748m2525o5607
2918A515912j70913m9305k3317n2974l9014o2746m1792o1966q9399j03382o4815
2907G56289k9828n3134n3746O785K5653n1884N344j2665p8163p0300L4883N7863
2895E37097m5693n8398l5826R8261k1265M702j7783m3236K7329O3110Q8770O5853
2883F62921r9948O3646N9630P8087M3101m7031M8826O0009O7279K1896o4873m6653
2871H46890M7041k2773j015n7459o1294M8435K0775J246P6753o553j4653q1820
2859G95573p477O839m1141n5570K8898n7643m7128n069l343j09003l5515p0688
2847C98733o9372q0815r6145m5835K2524Q625J2434p47J1438J7228K5560m2717
$$ plain form
2835 160911 105423 134621 59847 55050 54074 114087 76258 88617 130779 220664 232045 313369
2823 313369 307922 291980 342803 439544 506460 598676 609799 652477 714681 700329 748603 772709
2811 772709 760385 747742 774499 816496 829494 870126 961143 1121380 1244449 1466036 1764465
2800 1764465 2023230 2312705 2514414 2714620 2807727 2770881 2768620 2728160 2613319 2568333 2591700
2789 2591700 2601212 2549031 2418120 2311551 2166815 2001675 1808483 1634658 1363496 1175152
2779 1175152 1072762 898058 832988 791562 741115 690438 633588 624857 537468 514803 483394
2768 483394 471211 449430 452601 484599 482908 492465 487568 458004 395221 332363 344342 395823
2756 395823 398403 388577 389973 415316 417058 421321 377372 397830 431161 382439 327521 337616 285418
$$ packed form
2835A60911n5488K9198p4774m797r76O0013l7829J2359M2162Q9885J1381Q1324
2823C13369n447j5942N0823R6741O6916R2216J1123M2678O2204j4352M8274K4106
2811G72709j2324j2643K6757M1997J2998M0632R1017J60237J23069K21587K98429
2800A764465K58765K89475K01709K00206R3107l6846k261m0460j14841m4986K3367
2789B591700R512n2181j30911j06569j44736j65140j93192j73825k71162j88344
2779A175152j02390j74704o5070m1426n0447n0677n6850q731q7389k2665l1409
2768D83394j2183k1781L171L1998j691R557m897k9564o2783o2858J1979N1481
2756C95823K580r826J396K5343J742M263m3949K0458L3331m8722n4918J0095n2198
$$ plain form
2743 285418 301076 218688 261608 285650 276413 275036 244136 269754 169226 129874 138314 86315
2731 86315 41081 55660 93824 155032 112791 40614 70985 122703 197625 149922 153858 124735
2719 124735 102507 164235 164562 124851 64511 162488 197301 175763 151767 131868 111781 77060
2707 77060 75619 162761 171207 183680 222535 319452 290384 146783 178999 140926 123870 118940
2695 118940 44562 351 -34312 -58519 -30497 -127343 -116840 -62289 52470 -10542 -44715
2684 -44715 9510 1719 -39188 -15761 56248 88491 42358 28775 3371 21082 51046 -17933
2672 -17933 -12967 -52424 -67927 1538 40100 32987 127163 226447 232322 203711 202782 151015 117491
2659 117491 149354 96087 49785 -30169 -103124 -38474 47558 -3953 -68307 -91425 -72612 -34070
$$ packed form
2743B85418J5658q2388M2920K4042r237j377l0900K5618j00528l9352Q440n1999
2731H6315m5234J4579L8164O1208m2241p2177L0371N1718P4922m7703L936k9123
2719A24735k2228O1728L27l9711o0340R7977L4813k1538k3996j9899k0087l4721
2707G7060j441Q7142Q446J2473L8855R6917k9068j43601L2216l8073j7056m930
2695A18940p4378m4211l4663k4207K8022r6846J0503N4551J14759o3012l4173
2684d4715N4225p791m0907K3427P2009L2243m6133j3583k5404J7711K9964o8979
2672a7933M966l9457j5503O9465L8562p113R4176R9284N875k8611r29n1767l3524
2659A17491L1863n3267m6302p9954p2955O4650Q6032n1511o4354k3118J8813L8542
$$ plain form
2647 -34070 -46658 14422 7565 15755 41886 64815 45534 43480 67255 -6740 19297 8980
2635 8980 -87734 -97444 -97980 -149711 -146479 -114265 -53788 -50087 -63552 18539 47090 5211 16810
2622 16810 59273 18726 40875 47284 58539 72852 121132 108014 15676 29499 124364 156186
2610 156186 87647 68707 157688 125348 137778 114338 154459 206135 224793 209151 217485 145878
2598 145878 126404 160186 125871 34905 28869 116362 106651 101568 141728 191450 169431 136349
2586 136349 224846 323460 349737 367786 373383 342295 237175 296103 364165 387991 208341
2575 208341 111175 160498 166750 74747 -16518 391 21534 39469 -45156 -23687 11958 89597
2563 89597 136525 130553 99780 80575 122584 138630 22972 40004 19803 2257 -11744 -44203
$$ packed form
2647c4070j2588O1080o857Q190K6131K2929j9281k054K3775p3995K6037j0317
2635H980r6714r710n36n1731L232L2214O0477L701j3465Q2091K8551m1879J1599
2622A6810M2463m0547K2149O409J1255J4313M8280j3118r2338J3823R4865L1822
2610A56186o8539j8940Q8981l2340J2430k3440M0121N1676J8658j5642Q334p1607
2598A45878j9474L3782l4315r0966o036Q7493r711n083M0160M9722k2019l3082
2586A36349Q8497R8614K6277J8049N597l1088j05120N8928O8062K3826j79650
2575B08341r7166M9323O252r2003r1265J6909K1143J7935q4625K1469L5645P7639
2563H9597M6928n972l0773j9205M2009J6046j15658J7032k0201j7546j4001l2459
$$ plain form
2551 -44203 -80330 -77055 -15331 14313 21419 -17319 18069 21538 39045 25529 -3251 63638
2539 63638 69190 -16001 -46042 -49760 -36237 -117182 -166715 -159799 -146725 -150435 -154768 -98244 -63746
2526 -63746 -89009 -101664 -176335 -181494 -112202 -69141 -69142 -108985 -172129 -137307 -96591 -102147 -159887
2513 -159887 -182105 -127383 -94788 -77252 -43952 -167869 -76352 23037 55432 -29859 -70097
2502 -70097 19637 66083 23365 -48220 -8812 14417 30125 -87090 -38981 40109 71634 157227
2490 157227 185413 141581 170200 211631 240702 220498 186871 276591 256125 146815 105775
2479 105775 142741 177842 131922 81337 106017 77474 70737 48711 73033 110971 155511 196936
2467 196936 168420 122427 128612 143255 87586 66091 13952 -26331 -24006 -43429 -90366 -84245
$$ packed form
2551d4203l6127L275O1724K9644P106l8738L5388L469J7507j3516k8780O6889
2539F3638N552q5191l0041l718J3523q0945m9533O916J3074l710m333N6524L4498
2526f3746k5263j2655p4671n159O9292M3061jl9843o3144L4822M0716n556n7740
2513a59887k2218N4722L2595J7536L3300j23917R1517R9389L2395q5291m0238
2502g0097Q9734M6446m2718p1585L9408K3229J5708j17215M8109P9090L1525Q5593
2490A57227K8186m3832K8619M1431K9071k0204l3627Q9720k0466j09310m1040
2479A05775L6966L5101m5920n0585K4680k8543o737k2026K4322L7938M4540M1425
2467A96936k8516m5993O185J4643n5669k1495n2139m0283K325j9423m6937O121
$$ plain form
2455 -84245 -54443 -29388 106740 116299 60332 61508 168568 168405 128691 144285 158667 191181
2443 191181 203046 227843 182703 136655 118289 83130 101911 173128 83349 165229 162047 104022
2431 104022 227018 358773 370590 326990 286667 242475 219703 197944 122348 125685 67148
2420 67148 55491 34591 113285 196532 172049 240247 277924 251776 290800 342783 344446 351452
2408 351452 423897 456460 423037 469800 401081 425441 449811 389394 370324 427219 415106 457571
2396 457571 493146 509389 430054 425237 537901 537211 475623 448116 493326 528017 463563 361799
2384 361799 379435 411262 416237 442980 495010 392097 333153 395672 428145 402233 444750 578847
2372 578847 586422 554974 576393 600898 656167 670320 620593 610921 586117 578945 632400 626393
$$ packed form
2455h4245K9802K5055J36128R559n5967J176J07060j63l9714J5594J4382L2514
2443A91181J1865K4797m5140m6048j8366l5159J8781P1217q9779Q1880l182n8025
2431A04022J22996J31755J1817m3600m0323m4192k2772k1759p5596L337n8537
2420F7148j1657k0900P8694Q3247k4483O8198L7677k6148L9024N1983J663P006
2408C51452P2445L2563l3423M6763o8719K4360K4370o0417j9070N6895j2113M2465
2396D57571L5575J6243p9335m817J12664o90o1588k7507M5210L4691o4454j01764
2384C61799J7636L1827M975K6743N2030j02913n8944O2519L2473k5912M2517J34097
2372E78847P575l1448K1419K4505N5269J4153m9727r672k4804p172N3455o007
$$ plain form
2360 626393 655209 735088 832364 885646 874633 958717 997472 1115334 1155960 1096790 1222521
2349 1222521 1311537 1409686 1385699 1463615 1529687 1638115 1728245 1871313 1885360 2101960 2386545
2338 2386545 2622864 2856461 3166610 3754760 4499153 5107727 5673052 6240603 6839023 7371442
2328 7371442 7836749 8395760 9356394 10653082 12550983 15124866 19303000 27528688 41041442
2319 41041442 56752070 71103202 79089744 79284760 76248555 70072807 61186627 51134821
2311 51134821 42337215 34830511 27803273 21998842 17655500 14570794 12814241 11642594
2303 11642594 10797336 9970798 9044822 8091378 7124415 6207559 5566406 4998671 4480322
2294 4480322 4051507 3734521 3522392 3365910 3184251 3070774 3015516 2873351 2777497 2712071
$$ packed form
2360F26393K8816P9879R7276N3282j1013Q4084L8755J17862M0626n9170J25731
2349A222521Q9016R8149k3987P7916O6072J08428R0130J43068J4047K16600K84585
2338B386545K36319K33597L10149N88150P44393O08574N65325N67551N98420N32419
2328G371442M65307N59011R60634J296688J897901K573883M178134Q225688J3512754
2319D1041442J5710628J4351132P986542J95016l036205o175748q886180j0051806
2311E1134821q797606p506704p027238n804431m343342l084706j756553j171647
2303A1642594q45258q26538r25976r53444r66963r16856o41153n67735n18349
2294D480322m28815l16986k12129j56482j81659j13477n5258j42165r5854o5426
$$ plain form
2284 2712071 2549016 2453617 2421399 2325694 2088724 1978104 1928060 1839900 1808526 1675349 1604850
2273 1604850 1579416 1609591 1661326 1700094 1633308 1642629 1636318 1562486 1469915 1395324 1420060 1392853
2261 1392853 1333128 1277101 1171195 1187431 1115130 1055561 1093844 923726 866671 837228 789596
2250 789596 736506 670364 710227 708523 657514 682967 729419 694148 610943 578811 594883 526616
2238 526616 525094 448383 402429 405477 415900 426920 476824 351562 241526 275596 397851
2227 397851 378011 341469 317301 301843 370217 362942 290826 364931 359331 331701 334008 288019
2215 288019 241639 197560 192381 194942 131398 160979 157196 153242 144669 207742 219463 171042 139436
2202 139436 205601 180004 141876 76129 86765 76537 48293 71443 56676 85525 42943 95690
$$ packed form
2284B712071j63055r5399l2218r5705k36970j10620n0044q8160l1374j33177p0499
2273A604850k5434L0175N1735L8768o6786R321o311p3832r2571p4591K4736k7207
2261A392853n9725n6027j05906J6236p2301n9569L8283j70118n7055k9443m7632
2250G89596n3090o6142L9863j704n1009K5453M6452l5271q3205l2132J6072o8267
2238E26616j522p6711m5954L048J0423J1020M9904j25262j10036L4070J22255
2227C97851j9840l6542k4168j5458O8374p275p2116P4105n600k7630K307m5989
2215B88019m6380m4079n179K561o3544K9581l783l954q573O3073J1721m8421l1606
2202A39436O6165k5597l8128o5747J0636j0228k8244K3150j4767K8849m2582N2747
$$ plain form
2190 95690 105297 69313 99445 59435 70668 122922 91890 89291 116568 130346 132902 127898 142830
2177 142830 124311 60497 56825 8507 65454 30439 62870 40447 5615 114267 84738 40596
2165 40596 143402 129375 59366 4770 5591 102889 98332 102970 128051 67260 14099 -34502
2153 -34502 -15914 -32574 -113543 -139718 -128658 -127901 -99509 -80971 -51494 -53188 -10468 -19970 -13966
2140 -13966 13381 4772 -11094 -80326 -88808 -35665 -30209 -58718 -108117 -157665 -154819 -123621 -122217
2127 -122217 -113371 -97812 -82833 -87131 -50959 -57903 10557 47016 26543 35739 36478 -39877 -64158
2114 -64158 -39214 -49121 -67739 -34793 -41081 -100462 -117179 -108241 -41500 -42769 -96024 -110537 -132389
2101 -132389 -85084 -68365 -61795 -44099 -47267 35844 77960 37537 23298 -15902 18590 -33206
$$ packed form
2190I5690R607l5984L0132m0010J1233N2254l1032k599K7277J3778K556n004J4932
2177A42830j8519o3814l672m8318N6947l5015L2431k2423l4832J08652k9529m4142
2165D0596J02806j4027p0009n4596Q21R7298m557M638K5081o0791n3161m8601
2153c4502J8588j6660q0969k6175J1060P57K8392J8538K9477j694M2720r502O004
2140a3966K7347q609j5866o9232q482N3143N456k8509m9399m9548K846L1198J404
2127a22217Q846J5559J4979m298L6172o944O8460L6459k0473R196P39p6355k4281
2114f4158K4944r907j8618L2946o288n9381j6717Q938O6741j269n3255j4513k1852
2101a32389M7305J6719O570J7696l168Q3111M2116m0423j4239l9200L4492n1796
$$ plain form
2089 -33206 -136451 -103767 -103693 -165235 -175426 -158548 -146851 -149633 -108328 -68894 -122336 -110818
2077 -110818 -81819 -27803 -85523 -151574 -161268 -136642 -133947 -135216 -122074 -161979 -205113 -165817
2065 -165817 -147247 -132582 -115448 -100912 -56702 -35878 -40346 26789 23363 -8994 -27590 -34510
2053 -34510 24347 45200 30206 82889 128207 269417 339930 339207 286325 191636 191165 172751
2041 172751 111431 95024 40456 32556 15914 -62554 -56630 -28166 -55807 -94125 -78663 -57149
2029 -57149 -104286 -77365 -63038 -113840 -112291 -109251 36682 74414 28288 23180 10562 -19769
2017 -19769 -82847 -102376 -105000 -186652 -160546 -117254 -118752 -97560 -114697 -698 -114997 -146649
2005 -146649 -69026 -117896 -75552 -51326 -71632 -82918 -77704 -120257 -118141 -93359 -101220 -88423
$$ packed form
2089c3206j03245L2684P4o1542j0191J6878J1697k782M1305L9434n3442J1518
2077a10818K8999N4016n7720o6051r694K4626K695j269J3142l9905m3134L9296
2065a65817J8570J4665J7134J4536M4210K0824m468O7135l426l2357j8596o920
2053c4510N8857K0853j4994N2683M5318J41210P0513p23n2882r4689m71j8414
2041A72751o1320j6407n4568p900j6642p8468N924K8464k7641l8318J5462K1514
2029e7149m7137K6921J4327n0802J549L040J45933L7732m6126n108j2618l0331
2017a9769o3078j9529k624q1652K6106M3292j498K1192j7137J13999j14299l1652
2005a46649P7623m8870M2344K4226k0306j1286N214m2553K116K4782p861J2797
$$ plain form
1993 -88423 4249 -86594 -179661 -84354 -84834 -47659 -117101 -87613 -31658 -104170 -54045 442
1981 442 -79390 -169708 -172810 -80787 -96942 -155783 -124873 -165910 -216357 -149900 -149796 -45661 -109788
1968 -109788 -138547 -94925 -172569 -106956 -167467 -135515 -98236 -79619 -67498 -58646 -36205 -127752
1956 -127752 -200402 -190468 -186933 -189038 -210158 -174978 -135032 -160958 -113973 -69064 -118386 -50607
1944 -50607 -81605 -58497 -117631 -114115 -62283 -127590 -84698 -115467 -171569 -127686 -174926 -149812
1932 -149812 -149805 -180015 -166110 -180783 -143714 -79848 -90206 -71907 -75390 -37172 -88375 -74855 3670
1919 3670 -49694 -114327 -150510 -140500 -161296 -193893 -169769 -194896 -234071 -190217 -213549 -195647
1907 -195647 -220470 -197037 -127064 -132246 -109830 -76484 -71796 -67838 -108298 -68625 -104450 -153931
$$ packed form
1993h8423R2672r0843r3067R5307m80L7175o9442K9488N5955p2512N0125N4487
1981D42p9832r0318l102R2023j6155n8841L0910m1037n0447O6457J04J04135o4127
1968a09788k8759M3622p7644O5613o0511L1952L7279J8617J2121Q852K2441r1547
1956a27752p2650R934L535k105k1120L5180L9946k5926M6985M4909m9322O7779
1944e0607l0998K3108n9134L516N1832o5307M2892l0769n6102M3883m7240K5114
1932a49812Pl0210J3905j4673L7069O3866j0358J8299l483L8218n1203J3520P8525
1919C670n3364o4633l6183J0010k0796l2597K4124k5127l9175M3854k3332J7902
1907a95647k4823K3433O9973n182K2416L3346M688L958m0460L9673l5825m9481
$$ plain form
1895 -153931 -112954 -136932 -145701 -215362 -250385 -174916 -298669 -261685 -128015 -149850 -120385
1884 -120385 -172349 -64451 -52378 -133534 -76039 -81013 -124188 -93417 -123952 -98933 -129417 -133177
1872 -133177 -164924 -157296 -163705 -260454 -210124 -164662 -160515 -222941 -222130 -183350 -121404 -111361 -86013
1859 -86013 -143351 -135023 -151395 -119610 -72226 -38743 -12318 -86376 -204452 -148201 -167216 -142350
1847 -142350 -89042 -142166 -137127 -133349 -99106 -138102 -109739 -67521 -121680 -116008 -120900 -161172
1835 -161172 -141673 -186532 -174294 -71139 -197614 -215700 -171947 -206762 -170525 -152113 -140348
1824 -140348 -197611 -176027 -141316 -98432 -77187 -59966 -33084 -104853 -166734 -134795 -164714 -193615
1812 -193615 -266884 -268158 -181211 -278663 -256929 -155610 -97652 -117739 -181329 -94179 -26935 -18178
$$ packed form
1895a53931M0977k3978q769o9661l5023P5469j23753L6984J33670k1835K9465
1884a20385n1964J07898J2073q1156N7495m974m3175L0771l0535K5019l0484l760
1872a33177l1747P628o409r6749N0330M5462M147o2426Q11L8780O1946J0043K5348
1859h6013n7338Q328j6372L1785M7384L3483K6425p4058j18076N6251j9015K4866
1847a42350N3308n3124N039L778L4243l8996K8363M2218n4159N672m892m0272
1835a61172J9499m4859J2238J03155j26475j8086M3753l4815L6237J8412J1765
1824a40348n7263K1584L4711M2884K1245J7221K6882p1769o1881L1939k9919k8901
1812a93615p3269j274Q6947r7452K1734J01319N7958k0087o3590Q7150O7244Q757
$$ plain form
1800 -18178 -82072 -100793 -59517 -96481 -26360 -99840 -210500 -198392 -149842 -136330 -139307 -189116
1788 -189116 -166224 -204630 -202845 -138503 -139425 -97725 -47232 -108180 -151717 -187204 -181730 -209703
1776 -209703 -185839 -184029 -242288 -182778 -156537 -210437 -189898 -185347 -173519 -112593 -182924 -128138
1764 -128138 -155018 -131442 -107180 -73672 -171536 -298988 -261797 -267824 -351361 -296227 -230810 -208173
1752 -208173 -160809 -133605 -115663 -94663 -7858 18163 -110103 -158753 -98622 -72090 -169471
1741 -169471 -258690 -310425 -217395 -139419 -188280 -204752 -167358 -98074 -94831 -103360 -17315 -32538
1729 -32538 -100826 -58962 -86531 -103937 -91637 -86386 -96668 -169076 -162078 -197243 -215208 -227668
1717 -227668 -262657 -208455 -161994 -190618 -149049 -122532 -129315 -121905 -128680 -62910 -57827 -138428
$$ packed form
1800a8178o3894j8721M1276l6964P0121p3480j10660J2108M8550J3512k977m9809
1788a89116K2892l8406J785O4342r22M1700N0493o0948m3537l5487N474k7973
1776b09703K3864J810n8259N9510K6241n3900K0539M551J1828O0926p0331N4786
1764a28138k6880K3576K4262L3508r7864j27452L7191o027q3537N5134O5417K2637
1752b08173M7364K7204J7942K1000Q6805K6021j28266m8650O0131K6532r7381
1741a69471q9219n1735R3030P7976m8861j6472L7394O9284L243q529Q6045j5223
1729c2538o8288M1864k7569j7406J2300N251j0282p2408O998l5165j7965j2460
1717b27668l4989N4202M6461k8624M1569K6517o783P410o775O5770N083q0601
$$ plain form
1705 -138428 -172766 -249789 -325016 -315640 -225283 -141173 -171552 -255237 -164594 -154621 -139908 -93520
1693 -93520 -153711 -185637 -167986 -117864 -26788 -32579 -128951 -129242 -66243 -120511 -135639 -154903
1681 -154903 -144224 -168295 -211584 -169404 -130814 -112332 -116894 -155076 -199244 -147053 -122696 -33941
1669 -33941 -142198 -252684 -191196 -78684 -126663 -169034 -145222 -101672 -149833 -118744 -87942
1658 -87942 -107093 -121314 -159552 -157502 -163102 -168224 -130907 -178117 -151435 -124807 -130532 -125155 -141949
1645 -141949 -151492 -160624 -97300 -34572 -23609 -8651 -123253 -109553 -59526 -131678 -92648 -161496
1633 -161496 -193404 -129663 -200204 -203021 -126748 -31209 -69050 -130359 -137711 -110983 -85747 -46649
1621 -46649 -26577 -36261 -71266 -155820 -111358 -112356 -129696 -94570 -65875 -123670 -242652 -253171
$$ packed form
1705a38428l4338p7023p5227R376R0357Q4110l0379q3685R0643R973J4713M6388
1693i3520o0191l1926J7651N0122R1076n791r6372k91O2999n4268j5128j9264
1681a54903J0679k4071m3289M2180L8590J8482m562l8182m4168N2191K4357Q8755
1669c3941j08257j10486O1488J12512m7979m2371K3812M3550m8161L1089L0802
1658h7942j9151j4221l8238K050n600n122L7317m7210K6682K6628n725N377j6794
1645a41949r543r132O3324O2728J0963J4958j14602J3700N0027p2152L9030o8848
1633a61496l1908O3741p0541k817P6273R5539l7841o1309p352K6728K5236L9098
1621d6649K0072r684l5005q4554M4462r98j7340L5126K8695n7795j18982j0519
$$ plain form
1609 -253171 -151632 -201859 -248072 -203998 -170704 -88311 -64335 -97319 -62774 -89386 -86223 -110883
1597 -110883 -167715 -145088 -124794 -122508 -189386 -209537 -188853 -108512 -195846 -236546 -156834 -137152
1585 -137152 -110894 -97260 -41026 -60710 -47890 -52624 -33555 -4101 -73348 -47212 -57850 -135104
1573 -135104 -181597 -215969 -208064 -190837 -214501 -203361 -146062 -130135 -83033 9024 36564 -20334
1561 -20334 -6137 9325 -21027 -19967 -34425 -109366 -162992 -204664 -166330 -157781 -182740 -168739
1549 -168739 -178960 -158229 -108907 -122383 -102033 -85315 -77699 -112248 -80360 15087 51556 41950
1537 41950 -9651 -57589 -133225 -141315 -215562 -305104 -285730 -210149 -121876 -70473 -117501 -86300
1525 -86300 -39961 -83171 -115948 -117661 -107999 -135932 -154062 -121771 -145020 -211698 -204930 -178678
$$ packed form
1609b53171J01539n0227m6213M4074L3294Q2393K3976l2984L4545k6612L163k4660
1597a10883n6832K2627K0294K286o6878k0151K0684Q0341q7334m0700P9712J9682
1585a37152K6258J3634N6234j9684J2820m734J9069K9454o9247K6136j0638p7254
1573a35104m6493l4372P905J7227k3664J1140N7299J5927M7102R2057K7540n6898
1561b0334J4197J5462l0352J060j4458p4941n3626m1672L8334Q549k4959J4001
1549a68739j0221K0731M9322j3476K0350J6718P616l4549L1888R5447L6469r606
1537D1950n1601m7938p5636q090p4247q9542J9374P5581Q8273N1403m7028L1201
1525h6300M6339m3210l2777j713R662k7933j8130L2291k3249o6678O768K6252
$$ plain form
1513 -178678 -83010 -115742 -107061 -187612 -169530 -160176 -173947 -142690 -111559 -144057 -133968 -113274
1501 -113274 -154619 -149221 -109270 -129827 -228964 -216443 -192931 -167372 -172597 -189655 -191728 -182883
1489 -182883 -136230 -65053 -122610 -120777 -92211 -61676 -27767 -155296 -129659 -86346 -78491 -111592
1477 -111592 -137927 -80809 -39743 -108013 -149821 -148983 -160104 -96813 -90809 -140902 -138607 -81003
1465 -81003 -14473 -68560 -182647 -121420 -96727 -84033 -69352 -19971 -87363 -87674 -77243 -130245
1453 -130245 -118811 -105984 -102975 -126979 -203836 -150497 -134119 -160917 -265114 -275140 -214381 -145908
1441 -145908 -92752 -114120 -112693 -23513 -20362 -68514 -129214 -149771 -120969 -57637 -19467 -150091
1429 -150091 -128121 -163501 -144603 -60324 -179648 -218930 -193843 -145126 -95535 -123114 -87367
$$ packed form
1513a78678R5668l2732Q681q0551J8082R354j3771L1257L1131l2498J0089K0694
1501a13274m1345N398L9951k0557r9137J2521K3512K5559n225j7058k073Q845
1489a82883M6653P1177n7557J833K8566L0535L3909j27529K5637M3313P855l3101
1477a11592k6335N7118M1066o8270m1808Q38j1121O3291O004n0093K295N7604
1465h1003O6530n4087j14087O1227K4693J2694J4681M9381o7392l11J0431n3002
1453a30245J1434J2827L009k4004p6857N3339J6378k6798j04197j0026O0759O8473
1441a45908N3156k1368J427Q9180L151m8152o0700k0557K8802O3332L8170j30624
1429a50091K1970l5380J8898Q4279j19324l9282K5087M8717M9591k7579L5747
$$ plain form
1418 -87367 -69984 -95171 -18346 16676 -35407 -32494 -29378 -119770 -237140 -262558 -228738 -265114
1406 -265114 -296588 -235589 -151527 -140506 -167735 -144891 -165229 -147661 -96485 -80406 -67000 -66812
1394 -66812 -66191 -105089 -149813 -174931 -161777 -148487 -186781 -274040 -286767 -298123 -307546 -313760 -312340
1381 -312340 -249727 -199743 -91804 -47158 -65030 -39794 29911 22512 -126189 -182102 -154225
1370 -154225 -190822 -164809 -247287 -290857 -190705 -215431 -222418 -250059 -170742 -61120 -39529
1359 -39529 23487 1051 -6836 8041 -23 -31660 -96192 -109450 -112139 -193778 -256676 -323002
1347 -323002 -274012 -263011 -247801 -238217 -212592 -174664 -132649 -98828 -25214 -73395 -18084 66571
1335 66571 40617 -11957 -84962 -72008 -146614 -150620 -149401 -166789 -184686 -250363 -195349 -201649
$$ packed form
1418h7367J7383k5187P6825L5022n2083K913L116r0392j17370k5418L3820l6376
1406b65114l1474O0999Q4062J1021k7229K2844k0338J7568N1176J6079J3406J88
1394f6812O21l8898m4724k5118J3154J3290l8294q7259j2727j1356r423o214J420
1381c12340O2613M9984J07939M4646j7872K5236O9705p399j48701n5913K7877
1370a54225l6597K6013q2478m3570J00152k4726o987k7641P9317J09622K1591
1359c9529O3016k2436p887J4877q064l1637o4532j3258k689q1639o2898o6326
1347c23002M8990J1001J5210R584K5625L7928M2015L3821P3614m8181N5311Q4655
1335F6571k5954n2574p3005J2954p4606m006J219j7388j7897o5677N5014o300
$$ plain form
1323 -201649 -309512 -336563 -232879 -108820 -70285 -59400 11548 58587 7540 31855 86410
1312 86410 55088 -94987 -167399 -136590 -180170 -238510 -213549 -245062 -237496 -164211 -109022 -90843
1300 -90843 -117800 -97018 -18866 15360 -55779 -93871 -102188 -101027 -34877 -89676 -143257 -160281
1288 -160281 -164611 -244004 -207313 -212552 -277175 -112135 -60661 -101216 -83999 -40487 -74947 -64904
1276 -64904 -54001 -48325 -26716 -78154 -60592 -81364 -135878 -148465 -114779 -138184 -139942 -179013
1264 -179013 -143758 -180634 -153117 -154902 -117433 -130027 -150760 -104956 -98576 -79807 -86446 -138573
1252 -138573 -82847 -60943 -158149 -120733 -172475 -131991 -147050 -96764 -87628 -92264 -116204 -133335
1240 -133335 -153977 -106658 -180362 -154099 -208534 -175672 -145239 -184061 -149566 -144826 -50114 7978
$$ packed form
1323b01649j07863k7051J03684J24059L8535J0885P0948M7039n1047K4315N4555
1312H6410l1322j50075p2412L0809m3580n8340K4961l1513P566P3285N5189J8179
1300i0843k6957K0782P8152L4226p1139l8092q317J161O6150n4799n3581j7024
1288a60281m330p9393L6691n239o4623J65040N1474m0555J7217M3512l4460J0043
1276f4904J0903N676K1609n1438J7562k0772n4514j2587L3686k3405j758l9071
1264a79013L5255l6876K7517j785L7469j2594k0733M5804O380J8769o639n2127
1252a38573N5726K1904r7206L7416n1742M0484j5059N0286R136m636k3940j7131
1240a33335k0642M7319p3704K6263n4435L2862L0433l8822L4495M740R4712N8092
$$ plain form
1228 7978 -85323 -82319 -84269 -143711 -233354 -306893 -165245 -182608 -132239 -138478 -228544 -230904 -198245
1215 -198245 -149654 -123693 -150995 -59125 -52304 -85265 -104453 -101124 -16423 -17055 -39342 -89622
1203 -89622 -61423 -79137 -162941 -215989 -258894 -231850 -156396 -250219 -274110 -237911 -173883 -44640
1191 -44640 -43070 -33926 -53266 -10473 57984 -32723 -44015 7327 -67084 -131047 -185532 -223392
1179 -223392 -274537 -279197 -249345 -236247 -222522 -199662 -81908 -27802 -93024 -33640 4016 -45788
1167 -45788 -84878 -57415 -11511 -20207 -153085 -195306 -268166 -241518 -246520 -174720 -233876 -243174
1155 -243174 -156625 -150200 -109786 -92861 -100577 -59368 -46020 -84976 -15897 -39016 -60988 -72628
1143 -72628 -147178 -166052 -192868 -144371 -169987 -198727 -146382 -182660 -116946 -149657 -200034 -211400
$$ packed form
1228G978r3301L004j950n9442q9643p3539J41648j7363N0369o239r0066k360L2659
1215a98245M8591K5961k7302R1870O821l2961j9188L329Q4701o32k2287n0280
1203h9622K8199j7714q3804n3048m2905K7044P5454r3823k3891L6199O4028J29243
1191d4640J570R144j9340M2793O8457r0707j1292N1342p4411o3963n4485l7860
1179b23392n1145m660K9852J3098J3725K2860J17754N4106o5222N9384L7656m9804
1167d5788l9090K7463M5904q696j32878m2221p2860K6648n002P1800n9156r298
1155b43174Q6549O425M0414J6925p716M1209J3348l8956O9079k3119k1972j1640
1143g2628p4550j8874k6816M8497k5616k8740N2345l6278O5714l2711n0377j1366
$$ plain form
1131 -211400 -139786 -74129 -98673 -55833 -73851 -112188 -92602 -147995 -183000 -154076 -209404 -206930
1119 -206930 -126118 -130772 -136618 -136269 -71843 -99411 -141386 -109354 -146593 -99870 -45214 -46894 -2032
1106 -2032 -124765 -167852 -92689 -82772 -73424 -148705 -128080 -203996 -220457 -137674 -175037 -174871 -216287
1093 -216287 -164902 -100844 -125090 -55597 7265 -62298 -153660 -168673 -81135 -86778 -110554 -112819
1081 -112819 -179209 -177859 -166423 -80740 -112486 -214633 -149680 -112639 -125971 -216082 -116280 -47135
1069 -47135 -114688 -121829 -66035 -81244 -108115 -159888 -163178 -199032 -253388 -289567 -236264 -192618
1057 -192618 -103524 -94047 -69353 -161345 -219006 -127004 -86454 18440 -7569 -75797 -72236 -142587
1045 -142587 -167777 -157870 -143606 -130214 -220855 -116503 -137046 -149166 -129866 -203506 -134900 -172637
$$ packed form
1131b11400P1614O5657k4544M2840j8018l8337J9586n5393l5005K8924n5328K474
1119b06930Q0812m654n846L49O4426k7568m1975L2032l7239M6723N4656j680M4862
1106b032j22733m3087P5163R917R348p5281K0625p5916j6461Q2783l7363J66m1416
1093b16287N1385O4058k4246O9493O2862o9563r1362j5013Q7538n643k3776k265
1081a12819o6390J350J1436Q5683l1746j02147O4953L7041j3332r0111R9802O9145
1069d7135o7553p141N5794j5209k6871n1773l290l5854n4356l6179N3303M3646
1057a92618Q9094R477K4694r1992n7661R2002M0550J04894k6009o8228L561p0351
1045a42587k5190R907J4264J3392r0641J04352k0543j2120J9300p3640O8606l7737
$$ plain form
1033 -172637 -197265 -133550 -114035 -83178 -150293 -172921 -108188 -176137 -119598 -105323 -189263 -199259
1021 -199259 -160066 -123264 -131822 -83789 -21083 -97194 -107599 -128687 -91837 -89884 -133091 -96441
1009 -96441 -144841 -89602 -121294 -176321 -170863 -158647 -78217 -49398 -95164 -77616 -137507 -117952
997 -117952 -93168 -123034 -143273 -85015 -99290 -142048 -170158 -161671 -204314 -273579 -225840 -192717
985 -192717 -169474 -154942 -126795 -67191 -123645 -90947 -66218 -75972 -106485 -151678 -182109 -176497
973 -176497 -151871 -131702 -195113 -181288 -169406 -134338 -125514 -162296 -129343 -11313 20645 -43182
961 -43182 -109027 -94295 -124983 -126762 -126529 -124180 -124717 -141272 -200605 -260445 -190171 -133190 -96249
948 -96249 -165346 -121842 -132116 -116393 -43629 -33180 -23632 -80024 -123318 -80465 -137048 -165348
$$ packed form
1033a72637k4628O3715J9515L0857o7115k2628O4733o7949N6539J4275q3940r996
1021a99259L9193L6802q558M8033O2706p6111j0405k1088L6850J953m3207L6650
1009i6441m8400N5239l1692n5027N458J2216Q0430K8819m5766J7548n9891J9555
997a17952K4784k9866k0239N8258j4275m2758k8110Q487m2643o9265M7739L3123
985a92717K3243J4532K8147N9604n6454L2698K4729r754l0513m5193l0431N612
973a76497K4626K0169o3411J3825J1882L5068Q824l6782L2953J18030L1958o3827
961d3182o5845J4732l0688j779K33K349n37j6555n9333n9840P0274N6981L6941
948i6249o9097M3504j0274J5723P2764J0449R548n6392m3294M2853n6583k8300
$$ plain form
936 -165348 -164063 -161243 -187145 -208727 -208459 -217980 -124992 -82046 -70155 -119189 -62117 -15907 -69957
923 -69957 -19340 -65462 -70495 -46449 -111714 -124514 -208688 -286481 -222662 -222299 -176357 -225883 -214759
910 -214759 -172193 -130484 -85381 -68167 -48440 -44058 -88247 -79599 -98631 -92418 -79440 -104049
898 -104049 -98330 -216310 -276345 -217925 -201664 -238907 -224912 -197703 -196012 -152101 -74464 -18992
886 -18992 21047 8126 59092 4480 -71943 -131209 -147651 -269177 -281377 -266149 -274914 -223809
874 -223809 -280009 -217164 -121709 -101193 -153984 -126559 -41390 4253 -25125 -37412 -35404 -69234
862 -69234 -92665 -127239 -197872 -199731 -152306 -112242 -196324 -215439 -192113 -142231 -147735 -108068
850 -108068 -121125 -71526 -20737 17220 -19816 -74990 -87853 -116512 -113193 -136750 -114578 -55099
$$ packed form
936a65348J285K820k5902k1582K68r521R2988M2946J1891m9034N7072M6210n4050
923f9957N0617m6122n033K4046o5265j2800q4174p7793O3819L63M5942m9526J1124
910b14759M2566M1709M5103J7214J9727M382m4189Q648j9032O213J2978k4609
898a04049N719j17980o0035N8420J6261l7243J3995K7209J691M3911P7637N5472
886a8992M0039j2921N0966n4612p6423n9266j6442j21526j2200J5228q765N1105
874b23809n6200O2845R5455K0516n2791K7425Q5169M5643k9378j2287K008l3830
862f9234k3431l4574p0633j859M7425M0064q4082j9115K3326M9882n504L9667
850a08068j3057M9599N0789L7957l7036n5174j2863k8659L319k3557K2172N9479
$$ plain form
838 -55099 -130005 -200941 -150381 -152848 -130358 -151688 -218414 -203463 -176288 -149117 -194288 -251486
826 -251486 -187362 -126157 -118365 -104952 -121769 -114675 -84083 -89204 -139663 -188525 -153113 -143257 -141292
813 -141292 -116402 -111704 -89114 -79117 -169681 -166958 -160970 -113948 -119360 -123988 -205965 -243771 -149578
800 -149578 -182785 -191788 -224218 -184779 -106970 -203527 -236243 -251126 -206787 -239449 -208567 -154353
788 -154353 -203619 -177219 -106985 -164880 -260167 -161251 -102883 -104828 -157847 -173286 -179109 -137899
776 -137899 -47374 -168315 -250502 -179825 -134587 -166982 -178289 -129999 -175358 -190697 -131299 -139064
764 -139064 -183205 -122685 -162161 -195829 -134817 -61813 -72384 -176536 -188635 -149312 -93063 -77707
752 -77707 -68077 -103750 -200627 -233185 -164102 -197525 -215117 -209964 -175353 -130836 -148916 -133490
$$ packed form
838e5099p4906p0936N0560k467K2490k1330o6726J4951K7175K7171m5171n7198
826b51486O4124O1205P792J3413j6817P094L0592n121n0459m8862L5412R856J965
813a41292K4890M698K2590R997r0564K723N988M7022n412m628q1977l7806R4193
800a49578l3207r003l2430L9439P7809r6557l2716j4883M4339l2662L0882N4214
788a54353m9266K6400P0234n7895r5287R8916N8368j945n3019j5439n823M1210
776a37899R0525j20941q2187P0677M5238l2395j1307M8290m5359j5339N9398p765
764a39064m4141O0520l9476l3668O1012P3004j0571j04152j2099L9323N6249J5356
752g7707R630l5673r6877l2558O9083l3423j7592N153L4611M4517j8080J5426
$$ plain form
740 -133490 -147686 -108690 -108526 -154951 -102474 -84914 -19136 -64547 -61891 -90836 -98520 -83366 -169209
727 -169209 -288723 -232101 -263209 -257319 -219758 -198842 -193643 -166167 -17451 -78333 -127216 -33793
715 -33793 -43379 -69665 -97590 -158617 -162027 -162625 -99422 -165194 -316759 -328953 -299215 -239574 -248188
702 -248188 -222942 -102844 -132326 -144280 -128910 -127563 -77376 -105334 -147356 -108177 -98377 -93995
690 -93995 -245133 -265796 -274439 -281326 -222442 -309430 -306508 -240369 -194574 -102452 -121103 -79006
678 -79006 -26009 47324 13348 -40017 -48122 -49333 -54876 -79459 -170135 -202107 -217124 -259631 -203585
665 -203585 -242149 -237056 -119523 -107881 -67552 -4142 1114 -60529 -110365 -85516 -65368 -101674
653 -101674 -203081 -162002 -146049 -184956 -159878 -166210 -186512 -203938 -257143 -278162 -257491 -251460
$$ packed form
740a33490j4196L8996J64m6425N2477J7560O5778m5411K656k8945p684J5154q5843
727a69209j19514N6622l1108N890L7561K0916N199K7476J48716o0882m8883R3423
715c3793r586k6286k7925o1027l410n98O3203o5772j51565j2194K9738N9641q614
702b48188K5246J20098k9482j1954J5370J347N0187k7958m2022L9179R800M382
690i3995j51138k0663q643o887N8884q6988K922O6139M5795R2122j8651M2097
678g9006N2997P3333l3976n3365q105j211n543k4583r0676l1972j5017m2507N6046
665b03585l8564N093J17533J1642M0329O3410N256o1643m9836K4849K0148l6306
653a01674j01407M1079J5953l8907K5078o332k0302j7426n3205k1019K0671O031
$$ plain form
641 -251460 -236842 -200899 -118673 -95617 -152014 -148582 -111301 -101100 -35894 -49218 -48513 -66855
629 -66855 -62109 -147577 -194076 -208552 -163159 -57126 -8846 -108465 -60593 -3806 -3432 37889
617 37889 28471 33647 -5055 20902 -41985 -127227 -168744 -128152 -186994 -226681 -174135 -182171 -216386
604 -216386 -181576 -197471 -253798 -216930 -72537 -96383 -177282 -195129 -119092 -116296 -152057 -104524
592 -104524 -104411 -129687 -103440 -111263 -180649 -216856 -212940 -179466 -209506 -202488 -139048 -162664 -213442
579 -213442 -195125 -142554 -111775 -142566 -193073 -167404 -143842 -155710 -181894 -202110 -233809 -238324
567 -238324 -182585 -83291 -201356 -221481 -139995 -135885 -127009 -221085 -187260 -98630 -126767 -143071
555 -143071 -130667 -121576 -97959 15282 5871 -101636 -77876 -107814 -72971 -80830 -151752 -190555
$$ packed form
641b51460J4618L5943Q2226K3056n6397L432L7281J0201O5206j3324P05j8342
629f6855M746q5468m6499j4476M5393J06033M8280r9619M7872N6787L74M1321
617C7889r418N176l8702K5957o2887q5242m1517M0592n8842l9687N2546q036l4215
604b16386L4810j5895n6327L6868J44393k3846q0899j7847P6037K796l5761M7533
592a04524J13k5276K6247p823o9386l6207L916L3474l0040P018O3440k3616n0778
579b13442J8317N2571L0779l0791n0507K5669K3562j1868k6184k0216l1699m515
567b38324N5739R9294j18065k0125Q1486M110Q876r4076L3825Q8630k8137j6304
555a43071J2404R091K3617J13241r411j07507K3760k9938L4843p859p0922l8803
$$ plain form
543 -190555 -210866 -164052 -156945 -143126 -91275 -109591 -144444 -164812 -154125 -168424 -207348 -172294
531 -172294 -225545 -188815 -133297 -132290 -181026 -202645 -136680 -148690 -169524 -196374 -147069 -119246
519 -119246 -148506 -161448 -201631 -120695 -91723 -46645 -32407 -94429 -188912 -170372 -208307 -241266
507 -241266 -244380 -275119 -175905 -193947 -225404 -234416 -177303 -137471 -141367 -174144 -176717 -156022 -160964
494 -160964 -99155 -123116 -91744 -94270 -142409 -130494 -105458 -106127 -155693 -204559 -195873 -126221 -141176
481 -141176 -121757 -128582 -124825 -119473 -66172 -94261 -160601 -222567 -225365 -133161 -187832 -176320 -192773
468 -192773 -199670 -155276 -82058 -1126 -9850 -67167 -118317 -125938 -187507 -246994 -295315 -277339
456 -277339 -246020 -232288 -219605 -97854 -129114 -136054 -107281 -135036 -103865 -93983 -139918 -91739
$$ packed form
543a90555k0311M6814P107J3819N1851j8316l4853k0368J0687j4299l8924L5054
531a72294n3251L6730N5518J007m8736k1619O5965j2010k0834k6850M9305K7823
519a19246k9260j2942m0183Q0936K8972M5078J4238o2022r4483J8540l7935l2959
507b41266l114l0739R9214j8042l1457r012N7113L9832l896l2777k573K0695m942
494a60964O1809k3961L1372k526m8139J1915K5036o69m9566m8866Q686O9652j4955
481a41176J9419o825L757N352N3301k8089o6340o1966k798R2204n4671J1512j6453
468a92773o897M4394P3218Q0932q724n7317n1150p621o1569n9487m8321J7976
456b77339L1319J3732J2683J21751l1260o940K8773k7755L1171R882m5935M8179
$$ plain form
444 -91739 -91498 -156183 -124560 -128698 -112406 -102958 -86928 -103671 -143776 -151430 -186886 -186320 -147031
431 -147031 -122444 -95157 -22306 22534 17136 -46505 -21617 -54129 -100932 -161292 -139995 -139859
419 -139859 -188160 -227671 -223608 -238042 -174321 -104030 -91640 -119213 -154180 -89319 -104434 -85972
407 -85972 -82845 -77172 -109705 -118187 -178326 -221248 -271689 -300924 -282050 -278362 -336923 -322493 -293045
394 -293045 -221541 -193839 -136697 -52305 -54270 -136354 -73103 -67792 -91957 -64198 -84968 -169649
382 -169649 -238063 -203337 -187384 -213277 -224947 -183685 -195535 -215413 -226399 -175573 -146590 -158098
370 -158098 -99903 -78320 -18418 8979 -3426 -41006 -42454 -90193 -170265 -185862 -202550 -255087
358 -255087 -245303 -219743 -184237 -85383 -134595 -119638 -114647 -52820 -29344 -1296 -32120 -102636
$$ packed form
444i1739K41o4685L1623m138J6292R448J6030j6743m0105p654l5456N66L9289
431a47031K4587K7287P2851M4840n398o3641K4888l2512m6803o0360K1297J36
419a39859m8301l9511M063j4434O3721P0291J2390k7573l4967O4861j5115J8462
407h5972L127N673l2533q482o0139m2922n0441k9235J8874L688n8561J4430K9448
394b93045P1504K7702N7142Q4392j965q2084O3251N311k4165K7759k0770q4681
382a69649o8414L4726J5953k5893j1670M1262j1850j9878j0986N0826K8983j1508
370a58098N8195K1583N9902K7397j2405l7580j448m7739q0072j5597j6688n2537
358b55087R784K5560L5506R8854m9212J4957M991O1827K3476K8048l0824p0516
$$ plain form
346 -102636 -145678 -111009 -94798 -178395 -213412 -149880 -218630 -237718 -258793 -256552 -209552 -173059
334 -173059 -189194 -103038 -81563 -49654 -17697 10980 -15637 -21648 -17746 -125846 -136917 -155391
322 -155391 -179192 -239486 -192918 -205409 -192432 -205805 -205005 -151482 -89833 -61206 -33900 -43300
310 -43300 -70592 -100646 -114191 -165596 -199287 -243311 -259291 -282493 -286997 -261546 -265530 -235420
298 -235420 -275512 -254203 -119187 -183504 -153243 -104402 2183 10115 -2976 -29935 -102816 -152148
286 -152148 -187448 -252231 -271129 -263088 -223131 -193689 -153386 -75618 -37841 -43641 -80639 -172322
274 -172322 -128211 -116451 -134455 -145881 -186022 -176268 -244322 -219594 -167685 -225354 -220224 -196736
262 -196736 -175880 -221452 -192608 -150037 -145466 -103276 -167407 -122443 -130840 -140615 -166034 -169952 -170489
$$ packed form
346a02636m3042L4669J6211q3597l5017O3532o8750j9088k1075K241M7000L6493
334a73059j6135Q6156K1475L1909L1957K8677k6617o011L902j08100j1071j8474
322a55391k3801o0294M6568j2491J2977j3373Q00N3523O1649K8627K7306r400
310d3300k7292l0054j3545n1405l3691m4024j5980k3202m504K5451l984L0110
298b35420m0092K1309J35016o4317L0261M8841J06585P932j3091k6959p2881m9332
286a52148l5300o4783j8898Q041L9957K9442M0303P7768L7777n800l6998r1683
274a72322M4111J1760j8004j1426m0141R754o8054K4728N1909n7669N130K3488
262a96736K0856m5572K8844M2571M571M2190o4131M4964q397r775k5419l918n37
$$ plain form
249 -170489 -198533 -227436 -220508 -276097 -313372 -197786 -124768 -89080 -27653 -39238 -44814 -117521
237 -117521 -95150 -128762 -166436 -193515 -216937 -234488 -185030 -250403 -208558 -279019 -235048 -189806
225 -189806 -243631 -207786 -198681 -172063 -109736 -88972 -98094 -97541 -70580 -37763 -79937 -113270 -211128
212 -211128 -191523 -208116 -252589 -208938 -248068 -247937 -141412 -8242 -83188 -150441 -115762 -126715
200 -126715 -111740 -156808 -243995 -228746 -179201 -218439 -170592 -199657 -226971 -167078 -153598 -178808
188 -178808 -249822 -195071 -89811 -148712 -143508 -96612 -85951 -92230 -81156 -123658 -156845 -114021
176 -114021 -176295 -244079 -256777 -291207 -269184 -265480 -220446 -227046 -186217 -122743 -107463 -109056
164 -109056 -49450 -51535 -71725 -101714 -197009 -159360 -184632 -161523 -168846 -195368 -182363 -170967
$$ packed form
249a70489k8044k8903O928n5589l7275J15586P3018L5688O1427j1585n576p2707
237a17521K2371l3612l7674k7079k3422j7551M9458o5373M1845p0461M3971M5242
225a89806n3825L5845R105K6618O2327K0764r122N53K6961L2817m2174l3333r7858
212b11128J9605j6593m4473M3651l9130J31J06525J33170p4946o7253L4679j0953
200a26715J4975m5068q7187J5249M9545l9238M7847k9065k7314N9893J3480k5210
188a78808p1014N4751J05260n8901N204M6896J0661o279J1074m2502l3187M2824
176a14021o2274o7784j2698l4430K2023L704M5034o600M0829O3474J5280j593
164a09056N9606k085k0190k9989r5295L7649k5272K3109p323k6522J3005J1396
$$ plain form
152 -170967 -115995 -166263 -203390 -225226 -261353 -216035 -186313 -179216 -112092 -176747 -167588 -171076
140 -171076 -236265 -218324 -205299 -200365 -197516 -201443 -178744 -228019 -235581 -231069 -268754 -165265 -154633
127 -154633 -127796 -120564 -142783 -136860 -181406 -159529 -159105 -170157 -214250 -173645 -106797 -122608 -167491
114 -167491 -161857 -216075 -226237 -251648 -254623 -179801 -238351 -229960 -203396 -130980 -61199 -75428
102 -75428 -96297 -194438 -261961 -233621 -268229 -263900 -299363 -313953 -316350 -358692 -299195 -275214
90 -275214 -215993 -193589 -207835 -124817 -149084 -155387 -160123 -186552 -175755 -211664 -244270 -282372
78 -282372 -326916 -310229 -251509 -275195 -294632 -296494 -279191 -317877 -289158 -239078 -177053 -180580
66 -180580 -201217 -151071 -149436 -165257 -229330 -333269 -340038 -294785 -331751 -281184 -352338 -373100
$$ packed form
152a70967N4972n0268l7127k1836l6127M5318K9722P097O7124o4655R159l488
140a71076o5189J7941J3025M934K849l927K2699m9275p562M512l7685J03489J0632
127a54633K6837P232k2219N923m4546K1877M24j1052m4093M0605O6848j5811m4883
114a67491N634n4218j0162k5411k975P4822n8550Q391K6564P2416O9781j4229
102g5428k0869r8141o7523K8340l4608M329l5463j4590k397m2342N9497K3981
90b75214N9221K2404j4246Q3018k4267o303m736k6429J0797l5909l2606l8102
78b82372m4544J6687N8720k3686j9437j862J7303l8686K8719N0080O2025l527
66a80580k0637N0146J635j5821o4073j03939o769M5253l6966N0567p1154k0762
$$ plain form
54 -373100 -329159 -345827 -308688 -278983 -314666 -301053 -273283 -252296 -248449 -259637 -233773 -250416
42 -250416 -254984 -255486 -249550 -247784 -310605 -357632 -380565 -333772 -307839 -350435 -310010 -324408 -282280
29 -282280 -251718 -247130 -253938 -284290 -322884 -310361 -345373 -346052 -371426 -395967 -353611 -353622 -307985
16 -307985 -359445 -337955 -296108 -332059 -375358 -314507 -279174 -300108 -329223 -282354 -271772 -265716
4 -265716 -276063 -275726 -275186 -315055
0 -315055
$$ packed form
54c73100M3941j6668L7139K9705l5683J3613K7770K0987L847j1188K5864j6643
42b50416m568n02N936J766o2821m7027k2933M6793K5933m2596M0425j4398M2128
29b82280L0562M588o808l0352l8594J2523l5012o79k5374k4541M2356j1M5637
16c07985n1460K1490M1847l5951m3299O0851L5333k0934k9115M6869J0582O056
4b65716j0347L37N40l9869
0c15055
$$ Imaginary data points
##PAGE= N=2
##DATA TABLE= (X++(I..I)), XYDATA
$$ plain form
16383 -1839573 -1881729 -1885640 -1784665 -1733443 -1756003 -1739007 -1619038 -1564129 -1588322 -1585813 -1580323
16372 -1580323 -1553535 -1531604 -1546040 -1499866 -1504424 -1497381 -1432964 -1414454 -1397018 -1388028 -1354716 -1373767
16360 -1373767 -1396840 -1355908 -1293973 -1210941 -1168220 -1139031 -1113828 -1119531 -1132045 -1052564 -1035885
16349 -1035885 -1076100 -1091150 -1045669 -1030619 -1068931 -1086913 -947498 -919011 -901212 -884384 -839924
16338 -839924 -785565 -769796 -783711 -740998 -707130 -705082 -709335 -679214 -661977 -632545 -572003 -588761
16326 -588761 -684740 -707047 -623635 -593233 -584400 -579672 -484450 -464327 -438634 -415563 -341330 -268988
16314 -268988 -248178 -287284 -363778 -392150 -333482 -293684 -274559 -294230 -267774 -220681 -212850 -217074
16302 -217074 -135928 -88780 -61447 -54147 -146685 -149887 -59563 -4752 41412 59514 95575 97764
$$ packed form
16383a839573m2156l911J00975N1222k2560J6996J19969N4909k4193K509N490
16372a580323K6788K1931j4436M6174m558P043O4417J8510J7436Q990L3312j9051
16360a373767k3073M0932O1935Q3032M2721K9189K5203n703j2514P9481J6679
16349a035885m0215j5050M5481J5050l8312j7982J39415K8487J7799J6828M4460
16338h39924N4359J5769j3915M2713L3868K048m253L0121J7237K9432O0542j6758
16326e88761r5979k2307Q3412L0402Q833M728R5222K0123K5693K3071P4233P2342
16314b68988K0810l9106p6494k8372N8668L9798J9125j9671K6456M7093P831m224
16302b17074Q1146M7148K7333P300r2538l202R0324N4811M6164J8102L6061K189
$$ plain form
16290 97764 153154 107001 98612 110603 149910 160434 117325 90757 136475 221812 250628 246621
16278 246621 253759 290740 316504 302676 258864 285977 294469 378411 411359 406921 403808 499662
16266 499662 565827 552170 497207 498890 532233 479768 467244 453840 488999 512006 501888 568974
16254 568974 624169 645775 720621 809810 749659 709972 687624 744390 727108 761691 775243
16243 775243 813442 846414 813293 806861 742641 756426 780577 711405 739680 752995 778641 887595
16231 887595 986880 980921 971814 1065204 1139407 1127064 1056879 1004649 962718 936172 877967 881875
16219 881875 913552 980720 978799 977222 1041823 1099249 1129312 1166666 1088540 1142882 1165148 1104612
16207 1104612 1116239 1190805 1219327 1155043 1217569 1145028 1061293 1091753 1086738 1088719 1123751 1095738
$$ packed form
16290I7764N5390m6153q389J1991L9307J0524m3109k6568M5718Q5337K8816m007
16278B46621P138L6981K5764j3828m3812K7113Q492Q3942L2948m438l113R5854
16266D99662O6165j3657n4963J683L3343n2465j2524j3404L5159K3007j0118O7086
16254E68974N5195K1606P4846Q9189o0151l9687k2348N6766j7282L4583J3552
16243G75243L8199L2972l3121o432o4220J3785K4151o9172K8275J3315K5646J08954
16231H87595R9285n959r107R3390P4203j2343p0185n2230m1931k6546n8205L908
16219H81875L1677O7168j921j577O4601N7426L0063L7354p8126N4342K2266o0536
16207A104612J1627P4566K8522o4284O2526p2541q3735L0460n015J981L5032k8013
$$ plain form
16195 1095738 1160179 1270416 1303658 1316288 1387015 1474441 1434721 1386290 1335199 1324358 1381528
$$ packed form
16195A095738O4441J10237L3242J2630P0727Q7426l9720m8431n1091j0841N7170
$$ [...]
##END NTUPLES=NMR SPECTRUM
##END=
