##TITLE=1H_DE-80H_X3
 200.13MHz, d2o
 8 sc
 
 19ns.26.2.2025
##JCAMPDX= 6.0         $$ Bruker NMR JCAMP-DX V2.0
##DATA TYPE= NMR SPECTRUM
##DATA CLASS= NTUPLES
##ORIGIN= UXNMR, Bruker Analytische Messtechnik GmbH
##OWNER= pz
$$ XWIN-NMR		Version 3.5
$$ Fri Jul  3 12:48:15 2026 Russian Standard Time (UT+4h)  Yarkov@DPX200
##.OBSERVE FREQUENCY= 200.1313
##.OBSERVE NUCLEUS= ^1H
##.ACQUISITION MODE= SIMULTANEOUS
##.ACQUISITION SCHEME= undefined
##.AVERAGES= 8
##.DIGITISER RES= 18
##SPECTROMETER/DATA SYSTEM= spect
##.PULSE SEQUENCE= zg30
##.SOLVENT NAME= DMSO
##.SHIFT REFERENCE= (INTERNAL, DMSO, 0, 15.5023)
##AUDIT TRAIL= $$ (NUMBER, WHEN, WHO, WHERE, WHAT)
$$ ##TITLE= Audit trail, XWIN-NMR		Version 3.5
$$ ##JCAMPDX= 5.01
$$ ##ORIGIN= Bruker BioSpin GmbH
$$ ##OWNER= Yarkov
$$ C:/Bruker/XWIN-NMR/data/yarkov2/nmr/H-C/1/pdata/1/auditp.txt
$$ ##AUDIT TRAIL=  $$ (NUMBER, WHEN, WHO, WHERE, WHAT)
(   1,<2026-07-03 12:47:34.03 +0400>,<Yarkov>,<DPX200>,
      <created by zg, POWCHK disabled, PULCHK disabled
       configuration hash MD5:
       00 E9 B6 7A A2 85 ED C7 34 08 36 98 17 FE 4E 26
       data hash MD5: 16K
       DE B3 A7 C8 20 0B 80 D6 50 89 0F B5 84 68 72 AD>)
(   2,<2026-07-03 12:47:37.53 +0400>,<Yarkov>,<DPX200>,
      <Start of raw data processing
       efp BC_mod = 2 LB = 0.25 FT_mod = 6 PKNL = 1 PHC0 = -6894.148 PHC1 = 6.42196 SI = 16K 
       data hash MD5: 16K
       FB 44 23 4F B2 83 95 87 94 44 4C B9 D9 CD 6E 92>)
$$ ##END=
$$ 
$$ hash MD5
$$ D2 BF 57 02 67 B2 90 2C 5F 77 F9 1F B4 F2 F1 C8
##$RELAX= 
##$RELAX= 
##$RELAX= 
##$RELAX= 
##$RELAX= 
##$RELAX= 
$$ Bruker specific parameters
$$ --------------------------
##$DU= <C:/Bruker/XWIN-NMR>
##$EXPNO= 1
##$NAME= <H-C>
##$PROCNO= 1
##$TYPE= <nmr>
##$USER= <yarkov2>
##$AMP= (0..31)
100 100 100 100 100 100 100 100 100 100 100 100 100 100 100 100 100 100 
100 100 100 100 100 100 100 100 100 100 100 100 100 100 
##$AQSEQ= 0
##$AQ_mod= 1
##$AUNM= <au_zg>
##$AUTOPOS= <>
##$BF1= 200.13
##$BF2= 200.13
##$BF3= 200.13
##$BF4= 200.13
##$BF5= 200.13
##$BF6= 200.13
##$BF7= 200.13
##$BF8= 200.13
##$BYTORDA= 1
##$CFDGTYP= 0
##$CFRGTYP= 5
##$CHEMSTR= <none>
##$CNST= (0..31)
1 1 145 1 1 1 1 1 1 1 1 1 1 1 1 1 1 1 1 1 1 1 1 1 1 1 1 1 1 1 1 1 
##$CPDPRG= <>
##$CPDPRG1= <>
##$CPDPRG2= <>
##$CPDPRG3= <>
##$CPDPRG4= <mlev>
##$CPDPRG5= <mlev>
##$CPDPRG6= <mlev>
##$CPDPRG7= <mlev>
##$CPDPRG8= <mlev>
##$CPDPRGB= <>
##$CPDPRGT= <>
##$D= (0..31)
0 0.7 0 0 0 0 0 0 0 0 0 0.03 0 0 0 0 0 0 0 0 0 0 0 0 0 0 0 0 0 0 0 0 
##$DATE= 1783068453
##$DBL= (0..7)
120 120 120 120 120 120 120 120 
##$DBP= (0..7)
150 150 150 150 150 150 150 150 
##$DBP07= 0
##$DBPNAM0= <>
##$DBPNAM1= <>
##$DBPNAM2= <>
##$DBPNAM3= <>
##$DBPNAM4= <>
##$DBPNAM5= <>
##$DBPNAM6= <>
##$DBPNAM7= <>
##$DBPOAL= (0..7)
0.5 0.5 0.5 0.5 0.5 0.5 0.5 0.5 
##$DBPOFFS= (0..7)
0 0 0 0 0 0 0 0 
##$DE= 6
##$DECBNUC= <off>
##$DECIM= 32
##$DECNUC= <off>
##$DECSTAT= 4
##$DIGMOD= 1
##$DIGTYP= 9
##$DL= (0..7)
0 120 120 120 120 120 120 120 
##$DP= (0..7)
$$ [...]
##$SUBNAM2= <"">
##$SUBNAM3= <"">
##$SUBNAM4= <"">
##$SUBNAM5= <"">
##$SUBNAM6= <"">
##$SUBNAM7= <"">
##$SUBNAM8= <"">
##$SUBNAM9= <"">
##$SW= 18.0517328524113
##$SWIBOX= (0..15)
0 0 2 0 0 0 0 0 0 0 0 0 0 0 0 0 
##$SW_h= 3612.71676300578
##$TD= 16384
##$TD0= 1
##$TE= 0
##$TE2= 300
##$TE3= 300
##$TEG= 300
##$TL= (0..7)
0 120 120 120 120 120 120 120 
##$TP= (0..7)
150 150 150 150 150 150 150 150 
##$TP07= 0
##$TPNAME0= <>
##$TPNAME1= <>
##$TPNAME2= <>
##$TPNAME3= <>
##$TPNAME4= <>
##$TPNAME5= <>
##$TPNAME6= <>
##$TPNAME7= <>
##$TPOAL= (0..7)
0.5 0.5 0.5 0.5 0.5 0.5 0.5 0.5 
##$TPOFFS= (0..7)
0 0 0 0 0 0 0 0 
##$TUNHIN= 0
##$TUNHOUT= 0
##$TUNXOUT= 0
##$USERA1= <user>
##$USERA2= <user>
##$USERA3= <user>
##$USERA4= <user>
##$USERA5= <user>
##$V9= 5
##$VALIST= <valist>
##$VCLIST= <CCCCCCCCCCCCCCC>
##$VD= 0
##$VDLIST= <DDDDDDDDDDDDDDD>
##$VPLIST= <PPPPPPPPPPPPPPP>
##$VTLIST= <TTTTTTTTTTTTTTT>
##$WBST= 1024
##$WBSW= 4
##$XGAIN= (0..3)
0 0 0 0 
##$XL= 0
##$YL= 0
##$YMAX_a= 270872
##$YMIN_a= -223711
##$ZGOPTNS= <>
##$ZL1= 120
##$ZL2= 120
##$ZL3= 120
##$ZL4= 120
##$ABSF1= 0
##$ABSF2= 0
##$ABSG= 0
##$ABSL= 0
##$ALPHA= 0
##$AQORDER= 0
##$ASSFAC= 0
##$ASSFACI= 0
##$ASSFACX= 0
##$ASSWID= 0
##$AUNMP= <proc_1d>
##$AZFE= 0.1
##$AZFW= 0.1
##$BCFW= 0
##$BC_mod= 2
##$BYTORDP= 0
##$COROFFS= 0
##$CY= -3
##$DATMOD= 1
##$DC= 0
##$DFILT= <>
##$DTYPP= 0
##$F1P= 0
##$F2P= 0
##$FCOR= 1
##$FTSIZE= 16384
##$FT_mod= 6
##$GAMMA= 0
##$GB= 0
##$INTBC= 1
##$INTSCL= 3.241238e-09
##$ISEN= 128
##$LB= 0.25
##$LEV0= 0
##$LPBIN= 0
##$MAXI= 10000
##$MC2= 0
##$MEAN= 0
##$ME_mod= 0
##$MI= 1.114404
##$NCOEF= 0
##$NC_proc= -6
##$NLEV= 6
##$NOISF1= 3.799351
##$NOISF2= 2.8
##$NSP= 0
##$NTH_PI= 0
##$NZP= 0
##$OFFSET= 15.50229
##$PC= 1
##$PHC0= -6894.148
##$PHC1= 6.42196
##$PH_mod= 1
##$PKNL= yes
##$PPARMOD= 0
##$PSCAL= 0
##$PSIGN= 0
##$REVERSE= no
##$SF= 200.130003884468
##$SI= 16384
##$SIGF1= 3
##$SIGF2= 2
##$SINO= 0.751879
##$SIOLD= 32768
##$SREGLST= <19F.Aceton>
##$SSB= 0
##$STSI= 16384
##$STSR= 0
##$SW_p= 3612.71676300578
##$SYMM= 0
##$S_DEV= 0
##$TDeff= 16384
##$TDoff= 0
##$TI= <>
##$TILT= no
##$TM1= 0
##$TM2= 0
##$TOPLEV= 0
##$USERP1= <user>
##$USERP2= <user>
##$USERP3= <user>
##$USERP4= <user>
##$USERP5= <user>
##$WDW= 1
##$XDIM= 16384
##$YMAX_p= 305841024
##$YMIN_p= -488122
$$ End of Bruker specific parameters
$$ ---------------------------------
##NTUPLES= NMR SPECTRUM
##VAR_NAME=  FREQUENCY,     SPECTRUM/REAL,   SPECTRUM/IMAG
##SYMBOL=    X,             R,               I
##VAR_TYPE=  INDEPENDENT,   DEPENDENT,       DEPENDENT
##VAR_FORM=  AFFN,          ASDF,            ASDF
##VAR_DIM=   16384,         16384,           16384
##UNITS=     HZ,            ARBITRARY UNITS, ARBITRARY UNITS
##FACTOR=    0.220516191357247, 1,           1
##FIRST=     3102.47331229525, 0,            0
##LAST=      -510.243450710529, 0,           0
##MIN=       -510.243450710529, -488122,     0
##MAX=       3102.47331229525, 305841024,    0
$$ Real data points
##PAGE= N=1
##DATA TABLE= (X++(R..R)), XYDATA
$$ [...]
6117b24602k0806M7148L2084k5639k1157k564j7024J3530J1766l9541J1605m532
$$ -224602 -245408 -198260 -166176 -191815 -212972 -215536 -232560 -219030 -207264 -246805 -235200 -239732
6105b39732R637K7310J1205Q670n229m3381Q70K008j8686k149J5591O888k1877
$$ -239732 -230095 -202785 -191580 -182910 -188139 -231520 -230650 -228642 -247328 -249477 -233886 -226998 -248875
6092b48875J1469J4558K8074L966r163j0426l2403j694J5478R032j5905J3768
$$ -248875 -237406 -222848 -194774 -190808 -199971 -210397 -242800 -244494 -229016 -219984 -235889 -222121
6080b22121K7998m742m078m8209K1281L2991n39q977o514j5161j742j4970j1312
$$ -222121 -194123 -198865 -202943 -251152 -229871 -196880 -197419 -206396 -212910 -228071 -229813 -244783 -256095
6067b56095J2702m1403p792L9070J1791N1005K1854n3118Q757O665p974k4057
$$ -256095 -243393 -284796 -292588 -253518 -241727 -190722 -168868 -221986 -213229 -206564 -214538 -238595
6055b38595k3409P294m0013L2954J4994L3955j5487j5174L6801m9610K6836J4128
$$ -238595 -262004 -254710 -294723 -261769 -246775 -212820 -228307 -243481 -206680 -256290 -229454 -215326
6043b15326j7316j2667J2124k5150P111K1628o775r364K421K7859P95K0665J1051
$$ -215326 -232642 -245309 -233185 -258335 -251224 -229596 -236371 -245735 -243314 -215455 -214660 -193995 -182944
6030a82944J6860n2687j9836o633J8067N751J167O407K6732q651k0953K3030k839
$$ -182944 -166084 -218771 -238607 -245240 -227173 -221422 -220255 -213848 -187116 -195767 -216720 -193690 -196529
6017a96529k1720k4949P772N6312j3567m5533p433N578L3014J3794K9939l343
$$ -196529 -218249 -243198 -235426 -179114 -192681 -238214 -245647 -240069 -207055 -193261 -163322 -166665
6005a66665j6670j9339J92J5577k4698j3685K0258j1056L3694K5735n5699k6816
$$ -166665 -183335 -202674 -202482 -186905 -211603 -225288 -205030 -216086 -182392 -156657 -212356 -239172
5993b39172K8337o757Q000l791j1924J5292j7256l596J4382j3815M676k791m392
$$ -239172 -210835 -217592 -209592 -213383 -225307 -210015 -227271 -230867 -216485 -230300 -225624 -228415 -232807
5980b32807K0677J4298n3621J0435M5902L4627k3471o510N7502J4404j3423j5868
$$ -232807 -212130 -197832 -251453 -241018 -195116 -160489 -183960 -190470 -132968 -118564 -131987 -147855
5968a47855k4280j234K3067p957m52J2843Q363K444n459k5628L995l8896J6520
$$ -147855 -172135 -173369 -150302 -158259 -158711 -145868 -137505 -135061 -140520 -166148 -162153 -201049 -184529
5955a84529J5654k0047j5847o343L1090J376j3307l6823O13O3238N430r334Q435
$$ -184529 -168875 -188922 -204769 -211112 -180022 -178646 -191953 -228776 -228163 -164925 -159495 -168829 -160394
5942a60394K5208m386n068p055k7528k8824p122L6826O026j8903J6721K8506l3299
$$ -160394 -135186 -139572 -144640 -151695 -179223 -208047 -215169 -178343 -172317 -191220 -174499 -145993 -179292
5929a79292M0581k3566l8191j129K868p357K3573N105j5285L581j5238j5986J5898
$$ -179292 -138711 -162277 -200468 -201597 -198729 -206086 -182513 -177408 -192693 -189112 -204350 -220336 -204438
5916b04438K5005p025K622q769k991o599M278j5178L5047L9337k4893r351M830
$$ -204438 -179433 -186458 -183836 -192605 -195596 -202195 -197917 -213095 -178048 -138711 -163604 -172955 -168125
5903a68125Q530K156j1499R844j5513m569N767m131Q300m657J031m5322K6086
$$ -168125 -159595 -157439 -168938 -159094 -174607 -179176 -173409 -177540 -169240 -173897 -172866 -218188 -192102
5890a92102R079K0979J7178j0089j6164k6538L5900J1512L130m0397R04J8270
$$ -192102 -183023 -162044 -144866 -154955 -171119 -197657 -161757 -150245 -147115 -187512 -186608 -168338
5878a68338P20j3333l3059J3819K3418R887j942J8327J1577j8582M0834l7292
$$ -168338 -167618 -180951 -214010 -200191 -176773 -166886 -168828 -150501 -138924 -157506 -116672 -153964
5866a53964j6434M067L2569q209J5979J0520n104J2596m6150J8661J8980p373
$$ -153964 -170398 -166331 -133762 -141971 -125992 -115472 -120576 -107980 -154130 -135469 -116489 -123862
5854a23862L2029J3458j2219N1705K3896L5668K7315J6673O818k6835j3834L4545
$$ -123862 -91833 -78375 -90594 -38889 -14993 20675 47990 64663 71481 44646 30812 65357
5842F5357j0300l691J302Q620J9728K9836J9475k8241P289P349J0555J8268j0879
$$ 65357 55057 51366 52668 61288 81016 110852 130327 102086 109375 116724 127279 145547 134668
5829A34668J4304Q115n5578l8843p336o723l9070o613m4730m181j2746j6588L4962
$$ 134668 148972 157087 101509 62666 55330 48607 9537 2924 -41806 -45987 -58733 -75321 -40359
5816d0359J7777N5602J9512k446L1889K872k5454M6211O6148M9618Q4331J37410
$$ -40359 -22582 33020 52532 50086 81975 84847 59393 105604 171752 221370 305701 443111
5804D43111K01532J62420O9589K2641m296o9235j16451j30475m1107m0113p0901
$$ 443111 644643 807063 876652 899293 894997 825762 709311 578836 537729 497616 426715
5793D26715n0372m2034l0534k8971J754p325L3286M2356k842J8803N2857L3914
$$ 426715 376343 334309 303775 274804 276558 269233 302519 344875 342033 360836 413693 447607
5781D47607Q0970R8499J56610K91246M07271M24828L72829K50714Q4626r1708
$$ 447607 528577 627076 783686 1074932 1482203 1907031 2279860 2530574 2615200 2523492
5771B523492j75480k11719k20596j71231j37673n7385l7846Q1100J96216L60176
$$ 2523492 2348012 2136293 1915697 1744466 1606793 1549408 1511562 1592662 1788878 2149054
5761B149054O62444J105688J568209K036732J591326M85150j60801p50930j105000
$$ 2149054 2811498 3917186 5485395 7522127 9113453 9598603 9437802 8686872 7581872
5752G581872j046297p58702m58428k41643j05671n4730p3962k34125m20442m69051
$$ 7581872 6535575 5776873 5318445 5076802 4971131 4916401 4842439 4608314 4187872 3718821
5742C718821m93133m32912m13479l68303k83004j97519k05565j15017q4573j13811
$$ 3718821 3225688 2792776 2379297 2010994 1727990 1530471 1324906 1209889 1125316 1011505
5732A011505n0615l1578l8767j7372J1089L79M0389Q4779J46328K30592K99433
$$ 1011505 960890 929312 890545 873173 884262 884641 925030 1009809 1156137 1386729 1686162
5721A686162M04198L95799K46543R4986j06501k43504k50725l03116k74116k22675
$$ 1686162 2090360 2486159 2732702 2827688 2721187 2477683 2226958 1923842 1649726 1427051
5711A427051k39821j92896j46693j17859j01780o0834m2540l5837k3378J3390
$$ 1427051 1187230 994334 847641 729782 628002 567168 524628 488791 465413 478803
5701D78803K999m174N952J0468N4302O5885Q2654J48397J86269J23583N0246K2426
$$ 478803 481802 477628 483580 494048 548350 614235 696889 845286 1031555 1155138 1205384 1227810
5689A227810q1411j16914j15814j26737j00364j15527o3921q8631r1226k6278
$$ 1227810 1146399 1029485 913671 786934 686570 571043 507122 418491 327265 300987
5679C00987n4501j0776J2369j6549l0065K967N151j2675k1009J241M1967n942
$$ 300987 246486 235710 248079 231530 201465 204432 209583 196908 175899 177140 219107 213165
5667B13165l369N4372K3719K5898M2243j1892K9549J1763l0751l3143n8601K5432
$$ 213165 209796 264168 287887 313785 356028 344136 373685 385448 354697 321554 262953 288385
5655B88385j88k6064q805j0526J4159J3011P855J2357j8723l0824r133j6564K6504
$$ 288385 288197 262133 253328 242802 256961 269972 277827 290184 271461 240637 231504 214940 241444
5642B41444K642j1370K748j1368j91J6305M959j5259P68j2269M823J3482j97n89
$$ 241444 244086 232716 235464 224096 223905 240210 245169 229910 230678 218409 223232 236714 236517 235928
5628B35928J6651N515j5803O817J2476L4236K8827j3943L3856K5301P415j1586
$$ 235928 252579 258094 242291 249108 261584 295820 324647 310704 344560 369861 377276 365690
5616C65690J2542L0320q106O368L0011L2356K5859L8717K3149L4888O9540M3094
$$ 365690 378232 408552 400446 406814 436825 469181 495040 533757 556906 591794 661334 704428
5604G04428L3224K0313J7908J9867l0813l9028K1013O1955l361N7047M9011O638
$$ 704428 737652 757965 775873 795740 764927 725899 746912 808867 805506 862553 911564 918202
5592I18202K2590J5754J9769j6512J9022j919o08N1605K7577n535N0931j999n200
$$ 918202 940792 956546 976315 959803 978825 976906 976298 1027903 1055480 1049945 1100876 1098877 1093677
5579A093677J1515J2065L8557l170O0351P0903P0924K9761P6999M5613L9727N2333
$$ 1093677 1105192 1117257 1155814 1152644 1212995 1283898 1354822 1384583 1461582 1507195 1546922 1599255
5567A599255J5826R7587O1696R9434Q1470P3846J47959Q3894R4489J50161J31946
$$ 1599255 1615081 1712668 1774364 1873798 1955268 2029114 2177073 2260967 2355456 2505617 2637563
5556B637563J24348J53366K20596K48167K31060K53323L70176L96653M28008N09795
$$ 2637563 2761911 2915277 3135873 3384040 3615100 3868423 4238599 4635252 5063260 5573055
5546E573055N88038O79426R12702J133728J495540J924976K430803L145848L828307
$$ 5573055 6161093 6840519 7753221 8886949 10382489 12307465 14738268 17884116 21712423
5537B1712423M351419M387545L812494K734063J532975L94462l82882o47718m23206
$$ 21712423 26063842 30451387 34263881 36997944 38530919 38925381 38542499 37894781 37471575
5528C7471575K29463R11577J379397J353863P47853l23408j561278k568885l335170
$$ 37471575 37701038 38612615 39992012 41345875 42093728 41770320 40209042 37640157 34304987
5519C4304987l672394l723765l546454l211495k788075k443570k008361j636173
$$ 34304987 30632593 26908828 23362374 20150879 17362804 14919234 12910873 11274700
5511A1274700j349256j071212r13928p81856o74584n43372m72385m44227l21369
$$ 11274700 9925444 8854232 7940304 7158448 6483864 5940492 5468107 5023880 4702511
5502D702511l32513k61399k49480k64336j96670k06795k38830j49080j35106j34467
$$ 4702511 4369998 4108599 3859119 3594783 3398113 3191318 2952488 2803408 2668302 2533835
5492B533835q3305j08897r5653n8981r4286j26103q4924o3060j8891o6659q1468
$$ 2533835 2450530 2341633 2245980 2186999 2092713 1966610 1881686 1818626 1799735 1733076 1651608
5481A651608p9483n8038n1361n7877m4741l8072o7400n0490k9473j2804l4690
$$ 1651608 1572125 1514087 1462726 1404849 1360108 1322036 1254636 1204146 1174673 1161869 1127179
5470A127179j6818l4028m6607n4653k0119l4099k7540j4043J7560k7570k3400
$$ 1127179 1110361 1076333 1029726 975073 954954 920855 893315 879272 896832 869262 845862
5459H45862J0326j1241l7003l9981k5140j1950m1700k6403j1747m2822j3870K0078
$$ 845862 856188 844947 807944 767963 742823 730873 689173 662770 651023 608201 594331 614409
5447F14409l2392r47m2052m5817n674P965J2176K13K2729j7509l450p771Q598
$$ 614409 582017 581070 539018 493201 487527 495492 507668 507881 530610 513101 509651 501880 510478
5434E10478k1809J0506M038n695K8572r964j0876K3619j3542k354J7920J1468
$$ 510478 488669 499175 503213 497518 526090 516126 505250 528869 515327 512973 530893 542361
5422E42361l0899j6730o748K2872k2643q033k9530J921j0111j9241M8866k5727
$$ 542361 511462 494732 487984 510856 488213 480180 450650 452571 442460 423219 472085 446358
5410D46358l2388J2585J1397M6657o142k8157N9469J0487o713J5771Q008k8710
$$ 446358 413970 426555 437952 484609 478467 450310 509779 520266 513553 529324 537332 508622
5398E08622J5118K5286j3818r352m749j6706N394j8430Q329q169J7639J2176l251
$$ 508622 523740 549026 535208 525856 521107 504401 509795 491365 499694 491525 509164 521340 518089
5385E18089J6726M5946m413k8055J3553J91J8594J4223P348m529K8223r427L4566
$$ 518089 534815 580761 576348 548293 561846 562037 580631 594854 602202 597673 625896 616469 651035
5372F51035m999j4258j3262O250M5892k4174m1897l248L7147M2447L278j8077
$$ 651035 646036 631778 618516 624766 670658 646484 604587 601339 638486 680933 684211 666134
5360F66134j640O058K7452J5343N7147L7981M151K4467J6434J5954K5321J7148
$$ 666134 664494 670552 698004 713347 770494 808475 812626 837093 853527 869481 894802 911950
5348I11950L0050j9704L946M5069L7439K3475L7009L4097O025O61K3112L1819
$$ 911950 942000 922296 926242 971311 1008750 1032225 1069234 1103331 1109356 1110017 1133129 1164948
5336A164948L2548N7082K5872M4554O8496N2249N7350L0615M0545O6490L3596
$$ 1164948 1197496 1254578 1280450 1325004 1393500 1445749 1503099 1533714 1574259 1640749 1674345
5325A674345Q2876R5587P0183O7603N1204O6386R8395R5164R7221J71118J38413
$$ 1674345 1757221 1852808 1922991 1990594 2041798 2108184 2206579 2301743 2398964 2570082 2708495
5314B708495J76561J81009J42760K19263K06081K48032K92823L65612M52838N51282
$$ 2708495 2885056 3066065 3208825 3428088 3634169 3882201 4175024 4540636 4993474 5544756
5304E544756P07136Q56946J039294J304001J841541K776101M282981O048834P038102
$$ 5544756 6251892 7108838 8148132 9452133 11293674 14069775 18352756 24401590 31439692
5295C1439692O582221M531216J839936p67159k485481l179544l013796k000351
$$ 31439692 38021913 42553129 44393065 43625906 41140425 37960881 34947085 32946734
5287C2946734j35238K086100L959791M652838L465734J118548j572125l708952
$$ 32946734 32811496 34897596 38857387 43510225 46975959 48094507 46522382 42813430
5279D2813430m793304n226967m974243m358141l795117l189559k641363k035510
$$ 42813430 38020126 32793159 27818916 23460775 19665658 16476099 13834736 11799226
5271A1799226j597556j290989j055075q41398o82415n79533m65891l57420k74898
$$ 11799226 10201670 8910681 7855606 7014208 6331793 5752260 5286369 4928949 4654051
5262D654051l14550k61317k34112k25249k28159k07545k01636j44948j24802j43523
$$ 4654051 4339501 4078184 3844072 3618823 3390664 3183119 2981483 2836535 2711733 2568210
5252B568210j16736j07614o1824j16203o0591o1451j18486r5688n0578o5978p0888
$$ 2568210 2451474 2343860 2282036 2165833 2105242 2043791 1925305 1829617 1779039 1713061 1642173
5241A642173l9342l6160q9220l4153k1211n4955p2797m3275m9589p990K004m5196
$$ 1642173 1602831 1566671 1477451 1443298 1422087 1367132 1294335 1251060 1201471 1193481 1195485 1150289
5229A150289k8813l8550j4302j9536o2195l2029m4643l073J4117j8974K8933m480
$$ 1150289 1121476 1082926 1068624 1049088 986893 954864 910221 907148 921265 902291 931224 926744
5217I26744j9398j9175j6800P05l2671K343m1285k0546l335l6766l8067l2165
$$ 926744 907346 888171 871371 872076 839405 841748 800463 779917 776582 739816 701749 669584
5205F69584J921K4188j4753o3109k1352l5755l904K4551n2380k3272J5977j1219
$$ 669584 671505 695693 680940 617831 596479 560724 556820 581371 528991 505719 521696 510477
5193E10477n1063p937L5849l7328k7584M7374j5208k3426k8608l905L371j5350
$$ 510477 459414 451477 487326 449998 422414 469788 454580 431154 402546 398641 402012 386662
5181C86662O320k8061k2355q337J0661n4459l4515j5504r207o671L1074N286j0172
$$ 386662 392982 364921 342566 334229 344890 290431 255916 240412 231205 224534 255608 260894 250722
5168B50722L235n126k882k8913O860J5599j9108r95k2382R95M3879m3677l520
$$ 250722 253957 248831 245949 217036 223896 239495 220387 219392 197010 198005 241884 198207 194687
5155A94687J1545J2671k255l4883l417j1888k860O708K6196k7803K6669J2492
$$ 194687 206232 218903 216648 181765 178348 166460 163600 170308 196504 168701 195370 207862
5143B07862j72k859k5401N498L91K834j435R932J6105m2457m739K8765k0514o33
$$ 207862 207690 204831 179430 184928 185319 188153 186718 196650 212755 170298 165559 194324 173810 173177
5129A73177l4030l6713L1475k4683K6881J005o7m9568J4696L4148L1713n465m0848
$$ 173177 139147 102434 133909 109226 136107 137112 137045 87477 102173 136321 168034 162569 121721
5116A21721J385J719k3386k5902N1001k4378k427K3364k2053J941M1490Q27m4685
$$ 121721 123106 124825 101439 75537 126538 102160 99733 123097 101044 102985 144475 145302 100617
5103A00617l440L0461j3342l1121q571K5764p195J8436k4234R221n9970J4683
$$ 100617 97177 127638 114296 83175 74604 100368 93173 111609 87375 96596 36626 51309
5091E1309K3690r921l1797k8937J9166O765K0056J2214Q278P037J2148m0277p601
$$ 51309 74999 65078 33281 4344 23510 30275 50331 62545 70823 77860 90008 49731 42130
5078D2130K7323N037m035j4857J3835r848o242O920k4440K5479J7651J3923o408
$$ 42130 69453 74490 70455 55598 69433 59585 53343 60263 35823 61302 78953 92876 86468
5065H6468J930Q833O538J8313J4078j8612L0333k8187m1712J6430K9231J8762
$$ 86468 88398 97231 103769 122082 136160 117548 147881 119694 77982 94412 123643 142405
5053A42405m075K2311J5654j368k0982J0941j4988n906N109N154J8176n46K0335
$$ 142405 138330 160641 176295 174927 153945 164886 149898 143992 149101 154255 172431 171885 192220
5040A92220p593O009k7481j7058p656j7740K59l6142l6161J782L2708k4501L4779
$$ 192220 184627 190636 163155 146097 138441 120701 120960 84818 48657 50439 83147 58646 93425
5027I3425J0457J491l0068p635K2861k7271j9747K3400q661l1193J8317P952L0414
$$ 93425 103882 105373 75305 67670 90531 63260 43513 66913 58252 27059 45376 53328 83742
5014H3742k5744j426J7184l022K3262J7995j782k0530j4475j6490M818K7792j7353
$$ 83742 57998 56572 73756 70734 93996 111991 110209 89679 75204 58714 63532 91324 73971
5001G3971l0148l858l525R252L850J8865j4116O9092P2482N4495O8559N4417L3334
$$ 73971 43823 39965 36440 45692 49542 68407 54291 123383 195865 250360 318919 373336 406670
4988D06670k1039j2572j4975j4048k651L5305j7700j4901j2388k7996o211m085
$$ 406670 385631 373059 358084 344036 341385 376690 358990 344089 331701 303705 297494 293409
4976B93409p664l2463j525q142P940L8895j401L2N139r395J0293l1297l8759m5331
$$ 293409 285745 253282 251757 243615 251555 290450 289049 289081 294220 284825 295118 263821 225062 179731
4962A79731l7458J2376K852q925m7269l950j0942j0501j137J333J3154o604j6467
$$ 179731 142273 154649 157501 148576 101307 97357 86415 75914 74777 76110 89264 82660 66193
4949F6193K2776L2694m783N232k6600k496p727k1463N9616m8024k789J8500N216
$$ 66193 88969 121663 116880 122112 95512 93016 85289 63826 123442 75418 72629 91129 96345
4936I6345P001k1303o938l655J2217L099n632o900j2496o165j2649N879l290J2794
$$ 96345 103346 82043 75105 71450 83667 86766 81134 74234 61738 55573 42924 48803 45513 58307
4922E8307K1188j0822L4941j2300K3616k2090J6837M8383k1108j8035j2913Q530
$$ 58307 79495 68673 103614 91314 114930 92840 109677 158060 136952 118917 106004 114534
4910A14534O555j8526N237J4791J1159q797j8629k128k1411J9588L281M055j9003
$$ 114534 121089 102563 107800 122591 133750 124953 106324 104196 82785 102373 105654 109709 90706
4897I0706j036N1232L773j7541J3542L552N031J4974j2881n355p00o068k318J4791
$$ 90706 89670 140902 144675 127134 140676 144228 149259 164233 151352 145997 145297 139229 136911 151702
4883A51702J1328l8137K4926o678L8545L143r615N997o9951l4283M3251J0466
$$ 151702 163030 124893 149819 143141 181686 184829 175214 181211 111260 76977 120228 130694
4871A30694J3136J3066r674K942m449J7239k5524M722k1894P494M6992J9451L9801
$$ 130694 143830 156896 147222 150164 145715 162954 137430 142152 120258 127752 174744 194195 233996
4858B33996O980M646J2582n43N4376L5403N5201L9750N1594K9944j0235j0662
$$ 233996 240976 245622 258204 257661 312037 347440 402641 442391 493985 523929 513694 503032
4846E03032j4454m2622l0165j6468j375k431k1982j316J0163p655N1913O32L0286
$$ 503032 488578 445956 415791 399323 397948 395517 373535 372219 382382 374727 426640 427272 457558
4833D57558P5971K0693M6194Q3094J00708J06219J47828K82465M83393Q20560
$$ 457558 533529 554222 600416 683510 784218 890437 1038265 1320730 1804123 2624683
4823B624683J097794J383066J106874L68915j55077n21368p77124q13806p34421
$$ 2624683 3722477 5105543 6212417 6581332 6426255 5904887 5127763 4313957 3579536
4814C579536o38992n51642m64776l52700k53299j48784j02593l5588k8582r9806
$$ 3579536 2940544 2388902 1924126 1571426 1318127 1169343 1066750 1031162 1002580 902774
4804I02774r9765q2817m1652j6441j9054m4791o4070J9007p190k3788j2391k1911
$$ 902774 803009 720192 678540 662099 643045 598254 534184 553191 546001 522213 509822 487911
4792D87911l0916j4039N251P582j1804P650k1290n309m997K8387k7015k8175m826
$$ 487911 456995 442956 448207 455789 443985 451635 430345 425036 420039 448426 421411 393236 388410
4779C88410K2497j7469N859K1943K6041k4651R562K5675j6317j8422j1473L728
$$ 388410 410907 393438 399297 421240 447281 422630 432192 457867 441550 423128 411655 415383
4767D15383J0615r690j6342K7656J7399J2946k5504j4444o749K1611K250k5200
$$ 415383 425998 416308 399966 427622 445021 457967 432463 418019 411270 432881 435131 409931
4755D09931Q371j9004l2336r648L052J4011P254Q362L3146l2034k6264Q873j7921
$$ 409931 418302 399298 366962 357314 360366 374377 381631 389993 423139 391105 364841 373714 355793
4742C55793K4656M2365P551l9715l223J7506K9351J1106j0477j6649l725K4J4456
$$ 355793 380449 422814 430365 390650 387427 404933 434284 445390 434913 418264 414539 414563 429019
4729D29019K8081J9079k6508j211L2217o395J6601j6812j3391L3214o613O516
$$ 429019 457100 476179 449671 448460 480677 474282 490883 474071 460680 493894 487281 493797
4717D93797j9486j0952r54J8501j8203J0278K5373J2240j8541J7654J6370n335
$$ 493797 474311 463359 462405 480906 462703 472981 498354 510594 492053 509707 526077 520742
4705E20742K7212o741j3865k5202L3060M366r836N083j7391M059J209M4586k362
$$ 520742 547954 541213 527348 502146 535206 539572 529736 534819 517428 521487 522696 567282 564920
4692E64920k0398M5320N164n61K9073J2311J1085R330J8287J4712k5825O453K6920
$$ 564920 544522 589842 595006 594445 623518 635829 646914 656244 674531 689243 663418 669871 696791
4679F96791J4474q337l1525M1867J5199m1641j7051K8811L1511O917M7857J7470
$$ 696791 711265 702928 671403 713270 728469 686828 669777 698588 730099 737016 784873 802343
4667H02343J0387J0967M4099k6350J6947K0682j0415j0253j4513R590K731P6392
$$ 802343 812730 823697 867796 841446 858393 879075 868660 858407 843894 853484 856215 932607
4655I32607M5544l8298k5054P824r055j8514R728K5773J1489J2706P750j2737
$$ 932607 978151 939853 914799 922623 913568 895054 904782 930555 942044 954750 962500 949763
4643I49763m959K882M090J0097P0695K9372O271K6219J1874M3946N1018O0897
$$ 949763 944804 947686 951776 961873 1032568 1061940 1068211 1094430 1106304 1150250 1201268 1262165
4631A262165O2974J18161J46725K99945L92685M18608K54814J25359l4663j46727
$$ 1262165 1325139 1443300 1590025 1889970 2282655 2701263 2956077 3081436 3046773 2900046
4621B900046j93199k28431j73555j28502q5803p0751j4979J5955R1492Q7441J13440
$$ 2900046 2706847 2478416 2304861 2176359 2090556 2019805 2004826 2020781 2112273 2199714 2313154
4610B313154J83119J92125J98507J66632J58140J37977J08110K06055K67132L51259
$$ 2313154 2496273 2688398 2886905 3053537 3211677 3349654 3457764 3663819 3930951 4282210
4600D282210L19341L25309J62761J4094M1032J00166J76824K62698L18575K77761
$$ 4282210 4601551 4926860 5089621 5103715 5144747 5244913 5421737 5684435 6003010 6280771
4590F280771J42553k2926j03345j77577j45974q8834j495O2590j8040r0828k00019
$$ 6280771 6423324 6400398 6297053 6119476 5973502 5884668 5883173 5945763 5927723 5836895 5636876
4579E636876k32818k31485j85477j10925j17979q1734o9833j30180j07343j07037
$$ 5636876 5404058 5172573 4987096 4876171 4758192 4676458 4606625 4476445 4369102 4262065
4569D262065o3879j3100l487R4480J77668K46334L59371M97885O58514Q33937
$$ 4262065 4198186 4185086 4181599 4276079 4453747 4700081 5059452 5557337 6215851 7049788
4559G049788R53935J127847J255209J212902J100089Q87538O38055N17274N34355
$$ 7049788 8003723 9131570 10386779 11599681 12699770 13587308 14225363 14742637 15276992
4550A5276992P50736J036995J414655J692141J759411J197201K73518n32347j114265
$$ 15276992 16027728 17064723 18479378 20171519 21930930 23128131 23401649 22869302 21755037
4541B1755037j373639j380939j170203r04554o84527m99558n55822p34958r15454
$$ 21755037 20381398 19000459 17830256 16925702 16241175 15741617 15185795 14450837 13535383
4532A3535383j054614j102553j159126j066548r96850q82167p28013o04270m56929
$$ 13535383 12480769 11378216 10219090 9152542 8155692 7273525 6545512 5941242 5484313
4523E484313l70249k52964k23535j68473j04729j11387o9389J0761q2K120N1133
$$ 5484313 5114064 4861100 4637565 4469092 4364363 4252976 4183587 4194348 4194266 4196386 4247519
4512D247519L8341J47830K06309K75801L81740M76609P53323J017970J521976
$$ 4247519 4285860 4433690 4639999 4915800 5297540 5774149 6527472 7545442 9067418
4503I067418K107419K203764J455039M11990l43900p46984o47988l53881J65239
$$ 9067418 11174837 13378601 14833640 15245630 14901730 14154746 13506758 13152877 13318116
4494A3318116P42934J741572L019127M080193K911189M66617j312536k574024
$$ 13318116 14061050 15802622 18821749 22901942 25813131 26279748 24967212 22393188
4486B2393188k727282k370249j836761j312741n67935K02565R07006R27250J2775
$$ 22393188 19665906 17295657 15458896 14146155 13578220 13780785 14687791 15615041 15627816
4477A5627816r06691j443192j663528j589696j368571j170704r58888p47817n31768
$$ 15627816 14721125 13277933 11614405 10024709 8656138 7485434 6526546 5778729 5246961
4468E246961l87944l27453k50207k13437j71845j29694j44443j13102o2404q3760
$$ 5246961 4859017 4531564 4281357 4067920 3896075 3766381 3621938 3508836 3446432 3362672
4458C362672r0523k7532l5338j6977n2337m3383m0269m4505j3715j2260k7949
$$ 3362672 3272149 3244617 3209279 3192302 3139965 3096582 3056313 3011808 2998093 2985833 2957884
4447B957884k3422J5457K7915J644J3958K2567L1972L3719M2551N23J8943K3447
$$ 2957884 2934462 2949919 2977834 2979478 2993436 3016003 3047975 3081694 3124245 3124768 3143711 3167158
4435C167158K9898K2248q7393l5873n2932p4749j9292k2130k4579l136l0765m288
$$ 3167158 3197056 3219304 3131911 3096038 3043106 2968357 2949065 2926935 2902356 2899220 2868455 2864167
4423B864167l6273p501j5355j8018K5501n623J4404Q775j4291j0543n281L946
$$ 2864167 2827894 2820393 2805038 2787020 2812521 2806898 2821302 2830077 2815786 2805243 2799962 2803908
4411B803908q242L390L4131o73l8811K7805J5057K709K3015L7989j921p303J7180
$$ 2803908 2795666 2799056 2833187 2832514 2793703 2821508 2836565 2839274 2862289 2900278 2898357 2891054 2908234
4398B908234L772J8901p871L7387j5454K2437M6887J2440j1143L7982K6324N506
$$ 2908234 2912006 2930907 2923036 2960423 2944969 2967406 3014293 3026733 3015590 3053572 3079896 3085402
4386C085402J4304J3538o865J1484J7818L8657K3660M1857O5430L5862k5735m6503
$$ 3085402 3099706 3113244 3106379 3117863 3135681 3174338 3197998 3239855 3305285 3341147 3315412 3268909
4374C268909k341K7926m682J6681j3228K5145M5830J876J8046J3793K2874Q432
$$ 3268909 3266568 3294494 3289812 3306493 3293265 3318410 3364240 3366116 3384162 3397955 3420829 3429261
4362C429261n169N321K1150J9182L1941k9222N8528N5409k5821M6880K5947L6755
$$ 3429261 3424092 3429413 3450563 3469745 3501686 3472464 3530992 3586401 3560580 3607460 3633407 3670162
4350C670162N4397K3446k1611L4005J5344J643K7653O162M6645N475K3393K5039
$$ 3670162 3724559 3748005 3726394 3760399 3775743 3777386 3805039 3811201 3857846 3863321 3886714 3911753
4338C911753L6201J2525L4986R974M4086M4740M6584j5268K3001l774K5263K2216
$$ 3911753 3947954 3960479 3995465 4005439 4049525 4094265 4140849 4125581 4148582 4144808 4170071 4192287
4326D192287J4643n558L3272M3531M5446M7075n207M609L1459L5510M4624J0266
$$ 4192287 4206930 4201372 4234644 4278175 4323621 4370696 4365489 4370098 4401557 4437067 4481691 4491957
4314D491957J5986Q1328L3826L0844J8604J1466K8941Q3699K3844J0569M643n913
$$ 4491957 4507943 4589271 4623097 4653941 4672545 4684011 4712952 4796651 4820495 4831064 4835707 4829794
4302D829794L6399L7896O2145J5529J5583P1681M7566J8591L8671P6470M8192
$$ 4829794 4866193 4904089 4966234 4981763 4997346 5069027 5116593 5135184 5173855 5250325 5298517
4291E298517P0985O5935N5203R1329R7006J00208P1972P0986R2867J00762P6310
$$ 5298517 5369502 5435437 5490640 5581969 5678975 5779183 5851155 5922141 6015008 6115770 6192080
4280F192080J19581J49314J11941J93166K35236K08037K18266J93887J41841J67412
$$ 6192080 6311661 6460975 6572916 6766082 7001318 7209355 7427621 7621508 7763349 7930761
4270G930761J85522J55897J40792J52454K10725K44584K42423L33859M19683M58176
$$ 7930761 8116283 8272180 8412972 8565426 8776151 9020735 9263158 9597017 10016700 10474876
4260A0474876M96145M83577M42845L86856L54331L13329K58650K49385K29940
$$ 10474876 10971021 11454598 11897443 12284299 12638630 12951959 13210609 13459994 13689934
4251A3689934K11805K60722L25886M08477N05464N96452P33274P64192P15802
$$ 13689934 13901739 14162461 14488347 14896824 15402288 15998740 16732014 17496206 18212008
4242A8212008O63210N56268M33074L05461J45538J9009n9769j7756J2388K06837
$$ 18212008 18875218 19431486 19864560 20170021 20315559 20334568 20274799 20257043 20269431 20476268
4232B0476268L74698N62459P61654Q84074Q75720P98559N77294L06691j6290k76782
$$ 20476268 20850966 21413425 22175079 23059153 23934873 24733432 25310726 25617417 25601127 25324345
4222B5324345n42096o04761n06011k89889K1042L13995O06184Q63811Q72692O96321
$$ 25324345 24782249 24177488 23671477 23381588 23402630 23716625 24322809 25186620 26059312 26755633
4212B6755633L80132M2428l94485p56212q74786r57670r07704o74534k84512J33351
$$ 26755633 27135765 27178193 26783708 26027496 25152710 24195040 23287336 22612802 22328290 22461641
4202B2461641M77225O64944O73756M10743M8958l33464p27944j022747j120916
$$ 22461641 22938866 23603810 24277566 24688309 24737267 24403803 23675859 22653112 21532196
4193B1532196j157577j057507q03592m52862j78274J12027L21697L03205J34767
$$ 21532196 20374619 19317112 18513520 18060658 17882384 17994411 18316108 18619313 18754080
4184A8754080j13091m33648o74357q87672r19231r31549q48960p03387m83742
$$ 18754080 18640989 18207341 17532984 16645312 15726081 14794532 13945572 13242185 12758443
4175A2758443l94017j68924p4470j5975l4938j33409k30351l76307m60223m50180
$$ 12758443 12364426 12195502 12121032 12105057 12070119 11936710 11706359 11330052 10869829 10419649
4165A0419649m45608m16832l56472l00234k58641k08796j66808j32777p3694j27817
$$ 10419649 9974041 9557209 9200737 8900503 8641862 8433066 8266258 8133481 8059787 7931970
4155G931970j24200r0923j19640j74453j02287j01681j14487r9619r5074p9767
$$ 7931970 7807770 7716847 7597207 7422754 7320467 7218786 7104299 7004680 6909606 6829839
4145F829839m8436m0640n7391r2004m1907j4642l2341k0097l5418k2356k9670
$$ 6829839 6781403 6740763 6683372 6591368 6549461 6534819 6502478 6482381 6446963 6424607 6394937
4134F394937o6944k4015n3924l6792n0042l8737L2181M0032l2653l0889r959l5451
$$ 6394937 6327993 6303978 6250054 6213262 6163220 6124483 6156664 6196696 6164043 6133154 6123195 6087744
4122F087744l7212m8026J4644R512m9980j9124Q605r317n3090k1562J5295k4587
$$ 6087744 6050532 6002506 6017150 6026662 5976682 5957558 5966163 5956846 5903756 5882194 5897489 5872902
4110E872902o3712k2145J5632q484n3231k8996k083o066k5135k1370J5803k6879
$$ 5872902 5809190 5787045 5802677 5794193 5740962 5711966 5709883 5703817 5678682 5657312 5673115 5646236
4098E646236j9613J9570l8799m1518j6558j9137J9518l0998k8831k6287k3078
$$ 5646236 5626623 5646193 5607394 5565876 5549318 5530181 5549699 5518701 5489870 5463583 5440505
4087E440505J2340l1870p187j075m7572j29l4011Q961j1905n9261J2340j8983
$$ 5440505 5452845 5420975 5413788 5412713 5365141 5365012 5331001 5339962 5328057 5268796 5281136 5262153
4075E262153k4333r97k3507l0143k9560l5769k2986N84n0458j9120j0825j6556
$$ 5262153 5237820 5236823 5213316 5183173 5153613 5117844 5094858 5095442 5044984 5025864 5015039 4998483
4063D998483k3150m2913j3834m6270L853o1234m0249m704J6119m0359o1653l2663
$$ 4998483 4975333 4932420 4918586 4872316 4876169 4814935 4774686 4769982 4786101 4745742 4684089 4651426
4051D651426m693k3979j0604K5813m3324l523m4503n3984m2673n2606l6041m3457
$$ 4651426 4646733 4622754 4612150 4637963 4594639 4591116 4546613 4492629 4449956 4397350 4361309 4317852
4039D317852J2087j8195j0238r389l9101l7278l4877l924r090Pk8639j8365j3549
$$ 4317852 4329939 4311744 4301506 4292117 4253016 4215738 4180861 4176937 4167847 4167854 4139215 4120850 4107301
4026D107301j2168l6823j713j4732l3556l290k1295k3153n8618r328k9473l3936
$$ 4107301 4095133 4058310 4056597 4041865 4008309 4005019 3983724 3960571 3901953 3892625 3863152 3829216
4014C829216k3929n3487P686m8660m7306J1888k3008n4907K0125k1685m2296l533
$$ 3829216 3805287 3751800 3759486 3710826 3663520 3675408 3652400 3597493 3617618 3595933 3553637 3550104
4002C550104O893m7776p042J8370j237m2315l3786O554l5452M871j4895k9763
$$ 3550104 3556997 3509221 3502179 3520549 3519312 3476997 3443211 3449765 3414313 3419184 3404289 3374526
3990C374526j3823j190k5567p428n9768l8047l2088k855j7698J3285J7931k2407
$$ 3374526 3360703 3359513 3333946 3326518 3266750 3228703 3196615 3193760 3176062 3189347 3207278 3184871
3978C184871k0578j434L721p1725j9912J2071j1521k1721l8601k0015m9772j7562
$$ 3184871 3164293 3162859 3166580 3094855 3074943 3087014 3075493 3053772 3015171 2995156 2945384 2927822
3966B927822l4134k2503L2863j537k1592O86k6017o634J9741k3381l0202j2436
$$ 2927822 2893688 2871185 2904048 2902511 2880919 2881605 2855588 2848954 2868695 2845314 2815112 2802676
3954B802676l226k4598J7574p478j3050L6707O0791J52882J32697J42162J73849
$$ 2802676 2799450 2774852 2792426 2784948 2771898 2808605 2869396 3022278 3154975 3297137 3470986
3943C470986Q8703L5736l2174j09747j55512j01716r2228o5067j05367r6977p4226
$$ 3470986 3559689 3595425 3563251 3453504 3297992 3196276 3104048 3038981 2933614 2836637 2762411
3932B762411k2478l9403m9218J9925j906K9087M0595R807j8915m2107R933q769
$$ 2762411 2739933 2700530 2651312 2671237 2669331 2698418 2739013 2748820 2729905 2687798 2697731 2688962
3920B688962j5864J0513q163L2308P2693J49003J66226K27549J39085J1645j2855
$$ 2688962 2673098 2683611 2675448 2707756 2780449 2929452 3095678 3323227 3462312 3473957 3461102
3909C461102r6410j20509j35431j17614j40469p8094n9890o4251m9399l4481r990
$$ 3461102 3364692 3244183 3108752 2991138 2850669 2772575 2712685 2648434 2599035 2564554 2554564
3898B554564j1039J734j0246l0312n9738l2216o56K2297j867k9948j1401j8609
$$ 2554564 2543525 2545259 2535013 2504701 2444963 2412747 2412091 2434388 2432521 2402573 2391172 2372563
3886B372563J6351l8741n315J4512k4267j8630l4585q802K2888O0771k2186m3103
$$ 2372563 2388914 2350173 2344858 2359370 2335103 2316473 2281888 2273086 2295974 2356745 2334559 2291456
3874B291456m7607J8658L4454k7808m331m8740M816j5171K828l4871k0333K79
$$ 2291456 2243849 2262507 2296961 2269153 2264822 2216082 2220898 2205727 2208555 2173684 2153351 2153630
3862B153630j7134j9415k9391J9894j7841o202K2436l3577n0945J3962O198N6683
$$ 2153630 2136496 2117081 2087690 2107584 2089743 2083541 2105977 2072400 2021455 2035417 2041615 2098298
3850B098298O093j4650M836J0607k123J0080J0812J3569L2177K5814n284J7102
$$ 2098298 2104391 2089741 2094577 2105184 2103061 2113141 2123953 2137522 2169699 2195513 2190229 2207331
3838B207331M3372K1419J5829P18M8502M8275j9184r0M2253N5250K0385K3512
$$ 2207331 2250703 2272122 2287951 2288669 2337171 2385446 2366262 2366172 2408425 2463675 2484060 2507572
3826B507572j305j3100K3185K455J1905N0193L8298L4904M3086M8504P3650P192
$$ 2507572 2506267 2493167 2516352 2518807 2530712 2580905 2619203 2654107 2697193 2745697 2819347 2826539
3814B826539M8323O1917L1461O9632Q7930Q8556R7286J20055J65641J82269K31126
$$ 2826539 2874862 2936779 2968240 3037872 3125802 3214358 3311644 3431699 3597340 3779609 4010735
3803D010735K71718K81823L69815M66095N80327O77921Q20140R35256R90822J072613
$$ 4010735 4282453 4564276 4934091 5400186 5980513 6658434 7478574 8413830 9404652 10477265
3793A0477265J106262J085270J006563R00046Q19471N87536L92353K39291M9335
$$ 10477265 11583527 12668797 13675360 14575406 15394877 15982413 16374766 16614057 16663392
3784A6663392l5005o1715n7644j14706n2944L5007P3856R9978Q0947O1907m5702
$$ 16663392 16628387 16566672 16509028 16394322 16341378 16376385 16450241 16550219 16631166 16693073 16647371
3773A6647371j36378k79830m50705o15328p78463q92270r56990r39859r44696
$$ 16647371 16510993 16231163 15780458 15165130 14386667 13494397 12537407 11597548 10652852
3764A0652852r29498q69779q32179p03768o12465n30706m77703m00133l49363
$$ 10652852 9723354 8853575 8021396 7317628 6705163 6174457 5696754 5296621 4947258
3755D947258k35659j99130k14183j64534j29749r6430j10947j04179j00525q7248
$$ 4947258 4711599 4512469 4298286 4133752 4004003 3907573 3796626 3692447 3591922 3504674
3745C504674p4794l3251n1280l9016k4399Q631L310n2672k2315j6946j7535j6913
$$ 3504674 3429880 3396629 3345349 3306333 3281934 3290565 3293875 3241203 3218888 3201942 3184407 3167494
3733C167494j4630l3588q2564l5891P484j725m8996m9502Q244k4531R758P159
$$ 3167494 3152864 3119276 3036712 3000821 3008305 3006580 2957584 2908082 2916326 2891795 2901553 2908712
3721B908712l7495J8176l569l7184l5030n576P686K3572l8436J1441k687j5145
$$ 2908712 2871217 2889393 2885824 2848640 2813610 2808034 2815720 2839292 2800856 2812297 2809610 2794465
3709B794465M638k2396J5899K8336j1355M060j7086p601Q062L6641K3010L8849
$$ 2794465 2799103 2776707 2792606 2820942 2809587 2813647 2796561 2788960 2797022 2833663 2856673 2895522
3697B895522K4799k2178N817N1408M2300Q632j3843P021j9123n469N9827J0539
$$ 2895522 2920321 2898143 2903960 2955368 2997668 3006300 2992457 2999478 2980355 2974886 3034713 3045252
3685C045252k02K7512M9332o310M5103O3404N1911M2395K5642J4856P8991M8892
$$ 3045252 3045050 3072562 3121894 3115584 3160687 3224091 3276002 3318397 3344039 3358895 3437886 3486778
3673C486778K0447K2791N7212K2298L7038M2218M7514R5023R9374P1011Q3238
$$ 3486778 3507225 3530016 3587228 3609526 3646564 3688782 3736296 3831319 3930693 4001704 4084942
3662D084942J12049J27121J42636J40107J88319K13521J86054K40664L03739L16873
$$ 4084942 4196991 4324112 4466748 4606855 4795174 5008695 5194749 5435413 5739152 6056025
3652F056025L41667L85543M49632M54878N12642N52447N43046M93007M55642M02737
$$ 6056025 6397692 6783235 7232867 7687745 8200387 8752834 9295880 9788887 10244529 10647266
3642A0647266L27194K36072K02120J30852O8502Q1748P9761R3932J86553L55298
$$ 10647266 10974460 11210532 11412652 11543504 11612006 11693754 11773515 11867447 12054000 12409298
3632A2409298N18913P25235J030528J362434J721226K059612K343626K563440
$$ 12409298 12928211 13653446 14683974 16046408 17767634 19827246 22170872 24734312
3624B4734312K648754K520249K318320J943587J478134R78614M94953O4714k78366
$$ 24734312 27383066 29903315 32221635 34165222 35643356 36621970 37116923 37181637 36903271
3615C6903271m32377m57338k85656k2056K90169N49858P17866Q04036P21484M98305
$$ 36903271 36470894 36013556 35727900 35705844 35996013 36545871 37263737 38067773 38789257 39287562
3605C9287562J64141j59418n30328q86737j150732j315399j294440j200405j000440
$$ 39287562 39451703 39292285 38761957 37875220 36724488 35409089 34114649 32914244 31913804
3596C1913804p51033n21889k59741j51489m0102k5288q7622j79883l98022o37007
$$ 31913804 31162771 30640882 30381141 30229652 30189550 30164262 30076640 29896757 29498735 28861728
3586B8861728q09316r89469j144138j253248j343593j347904j316000j223293
$$ 28861728 28052412 27062943 25918805 24665557 23321964 21974060 20658060 19434767
3578A9434767j106118j035921q93847p05843o07212m73182k98369k14164m8465
$$ 19434767 18328649 17292728 16398881 15693038 15085826 14612644 14314275 14100111 14051646
3569A4051646J24853K06493L29340M83463N73853O48814P96262R46463J214314
$$ 14051646 14176499 14382992 14712332 15195795 15769648 16418462 17214724 18161187 19375501
3560A9375501J299763J450904J617881J787018K024661K280697K475688K715806
$$ 19375501 20675264 22126168 23744049 25531067 27555728 29836425 32312113 35027919
3552C5027919K888982K983685K946909K759353K441801J937551J382039P57700
$$ 35027919 37916901 40900586 43847495 46606848 49048649 50986200 52368239 53125939
3544E3125939J18443m38609r06732j206888j257704j208306r56838n80069k02538
$$ 53125939 53244382 52805773 51899041 50692153 49434449 48226143 47269305 46689236 46486698
3535D6486698J37549K33873L33405K06231m2305m54858r38950j382529j857048
$$ 46486698 46624247 46858120 47191525 47397756 47355451 46900593 45961643 44579114 42722066
3526D2722066k187774k411325k522716k418212k318926k044820j744996j478031
$$ 42722066 40534292 38122967 35600251 33182039 30863113 28818293 27073297 25595266
3518B5595266j181089r19621o62595n06607l22510k81825j81526k07957j89772
$$ 25595266 24414177 23494556 22831961 22325354 22002844 21721019 21539493 21331536 21141764
3509B1141764j30157p5211j7982J2677N8595J25295K39047L31194L43442M61800
$$ 21141764 21011607 20936396 20918414 20931091 20989686 21114981 21354028 21685222 22028664 22490464
3499B2490464M92166M81986N31478N45615N31293N76316N91486O79367O80684
$$ 22490464 22982630 23464616 23996094 24541709 25073002 25649318 26240804 26920171 27600855
3490B7600855P61293R49698J055592J218804J472383J762300K037665K341155
$$ 27600855 28362148 29311846 30367438 31586242 33058625 34820925 36858590 39199745
3482C9199745K688290L054262L376480L716717M042481M241093M349940M338354
$$ 39199745 41888035 44942297 48318777 52035494 56077975 60319068 64669008 69007362
3474F9007362M284206M093680L840570L527690L217773K958438K810182K694685
$$ 69007362 73291568 77385248 81225818 84753508 87971281 90929719 93739901 96434586
3466I6434586K730664K897668L096148L327503L504493L615386L546997L342323
$$ 96434586 99165250 102062918 105159066 108486569 111991062 115606448 119153445 122495768
3458A22495768L019973K572056J959763J224767M57135j64615q39256j310354
$$ 122495768 125515741 128087797 130047560 131272327 131729462 131564847 130725591 129415237
3450A29415237j702535k005893k161254k261580k331542k244376k149709k092474
$$ 129415237 127712702 125706809 123545555 121283975 118952433 116708057 114558348 112465874
3442A12465874j922157j803224j576835j334343j036076o54202l49809q747K66622
$$ 112465874 110543717 108740493 107163658 105829315 104793239 104139037 103789228 103780481 104047103
3433A04047103L41785L32515J87852q6012m25680r58894j414143j808501k209939
$$ 104047103 104388888 104721403 104909255 104823243 104397563 103438669 102024526 100216025 98006086
3424I8006086k464671k570945k620475k633810k473488k269107k046841j727348
$$ 98006086 95541415 92970470 90349995 87716185 85242697 82973590 80926749 79199401
3416G9199401j453083j261096j146222j106907j227226j357050j607185j920008
$$ 79199401 77746318 76485222 75339000 74232093 73004867 71647817 70040632 68120624
3408F8120624k232049k574004k841714l034328l151034l178196l072199k980147
$$ 68120624 65888575 63314571 60472857 57438529 54287495 51109299 48037100 45056953
3400D5056953k827758k625929k427060k249571j970218j783690j555092j332084
$$ 45056953 42229195 39603266 37176206 34926635 32956417 31172727 29617635 28285551
3392B8285551j160536r25950p71059o08545n08184l88323k77345k19917j02211
$$ 28285551 27125015 26199065 25428006 24819461 24311277 23922954 23645609 23425692 23323481
3383B3323481K8282J68752L83941O88892R90863J384917J893572K488721L133552
$$ 23323481 23351763 23520515 23904456 24593348 25584211 26969128 28862700 31351421 34484973
3374C4484973L735700M165295M339845M304907M096500L672889L181435K616024
$$ 34484973 38220673 42385968 46725813 51030720 55127220 58800109 61981544 64597568
3366F4597568K005928J409140Q84558K66348j06451l55919n22919o02350o25384
$$ 64597568 66603496 68012636 68897194 69163542 69057091 68701172 68178253 67575903 66950519
3357F6950519n00137m35963k83110j83800j03471j35322k42676m80218q15422
$$ 66950519 66450382 66014419 65731309 65547509 65444038 65308716 65066040 64585822 63770400
3348F3770400j188476j586791k061016k463235k706231k897221l049892l074138
$$ 63770400 62581924 60995133 58934117 56470882 53764651 50867430 47817538 44743400
3340D4743400k955183k852239k706170k577108k464450k258649k075244j816994
$$ 44743400 41788217 38935978 36229808 33652700 31188250 28929601 26854357 25037363
3332B5037363j689410j393013j144795r40563p76166n76031m38237k94911j59124
$$ 25037363 23347953 21954940 20810145 19869582 19093416 18517385 18079148 17784237 17625113
3323A7625113m0167Q6918K00475L61797N28579O85483R14997J183345J454462
$$ 17625113 17584946 17671864 17872339 18234136 18762715 19448198 20363195 21546540 23001002
3314B3001002J829253K225827K700367L237366L766614M220668M672227M925332
$$ 23001002 24830255 27056082 29756449 32993815 36760429 40981097 45653324 50578656
3306E0578656N194462N289101N301477N128807M748041M141690L330098K301348
$$ 50578656 55773118 61062219 66363696 71492503 76240544 80382234 83712332 86013680
3298H6013680J230602Q7012r01115j766028k297593k552673k314041j461215N96630
$$ 86013680 87244282 87331294 86430179 84664151 82366558 79813885 77499844 76038629 76635259
3289G6635259L113502N006338N186295L261621J081477j119529k306111k777214
$$ 76635259 79748761 84755099 89941394 93203015 94284492 93164963 90858852 88081638
3281H8081638k972533k804633k861586l178932l486020l876116m191375m414893
$$ 88081638 85109105 82304472 79442886 76263954 72777934 68901818 64710443 60295550
3273F0295550m601521m694747m582402m270270l920747l462377k923213k300963
$$ 60295550 55694029 50999282 46416880 42146610 38225863 34763486 31840273 29539310
3265B9539310j614001p12110O25038K760285M618660N537328M201625J458828
$$ 29539310 27925309 27213199 27838237 30598522 35217182 40754510 44956135 46414963
3257D6414963j076338l382560m334813m707801m413192l703854l121203k595923
$$ 46414963 45338625 41956065 37621252 32913451 28500259 24796405 21675202 19079279
3249A9079279k055954j567219j118116r03554p45500n78359n14484m66252m12747
$$ 19079279 17023325 15456106 14337990 13434436 12688936 12110577 11596093 11129841 10717094
3240A0717094l66535l42650l15478l15666l03000k91325k51210k93317k47976
$$ 10717094 10350559 10007909 9692431 9376765 9073765 8782440 8531230 8237913 7989937
3231G989937k40545k44894j87160j86004j16837j15551j31382r0682j07670j23902
$$ 7989937 7749392 7504498 7317338 7131334 7014497 6898946 6767564 6676882 6569212 6445310
3221F445310j72632j47365j06051j71424j67251q7293j00865n1386p6281q8068
$$ 6445310 6272678 6125313 6019262 5847838 5680587 5593294 5492429 5441043 5364762 5276694
3211E276694r2195j21198j15000p8808p0886j4911n5633P73K4257j2403l876k249
$$ 5276694 5184499 5063301 4948301 4869493 4798607 4783696 4728063 4728836 4753093 4740690 4736814 4734565
3199D734565K3910J1039j1969L4910N1634K4703J5821O5394J9400o388K6198J6315
$$ 4734565 4758475 4769514 4757545 4792455 4844089 4868792 4884613 4950007 4969407 4963019 4989217 5005532
3187E005532j4865J6645R015j363j6119j3717K9154O394M2570L6189K0795K1436
$$ 5005532 4990667 5007312 5016327 5014964 4998845 4985128 5014282 5020676 5063246 5099435 5120230 5141666
3175E141666K2708K034l135M5942J4008k902K2697N4684O7997J5621J0857j1534
$$ 5141666 5164374 5166408 5163273 5209215 5223223 5220321 5243018 5297702 5365699 5381320 5392177 5380643
3163E380643M4595Q4453M1093R7185J12234M5669Q8196R9761O9043O7503Q8041
$$ 5380643 5425238 5509691 5550784 5647969 5760203 5805872 5894068 5993829 6062872 6130375 6218416
3152F218416R4903R4184J24486J34360J31291R8211Q1696J35613Q2179R1718P7068
$$ 6218416 6313319 6407503 6531989 6666349 6797640 6895851 6977547 7113160 7195339 7287057 7364125
3141G364125J13826J33402J47493J30820J50582J42203J30795J65494K04152K54209
$$ 7364125 7477951 7611353 7758846 7889666 8040248 8182451 8313246 8478740 8682892 8937101
3131H937101K89119L22210L06144K87292J68428P4014L9536R2150J00575J09417
$$ 8937101 9226220 9548430 9854574 10141866 10310294 10384308 10423844 10515994 10616569 10725986
3121A0725986J56349K15848K46738L11365L18523K85560K39280K40702K54934
$$ 10725986 10882335 11098183 11344921 11656286 11974809 12260369 12499649 12740351 12995285
3112A2995285K54690L04490L47698L62050L92656M53740M24744M33457M40336
$$ 12995285 13249975 13554465 13902163 14264213 14656869 15110609 15535353 15968810 16409146
3103A6409146M33050N15446O19350P54808R11641J000726J089614J150355J201050
$$ 16409146 16842196 17357642 17976992 18731800 19643441 20644167 21733781 22884136 24085186
3094B4085186J320419J490161J738684J991224K342392K790407L170927L691475
$$ 24085186 25405605 26895766 28634450 30625674 32968066 35758473 38929400 42620875
3086D2620875M505977N715883P441951R851236J2774466J5529636J6872157J5793216
$$ 42620875 47126852 52842735 60284686 70135922 82910388 98440024 115312181 131105397
3078A31105397J2337646P841423M024389K033547K828288P094637J4274433K2453350
$$ 131105397 143443043 151284466 155308855 157342402 160170690 167265327 181539760 203993110
3070B03993110K7853577K6903519J8842476P127014m190643j2395943j5775505
$$ 203993110 231846687 258750206 277592682 284719696 280529053 268133110 252357605
3063B52357605j3462379n443249O294692J7611058K3235511J8834504O413282
$$ 252357605 238895226 233451977 239746669 257357727 280593238 299427742 305841024
3056C05841024p651534j9693431k8100799l1798995l1353263k8515077k4788530
$$ 305841024 298189490 278496059 250395260 218596265 187243002 158727925 133939395
3049A33939395k0875534j6911703j3383973j0499260q406419o897349n888008
$$ 133939395 113063861 96152158 82768185 72268925 63862506 56965157 51077149
3042E1077149n029879m320764l655270l071216k612831k151016j830960j626788
$$ 51077149 46047270 41726506 38071236 35000020 32387189 30236173 28405213 26778425
3034B6778425j438736j391844j294627j209807j048906r70261r08750p41670o39076
$$ 26778425 25339689 23947845 22653218 21443411 20394505 19424244 18515494 17773824 17134748
3025A7134748n83967n92982n16463n37439n79901n65355m75922m60563l59980
$$ 17134748 16550781 15957799 15441336 14903897 14323996 13758641 13282719 12822156 12462176
3016A2462176l34007l22796l20728l21816k90566l27774l37256l41313l13727
$$ 12462176 12128169 11805373 11484645 11162829 10872263 10544489 10207233 9865920 9552193
3007I552193k96830k50719k14293j98809j95899k03180l14908k79550k15611j89828
$$ 9552193 9255363 9004644 8790351 8591542 8395643 8192463 7877555 7598005 7382394 7192566
2997G192566j95114j46811j21393j10105j18140j11233j55923j49851j40436j74026
$$ 7192566 6997452 6850641 6729248 6619143 6501003 6389770 6233847 6083996 5943560 5769534
2987E769534j34526j57248j76186j06010j35140j33762j10944r7302m5022m6123
$$ 5769534 5635008 5477760 5301574 5195564 5060424 4926662 4815718 4718416 4673394 4627271
2977D627271p7749o1665o7625m0969m3138n3462n7392p1093m6802p3453n2694
$$ 4627271 4549522 4487857 4420232 4379263 4336125 4282663 4225271 4154178 4107376 4033923 3981229
2966C981229k8757l5169n9814k1504k3621o5604j07933o1459l5215n7148p7187
$$ 3981229 3952472 3917303 3857489 3835985 3812364 3746760 3638827 3577368 3542153 3485005 3407818
2955C407818q3491p7220m3102o1155p8613q2339j02691o1458j05616p2775m1312
$$ 3407818 3324327 3247107 3204005 3142850 3064237 2981898 2879207 2817749 2712133 2639358 2598046
2944B598046p0519m1327k1829K3543l2082n5820q509l6762k0538j2725l3691j8995
$$ 2598046 2527527 2486200 2464371 2487914 2455832 2400012 2391503 2354741 2334203 2321478 2287787 2268792
2932B268792m534j1882k601N6228J3379j931m7342l1845l5494m788j6858R529
$$ 2268792 2264258 2252376 2249775 2306003 2319382 2317451 2270109 2238264 2202770 2197982 2181124 2190653
2920B190653j0l0648j3186n113m2475m8918m7282m2200j6544P274L832n1321j3920
$$ 2190653 2190643 2159995 2146809 2141696 2099221 2050303 2003021 1960821 1944277 1951551 1955383 1904062 1890142
2907A890142j8811l4783n6840L646j6594j14503q4431k9814j3615m5133m9701
$$ 1890142 1871331 1836548 1779708 1783354 1766760 1652257 1567826 1538012 1524397 1479264 1429563
2896A429563j0770l7699l7610m1557k7715j9576l9597k2458j0836P41k149m1918
$$ 1429563 1418793 1381094 1343484 1301927 1274212 1254636 1215039 1192581 1181745 1182486 1180337 1138419
2884A138419J7407q386k7655k799M045j9592j5724k4565k5400L3533O502R721
$$ 1138419 1155826 1147440 1119785 1116986 1121031 1101439 1085715 1061150 1035750 1069283 1075785 1085506
2872A085506k2900l0989k6003k2279q519K7471N012k5323l1434K786K068L2188
$$ 1085506 1062606 1031617 1005614 983335 974816 1002287 1007299 981976 950542 953328 955396 987584
2860I87584K6052J5016J5794K0980l2330P719j6199m3015o1435K5936J7408k98
$$ 987584 1013636 1028652 1044446 1065426 1033096 1040815 1024616 981601 920166 946102 963510 963212
2848I63212L9743r887K2328O2610k4986m2609j4902o092j8767l4581M0601j5546
$$ 963212 1002955 993068 1015396 1078006 1053020 1010411 995509 989417 970650 936069 976670 961124
2836I61124p393K1045J4077J4644m097j4211K6802J4868J9586K8928K3213m363
$$ 961124 953731 974776 988853 1003497 999400 985189 1011991 1026859 1046445 1075373 1098586 1094223
2824A094223J6546R69R785K461r568r400L1781R48K6426j5077n428j0090k6009
$$ 1094223 1110769 1111738 1121523 1123984 1114416 1105016 1136797 1137745 1164171 1149094 1143666 1133576 1107567
2811A107567O607K0886l362j332P992J9868J0116L064k738K9770M8350M1940O1706
$$ 1107567 1114174 1135060 1131698 1130366 1138358 1158226 1168342 1171406 1168668 1198438 1246788 1288728 1350434
2798A350434M1128P7032Q2907M0479O5736L6533J39J4374J4528L3793J26594J30209
$$ 1350434 1391562 1468594 1551501 1591980 1657716 1694249 1694388 1708762 1723290 1757083 1883677 2013886
2786B013886J55117Q7350N6857r851p2093o5448n4117k6158L6440R7042J09845
$$ 2013886 2169003 2256353 2313210 2303359 2231266 2165818 2111701 2085543 2121983 2219025 2328870
2775B328870Q6914K190n1205j09792j82924j95811j22727j21345j32002j06541
$$ 2328870 2415784 2417974 2366769 2256977 2074053 1878242 1755515 1634170 1502168 1395627
2765A395627q6259r6943n7412o7310m3421n3357o7585n1379j3483j0097p949k1127
$$ 1395627 1309368 1212425 1155013 1087703 1044282 990925 923340 871961 858478 848381 840432 819305
2753H19305j7150j7461j9428l035J211l4877j0710m965K1264k1500L0094J7794
$$ 819305 802155 784694 765266 762231 763442 728565 717855 712890 734154 712654 742748 760542
2741G60542k3756k56j9006O078n828j062j4894j756l3085k8766L3917O940j3391
$$ 760542 736786 736530 717524 723602 717774 716712 701818 700062 666977 638211 672128 679068 665677
2728F65677m470k1120j2720k5981J0938J1237l2001K7638o036o038k9519k7848
$$ 665677 661207 640087 627367 601386 612324 623561 591560 619198 613162 607124 577605 549757
2716E49757K9630L8578o197J9397m9254r509p542l7072K4490M2413N683j9699
$$ 549757 579387 617965 611768 631165 581911 572402 564860 527788 552278 594691 600374 580675
2704E80675j1934k4610K1545j4427l3465k4404K663J7972K8935Q624l8783J5716
$$ 580675 568741 544131 565676 551249 517784 493380 496043 514015 542950 551574 512791 528507
2692E28507K3798Q431J6063j496l3832N1635J776l541K0231j7304J1424o125P794
$$ 528507 552305 560736 576799 575303 541471 593106 594882 591341 611572 594268 605692 599567 607361
2679F07361K5924J5222j8051k9463N16L7154R373L744k9341j885j0292L169k4749
$$ 607361 633285 648507 630456 600993 601509 638663 648036 651780 622439 620554 610262 613431 588682
2666E88682l059j8584J786j5501j6360J2563K6560m0048q883p505m6395R865K1943
$$ 588682 585623 567039 568825 553324 536964 549527 576087 536039 527156 519651 473256 483121 505064
2653E05064l3723k1609k0365R576L369l9758j529L9155m0948l1649J9812j5819
$$ 505064 471341 449732 429367 438943 442312 402554 401025 440180 399232 367583 387395 371576
2641C71576J3195l228l0197J4604O6519r93m5403j4266q721O0203L4199j3146
$$ 371576 384771 381543 351346 365950 432469 431476 386073 371807 363086 423289 457488 444342
2629D44342K1678l5325J1767K6405R590k3361J5194l4995p809K020j620L8113
$$ 444342 466020 430695 442462 468867 478457 455096 470290 435295 427486 429506 427886 465999
2617D65999K2575r223m1619m2507N849K9132j0398J458K2697K6428j1499q460
$$ 465999 488574 479351 437732 395225 401074 430206 419808 421266 443963 470391 458892 450432
2605D50432r849l4825m0914j9474k716N9370L1575K5206j8404j8190J4030j8128
$$ 450432 440583 405758 364844 345370 342654 402024 433599 458805 440401 422211 436241 418113
2593D18113j8153K5478j211o299M4526j2067J0762K4843N5294K6953J4854j465
$$ 418113 399960 425438 424227 417928 462454 450387 461149 485992 541286 568239 583093 581628
2581E81628Q909K6292l0817o4065l5714J0024M899Q511m0066k7087n62m2878K6971
$$ 581628 590537 616829 586012 521947 486233 496257 501156 509667 469601 442514 441952 399074 426045
2568D26045q18p118K725K320n5590K4418K1951P790J6960J3727L6890p451k2416
$$ 426045 425227 418109 420834 423154 367564 391982 413933 421723 438683 452410 489300 481849 459433
2555D59433k499j779r369K2078l4747M821K3859q816J5399j1582r813J6703K2528
$$ 459433 456934 455155 445786 467864 433117 437938 461797 452981 468380 456798 446985 463688 486216
2542D86216N047l5516o456K0192L4696m3716j3895k260M119J2705J7639l7953
$$ 486216 491263 455747 449291 469483 504179 460463 446568 444308 448427 461132 478771 440818
2530D40818j4547K1849J3655j8082J3699j4725k1655K3854J4245M811R433K7623
$$ 440818 426271 448120 461775 443693 457392 442667 421012 444866 459111 463922 473355 500978
2518E00978o107j4858n9568k6143N1180K5786j2754l1381j3106K8586m037J3600
$$ 500978 494871 480013 420445 394302 445482 471268 458514 427133 414027 442613 438576 452176
2506D52176j7473K1283l987J7197K3113J036m228n6789r664j4727J5312l1287
$$ 452176 434703 455986 451999 469196 492309 493345 489117 432328 422664 407937 423249 391962
2494C91962j3269J7576j8530Q056l5972m2930J2426M0377K5849P174K2322l4337
$$ 391962 378693 396269 377739 385795 349823 306893 319319 359696 385545 392719 415041 380704
2482C80704J392K9365k2424J1796j4129M680j0783o785p733K2052r123l0558m686
$$ 380704 382096 411461 389037 400833 386704 391384 380601 373816 366083 388135 379012 348454 343768
2469C43768k0170K3439j8181l0652N0288o124K167R817R096J8404J999L1171o314
$$ 343768 323598 347037 328856 298204 348492 342368 344535 354352 363448 381852 383851 415022 408708
2456D08708r007l5261J3670J0776j2791J5471m443m5058k2824m828M824R801K413
$$ 408708 399701 364440 378110 388886 376095 391566 387123 342065 319241 314413 319237 329038 331451
2443C31451l2141j2305N583L1315j477j6932K831K2453K1843k1442R447L994k1883
$$ 331451 299310 287005 292588 323903 322426 305494 308325 330778 352621 331179 340626 344620 322737
2430C22737j7218J1873K5070l419J6059j3306l506K2697O072R162k6446q771M357
$$ 322737 305519 317392 342462 339043 355102 341796 338290 360987 367059 376221 349775 341004 345361
2417C45361l2701r378L6000P976k0667L3838l577k2181L949L8679J9132O5441
$$ 345361 312660 303282 339282 347258 326591 360429 356852 334671 338620 377299 396431 461872
2405D61872J2633l1783M4299j1213m907j0571L448R597K2405n07l0432J0380L1493
$$ 461872 474505 442722 487021 475808 470901 460330 463778 473375 495780 495273 464841 475221 506714
2392E06714j4908K1844Q815R40j37N688k5695j4787j8573p799L1674k9163k2579
$$ 506714 491806 513650 522465 523405 523268 528956 503261 488474 469901 462102 493776 464613 442034
2379D42034J0263M4625P2490j647p682L4781J6480J063J3224j1608k9660L9954
$$ 442034 452297 496922 569412 567765 560083 594864 611344 612407 625631 614023 584363 624317
2367F24317L694j806K0957L862J424q607L731J0916L2251L2200n240N0359K7788
$$ 624317 628011 626205 647162 651024 652448 643841 647572 658488 690739 722939 717699 768058 795846
2354G95846K3893Q040l2766M8858L853k4719K4617M9074L3119O8807L5699j475
$$ 795846 819739 827779 795013 843871 847724 823005 847622 896696 929815 998622 1034321 1032846
2342A032846J4722L7442L0347L2834L2967Q2547Q1142J34135J51235K60736K73350
$$ 1032846 1047568 1085010 1115357 1148191 1181158 1263705 1344847 1478982 1630217 1890953 2164303
2331B164303L30166K74292J97707K01952J90242J88000L88842M79581O21024R22597
$$ 2164303 2494469 2768761 2966468 3168420 3358662 3546662 3935504 4415085 5036109 5958706
2321E958706J495501K382721M412155O464171Q201944P494894L342554p9713k823970
$$ 5958706 7454207 9836928 14249083 20713254 28915198 36410092 39752646 39672933 36848963
2312C6848963m345823n045604m824183m001708l455436l015880k317370j721055
$$ 36848963 32503140 27457536 22633353 18631645 15176209 12160329 9842959 8121904
2304H121904j152489p84629m56057k96183l32006l82467l78367l43850l01981
$$ 8121904 6969415 6184786 5728729 5432546 5100540 4718073 4339706 3995856 3693875
2295C693875k77962k80655k04785k13957j84341j48197j71134j01670r4443q5324
$$ 3693875 3415913 3135258 2930473 2716516 2532175 2383978 2212844 2111174 2016731 1931407
2285A931407r4297o2706o6873q9923l7149l2840k3421p1054m5612o5992J2642
$$ 1931407 1837110 1774404 1707531 1617608 1580459 1547619 1524198 1453144 1407532 1341540 1354182
2274A354182m3935o6783K8490J0811n9136k4294l1958k4210m2265k0467m1134
$$ 1354182 1310247 1243464 1271954 1282765 1223629 1199335 1167377 1143167 1100902 1080435 1039301
2263A039301l7366k5587n6610j8834l983l0074l9346l3397l2076L72J257R687
$$ 1039301 1001935 976348 919738 900904 896921 866847 827501 794104 762028 762400 763657 773344
2251G73344o862n422K0128k5883m7629q876J6756J031m0954k0013M736j7118l7416
$$ 773344 766482 761060 781188 755305 707676 698800 715556 716587 675633 655620 660356 643238 605822
2238F05822j0144K878l7695r644J6685k7038j3654j4803k0392L0232K0822R593
$$ 605822 595678 598556 560861 551217 567902 540864 527210 512407 492015 522247 543069 552662
2226E52662k5422J2481n8826K8454k1690Q079J4146k1059K384J8281o0527j6383
$$ 552662 527240 539721 480895 509349 487659 495738 509884 488825 491209 509490 448963 432580
2214D32580N2188j2948k818o346r448k9729R667O18k3143k0886n863l84K671J1116
$$ 432580 484768 471820 469002 462656 453208 423479 433146 433764 410621 389735 383872 383488 386159 397275
2200C97275Q285l482p923k2291j8482m843j3546l4894L2883J4711k1259J7019
$$ 397275 405560 402078 394155 371864 353382 348539 334993 300099 332982 347693 326434 343453
2188C43453R223M764K4365l8872k560j593Q096K8504j4240j0029J6333j0658j9367
$$ 343453 352676 357440 381805 342933 340373 338780 346876 375380 361140 351111 367444 356786 337419
2175C37419m550o760q580M869j6757m374N037J5850n825Q793J0774J9555O539
$$ 337419 332869 326109 317529 322398 305641 301267 306304 322154 316329 325122 335896 355451 361990
2162C61990J541K006O396j6762j7153o556L006n934j2454o634J1474M112k2404
$$ 361990 363531 365537 371933 355171 338018 331462 334468 328534 316080 309446 320920 325032 302628
2149C02628j1456m4265K1422n432m7137K0084p154K3853J6884l429K1865J794
$$ 302628 291172 246907 268329 262897 215760 235844 228690 252543 269427 265998 287863 289657
2137B89657j2230j9082J0898J3806k4856k6201J5314K652M038m111j1603l8308
$$ 289657 277427 258345 269243 283049 258193 231992 247306 249958 253996 249885 238282 199974
2125A99974J2516k4119J6704N9027J1232Q822k8385P96R795p356j6747k6302o224
$$ 199974 212490 188371 205075 264102 275334 284156 255771 256567 266362 259006 242259 215957 209733
2112B09733J4869J045k6238L9548j2694N567M045P369j2338K0342p811q705Q322
$$ 209733 224602 225647 199409 238957 226263 231830 235875 243244 230906 251248 243437 234732 243054
2099B43054K148q631k3108n613L110J1800p506j9253k5859L541K3687J6590J587
$$ 243054 245202 236571 213463 207850 210960 222760 215254 196001 170142 173683 197370 213960 215547
2086B15547L4510j8019k882Q069o035k4711K2248m454k9250K5963K4968O678K864
$$ 215547 250057 232038 229156 237225 231190 206479 228727 224273 195023 220986 245954 252632 255496
2073B55496J3755k1316k1804O229o161L02k8472J1836q872j7203J7130K3934j9102
$$ 255496 269251 247935 226131 232360 226199 226501 198029 209865 200993 183790 200920 224854 205752
2060B05752J0589m473N184O414p463K2099k8615p246K6936Q976K2273L6611k856
$$ 205752 216341 211868 217052 223466 216003 238102 209487 202241 229177 238153 260426 297037 294181
2047B94181K9227K9171M4852N919n7859k5079j3978k098k3980k8567k7291M536
$$ 294181 323408 352579 397431 403350 345491 320412 306434 304336 280356 251789 224498 229034
2035B29034K2497m5665k4480K3083N1491J9505P597k1746n1706n533j8510K6019
$$ 229034 251531 205866 181386 204469 255960 275465 283062 261316 209610 204077 185567 211586
2023B11586j7610Q731q137j5226J110J2001K3501J7249P635m9536j1968J4502
$$ 211586 193976 202707 194570 179344 180454 192455 215956 233205 240840 191304 179336 193838
2011A93838k0287J530K3215j7947J1373j2939k888j2653k0159Q50l74M0944r525
$$ 193838 173551 175081 198296 180349 191722 178783 175895 163242 143083 143933 143559 184503 174978
1998A74978q216L5855j4572l1105k13p010N0322J9252j4224j9570n400l4137K1297
$$ 174978 166762 202617 188045 156940 156727 149717 200039 219291 205067 185497 180097 145960 167257
1985A67257P746j9715L0306K4779q280l9304J0949J0609r728M166n928r799M313
$$ 167257 175003 155288 185594 210373 202093 162789 173738 184347 174619 178785 172857 163058 167371
1972A67371J142M4398m974k5267j7980j0993K225M7580r440j7224l0287j2567
$$ 167371 168513 212911 207937 182670 164690 153697 155922 203502 194062 176838 146551 133984
1960A33984K4883j0637J5141R949k5854o505J9203j4315K8432J7686k8706J3943
$$ 133984 158867 148230 163371 173320 147466 140961 160164 145849 174281 191967 163261 177204
1948A77204j8671L7087K9149K752p7082N089M5601k1981k9647j0134K8010K9981
$$ 177204 158533 195620 224769 227521 150439 155528 201129 179148 149501 139367 167377 197358
1936A97358l4188J754L9951R674j1278N011K80m774J7773o867o3045M2117J7265
$$ 197358 163170 164924 204875 214549 203271 208282 208562 203788 221561 214694 151649 193766 211031
1923B11031J135o803l5640j6045O649L0267l2859L7116R777k9421j0118J0340
$$ 211031 212166 205363 169723 153678 160327 190594 157735 194851 204628 175207 165089 175429
1911A75429J4853n446j2428P099j8883K5179l429l760l0214P421j4056r794J9946
$$ 175429 190282 184836 172408 179507 160624 185803 182374 178614 148400 155821 141765 131971 151917
1898A51917r9J4324j2681N095J174P171K4538m2453L6067J7103j9324o181J7760
$$ 151917 151818 166142 153461 158556 159730 166901 191439 148986 185053 202156 182832 176651 194411
1885A94411l2151k499K5934j6398j9781K52J4691k4898J4174K1251m987k3701
$$ 194411 162260 159761 185695 169297 149516 149768 164459 139561 153735 174986 169999 146298
1873A46298O734l4638j0708L4840K969p962J0032P140l2370J0146J39n2565P221
$$ 146298 153032 118394 107686 142526 145495 137533 147565 154705 122335 132481 132620 80055 87276
1860H7276Q333K6326K2639K5846l1394j0677j2950J3188j5132m70M3723j4195
$$ 87276 95609 121935 144574 170420 139026 128349 115399 128587 113455 112985 156708 142513
1848A42513K2128K220l3169j5657O7463j0807k3695p938j1614R366K617j3389
$$ 142513 164641 166861 133692 118035 185498 174691 150996 143058 131444 140810 143427 130038
1836A30038K3231J8068j2979l478J6999n82l9383p888J9411j0632l1813K8986
$$ 130038 153269 171337 158358 154880 171879 171297 131914 124026 143437 132805 100992 129978
1824A29978J070l928J9041Q58J3162q273j7489M1523l531m9325j2496j4182n433
$$ 129978 131048 127120 146161 147019 160181 151908 134419 175942 172411 123086 110590 96408 90975
1811I0975P809j110R144q410q509k81J1045L1607K5442j6905j6022K8528K0326
$$ 90975 98784 97674 106818 98408 89899 89618 100663 132270 157712 140807 124785 153313 173639
1798A73639k4759m3974K3423J7257K1063q048j2362k9657J7169l2363J5794K413
$$ 173639 148880 104906 128329 145586 166649 158601 146239 116582 133751 101388 117182 119595
1786A19595j6989K7623J8217J7140l2668m635J2159p802Q58j6670N540K0796M278
$$ 119595 102606 130229 148446 165586 132918 128283 140442 132640 133498 116828 122368 143164 147442
1773A47442k6712j5328n398j1137M0775J7166n671k519K8263m932k3243k3840
$$ 147442 120730 105402 100004 88867 129642 146808 141137 138618 166881 161949 138706 114866
1761A14866j0368N350L0505J021J5694m403L3775n399o0459j6221K3615l489N543
$$ 114866 104498 109848 140353 141374 157068 152665 186440 181041 120582 104361 127976 124487 130030
1748A30030L7647K278l6091J4908q267R47M241K33j2983k2560L1143l0341k052
$$ 130030 167677 169955 133864 148772 140505 141452 145693 145926 132943 110383 141526 111185 109133
1735A09133P118J5549j4414R636j7712J1606N337o717K4557l771J267j6012j147
$$ 109133 116251 131800 117386 127022 109310 120916 126253 119536 144093 140322 141589 125577 124430
1722A24430J0547L743k1825K706J39J0399k8481m409J4711M757j6567n103J2479
$$ 124430 134977 138720 116895 119601 119740 130139 101658 97249 111960 116717 100150 95047 107526
1709A07526P958j5322K4075K953j8785r640l1328P473K3866M243k6267L478J2988
$$ 107526 115484 100162 124237 127190 108405 98765 67437 74910 98776 103019 76752 80230 93218
1696I3218L0730J9889j8797n508l12K57l2152J412J1719l2572J4511k4362L4025
$$ 93218 123948 143837 125040 119532 119220 119477 87325 88737 100456 67884 82395 58033 92058
1683I2058M2774j0695p852M286K7022q446k1431m2540J9071k8921j5072M2839
$$ 92058 134832 124137 116285 120571 147593 139147 117716 75176 94247 65326 50254 93093
1671I3093M0456l892l4600o754j6568R918L6015K8058k61M98n7j1286K1092p664
$$ 93093 133549 129657 95057 88303 71735 81653 117668 145726 145465 145963 145906 134620 155712 148048
1657A48048o1800JM2743j9648K8734l2851K4683K5129j9079J370j4726r219K1145
$$ 148048 86248 86249 128992 109344 138078 105227 129910 155039 135960 137330 122604 113385 134530
1644A34530k15J2074K6080p722q202l6114j9521k0812K332j0222K3547j6696P076
$$ 134530 134315 146389 172469 164747 156545 120431 100910 80098 82430 72208 95755 79059 86135
1631H6135K5708K5527k0743N598J9553j5952P009k3010p413K9416j0609P06J1877
$$ 86135 111843 137370 116627 122225 141778 125826 132835 109825 102412 131828 121219 121925 133802
1618A33802K5l7086J5131L2657M410o486n2781M715M8078J2360N624j7694k8592
$$ 133802 133827 96741 111872 144529 148939 142453 89672 94387 142465 154825 160449 142755 114163
1605A14163M254J2374j3923j2937J3552J3585k3445J4414J4461l0549m2360L1030
$$ 114163 118417 130791 116868 103931 117483 131068 107623 122037 136498 105949 63589 94619
1593I4619J3294n571k8631R076k3521L8200M3098j1266k113J7595j0321l2532
$$ 94619 107913 102342 73711 82787 59266 97466 140564 129298 127185 144780 134459 101927
1581A01927k4664m0222O361K1847O386K1149J7081N2056k1417P18n8432J1415
$$ 101927 77263 37041 43402 65249 71635 92784 109865 161921 140504 141222 82790 94205
1569I4205J4074n433n533j6121K9628k4175L0849k0660K6487J0049k3470j8654
$$ 94205 108279 102846 97313 81192 110820 86645 117494 96834 123321 133370 109900 91246
1557I1246k0903R922J556Q917j9849j8373K3668M376J7827l711j6755K258j5078
$$ 91246 70343 80265 81821 90738 70889 52516 76184 80560 98387 94676 77921 80179 65101
1544F5101Q137J4897j411J9437k1661J1958k1614O080J5521r668o964K8657k2107
$$ 65101 73238 88135 86724 106161 84500 96458 74844 80924 96445 86777 79813 108470 86363
1531H6363K1413k6742k0259J8369k588m693M2765q554n5143J5155L2263M000J4080
$$ 86363 107776 81034 60775 79144 76556 71863 114628 106074 50931 66086 98349 102349 116429
1518A16429j9906m831L132K145J3457j5080N442J773k6409J9515j9852j6630K7140
$$ 116429 96523 91692 94824 96969 110426 95346 100788 102561 76152 95667 75815 59185 86325
1505H6325M1304k7116j9567j6188J1754J1170j0255k2843J4653k6004Q433P612
$$ 86325 127629 100513 80946 64758 76512 87682 77427 54584 69237 43233 51666 59278
1493E9278J5586K894j567j4770K431L2287P431l9979j6429N0651k1489p232J0344
$$ 59278 74864 77758 76191 61421 63852 96139 103570 63591 47162 97813 76324 69092 79436
1480G9436K1765m470K2074P392j7330k8752L7070m5826j7108j169k7974L9235
$$ 79436 101201 96731 118805 126197 108867 80115 117185 71359 54251 53082 25108 64343
1468F4343Q237k5803J5744L1527m088q074n058o401L7340k4633k2912K1689L0943
$$ 64343 72580 46777 62521 94048 89960 81886 76828 70427 107767 83134 60222 81911 112854
1455A12854j3909k7529j4156j040J7785J9440J1579k0741j03n05j8487O833K6682
$$ 112854 98945 71416 57260 56220 74005 93445 105024 84283 84180 83675 65188 72021 98703
1442I8703k6997j3591L136r183K8215L1138o005n757K6074p399N815K653J9979
$$ 98703 71706 58115 61251 52068 80283 111421 105416 99659 125733 118334 124149 126802 146781
1429A46781o7344J9214J3865l55k0446n0097q813M3643J5616l3411j4367K4056
$$ 146781 79437 98651 112516 112161 91715 41618 32805 76448 92064 58653 44286 68342
1417F8342K0459j0345O768J4657k990L471j2130j0494J7970n8992K2635N0296
$$ 68342 88801 78456 85224 99881 96891 100362 88232 77738 95708 36716 59351 109647
1405A09647k6265J9323N420j8244k2447k4248K7202L3824N463K285l8068M898
$$ 109647 83382 102705 108125 89881 67434 43186 70388 104212 109675 111960 73892 78790
1393G8790J2104K590o488J745J3908K2529k2353k0216k3820k7126K5322j0822
$$ 78790 90894 93484 86996 88741 102649 125178 102825 82609 58789 31663 56985 46163
1381D6163J3078j0552r940Q827J6455J9265r518K4102M705L1692J6318n2109N192
$$ 46163 59241 48689 38749 47576 64031 83296 73778 97880 102585 134277 150595 98486 103678
1368A03678l1121Q443J4469R447M870m0500J0385n888l6449J2203K1926J8927
$$ 103678 72557 81000 95469 104916 109786 69286 79671 73783 37334 49537 71463 90390
1356I0390k9320l7690l096J4462J0281r081p830L383L9475p680m043o144k0775
$$ 90390 61070 23380 20284 34746 45027 35946 28116 31499 70974 63294 59251 53107 32332
1343C2332m82J4155K6010l4212r664K9748k990j3684q373J8320K6290J9445J3932
$$ 32332 31850 46005 72015 37803 28139 57887 54897 41213 32840 51160 77450 96895 110827
1330A10827q449j6551k5482L8099j5336J9830j0897k520l2561N291K4286k0200
$$ 110827 102378 85827 60345 98444 83108 102938 92041 89521 56960 62251 86537 66337
1318F6337m16j2319j846L4459Q423k9218K811j077j5083k692J7002L414j3277
$$ 66337 65921 53602 51756 86215 94638 65420 68231 67154 52071 49379 66381 69795 56518
1305E6518J5027K4976j5758l1061K4648L0000j3617j3325J1337l3084K554O443
$$ 56518 71545 96521 80763 49702 74350 104350 90733 77408 88745 55661 58215 64658
1293F4658l308l3962K1547J0331j3943j3681j2857K6049K3017k676j1235R092
$$ 64658 61350 27388 48935 59266 45323 31642 18785 44834 67851 65175 53940 63032
1281F3032J797k6018l235M7012J7805k1548j365P407j7270j4607J8225m087L0346
$$ 63032 64829 38811 35576 82588 100393 78845 77480 84887 67617 53010 71235 67148 97494
1268I7494j4548l1508J4253J0278k699j6002P326j8518J2034p836j2502k0316
$$ 97494 82946 51438 65691 75969 73270 57268 64594 46076 58110 50274 37772 17456
1256A7456L8505J4807J2089j7623K0370j5776j651j2803j5265q034o66K0200J139
$$ 17456 55961 70768 82857 65234 85604 69828 68177 55374 40109 32075 31409 51609 52748
1243E2748K8156J1213j9781j3934j7321N6794J2288j3658k3799m18J361o3j6598
$$ 52748 80904 92117 72336 58402 41081 97875 110163 96505 72706 72288 73649 73586 56988
1230E6988L3576J8104k7253m950K2663J5485j4919O459m448j5429k9693k5482
$$ 56988 90564 108668 81415 76465 99128 114613 99694 106153 101705 86276 56583 31101
1218C1101j5268M0169L3611l2159J5226r127J4722J4719j7879J429J2076N236
$$ 31101 15833 56002 89613 57454 72680 63553 78275 92994 75115 76544 88620 93856
1206I3856j4606j4544l0348J676Q229M0914j8456j362k3253K1730K2304k8634
$$ 93856 79250 64706 34358 36034 44263 85177 66721 65359 42106 63836 86140 57506
1194E7506J5683N8252m168n6059m288J0806k1397k2078J8083J0172n246q832J7328
$$ 57506 73189 131441 127273 71214 66926 77732 56335 34257 52340 62512 57266 48434 65762
1181F5762J2971o786k7545J0202K892J760j6628P701J3664M676N971p442k7532
$$ 65762 78733 71947 44402 54604 57496 59256 42628 50329 63993 68669 74640 67198 39666
1168C9666k172n285R325l431k2726M1979M857J8685j963j60k1308J5753m0096
$$ 39666 37494 32209 41534 38103 15377 57356 62213 80898 78935 78775 57467 73220 33124
1155C3124L473J0046J1965O289J787k8043J8441L4923j4188q894R811Q3M937k4865
$$ 33124 36597 46643 58608 64897 66684 38641 57082 92005 77817 68923 78734 78817 83754 58889
1141E8889l116R04q307Q173j3891l852r425j1943J9204j6359K3497K4256j7438
$$ 58889 55773 56677 48370 56543 42652 38800 29375 17432 36636 20277 43774 68030 50592
1128E0592K7034l612k2995O083J2265L82k4080j2273m619q574J1391j1239J5049
$$ 50592 77626 74014 51019 57102 69367 69749 45669 33396 28777 20203 31594 20355 35404
1115C5404j6488J3468K2792k993k1391j3212J4614J5077J7579K458j2981M5566
$$ 35404 18916 32384 55176 52183 30792 17580 32194 47271 64850 67308 54327 99893
1103I9893j1792l3052k524J5018k5550p136J4282J7764m975j621k3418k4560j149
$$ 99893 88101 55049 52525 67543 41993 34857 49139 66903 61928 60307 36889 12329 11180
1090A1180J6636L9106j9478J5516M866j0237O58M942r009j3957q183l143l639
$$ 11180 27816 66922 47444 62960 67826 57589 58247 63189 54180 40223 32040 28897 25258
1077B5258q56J6565k3969K5048K1092K7858m1752j6672K0579P529n698o451J4838
$$ 25258 24402 40967 16998 42046 63138 90996 49244 32572 53151 60680 54982 48531 63369
1064F3369q130L307k2177j8455q089J8004J3011k4274L17K7271n026j355N4394
$$ 63369 55239 58546 36369 17914 9825 27829 40840 16566 16883 44154 39128 37773 92167
1051I2167n401j0687j9684j520l485k91l8742L355p044k2252M7114j5236J786
$$ 92167 86766 76079 56395 54875 51390 51099 12357 15712 8668 -13584 33530 18294 20080
1038B0080J2780P891J532L6821k8496l7507k088L0110Q731J16K2853j7571p060
$$ 20080 32860 40751 42283 79104 50608 13101 11013 41123 49854 49970 72823 55252 48192
1025D8192K0759k9770o274N146r048k0111P359K9362K4151k3901K3053p484m855
$$ 48192 68951 39181 32907 38053 29005 8894 16253 45615 69766 45865 68918 61434 56579
1012E6579l5020Q791l862L2346l327j5493j07j7028L7860Q909k9281J5394J9552
$$ 56579 21559 30350 26488 58834 55507 40014 39907 22879 60739 69648 40367 55761 75313
999G5313l5799K1684J0788o958o753k4234N382K8146k8021n043Q844J3273n2140
$$ 75313 39514 61198 71986 65028 58275 34041 39423 67569 39548 34505 43349 56622 4482
986D482J2517K0758j4048j5392J0206M0478k2700j9374K6382r187J0393L0710
$$ 4482 16999 37757 23709 8317 18523 59001 36301 16927 43309 34122 44515 75225
974G5225K788j3308k5438k9838K4626M9486j9909l6015J13J151k602j0126J160
$$ 75225 78013 64705 39267 9429 34055 83541 63632 27617 27730 28881 26279 16153 17313
961A7313R617K8646k4569j127K0104k445K087Q65N275M1540k9876j7399j410k4303
$$ 17313 26930 55576 31007 29880 49984 47539 49626 50491 55766 97306 67430 50031 48621 24318
947B4318J0470l2208J2763j2880L452K5245K049K844J894J7704j2609k8124K2980
$$ 24318 34788 2580 15343 2463 5915 31160 33209 36053 37947 55651 43042 14918 37898
934C7898o88m374j5421N287j437R402Q997L0404j4513m6093j0607n204M2610m075
$$ 37898 37210 32836 17415 22702 21265 30667 39664 70068 55555 9462 -1145 -6349 36261 32186
920C2186l2948L7380K4597k6244Q085L233k2075k2738K7501K376J1284k096j2514
$$ 32186 -762 36618 61215 34971 43056 46289 24214 1476 28977 31353 42637 40541 28027
907B8027K9271k3361k9995K2756J1385l5221K0903J3593N877J1326K9119k0570
$$ 28027 57298 33937 3942 26698 38083 2862 23765 37358 43235 54561 83680 63110
895F3110k4610Q605l7024K3651L8458j5580k0642L2557m447r135k8973m148N122
$$ 63110 38500 47105 10081 33732 72190 56610 35968 68525 64078 54943 25970 21822 26944
882B6944m915K3153L7833j3266n306j4497j5716l2567L2030q668k7542K7315l2961
$$ 26944 22029 45182 83015 69749 64443 49946 34230 1663 33693 25025 -2517 24798 -8163
869h163K2005M633k2015O38J6219Q228Q216J0240M389J7647o886l847o299O295
$$ -8163 13842 18475 -3540 -2902 13317 21545 29761 40001 44390 62037 55151 51304 45005 51300
855E1300m487m849q814k0298M1552j6610p405J1230M5745l217k0858m3133m4234
$$ 51300 46813 41964 33150 12852 54404 37794 30389 41619 87364 84147 63289 20156 -24078
842b4078N634J9792K8003J9008Q842R15J0355r565k7175k7778k0795K7672P609
$$ -24078 -18444 1348 29351 48359 57201 58116 68471 58906 31731 3953 -16842 10830 18439
829A8439r464P073K8967m269k3979L3078R745m466j5456j7503k9253p513L0296
$$ 18439 8975 16048 45015 40746 16767 49845 59590 55124 39668 22165 -7088 -14601 15695
816A5695j5822q805J9541J7331k1821j4163K3106J3961j7430K8321M8493k2010
$$ 15695 -127 -8932 10609 27940 6119 -8044 15062 29023 11593 39914 88407 66397
804F6397k9025o159J3442k9110M41k0997P70L047L5088K5179K052l952K8935l0114
$$ 66397 37372 31213 44655 15545 15986 -5011 -4241 -1194 33894 59073 61125 57173 86108 55994
790E5994k7640J2750O028k3905o151K4124N810j7749k4815R347R888Q92p844K820
$$ 55994 28354 41104 47132 23227 17076 41200 47010 29261 4446 13793 23681 24573 16729 19549
776A9549o9K0672k1710R352k3294O140K0509K2802k449l5227l4741M8323Q72J2292
$$ 19549 19480 40152 18442 27794 4500 10640 31149 53951 51502 16275 -18466 29857 30729 43021
762D3021j9362k8946J6477L6606j3047O571j2323j2569J7435j1242K5077R649
$$ 43021 23659 -5287 11190 47796 34749 41320 28997 16428 33863 22621 47698 57347
750E7347k4819M9073k0771J5302n944l9119j480j535J9839j9232j4011P060l413
$$ 57347 32528 81601 60830 76132 70188 31069 29589 28054 47893 28661 14650 21710 18297
737A8297O411n624j322M3002l9972L114k8077p587J1333K5644J2477k7653j7312
$$ 18297 24708 19084 17762 60764 20792 23906 -4171 -11758 -425 25219 37696 10043 -7269
724g269J7078j8660K9186K6217l934k0225P828l0741m953M1344o295l554J4338
$$ -7269 9809 -8851 20335 46552 42618 22393 30221 -520 -5473 35871 29576 26022 40360
711D0360K1777j8927l0602p093K2125M064n597N944k4611k531O202M6034j6329
$$ 40360 62137 43210 12608 5515 27640 31704 26107 32051 7440 4909 11111 57145 40816
698D0816k8864k752j727J0530J3282l1834O923N622L3142j6043o755k377K1080
$$ 40816 11952 9200 7473 18003 31285 -549 6374 11996 45138 29095 22340 19963 41043
685D1043J2143m2056J7201j7119N2115m522k3705N438k9478q278K4576j2993p079
$$ 41043 53186 11130 28331 11212 63327 58805 35100 40538 11060 2782 27358 14365 7286
672G286K4184J8103n537l7405p139J5838J0579k131Q366J0841j4557J0498P680
$$ 7286 31470 49573 44036 6631 -508 15330 25909 23778 32144 42985 28428 38926 46606
659D6606m352K0137r020l9726r077K5071J4263J6246M247j9831j7064R876J0607
$$ 46606 42254 62391 53371 13645 4568 29639 43902 60148 64395 44564 27500 37376 47983
646D7983k9162J1691J0692j1819J1K0937k834Q941j484l008n631k1650j8577K8474
$$ 47983 18821 30512 41204 29385 29396 50333 47499 56440 54956 51948 46317 24667 6090 34564
632C4564q242l3927J628K3815L4435R111L894j5971k3325k9975O118M102N868
$$ 34564 26322 -7605 -5977 17838 52273 61384 65278 49307 25982 -3993 2125 6227 12095
619A2095p515J7810L1336j0777l3950J664K1231j7942J1063K48L966O881N539
$$ 12095 4580 22390 53726 42949 8999 10663 31894 13952 25015 25263 29229 36110 41649
606D1649J0137j4950n0677m40K2508L4619j6329P252J4347J6974l1491j4407K663
$$ 41649 51786 36836 -13841 -14281 8227 42846 26517 33769 48116 65090 33599 19192 21855
593B1855j7368K382q353o151k3500L4723l726k5897M6029n604m378K4472J2393
$$ 21855 4487 6869 -1484 -7635 -31135 3588 -138 -26035 19994 14390 10012 34484 46877
580D6877k906j7754q87j5440j7523L347R503l6332K0714j155O4174N4678m7339
$$ 46877 43971 26217 25330 9890 -7633 -4286 5217 -31115 -10401 -11556 52618 107296 59957
567E9957L22j3570l494N56k123q876k2536N0991L724J6898k5016k8513K1209j4781
$$ 59957 60279 46709 43215 43771 41648 32772 10236 61227 64951 81849 56833 28320 49529 34748
553C4748L2597p03j3157J2859k579r291n084l184J5137k7534l7621N618J3591
$$ 34748 67345 66642 53485 66344 63765 54474 49390 46206 61343 33809 -3812 1806 15397
540A5397n920o398K8350M1055k4461k261J8368l0671j4830O2Q306o003L1731j5953
$$ 15397 9477 3079 31429 72484 48023 45762 64130 33459 18629 18691 26997 20994 52725 36772
526C6772j9972q047J1434J488M075p77j6310J052K6614j4610M511O2310k5972
$$ 36772 16800 8753 20187 21675 25750 24973 8663 9715 36329 21719 26230 88540 62568
513F2568j3740k775L113n6100j8897J4428p475j952L7511L847J7156L140j4658
$$ 62568 48828 46053 49166 -6934 -25831 -11403 -18878 -20830 16681 20528 37684 40824 26166
500B6166j8535J3506n042K2735k380P916k684m0321K1364J3404k0437j541K8324
$$ 26166 7631 21137 16095 38830 36450 44366 41682 1361 22725 36129 15692 14151 42475
487D2475j3015O024k6336j8380j12k4335J6591J7086J3784N245J9931m048l9718
$$ 42475 29460 35484 9148 -9232 -9344 -33679 -17088 -2 13782 19027 38958 34910 -4808
474d808K1822k5229k0614J1794J1018m340J32m703L1229J0443j1882j0363K5135
$$ -4808 17014 -8215 -28829 -17035 -6017 -10357 -10225 -14928 16301 26744 14862 4499 29634
461B9634j0853j762J3623K427j8024J388N421k4776P078k265L3863k286k1531
$$ 29634 18781 17019 30642 33069 15045 16433 21854 -2922 4156 1891 35754 33468 11937
448A1937k1922J0123Q926q579J4726k429J1102r801K055l8586l487L5118J0540
$$ 11937 -9985 138 9064 485 15211 12782 23884 14083 16138 -22448 -25935 9183 19723
435A9723o164K9733p700n277P209P494J447j4161p238Q220O012J1284m897J0737
$$ 19723 13559 43292 35592 30315 37524 45018 46465 32304 25066 33286 39298 50582 45685 56422
421E6422j808L540l6434K7417K3930n3654m008N0468m0653r112Q416n86j1522
$$ 56422 54614 58154 21720 49137 73067 19413 15405 65873 25220 16108 24524 23938 12416
408A2416j6437k5332k6110K6925P737K3732Q066K761l7974L6432n994k7401L198
$$ 12416 -4021 -29353 -55463 -28538 -20801 2931 10997 13758 -24216 12216 6222 -21179 -17981
395a7981M2301J4248j0200m903j4758M66J3226J1930m7664j4186J2930K422L0879
$$ -17981 24320 38568 28368 23465 8707 9173 22399 34329 -13335 -27521 -14591 -12169 18710
382A8710K8034q665l9628P056J651j305j421j0525Q044L3364M6926m2221k5220
$$ 18710 46744 38079 -1549 5507 7158 5853 4432 -6093 1951 35315 82241 40020 14800
369A4800J9691m2321J2314P647P081J4054K1503j0511l945j3459n569M828N6824
$$ 14800 34491 -7830 4484 12131 19212 33266 54769 44258 40313 26854 21285 26113 82937
356H2937l1697j6153j1618J8626l4166k0518J7162L4226J6165l281j9973m32J1492
$$ 82937 51240 35087 23469 42095 7929 -12589 4573 38799 54964 51683 31710 31278 42770
343D2770M889n551k5691j4545n1641L3888K5563M59j1098n218p106L929J9557
$$ 42770 47659 42108 16417 1872 -49769 -15881 9682 10141 -957 -6175 -13281 -9352 10205
330A0205m3315K813K6103L74n992K2980L4858l461n3110K4314Q29Q102j4398j0705
$$ 10205 -33110 -30297 -4194 -3820 -9812 13168 48026 44565 -8545 15769 16598 24700 10302 -403
316d03n620J4378J1141k722L1362l6907o357m4940L1909J8325j6345M0185L0370
$$ -403 -6023 8355 19496 16774 48136 11229 4872 -40068 -8159 10166 -6179 34006 64376
303F4376k9960m775j9635K141P368j3046R370j1087k0309L324k310J2596M198
$$ 64376 34416 29641 10006 12147 19515 6469 15839 4752 -15557 -12233 -14543 -1947 2251
290B251P811j4446j186j5061p176q497M676j2383L3444K3462J399m229L0241K549
$$ 2251 10062 -4384 -5570 -20631 -27807 -36304 -31628 -44011 -10567 12895 14294 10065 40306 42855
276D2855J9129n0388l4874q920L0191M6086k6008o423N719j2015K9293O160m5427
$$ 42855 61984 11596 -23278 -32198 -2007 44079 18071 11648 17367 5352 34645 40805 -4622
263d622Q237j573O441j0401K3634P85j6172j2895K855R538n40p053l516J5600
$$ -4622 3615 2042 8483 -1918 21716 22501 6329 -6566 -3711 5827 5287 -1766 -5282 10318
249A0318Q692j9356j2751M356j2667K6308j701J6057l420j4091k7503p304P250
$$ 10318 19010 -346 -13097 -8741 -21408 4900 3199 19256 15836 1745 -25758 -33062 -25812
236b5812j4394l124J6940J8989k402j5180R912L4782o294p6O539p017l6763mJ3183
$$ -25812 -40206 -43330 -26390 -7401 -9803 -24983 -15071 19711 13417 13341 19880 12863 -23900 -23904 -10721
221a0721k444j1650P833R033K837M2962j3420l4819k7277L3146J1359O663k1930
$$ -10721 -13165 -24815 -16982 -7949 -5112 37850 24430 -10389 -37666 -4520 6839 13502 -8428
208h428k623O036r536Q562j1761J0141L3612k957j5651m995k2428j0002P28K9482
$$ -8428 -11051 -5015 -14551 -5989 -17750 -7609 26003 23046 7395 2400 -20028 -30030 -29302 180
194A80j8392j0296o259P383P157J9478O202j8945j7780j8074j0532K8405J626
$$ 180 -18212 -28508 -34767 -27384 -20227 -749 5453 -13492 -31272 -49346 -59878 -31473 -29847
181b9847m1418J335K5731j5250N539j5019L7455J71J0453K3902r487l587K933
$$ -29847 -71265 -69930 -44199 -59449 -53910 -68929 -31474 -31303 -20850 3052 -6435 -10022 -7089
168g089m6019M412L0892j4959j5067j5703n478L5615j7195j0726K3171r73j4199
$$ -7089 -53108 -48696 -17804 -32763 -47830 -63533 -69011 -33396 -50591 -61317 -38146 -39119 -53318
155e3318K177K0652k8622j1260K2748J5505r054O427J0965M345p911j8377N910
$$ -53318 -51141 -30489 -59111 -70371 -47623 -32118 -41172 -34745 -23780 -19435 -27346 -45723 -39813
142c9813j4704Q319j1939J4952k067k1072J2636O276J0792J087l0030J4467J1818
$$ -39813 -54517 -46198 -58137 -43185 -45252 -66324 -53688 -47412 -36620 -35533 -65563 -51096 -39278
129c9278j937M654k1113o720k1248L225K0307L107K1768k3818j2078j2538J7566
$$ -39278 -41215 -36561 -57674 -64394 -85642 -82417 -62110 -59003 -37235 -61053 -73131 -85669 -68103
116f8103J7210q237k687j70j5208j224K7724j506K087k358q946J4641j1621N497
$$ -68103 -50893 -59130 -61817 -61987 -77195 -78419 -50695 -52201 -50114 -52472 -61418 -46777 -58398 -52901
102e2901L6706L138j3373m8739k1294O041K2467r811J9876j9339k170k493j720
$$ -52901 -16195 -13057 -26430 -75169 -96463 -90422 -67955 -77766 -57890 -77229 -79399 -81892 -83612
89h3612j662j0341R419J3097m953J3742J8286J235l0885L663P561k7151l105K9674
$$ -83612 -85274 -95615 -86196 -73099 -78052 -64310 -46024 -44789 -75674 -72011 -64450 -91601 -94706 -65032
75f5032J3487l1972j8689p972p992M3967l640q941j1116Q211J6063j5134j8935
$$ -65032 -51545 -83517 -102206 -110178 -118170 -74203 -77843 -86784 -97900 -89689 -73626 -88760 -107695
62a07695Q416k0253j2595J2928O842k5903j131O757j1726P816L5108j7135m458
$$ -107695 -99279 -119532 -132127 -119199 -112357 -138260 -139391 -132634 -144360 -136544 -101436 -118571 -123029
49a23029K8373j4549l0075J3500J5151j9792j9015L0242n03j3082l0996K6301
$$ -123029 -94656 -109205 -139280 -125780 -110629 -130421 -149436 -119194 -119697 -132779 -163775 -137474
37a37474K282k7426K0420j7323J8186L985J4607L235j528m938l2111M293L0763
$$ -137474 -135192 -162618 -142198 -159521 -141335 -137350 -122743 -119508 -121036 -125974 -158085 -153792 -123029
24a23029j6809j8931k1644J6490k841o866m854K8723q667j5004j0456k7588l010
$$ -123029 -139838 -158769 -180413 -163923 -166764 -173630 -178484 -149761 -158428 -173432 -183888 -211476 -214486
11b14486J3989K0069R643K072K361o872j6785J1394r697o804O375
$$ -214486 -200497 -180428 -170785 -168713 -166352 -173224 -190009 -178615 -188312 -195116 -188741
0a88741
$$ -188741
$$ Imaginary data points
##PAGE= N=2
##DATA TABLE= (X++(I..I)), XYDATA
16383a315727K5938K8969j012K5051J2140M760J4608K4766K2547J3401n73K0616
$$ -1315727 -1289789 -1260820 -1261832 -1236781 -1224641 -1219881 -1205273 -1180507 -1157960 -1144559 -1145132 -1124516
16371a124516K0406r160k60J7549K3113L3814K5231L827J3711j799K5241L7603
$$ -1124516 -1104110 -1113270 -1113530 -1095981 -1072868 -1039054 -1013823 -1009996 -996285 -998084 -972843 -935240
16359i35240J0955J1671K867J9638K5359P2l796J2209R51J7766M1292J1931J6018
$$ -935240 -924285 -912614 -909747 -890109 -864750 -864678 -868474 -856265 -855314 -837548 -796256 -784325 -768307
16346g68307J9094R084L3754J6844j5599m891K8447O2N9238K8427J1125o378L2242
$$ -768307 -749213 -740129 -706375 -689531 -705130 -710021 -681574 -681512 -622274 -593847 -582722 -589100 -556858
16333e56858K3973k418R186O733r123O181L0631J4961L0106J3469m1N814K8490
$$ -556858 -532885 -535303 -526117 -519384 -528507 -522326 -491695 -476734 -446628 -433159 -433200 -427386 -398896
16320c98896l409L0718K5950J9169j7785K0107J146M0669N70K5302K3639J9485
$$ -398896 -402305 -371587 -345637 -326468 -344253 -324146 -323000 -282331 -281761 -256459 -232820 -213335
16308b13335L31K133J6253P707K1685M962L191K3742L69p10R216J4100L6723J0163
$$ -213335 -213004 -210871 -194618 -186911 -165226 -160264 -157073 -133331 -132962 -133672 -124456 -110356 -73633 -63470
16294f3470j048J0732J8165l154R487M185P124L1827J5553M828o13L8789Q367
$$ -63470 -64518 -53786 -35621 -38775 -29288 -25103 -17979 13848 29401 34229 33616 72405 80772
16281H0772j638j5832K1904L5278P176J5000Q783K0874j1624K7964J9813k1132
$$ 80772 79134 63302 85206 120484 127660 142660 151443 172317 160693 188657 208470 187338
16269A87338L480J4876J1909K8533j3634j2919L8574K029r265M3150K3380P261
$$ 187338 190818 205694 217603 246136 232502 219583 258157 260186 250921 294071 317451 324712
16257C24712J2161J3510q860J1865m074K3337j9087j5061M6257M829Q755p407
$$ 324712 336873 350383 341523 353388 349314 372651 353564 338503 384760 389589 398344 390937
16245C90937J8563M248K2442R355k887j6939J7046M509j5998N7537K4446J8872
$$ 390937 409500 413748 436190 445545 442658 425719 442765 447274 431276 488813 513259 532131
16233E32131R566L3311J0495k1176k0524l0059L3370J2675j7375L5381P578n794
$$ 532131 541697 575008 585503 564327 543803 513744 547114 559789 542414 577795 585373 579579
16221E79579K612j636J8330J9116j2959K0549L5129j7300P813K680N125K5974
$$ 579579 582191 580555 598885 618001 605042 625591 660720 643420 651233 653913 659038 685012
16209F85012j0988M5381K1066j7822n530j5255L8692j2653j9353M4635j4670k1897
$$ 685012 674024 719405 740471 722649 717119 701864 740556 727903 708550 753185 738515 716618
16197G16618J3246M013M7309K6367n1877J1922J2072k2295M907L2701J9167k7942
$$ 716618 729864 733877 781186 807553 755676 767598 779670 757375 762282 794983 814150 786208
16185G86208J2756K3097j6898k2807R619L0854J8851j2937J3346J5077P183k5228
$$ 786208 798964 822061 805163 782356 791975 822829 841680 828743 842089 857166 864349 839121
16173H39121M875K9310L8055j2703P03J7808n0428k975o283N653K7008j0429l2405
$$ 839121 843996 873306 911361 898658 899361 917169 866741 863766 857483 863136 890144 879715 847310
16160H47310j757M8043K8859J380R503j7845L619k6776K7930j9117K181M4972
$$ 847310 845553 893596 922455 923835 933338 915493 919112 892336 920266 901149 903330 948302
16148I48302j4588k0133M990j432J1443j0741J0439J0609R323M489j8110j582
$$ 948302 933714 913581 918571 917139 928582 917841 928280 938889 948212 952701 934591 933009
16136I33009L0599m649R366J0728J912m1382Q52L3158l828K7159r950k8927j1589
$$ 933009 963608 958959 968325 979053 980965 939583 940435 973593 969765 996924 986974 958047 946458
16123I46458Q373L3488L6545j2764j9437k9327j6544K6822N9791O330l2815k2679
$$ 946458 954831 988319 1024864 1012100 992663 963336 946792 973614 1033405 1039735 1006920 984241
16111I84241k221j1456K2743q947K5580m328j68K4297j0698J2638M512J0785k8173
$$ 984241 982020 970564 993307 984360 1009940 1005612 1005444 1029741 1019043 1031681 1036193 1046978 1018805
16098A018805j0178K759R955L826j9125L421J5114O2779m2058j9450j4134L714
$$ 1018805 1008627 1011386 1021341 1025167 1006042 1009463 1024577 1087356 1045298 1025848 1011714 1015428
16086A015428J8195L2794o950m3601j0803J2100J1221K5432j0638j9265q96m368
$$ 1015428 1033623 1066417 1059467 1015866 1005063 1017163 1028384 1053816 1043178 1023913 1023017 1018649
16074A018649k46J3443q072k9482J2392J3851K3183K65l046R536p892n387k7092
$$ 1018649 1018403 1031846 1023774 994292 1006684 1020535 1043718 1043983 1040937 1050473 1042581 1037194 1010102
16061A010102K9456L8856l3302J5695l1833j0162K3018L2742M555j6989J4870
$$ 1010102 1039558 1078414 1045112 1060807 1028974 1018812 1041830 1074572 1079127 1062138 1077008
16050A077008J4097M722m1260j8073K2682m506J4353o81K201k9076L0852R202
$$ 1077008 1091105 1095827 1054567 1036494 1059176 1054670 1069023 1068342 1070543 1041467 1072319 1081521
16038A081521k8143j7693p709O1386n2200j0082N3030j4430j2164k0941n972L767
$$ 1081521 1053378 1035685 1027976 1089362 1037162 1027080 1080110 1065680 1053516 1032575 1026603 1030370
16026A030370j038J5975J8398j5101n743N035R099K1709J7171j7175K961n137
$$ 1030370 1029332 1045307 1063705 1048604 1042861 1047896 1056995 1078704 1095875 1078700 1081661 1076524
16014A076524j9362j1745J9138j0641l0359K2677J6009j7967K7846r921l5006
$$ 1076524 1057162 1045417 1064555 1053914 1023555 1046232 1062241 1044274 1072120 1062199 1027193
16003A027193L0360j4645J7232J9231p701k0810J7544J284r409J5749J6338k7545
$$ 1027193 1057553 1042908 1060140 1079371 1071670 1050860 1068404 1069688 1060279 1076028 1092366 1064821
15991A064821j5019M030k7077M167K6167L8120J5846q114J518M889j1671m983
$$ 1064821 1049802 1053832 1026755 1030922 1057089 1095209 1111055 1102941 1104459 1109348 1097677 1092694
15979A092694k7349l3827L1771L0144j4592j6549J5272J1500o68k8440l693j6993
$$ 1092694 1065345 1031518 1063289 1093433 1078841 1062292 1077564 1089064 1088396 1059956 1056263 1039270
15967A039270N507L0011O657k9562O190K2141j1931K669L07J0818m4746R26Q564
$$ 1039270 1044777 1074788 1081445 1051883 1058073 1080214 1068283 1070952 1071259 1082077 1037331 1038257 1046821
15954A046821R862j7893K217q318J3155K7769O771j5117k1912M780K1429j3644
$$ 1046821 1056683 1038790 1041007 1032689 1045844 1073613 1080384 1065267 1043355 1048135 1069564 1055920
$$ [...]
##END NTUPLES=NMR SPECTRUM
##END=
