##TITLE=1H_DE-80H_X3
 200.13MHz, d2o
 8 sc
 
 19ns.26.2.2025
##JCAMPDX= 6.0         $$ Bruker NMR JCAMP-DX V2.0
##DATA TYPE= NMR SPECTRUM
##DATA CLASS= NTUPLES
##ORIGIN= UXNMR, Bruker Analytische Messtechnik GmbH
##OWNER= pz
$$ XWIN-NMR		Version 3.5
$$ Thu Jul  2 11:45:35 2026 Russian Standard Time (UT+4h)  Yarkov@DPX200
##.OBSERVE FREQUENCY= 200.1313
##.OBSERVE NUCLEUS= ^1H
##.ACQUISITION MODE= SIMULTANEOUS
##.ACQUISITION SCHEME= undefined
##.AVERAGES= 8
##.DIGITISER RES= 18
##SPECTROMETER/DATA SYSTEM= spect
##.PULSE SEQUENCE= zg30
##.SOLVENT NAME= DMSO
##.SHIFT REFERENCE= (INTERNAL, DMSO, 0, 15.5023)
##AUDIT TRAIL= $$ (NUMBER, WHEN, WHO, WHERE, WHAT)
$$ ##TITLE= Audit trail, XWIN-NMR		Version 3.5
$$ ##JCAMPDX= 5.01
$$ ##ORIGIN= Bruker BioSpin GmbH
$$ ##OWNER= Yarkov
$$ C:/Bruker/XWIN-NMR/data/yarkov2/nmr/H-C/1/pdata/1/auditp.txt
$$ ##AUDIT TRAIL=  $$ (NUMBER, WHEN, WHO, WHERE, WHAT)
(   1,<2026-07-02 11:44:41.14 +0400>,<Yarkov>,<DPX200>,
      <created by zg, POWCHK disabled, PULCHK disabled
       configuration hash MD5:
       00 E9 B6 7A A2 85 ED C7 34 08 36 98 17 FE 4E 26
       data hash MD5: 16K
       C6 10 BC 69 8D DF 92 04 77 1E A8 FF F7 33 D5 5B>)
(   2,<2026-07-02 11:44:58.06 +0400>,<Yarkov>,<DPX200>,
      <Start of raw data processing
       efp BC_mod = 2 LB = 0.25 FT_mod = 6 PKNL = 1 PHC0 = -6894.148 PHC1 = 6.42196 SI = 16K 
       data hash MD5: 16K
       E2 15 09 01 EB 84 05 E3 7C 22 3B 15 27 1A 83 1B>)
$$ ##END=
$$ 
$$ hash MD5
$$ 36 78 58 C7 2F 1A 3E 72 97 D2 6D B5 D8 FB 16 51
##$RELAX= 
##$RELAX= 
##$RELAX= 
##$RELAX= 
##$RELAX= 
##$RELAX= 
$$ Bruker specific parameters
$$ --------------------------
##$DU= <C:/Bruker/XWIN-NMR>
##$EXPNO= 1
##$NAME= <H-C>
##$PROCNO= 1
##$TYPE= <nmr>
##$USER= <yarkov2>
##$AMP= (0..31)
100 100 100 100 100 100 100 100 100 100 100 100 100 100 100 100 100 100 
100 100 100 100 100 100 100 100 100 100 100 100 100 100 
##$AQSEQ= 0
##$AQ_mod= 1
##$AUNM= <au_zg>
##$AUTOPOS= <>
##$BF1= 200.13
##$BF2= 200.13
##$BF3= 200.13
##$BF4= 200.13
##$BF5= 200.13
##$BF6= 200.13
##$BF7= 200.13
##$BF8= 200.13
##$BYTORDA= 1
##$CFDGTYP= 0
##$CFRGTYP= 5
##$CHEMSTR= <none>
##$CNST= (0..31)
1 1 145 1 1 1 1 1 1 1 1 1 1 1 1 1 1 1 1 1 1 1 1 1 1 1 1 1 1 1 1 1 
##$CPDPRG= <>
##$CPDPRG1= <>
##$CPDPRG2= <>
##$CPDPRG3= <>
##$CPDPRG4= <mlev>
##$CPDPRG5= <mlev>
##$CPDPRG6= <mlev>
##$CPDPRG7= <mlev>
##$CPDPRG8= <mlev>
##$CPDPRGB= <>
##$CPDPRGT= <>
##$D= (0..31)
0 0.7 0 0 0 0 0 0 0 0 0 0.03 0 0 0 0 0 0 0 0 0 0 0 0 0 0 0 0 0 0 0 0 
##$DATE= 1782978280
##$DBL= (0..7)
120 120 120 120 120 120 120 120 
##$DBP= (0..7)
150 150 150 150 150 150 150 150 
##$DBP07= 0
##$DBPNAM0= <>
##$DBPNAM1= <>
##$DBPNAM2= <>
##$DBPNAM3= <>
##$DBPNAM4= <>
##$DBPNAM5= <>
##$DBPNAM6= <>
##$DBPNAM7= <>
##$DBPOAL= (0..7)
0.5 0.5 0.5 0.5 0.5 0.5 0.5 0.5 
##$DBPOFFS= (0..7)
0 0 0 0 0 0 0 0 
##$DE= 6
##$DECBNUC= <off>
##$DECIM= 32
##$DECNUC= <off>
##$DECSTAT= 4
##$DIGMOD= 1
##$DIGTYP= 9
##$DL= (0..7)
0 120 120 120 120 120 120 120 
##$DP= (0..7)
$$ [...]
##$SUBNAM2= <"">
##$SUBNAM3= <"">
##$SUBNAM4= <"">
##$SUBNAM5= <"">
##$SUBNAM6= <"">
##$SUBNAM7= <"">
##$SUBNAM8= <"">
##$SUBNAM9= <"">
##$SW= 18.0517328524113
##$SWIBOX= (0..15)
0 0 2 0 0 0 0 0 0 0 0 0 0 0 0 0 
##$SW_h= 3612.71676300578
##$TD= 16384
##$TD0= 1
##$TE= 0
##$TE2= 300
##$TE3= 300
##$TEG= 300
##$TL= (0..7)
0 120 120 120 120 120 120 120 
##$TP= (0..7)
150 150 150 150 150 150 150 150 
##$TP07= 0
##$TPNAME0= <>
##$TPNAME1= <>
##$TPNAME2= <>
##$TPNAME3= <>
##$TPNAME4= <>
##$TPNAME5= <>
##$TPNAME6= <>
##$TPNAME7= <>
##$TPOAL= (0..7)
0.5 0.5 0.5 0.5 0.5 0.5 0.5 0.5 
##$TPOFFS= (0..7)
0 0 0 0 0 0 0 0 
##$TUNHIN= 0
##$TUNHOUT= 0
##$TUNXOUT= 0
##$USERA1= <user>
##$USERA2= <user>
##$USERA3= <user>
##$USERA4= <user>
##$USERA5= <user>
##$V9= 5
##$VALIST= <valist>
##$VCLIST= <CCCCCCCCCCCCCCC>
##$VD= 0
##$VDLIST= <DDDDDDDDDDDDDDD>
##$VPLIST= <PPPPPPPPPPPPPPP>
##$VTLIST= <TTTTTTTTTTTTTTT>
##$WBST= 1024
##$WBSW= 4
##$XGAIN= (0..3)
0 0 0 0 
##$XL= 0
##$YL= 0
##$YMAX_a= 114371
##$YMIN_a= -96835
##$ZGOPTNS= <>
##$ZL1= 120
##$ZL2= 120
##$ZL3= 120
##$ZL4= 120
##$ABSF1= 0
##$ABSF2= 0
##$ABSG= 0
##$ABSL= 0
##$ALPHA= 0
##$AQORDER= 0
##$ASSFAC= 0
##$ASSFACI= 0
##$ASSFACX= 0
##$ASSWID= 0
##$AUNMP= <proc_1d>
##$AZFE= 0.1
##$AZFW= 0.1
##$BCFW= 0
##$BC_mod= 2
##$BYTORDP= 0
##$COROFFS= 0
##$CY= -3
##$DATMOD= 1
##$DC= 0
##$DFILT= <>
##$DTYPP= 0
##$F1P= 0
##$F2P= 0
##$FCOR= 1
##$FTSIZE= 16384
##$FT_mod= 6
##$GAMMA= 0
##$GB= 0
##$INTBC= 1
##$INTSCL= 3.241238e-09
##$ISEN= 128
##$LB= 0.25
##$LEV0= 0
##$LPBIN= 0
##$MAXI= 10000
##$MC2= 0
##$MEAN= 0
##$ME_mod= 0
##$MI= 1.114404
##$NCOEF= 0
##$NC_proc= -7
##$NLEV= 6
##$NOISF1= 3.799351
##$NOISF2= 2.8
##$NSP= 0
##$NTH_PI= 0
##$NZP= 0
##$OFFSET= 15.50229
##$PC= 1
##$PHC0= -6894.148
##$PHC1= 6.42196
##$PH_mod= 1
##$PKNL= yes
##$PPARMOD= 0
##$PSCAL= 0
##$PSIGN= 0
##$REVERSE= no
##$SF= 200.130003884509
##$SI= 16384
##$SIGF1= 3
##$SIGF2= 2
##$SINO= 0.751879
##$SIOLD= 32768
##$SREGLST= <19F.Aceton>
##$SSB= 0
##$STSI= 16384
##$STSR= 0
##$SW_p= 3612.71676300578
##$SYMM= 0
##$S_DEV= 0
##$TDeff= 16384
##$TDoff= 0
##$TI= <>
##$TILT= no
##$TM1= 0
##$TM2= 0
##$TOPLEV= 0
##$USERP1= <user>
##$USERP2= <user>
##$USERP3= <user>
##$USERP4= <user>
##$USERP5= <user>
##$WDW= 1
##$XDIM= 16384
##$YMAX_p= 443391273
##$YMIN_p= -463005
$$ End of Bruker specific parameters
$$ ---------------------------------
##NTUPLES= NMR SPECTRUM
##VAR_NAME=  FREQUENCY,     SPECTRUM/REAL,   SPECTRUM/IMAG
##SYMBOL=    X,             R,               I
##VAR_TYPE=  INDEPENDENT,   DEPENDENT,       DEPENDENT
##VAR_FORM=  AFFN,          ASDF,            ASDF
##VAR_DIM=   16384,         16384,           16384
##UNITS=     HZ,            ARBITRARY UNITS, ARBITRARY UNITS
##FACTOR=    0.220516191357247, 1,           1
##FIRST=     3102.47331229589, 0,            0
##LAST=      -510.243450709893, 0,           0
##MIN=       -510.243450709893, -463005,     0
##MAX=       3102.47331229589, 443391273,    0
$$ Real data points
##PAGE= N=1
##DATA TABLE= (X++(R..R)), XYDATA
$$ [...]
$$ plain form
6142 -107517 -144449 -227203 -255532 -262653 -247277 -209330 -172191 -207203 -262915 -313091 -327502 -305335
6130 -305335 -246997 -264479 -293699 -308301 -355090 -309951 -262576 -265046 -249743 -256708 -254835 -261166
6118 -261166 -344210 -392205 -326551 -236819 -161287 -162837 -167260 -158593 -220860 -248678 -231848 -189433
6106 -189433 -174999 -136063 -144737 -92324 -130487 -157328 -177183 -122163 -67029 -136081 -150052 -112514
6094 -112514 -92123 -93857 -93208 -117154 -132971 -143424 -132220 -151573 -228161 -213729 -218733 -153128
6082 -153128 -175466 -191070 -88113 -103778 -220719 -231444 -166010 -184043 -217085 -246600 -219480
6071 -219480 -158994 -173393 -178736 -197895 -227581 -233461 -288470 -337516 -308306 -195574 -245320 -309882
6059 -309882 -286765 -305414 -323808 -300968 -284137 -262497 -257006 -327360 -366720 -391771 -342343 -325665
$$ packed form
6142a07517l6932q2754k8329p121J5376L7947L7139l5012n5712n0176j4411K2167
6130c05335N8338j7482k9220j4602m6789M5139M7375k470J5303o965J873o331
6118b61166q3044m7995O5654Q9732P5532j550m423Q667o2267k7818J6830M2415
6106a89433J4434L8936q674N2413l8163k6841j9855N5020N5134o9052j3971L7538
6094a12514K0391j734O49k3946j5817j0453J1204j9353p6588J4432n004O5605
6082a53128k2338j5604J02957j5665j16941j0725O5434j8033l3042k9515K7120
6071b19480O0486j4399n343j9159k9686n880n5009m9046K9210J12732m9746o4562
6059c09882K3117j8649j8394K2840J6831K1640N491p0354l9360k5051M9428J6678
$$ plain form
6047 -325665 -312073 -355334 -314025 -286984 -295662 -269485 -263247 -271139 -268697 -295974 -332430 -287849
6035 -287849 -238023 -219036 -155769 -219302 -223817 -211659 -230443 -162179 -200361 -216753 -149817 -182849
6023 -182849 -149389 -154950 -177272 -178256 -201146 -171092 -148381 -140759 -108756 -95246 -98583 -87873 -144128
6010 -144128 -103964 -142007 -143798 -171151 -177132 -139612 -169537 -176293 -194184 -143968 -139485 -127329
5998 -127329 -125452 -188162 -195678 -223796 -201904 -119899 -111198 -233537 -255339 -310986 -238204 -220239
5986 -220239 -278115 -277376 -244026 -297633 -276101 -285838 -291870 -298105 -256132 -202631 -189406 -231070 -253247
5973 -253247 -220908 -166050 -185404 -238651 -227899 -218721 -167986 -204391 -139756 -110092 -140440 -101487
5961 -101487 -81294 -127349 -128590 -147886 -56442 23870 -60641 -93834 -120229 -80024 -65095 -68171
$$ packed form
6047c25665J3592m3261M1309K7041q678K6177O238p892K442k7277l6456M4581
6035b87849M9826J8987O3267o3533m515J2158j8784O8264l8182j6392O6936l3032
6023a82849L3460n561k2322r84k2890L0054K2711P622L2003J3510l337J0710n6255
6010a44128M0164l8043j791k7353n981L7520k9925o756j7891N0216M483J2156
5998a27329J877o2710p516k8118K1892Q2005Q701j22339k1802n5647P2782J7965
5986b20239n7876P39L3350n3607K1532r737o032o235M1973N3501J3225m1664k2177
5973b53247L2339N4858j9354n3247J0752R178N0735l6405O4635K9664l0348L8953
5961a01487K0193m6055j241j9296R1444Q0312q4511l3193k6395M0205J4929l076
$$ plain form
5949 -68171 13138 30779 88286 125162 114816 132624 106839 106381 43302 112652 197119 126753
5937 126753 120630 128762 145456 157038 157601 82192 132262 134790 18555 -34699 -60337 1337
5925 1337 -27140 -26294 -16250 -91829 -114746 -189636 -231735 -204674 -230227 -319951 -215371 -203740
5913 -203740 -202203 -198503 -219593 -207204 -167562 -177477 -206570 -210657 -266379 -207536 -223989 -235136
5901 -235136 -244542 -219359 -201521 -251679 -259212 -250141 -293857 -285272 -262491 -197189 -185928 -161991
5889 -161991 -150061 -192020 -223889 -206503 -175891 -193631 -195567 -134749 -134905 -102879 -155065 -155184 -191433
5876 -191433 -201690 -87592 -69382 -23711 -146825 -165997 -147910 -98983 -101402 -106512 -82928 -90208
5864 -90208 -77238 -75003 -137065 -146547 -148615 -176199 -120677 -172863 -198601 -201477 -113884 -73874 -138659
$$ packed form
5949f8171Q1309J7641N7507L6876j0346J7808k5785m58o3079O9350Q4467p0366
5937A26753o123Q132J6694J1582N63p5409N0070K528j16235n3254k5638O1674
5925A337k8477Q46J0044p5579k2917p4890m2099K7061k5553q9724J04580J1631
5913b03740J537L700k1090J2389L9642r915k9093m087n5722N8843j6453j1147
5901b35136r406K5183J7838n0158p533R071m3716Q585K2781O5302J1261K3937
5889a61991J1930m1959l1869J7386L0612j7740j936O0818j56L2026n2186j19l6249
5876a91433j0257J14098J8210M5671j23114j9172J8087M8927k419n110K3584p280
5864i0208J2970K235o2062r482k068k7584N5522n2186k5738k876Q7593M0010o4785
$$ plain form
5851 -138659 -80401 -103311 -154636 -163357 -148547 -158522 -101373 -185384 -172252 -207224 -173081 -178326
5839 -178326 -219574 -231477 -271897 -213311 -133490 -188533 -264893 -278273 -285831 -332449 -332264 -331383 -265896
5826 -265896 -269154 -263140 -124515 -155496 -235582 -290065 -204512 -213553 -194796 -176580 -134492 -89615
5814 -89615 -129573 -120643 -158137 -158533 -104670 -89555 -70537 -78244 -85482 -79925 -98918 -62078 -86191
5801 -86191 -74653 -14547 -33432 -13979 27004 61154 58399 -1718 -3084 14505 -16948 -10646
5789 -10646 36413 94007 58533 31139 140955 149529 100972 125560 137076 221577 244172 249962
5777 249962 232093 225051 238718 386613 381962 422361 566183 641313 717466 879094 995758
5766 995758 1181893 1457120 1766889 2220624 2865054 3846011 5533117 8179452 11788516
$$ packed form
5851a38659N8258k2910n1325q721J4810r975N7149q4011J3132l4972L4143n245
5839a78326m1248j1903m0420N8586P9821n5043p6360j3380p558m6618J85Q81O5487
5826b65896l258O014J38625l0981q0086n4483Q5553r041J8757J8216M2088M4877
5814h9615l9958Q930l7494l96N3863J5115J9018p707p238N557j8993L6840k4113
5801h6191J1538O0106j8885J9453M0983L4150k755o0117j366J7589l1453O302
5789a0646M7059N7594l5474k7394J09816Q574m8557K4588J1516Q4501K2595N790
5777B49962j7869p042J3667J47895m651M0399J43822P5130P6153J61628J16664
5766I95758J86135K75227L09769M53735O44430R80957J687106K646335L609064
$$ plain form
5757 11788516 15194841 17349750 17749762 17361105 16165410 14079459 11858260 9741357
5749 9741357 7893338 6240883 4849643 3760984 3025158 2514096 2187725 1899866 1686504
5740 1686504 1490431 1369948 1232877 1104639 968814 942183 948610 920117 866897 738878
5730 738878 663695 655723 660263 630847 630110 630164 592309 495099 473433 474033 419264 472211 428996
5717 428996 456406 481393 387087 316420 326323 340909 326123 325989 279732 238852 235264 182403
5705 182403 185705 142461 152995 147505 134192 114600 142079 135857 68383 17132 -22003 -13815
5693 -13815 -27108 -27156 -51573 -61542 -67590 -106379 -32470 -17206 -25295 -58286 -91703 -61461 -43001
5680 -43001 -94083 -79282 -79804 -87304 -77291 -92877 -82299 -83376 -85555 -51153 -86722 -155682 -106974
$$ packed form
5757A1788516L406325K154909M00012l88657j195695k085951k221199k116903
5749I741357j848019j652455j391240j088659p35826n11062l26371k87859k13362
5740A686504j96073j20483j37071j28238j35825k6631O427k8493n3220j28019
5730G38878p5183p972M540k9416p37N4l7855r7210k1666O00n4769N2947m3215
5717D28996K7410K4987r4306p0667R903J4586j4786j34m6257m0880l588n2861
5705A82403L302m3244J0534n490j3313j9592K7479o222o7474n1251l9135Q188
5693a3815j3293m8k4417r969o048l8789P3909J5264q089l2991l3417L0242J8460
5680d3001n1082J4801n22p500J0013j5586J0578j077k179L4402l5569o8960M8708
$$ plain form
5667 -106974 -126854 -97581 -78746 -74117 -47040 -73228 -86119 -92016 -60639 -28947 35822 9075
5655 9075 1123 -16044 -5711 -22030 -69744 -22237 6612 50863 84829 80650 76097 89037 149350
5642 149350 103975 78003 86100 95463 121426 160991 121342 89140 88511 19656 20633 10683 24135
5629 24135 48056 36097 27076 21157 24533 -22228 -67841 -44270 -1686 -31544 -105360 -97343 -94765
5616 -94765 -105074 -98447 -72333 -87814 -54493 -86736 -78082 -49095 12501 105161 187309 253981
5604 253981 335385 288571 226253 191051 194426 139000 135906 202180 207122 245116 284420 350459
5592 350459 407678 349696 298867 225342 194014 162306 112051 121413 92867 64754 58143 7565
5580 7565 -48720 -15408 -6027 34796 76653 126143 75945 -3664 -3341 50125 35775 15394 38294
$$ packed form
5667a06974j9880K9273J8835M629K7077k6188j2891n897L1377L1692O4769k6747
5655I075p952j7167J0333j6319m7714M7507K8849M4251L3966m179m553J2940O0313
5642A49350m5375k5972Q097R363K5963L9565l9649l2202o29o8855R77r950J3452
5629B4135K3921j1959r021n919L376m6761m5613K3571M2584k9858p3816Q017K578
5616i4765j0309O627K6114j5481L3321l2243Q654K8987O1596R2660Q2148O6672
5604B53981Q1404m6814o2318l5202L375n5426l094O6274M942L7994L9304O6039
5592C50459N7219n7982n0829p3525l1328l1708n0255R362k8546k8113o611n0578
5580G565n6285L3312R381M0823M1857M9490n0198p9609L23N3466j4350k0381K2900
$$ plain form
5567 38294 91283 32803 30270 82255 22886 12372 50788 60404 50066 54283 10250 9801 -34933
5554 -34933 -20617 10917 50603 2514 -58047 36599 50236 -28631 9650 38021 7814 2435
5542 2435 65160 153924 157164 184528 245510 250832 339944 423953 535852 625745 768786 829610
5530 829610 735402 691065 695711 721247 754318 725387 824273 906312 852389 872405 809871 753350
5518 753350 730441 634721 547925 411375 344437 395681 335246 261648 240136 226983 160667
5507 160667 128220 155784 132972 154801 220234 121094 112055 43037 26354 49412 68857 91793
5495 91793 98492 97297 110856 163640 106860 37085 34142 51771 59826 92745 53433 5092 68619
5482 68619 65939 75113 65193 46744 35546 128 54191 22978 -46706 -76033 -55550 -87898
$$ packed form
5567C8294N2989n8480k533N1985n9369j0514L8416R616j0338M217m4033m49m4734
5554c4933J4316L1534L9686m8089o0561R4646J3637p8867L8281K8371l0207n379
5542B435O2725Q8764L240K7364O0982N322Q9112Q4009J11899Q9893J43041O0824
5530H29610r4208m4337M646K5536L3071k8931R8886Q2039n3923K0016o2534n6521
5518G53350k2909r5720q6796j36550o6938N1244o0435p3598k1512j3153o6316
5507A60667l2447K7564k2812K1829O5433r9140r039o9018j6683K3058J9445K2936
5495I1793O699j195J3559N2784n6780o9775k943J7629Q055L2919l9312m8341O3527
5482F8619k680R174r920j8449j1198l5418N4063l1213o9684k9327K0483l2348
$$ plain form
5470 -87898 -111230 -65046 -89213 -9143 -24423 -24657 47262 64375 44802 -13583 -75710 -48353
5458 -48353 30996 6700 -32957 -27892 -42636 -127941 -152140 -58727 -34973 -9286 -10479 -48594
5446 -48594 -64313 7650 -17781 -22488 -43366 -3627 93452 86288 75762 77123 80261 118309 214345
5433 214345 149700 162583 124610 151111 175495 209462 281623 277729 204933 197318 230357 216128
5421 216128 246773 209407 258090 299521 333451 289940 357201 425612 405301 339508 334466 343337
5409 343337 380079 431720 416335 363899 355646 488627 502052 516107 497205 446048 396860 425582
5397 425582 428048 430047 376857 353028 354643 313832 326260 341262 333162 367445 331621 337205 381858
5384 381858 378274 428909 453332 462188 429987 451602 558286 525604 585824 550548 569262 581906
$$ packed form
5470h7898k3332M6184k4167Q0070j5280k34P1919J7113j9573n8385o2127K7357
5458d8353P9349k4296l9657N065j4744q5305k4199R3413K3754K5687j193l8115
5446d8594j5719P1963k5431m707k0878L9739R7079p164j0526J361L138L8048R6036
5433B14345o4645J2883l7973K6501K4384L3967P2161l894p2796p615L3039j4229
5421B16128L0645l7366M8683M1431L3930m3511O7261O8411k0311o5793n042Q871
5409C43337L6742N1641j5385n2436q253J32981J3425J4055j8902n1157m9188K8722
5397D25582K466J999n3190k3829J615m0811J2428J5002q100L4283l5824N584M4653
5384C81858l584N0635K4423Q856l2201K1615J06684l2682O0220l5276J8714J2644
$$ plain form
5372 581906 618071 563232 582458 611206 581619 637218 633510 680243 696559 720866 753058 823864
5360 823864 891604 951001 905426 938622 1025027 1026840 1079500 1078214 1079018 1164534 1192108 1171711
5348 1171711 1168700 1259807 1311718 1346258 1393989 1424742 1478757 1526758 1579356 1588406 1600942 1640057
5336 1640057 1692546 1705524 1731815 1802467 1904812 2041417 2060036 2142437 2204202 2242854 2333854
5325 2333854 2430549 2602581 2768117 2859374 3075334 3256563 3454580 3645025 3964760 4286873
5315 4286873 4549222 4930360 5378796 5795855 6325129 6918833 7581478 8395611 9414750
5306 9414750 10601251 12030206 13842388 16041106 18860434 22765978 28471463 36884499
5298 36884499 48550144 62343493 75134683 83751843 87403029 87393639 84543105 79682611
$$ packed form
5372E81906L6165n4839J9226K8748k9587N5599l708M6733J6316K4307L2192P0806
5360H23864O7740N9397m5575L3196Q6405J813N2660j286Q04Q5516K7574k0397
5348A171711l011R1107N1911L4540M7731L0753N4015M8001N2598R050J2536L9115
5336A640057N2489J2978K6291P0652J02345J36605J8619Q2401O1765L8652R1000
5325B333854R6695J72032J65536R1257K15960J81229J98017J90445L19735L22113
5315D286873K62349L81138M48436M17059N29274N93704O62645Q14133J019139
5306I414750J186501J428955J812182K198718K819328L905544N705485Q413036
5298C6884499J1665645J3793349J2791190Q617160L651186r390k850534m860494
$$ plain form
5290 79682611 74426688 70632174 69883399 73035552 79799577 87944414 94100592 95708402
5282 95708402 93305039 87827277 79787313 70174152 60362089 51225930 43032379 35858968
5274 35858968 29890369 25187899 21740542 19117985 16942515 15151337 13649286 12401106
5266 12401106 11383039 10603957 9932214 9289764 8771643 8368343 7908707 7499115 7157603
5257 7157603 6808863 6490491 6222577 5969854 5705775 5470311 5239636 5023184 4853575 4663517
5247 4663517 4553684 4432319 4290420 4120408 4051293 3975134 3822174 3670877 3531046 3349244
5237 3349244 3293687 3161302 3030995 3052440 2949901 2792204 2700055 2676923 2560990 2427851
5227 2427851 2366805 2380444 2377090 2315428 2244899 2216211 2142010 2111999 2071417 2038437 1941857 1834061
$$ packed form
5290G9682611n255923l794514p48775L152153O764025Q144837O156178J607810
5282I5708402k403363n477762q039964r613161r812063r136159q193551p173411
5274C5858968n968599m702470l447357k622557k175470j791178j502051j248180
5266A2401106j018067p79082o71743o42450n18121m03300m59636m09592l41512
5257G157603l48740l18372k67914k52723k64079k35464k30675k16452j69609j90058
5247D663517j09833j21365j41899j70012o9115p6159j52960j51297j39831j81802
5237C349244n5557j32385j30307K1445j02539j57697r2149k3132j15933j33139
5227B427851o1046J3639l354o1662p0529k8688p4201l0011m0582l2980r6580j07796
$$ plain form
5215 1834061 1789359 1778308 1737422 1682362 1678203 1677899 1622189 1620319 1643171 1597127 1534470 1505575
5203 1505575 1515872 1539925 1574570 1529508 1483102 1416298 1413975 1413133 1357694 1353190 1425129 1435043
5191 1435043 1392287 1376987 1351058 1334827 1396032 1423011 1264027 1207751 1209435 1181899 1181909 1194711
5179 1194711 1104074 1099601 1127078 1110020 1108237 1078129 1051686 972533 1001500 930141 901283 881984
5167 881984 877890 871813 876380 852395 769991 742689 718329 686247 686853 727355 675861 638414 595917
5154 595917 558963 547689 632991 637377 592667 540190 458083 545281 649815 623184 561610 618618
5142 618618 598921 555703 515752 617461 645803 606768 626911 624483 619310 580460 520867 544210
5130 544210 595513 582613 634834 633607 587532 677940 699197 681926 705248 764241 700554 649955
$$ packed form
5215A834061m4702j1051m0886n5060m159l04n5710j870K2852m6044o2657k8895
5203A505575J0297K4053L4645m5062m6406o6804k323q42n5439m504P1939R914
5191A435043m2756j5300k5929j6231O1205K6979j58984n6276J684k7536J0J2802
5179A194711r0637m473K7477j7058j783l0108k6443p9153K8967p1359k8858j9299
5167H81984m094o077M567k3985q2404k7302k4360l2082O06M0502n1494l7447m2497
5154E95917l6954j1274Q5302M386m4710n2477q2107Q7198J04534k6631o1574N7008
5142F18618j9697m3218l9951J01709K8342l9035K0143k428n173l8850n9593K3343
5130E44210N1303j2900N2221j227m6075R0408K1257j7271K3322N8993o3687n0599
$$ plain form
5118 649955 695973 631672 650159 623857 644084 653679 564666 599850 672819 614674 632045 657633
5106 657633 610975 638054 675499 632806 628722 645945 594412 609146 614672 581645 595318 600441
5094 600441 627419 541646 512809 522887 490654 476159 472226 504259 501069 503002 452362 459602
5082 459602 419467 380272 377118 417400 422051 461646 483691 437580 405259 407761 483177 420779
5070 420779 474348 437666 424360 444587 525530 595631 639936 660098 642853 704818 741735 717629
5058 717629 671143 712912 754137 782303 854489 846545 889125 891372 840434 875339 807350 764302
5046 764302 731862 716496 720376 683501 695754 702207 672001 671678 659775 663242 729745 712904 727183
5033 727183 641360 636708 670261 693743 666866 686199 697413 680174 674237 628471 688000 733125
$$ packed form
5118F49955M6018o4301J8487k6302K0227R595q9013L5184P2969n8145J7371K5588
5106F57633m6658K7079L7445m2693m084J7223n1533J4734N526l3027J3673N123
5094F00441K6978q5773k8837J0078l2233j4495l933L2033l190J933n0640P240
5082D59602m0135l9195l154M0282M651L9595K2045m6111l2321K502P5416o2398
5070D20779N3569l6682j3306K0227Q0943P0101M4305K0162j7245O1965L6917k4106
5058G17629m6486M1769M1225K8166P2186p944M2580K247n0938L4905o7989m3048
5046G64302l2440j5366L880l6875J2253O453l0206l23j1903L467O6503j6841J4279
5033G27183q5823m652L3553K3482k6877J9333J1214j7239n937m5766N9529M5125
$$ plain form
5021 733125 728804 706681 681457 654884 646749 676198 655778 669653 626702 565406 643841 647586
5009 647586 650451 705678 702667 718337 725364 734630 762440 759029 798287 782456 831136 896760 861135
4996 861135 898234 1012172 1068850 1252969 1299554 1380241 1468167 1524352 1590167 1633647 1625521
4985 1625521 1635473 1625132 1622137 1582967 1575337 1547984 1505294 1480083 1449319 1380411 1387512 1423199
4973 1423199 1414753 1434318 1491891 1568763 1497987 1413136 1405542 1389177 1331992 1309849 1279236 1177806
4961 1177806 1185077 1181146 1167847 1124433 1143726 1201165 1088295 1042024 990426 974647 1019752 1048448
4949 1048448 1068440 1036463 1073246 1044268 1010005 961532 1052500 1066349 1106042 1121635 1085699
4938 1085699 1094744 1074382 1041773 1106547 1131894 1108670 1192076 1292402 1286581 1246033 1234986 1138062
$$ packed form
5021G33125m321k2123k5224k6573q135K9449k0420J3875m2951o1296P8435L745
5009F47586K865N5227l011J5670P027R266K7810l411L9258j5831M8680O5624l5625
4996H61135L7099J13938N6678J84119M6585Q0687Q7926N6185O5815M3480q126
4985A625521R952j0341k995l9170p630k7353m2690k5211l0764o8908P101L5687
4973A423199q446J9565N7573P6872p0776q4851p594j6365n7185k2143l0613j01430
4961A177806P271l931j3299m3414J9293N7439j12870m6271n1598j5779M5105K8696
4949A048448J9992l1977L6783k8978l4263m8473R0968J3849L9693J5593l5936
4938A085699R045k0362l2609O4774K5347k3224Q3406J00326n821m0548j1047r6924
$$ plain form
4926 1138062 1160254 1191258 1208769 1296126 1340868 1347500 1427746 1347034 1286654 1408010 1447181
4915 1447181 1368911 1422596 1480726 1510531 1542750 1497268 1490762 1570929 1581540 1657670 1649452 1659220
4903 1659220 1674687 1714275 1715159 1782665 1772755 1776037 1821698 1754454 1643800 1682292 1710996 1732579
4891 1732579 1755369 1847258 1934964 1962863 1873985 1880329 1884401 1941971 2018752 2021194 1990336 2025105
4879 2025105 2062253 1997562 2020146 2089171 2135138 2107970 2092193 2150728 2234253 2268710 2284755
4868 2284755 2288946 2294657 2342229 2382276 2377568 2430682 2463300 2491422 2436504 2462836 2553552 2631848
4856 2631848 2731088 2810491 2884902 2981246 3076405 3246538 3461178 3605570 3612549 3723767 3761044
4845 3761044 3743809 3746298 3725631 3619870 3632667 3645755 3608928 3680054 3772598 3887966 3934646
$$ packed form
4926A138062K2192L1004J7511Q7357M4742O632Q0246q0712o0380J21356L9171
4915A447181p8270N3685N8130K9805L2219m5482o506Q0167J0611P6130q218R768
4903A659220J5467L9588Q84O7506r910L282M5661o7244j10654L8492K8704K1583
4891A732579K2790R1889Q7706K7899q8878O344M072N7570P6781K442l0858L4769
4879B025105L7148o4691K2584O9025M5967k7168j5777N8535Q3525L4457J6045
4868B284755M191N711M7572M0047m708N3114L2618K8122n4918K6332R0716P8296
4856B631848R9240P9403P4411R6344R5159J70133K14640J44392O979J11218L7277
4845C761044j7235K489k0667j05761J2797J3088l6827P1126R2544J15368M6680
$$ plain form
4834 3934646 4122345 4287187 4419920 4614610 4805232 5074122 5318270 5680130 6215967 7098981
4824 7098981 8554933 10790093 13413957 15652605 16700860 16714645 16336356 15295274 13850904
4815 13850904 12339109 10915780 9804669 8796490 7898974 7216830 6763106 6557624 6471185
4806 6471185 6411079 6185585 6082270 6031136 5963371 5944921 5989448 6023349 6007883 6061570 6052388
4795 6052388 6046500 6102222 6187121 6291722 6358401 6364469 6374745 6373410 6518433 6636358 6759795
4784 6759795 6904106 6995622 7052876 7109613 7239450 7322763 7420761 7492973 7554390 7646729 7718441
4773 7718441 7803468 7910318 8069246 8175854 8273200 8395178 8423438 8486021 8635009 8783655
4763 8783655 8960288 8981141 9149348 9229296 9310222 9515804 9573648 9720460 9873894 10019061
$$ packed form
4834C934646J87699J64842J32733J94690J90622K68890K44148L61860N35837Q83014
4824G098981J455952K235160K623864K238648J048255J3785l78289j041082j444370
4815A3850904j511795j423329j111111j008179q97516o82144m53724k05482q6439
4806F471185o0106k25494j03315n1134o7765j8450M4527L3901j5466N3687r182
4795F052388n888N5722Q4899J04601O6679O068J0276j335J45023J17925J23437
4784F759795J44311R1516N7254N6737J29837Q3313R7998P2212O1417R2339P1712
4773G718441Q5027J06850J58928J06608R7346J21978K8260O2583J48988J48646
4763H783655J76633K0853J68207P9948Q0926K05582N7844J46812J53434J45167
$$ plain form
4753 10019061 10168541 10266172 10365783 10517820 10657173 10751345 10900685 11040163 11199879 11346397
4743 11346397 11492725 11601763 11708298 11781187 11953143 12088425 12221819 12363217 12582462 12729218
4733 12729218 12841011 13049939 13187710 13291955 13425310 13653173 13849495 14041414 14139949 14280785
4723 14280785 14459946 14535627 14627376 14851958 14975437 15035453 15097459 15221686 15287417 15392686
4713 15392686 15634398 15833030 15923908 15952567 16031947 16139175 16300023 16494491 16511851 16592101
4703 16592101 16688137 16839320 16946513 17089514 17283283 17314269 17282455 17389862 17451457 17535472
4693 17535472 17591183 17646750 17689251 17759181 17843169 17862474 17853961 17866516 17961485 18003308 18096556
4682 18096556 18062359 18080015 18154774 18155416 18179369 18257012 18300038 18316991 18278904 18263127 18236171 18185895
$$ packed form
4753A0019061J49480R7631R9611J52037J39353R4172J49340J39478J59716J46518
4743A1346397J46328J09038J06535P2889J71956J35282J33394J41398K19245J46756
4733A2729218J11793K08928J37771J04245J33355K27863J96322J91919R8535J40836
4723A4280785J79161P5681R1749K24582J23479O0016O2006J24227O5731J05269
4713A5392686K41712J98632R0878K8659P9380J07228J60848J94468J7360Q0250
4703A6592101R6036J51183J07193J43001J93769L0986l1814J07407O1595Q4015
4693A7535472N5711N5567M2501O9930Q3988J9305q513J2555R4969M1823R3248
4682A8096556l4197J7656P4759O42K3953P7643M3026J6953l8087j5777k6956n0276
$$ plain form
4670 18185895 18172438 18185560 18154618 18186632 18154628 18118968 18103141 18037763 18070409 18041487 18021435
4659 18021435 17983437 17951495 17900651 17836641 17782096 17718531 17665164 17530941 17461526 17454075 17298572
4648 17298572 17282032 17213356 17170964 17098024 16985888 16890775 16709162 16662880 16679478 16607243 16515032
4637 16515032 16445646 16318648 16264506 16252568 16132256 16159162 16157495 16199871 16449026 16870189 17509344
4626 17509344 18140710 18524347 18600484 18450711 18092678 17558206 16955271 16376412 15965165 15614063
4616 15614063 15243868 15002344 14788728 14638664 14732883 14947273 15211390 15428325 15626835 15811161
4606 15811161 15945879 16103156 16284046 16583753 17005777 17455002 17951545 18368294 18520476
4597 18520476 18584210 18572845 18657021 18947189 19345058 19751066 20102026 20226112 20066065 19671130
$$ packed form
4670A8185895j3457J3122l0942L2014l2004l5660j5827o5378L2646k8922k0052
4659A8021435l7998l1942n0844o4010n4545o3565n3367j34223o9415p451j55503
4648A7298572j6540o8676m2392p2940j12136r5113j81613m6282J6598p2235r2211
4637A6515032o9386j26998n4142j1938j20312K6906j667M2376K49155M21163O39155
4626A7509344O31366L83637P6137j49773l58033n34472o02935n78859m11247l51102
4616A5614063l70195k41524k13616j50064R4219K14390K64117K16935J98510J84326
4606A5811161J34718J57277J80890K99707M22024M49225M96543M16749J52182
4597A8520476O3734j1365Q4176K90168L97869M06008L50960J24086j60047l94935
$$ plain form
4587 19671130 19237283 18802126 18417471 18161084 18052124 17771704 17258064 16706801 16133246
4578 16133246 15500385 14953504 14430590 13959507 13496639 13063129 12660874 12151016 11638468
4569 11638468 11153502 10558537 10129398 9686385 9335265 9091214 8864114 8643910 8404930
4560 8404930 8217695 8120378 8001565 7854062 7706933 7617359 7587499 7501498 7455445 7343157
4550 7343157 7241929 7209028 7141989 7128111 7071406 7017151 6986225 6922930 6914464 6839087 6733900
4539 6733900 6739370 6693811 6601727 6519770 6380675 6384122 6298687 6248047 6185350 6051205 6092315
4528 6092315 6065343 5975836 5959844 5968880 5927329 5993308 6174028 6198079 6210179 6296745 6340146
4517 6340146 6466515 6709248 6874081 7040341 7394909 7783744 8221466 8849719 9790256 11169422
$$ packed form
4587A9671130m33847m35157l84655k56387j08960k80420n13640n51263n73555
4578A6133246o32861n46881n22914m71083m62868m33510m02255n09858n12548
4569A1638468m84966n94965m29139m43013l51120k44051k27100k20204k38980
4560H404930j87235r7317j18813j47503j47129q9574k9860q6001m6053j12288
4550G343157j01228l2901o7039j3878n6705n4255l0926o3295q466p5377j05187
4539F733900N470m5559r2084q1957j39095L447q5435n0640o2697j34145M1110
4528F092315k6972q9507j5992R036m1551O5979J80720K4051J2100Q6566M3401
4517F340146J26369K42733J64833J66260L54568L88835M37722O28253R40537J379166
$$ plain form
4507 11169422 13144615 15912317 19154527 22428808 25125556 26804181 27590002 27822271
4499 27822271 27592599 27093300 26996204 28159703 30902427 35225826 40064884 44267840 46533788
4490 46533788 46827947 45764488 43496506 39988437 36021166 32776181 30615302 29590602
4482 29590602 29218110 29276537 29132482 28408830 27105496 25354641 23033355 20243518 17564952
4473 17564952 15261752 13197813 11450819 10088950 9034444 8255304 7580455 7147827 6736957
4464 6736957 6367269 6030116 5768176 5565135 5379116 5196726 4994541 4868306 4783482 4741400
4454 4741400 4528227 4317752 4203722 4177044 4091334 4045069 3959401 3859881 3741969 3637453
4444 3637453 3590976 3467124 3448483 3402751 3341289 3332519 3242820 3194800 3203751 3111275 3084977 3035446
$$ packed form
4507A1169422J975193K767702L242210L274281K696748J678625P85821K32269
4499B7822271k29672m99299r7096J163499K742724M323399M839058M202956K265948
4490D6533788K94159j063459k267982l508069l967271l244985k160879j024700
4482B9590602l72492N8427j44055p23652j303334j750855k321286k789837k678566
4473A7564952k303200k063939j746994j361869j054506p79140o74849m32628m10870
4464F736957l69688l37153k61940k03041j86019j82390k02185j26235q4824m2082
4454D741400k13173k10475j14030k6678q5710m6265q5668r9520j17912j04516
4444C637453m6477j23852j8641m5732o1462q770q9699m8020Q951r2476k6298m9531
$$ plain form
4432 3035446 3024160 2919561 2901876 2830204 2792487 2781495 2732547 2653648 2582231 2584843 2593357 2518902
4420 2518902 2449630 2408298 2443574 2427134 2348812 2368816 2309853 2296244 2266417 2212801 2104116
4409 2104116 2039286 2041591 2060419 2025491 1993884 1947777 1925685 1957630 2001263 1955535 1906245 1906456
4397 1906456 1892357 1862068 1831424 1773143 1778300 1875720 1866855 1922025 1934488 1906083 1825896 1751077
4385 1751077 1759252 1766405 1837226 1849481 1803936 1772582 1836770 1803791 1825728 1858026 1841745 1825335
4373 1825335 1830674 1749996 1740613 1672427 1690503 1750528 1764751 1748821 1651519 1632753 1698645 1641849
4361 1641849 1655499 1625204 1671624 1639935 1562638 1515909 1535630 1613454 1667745 1710144 1864823
4350 1864823 1934023 1990055 2057270 2151734 2139227 2060278 2065909 1970581 1914929 1776652 1665740
$$ packed form
4432C035446j1286j04599j7685p1672l7717j0992m8948p8899p1417K612Q514p4455
4420B518902o9272m1332L5276j6440p8322K0004n8963j3609k9827n3616j08685
4409B104116o4830K305J8828l4928l1607m6107k2092L1945M3633m5728m9290K11
4397A906456j4099l0289l0644n8281N157R7420q865N5170J2463k8405q0187p4819
4385A751077Q175P153P0821J2255m5545l1354O4188l2979K1937L2298j6281j6410
4373A825335N339q0678r383o8186J8076O0025J4223j5930r7302j8766O5892n6796
4361A641849J3650l0295M6420l1689p7297m6729J9721P7824N4291M2399J54679
4350A864823O9200N6032O7215R4464j2507p8949N631r5328n5652j38277j10912
$$ plain form
4339 1665740 1657631 1629816 1540688 1541546 1486870 1559604 1481325 1442006 1414349 1431142 1458520 1442418
4327 1442418 1393167 1405887 1408064 1364293 1375937 1411879 1371191 1339089 1367988 1355796 1315586 1278157
4315 1278157 1285906 1336967 1341598 1377940 1349084 1352661 1345931 1312047 1356304 1367822 1439471 1505933
4303 1505933 1453649 1429325 1463599 1471496 1495166 1470087 1454564 1433917 1422125 1460511 1513006 1522099
4291 1522099 1484732 1480237 1555737 1646310 1581504 1558882 1639818 1624511 1577188 1633988 1738610
4280 1738610 1782251 1769467 1777439 1883603 1979849 2007000 2074817 2157973 2287460 2363954 2479633
4269 2479633 2661361 2795291 2942557 3114234 3252955 3453956 3628751 3810946 4043803 4289647
4259 4289647 4536902 4905130 5465766 5927770 6511903 7163245 7743300 8334383 8741909 9075344
$$ packed form
4339A665740q109k7815q9128Q58n4676P2734p8279l9319k7657J6793K7378j6102
4327A442418m9251J2720K177m3771J1644L5942m0688l2102K8899j2192m0210l7429
4315A278157P749N1061M631L6342k8856L577o730l3884M4257J1518P1649O6462
4303A505933n2284k4324L4274P897K3670k5079j5523k0647j1792L8386N2495R093
4291A522099l7367m495P5500R0573o4806k2622Q0936j5307m7323N6800J04622
4280A738610M3641j2784P972J06164R6246K7151O7817Q3156J29487P6494J15679
4269B479633J81728J33930J47266J71677J38721K01001J74795J82195K32857K45844
4259D289647K47255L68228N60636M62004N84133O51342N80055N91083M07526L33435
$$ plain form
4249 9075344 9369129 9603881 9871130 10205501 10697881 11301334 12175795 13316151 14576697
4240 14576697 15828916 17023767 17973364 18636670 18992736 19020482 18880929 18707575 18503295
4231 18503295 18517888 18764399 19362627 20325102 21528407 22891527 24158447 25073357 25550098
4222 25550098 25584737 25152588 24379572 23401230 22305838 21355286 20616275 20190272 20114584 20320578
4212 20320578 20831299 21365114 21842552 21946459 21691974 21020529 20007373 18768417 17449475
4203 17449475 16198728 15025690 14020769 13212434 12739063 12495068 12293301 12179522 12039780
4194 12039780 11686771 11159213 10576366 9853221 8957985 8185522 7514559 6900373 6353298
4185 6353298 5876386 5540111 5269263 4997819 4793679 4593019 4345115 4125440 3897251 3662012
$$ packed form
4249I075344K93785K34752K67249L34371M92380O03453Q74461J140356J260546
4240A4576697J252219J194851R49597O63306L56066K7746j39553j73354k04280
4231A8503295J4593K46511N98228R62475J203305J363120J266920R14910M76741
4222B5550098L4639m32149p73016r78342j095392r50552p39011m26003p5688K05994
4212B0320578N10721N33815M77438J03907k54485o71445j013156j238956j318942
4203A7449475j250747j173038j004921q08335m73371k43995k01767j13779j39742
4194A2039780l53009n27558n82847p23145q95236p72463o70963o14186n47075
4185F353298m76912l36275k70848k71444k04140k00660k47904k19675k28189k35239
$$ plain form
4175 3662012 3415947 3216843 2981582 2769709 2665100 2573435 2449653 2306983 2192365 2041737
4165 2041737 1978798 1971077 2000371 1954743 1839245 1758327 1704401 1651715 1584394 1556013 1516840
4154 1516840 1481887 1437403 1384336 1321701 1286479 1341802 1330314 1347825 1302822 1183923 1173813
4143 1173813 1063342 1026294 1036952 1007856 981017 1009108 996932 995059 1016592 1006932 958832 929902
4131 929902 929665 887307 859596 762948 833104 868631 758187 701423 705523 699109 736383 751181
4119 751181 703380 699067 752976 755890 713857 621844 574870 580159 610380 600288 619109 652935
4107 652935 623755 600286 604219 556193 555097 615988 666197 608446 566033 627472 675576 715473
4095 715473 704287 704683 638912 639050 587305 563221 521506 494326 550887 565537 537947 562991
$$ packed form
4175C662012k46065j99104k35261k11873j04609r1665j23782j42670j14618j50628
4165B041737o2939p721K9294m5628j15498q0918n3926n2686o7321k8381l9173
4154A516840l4953m4484n3067o2635l5222N5323j1488J7511m5003j18899j0110
4143A173813j10471l7048J0658k9096k6839K8091j2176j873K1533r660m8100k8930
4131I29902k37m2358k7711r6648P0156L5527j10444n6764M100o414L7274J4798
4119G51181m7801m313N3909K914m2033r2013m6974N289L0221j0092J8821L3826
4107F52935k9180k3469L933m8026j096O0891N0209n7751m2413O1439M8104L9897
4095G15473j1186L96o5771J38n1745k4084m1715k7180N6561J4650k7590K5044
$$ plain form
4083 562991 557767 539733 542660 563383 507412 478138 437285 452112 549378 542925 489658 470687
4071 470687 517776 500114 511432 494895 498992 468737 463180 510915 535568 568621 598283 601963
4059 601963 560112 519563 534834 515447 510016 561570 531442 550721 655616 653152 710301 747437
4047 747437 743645 728807 717870 737636 775179 766788 731939 766415 734728 755134 803850 783495
4035 783495 746872 783499 833409 771053 739798 823596 746592 669103 680048 671134 720020 633026
4023 633026 567902 561882 557262 559519 545078 581813 555388 556685 529125 456145 445896 455657 437211
4010 437211 427443 421034 422347 393842 388481 396247 481308 434083 379946 343963 310830 339068 309974
3997 309974 286580 260813 238872 303659 310188 336231 296499 252023 233576 254242 206967 283090
$$ packed form
4083E62991n224j8034K927K0723n5971k9274m0853J4827R7266o453n3267j8971
4071D70687M7089j7662J1318j6537M097l0255n557M7735K4653L3053K9662L680
4059F01963m1851m0549J5271j9387n431N1554l0128J9279J04895k464N7149L7136
4047G47437l792j4838j0937J9766L7543q391l4849L4476l1687K0406M8716k0355
4035G83495l6623L6627M9910o2356l1255Q3798p7004p7489J0945q914M8886q6994
4023F33026o5124o020m620K257j4441L6735k6425J297k7560p2980j0249R761j8446
4010D37211r768o409J313k8505n361P766Q5061m7225n4137l5983l3133K8238k9094
3997C09974k3394k5767k1941O4787O529K6043l9732m4476j8447K0666m7275P6123
$$ plain form
3985 283090 299708 213392 260654 215999 218912 209088 228730 269848 254587 235555 277719 288225
3973 288225 323578 283741 277147 272497 334850 336500 293955 268817 295804 313906 325168 291190
3961 291190 293847 418087 425816 382143 359194 369507 386108 498585 580490 594751 630410 589809
3949 589809 741424 891042 1123556 1524403 1910362 2132803 2374044 2477111 2383318 2311646
3939 2311646 2126657 1865149 1644936 1484969 1362606 1178857 1038294 995771 1044575 1081936
3929 1081936 1060340 1097411 1121129 1160760 1288232 1311331 1236588 1272996 1358032 1410105 1397223
3918 1397223 1440118 1519071 1697831 2024300 2486751 2773805 2917683 2951366 2866488 2785311
3908 2785311 2500465 2233094 2014474 1742129 1583560 1439825 1263621 1188419 1114803 951299
$$ packed form
3985B83090J6618q6316M7262m4655K913r824J9642M1118j5261j9032M2164J0506
3973B88225L5353l9837o594m650O2353J650m2545k5138K6987J8102J1262l3978
3961B91190K657J24240P729m3673k2949J0313J6601J12477Q1905J4261L5659m0601
3949E89809J51615J49618K32514M00847L85959K22441K41241J03067r3793p1672
3939B311646j84989k61508k20213j59967j22363j83749j40563m2523M8804L7361
3929A081936k1596L7071K3718L9631J27472K3099p4743L6408Q5036N2073j2882
3918A397223M2895P8953J78760L26469M62451K87054J43878L3683q4878q1177
3908B785311k84846k67371k18620k72345j58569j43735j76204p5202p3616j63504
$$ plain form
3898 951299 912488 920800 834034 773145 823931 793387 756836 734455 793975 724366 712724 737919
3886 737919 651910 608024 612697 603351 575595 531252 580300 616694 567451 591535 601385 559958
3874 559958 525355 488075 482613 470952 398213 340211 348295 350917 360490 375774 372579 367283 287282
3861 287282 322593 311909 347744 339449 247178 270820 306398 324374 294032 188410 193276 151100
3849 151100 98178 167442 208050 149318 139378 151592 160366 206306 199020 206940 192065 172051
3837 172051 180107 196177 162298 163867 210781 237605 207816 260957 339031 337005 369679 345942
3825 345942 382805 388867 361928 362057 373100 416791 378017 353222 403875 490693 467309 520896
3813 520896 601247 605434 570832 599101 536273 565579 665611 716071 679651 594656 618045 645408
$$ packed form
3898I51299l8811Q312q6766o0889N0786l0544l6551k2381N9520o9609j1642K5195
3886G37919q6009m3886M673r346k7756m4343M9048L6394m9243K4084R850m1427
3874E59958l4603l7280n462j1661p2739n8002Q084K622R573J5284l195n296q0001
3861B87282L5311j0684L5835q295r2271K3642L5578J7976l0342j05622M866m2176
3849A51100n2922O9264M0608n8732r940J2214Q774M5940p286P920j4875k0014
3837A72051Q056J6070l3879J569M6914K6824k9789N3141P8074k026L2674k3737
3825C45942L6863O062k6939J29J1043M3691l8774k4795N0653Q6818k3384N3587
3813E20896Q0351M187l4602K8269o2828K9306J00032N0460l6420q4995K3389K7363
$$ plain form
3801 645408 675173 678181 685289 694846 750577 690639 685539 741726 797487 819407 884915 849914
3789 849914 821634 822885 876567 900388 899676 829955 821160 862390 910459 905240 933605 976641 950705
3776 950705 935691 965278 958249 962293 962143 997219 1082918 1043675 1174881 1168165 1100352 1158885
3764 1158885 1247179 1196464 1202784 1287761 1267047 1368658 1493449 1560376 1678674 1742545 1883169
3753 1883169 2008928 2145569 2231676 2303327 2380019 2527932 2635629 2635904 2652914 2611491 2593535
3742 2593535 2595531 2591226 2544312 2463075 2442333 2451836 2305025 2165494 2131259 2034859 1960106 1933642
3730 1933642 1878990 1755738 1736998 1714873 1651181 1647691 1653347 1617227 1545856 1582476 1554350 1528002
3718 1528002 1558324 1565549 1598032 1649579 1599916 1523589 1569042 1606670 1683359 1747860 1777539 1757871
$$ packed form
3801F45408K9765L008P108R557N5731n9938n100N6187N5761K1920O5508l5001
3789H49914k8280J251N3682K3821p12o9721q795M1230M8069n219K8365M3036k5936
3776I50705j5014K9587p029M044j50L5076Q5699l9243J31206o716o7813N8533
3764A158885Q8294n0715O320Q4977k0714J01611J24791O6927J18298O3871J40624
3753A883169J25759J36641Q6107P1651P6692J47913J07697K75J7010m1423j7956
3742B593535J996m305m6914q1237k0742R503j46811j39531l4235r6400p4753k6464
3730A933642n4652j23252j8740k2125o3692l490N656l6120p1371L6620k8126k6348
3718A528002L0322P225L2483N1547m9663p6327M5453L7628P6689O4501K9679j9668
$$ plain form
3706 1757871 1765047 1788950 1811775 1856813 1936065 1982413 1967180 1990957 2042234 2118417 2213312 2205309
3694 2205309 2219910 2210567 2238528 2224737 2167688 2206965 2159035 2136732 2125825 2171943 2143222 2129515
3682 2129515 2150786 2135311 2183113 2193082 2147828 2216607 2238367 2244786 2228560 2226210 2225668 2244273
3670 2244273 2313167 2248308 2307006 2388839 2338062 2344747 2335976 2322840 2326097 2440757 2537068 2573759
3658 2573759 2610708 2708896 2773502 2810769 2943544 3047140 3150042 3259936 3433082 3577219
3648 3577219 3708393 3894247 4148469 4361174 4582607 4908822 5208589 5598072 6046534 6547390
3638 6547390 7099471 7778694 8613690 9544649 10667891 11988916 13574162 15574012 18048248
3629 18048248 21080038 24715099 28994702 33823745 39074993 44442000 49671384 54630714
$$ packed form
3706A757871P176K3903K2825M5038P9252M6348j5233K3777N1277P6183R4895q003
3694B205309J4601r343K7961j3791n7049L9277m7930k2303j0907M6118k8721j3707
3682B129515K1271j5475M7802R969m5254O8779K1760O419j6226k350n42J8605
3670B244273O8894o4859N8698Q1833n0777O685q771j3136L257J14660R6311L6691
3658B573759L6949R8188O4606L7267J32775J03596J02902J09894J73146J44137
3648C577219J31174J85854K54222K12705K21433L26215K99767L89483M48462N00856
3638F547390N52081O79223Q34996R30959J123242J321025J585246J999850K474236
3629A8048248L031790L635061M279603M829043N251248N367007N229384M959330
$$ plain form
3621 54630714 58939173 62497755 65003312 66504933 67171147 67043723 66359976 65530569 64843488
3612 64843488 64441638 64508299 65080940 65952420 66995427 68021447 68530870 68384818 67541086
3603 67541086 65836808 63242084 59797772 55718156 51253428 46587269 41927659 37370635
3595 37370635 33288636 29545315 26280143 23409184 21038049 19058337 17347456 15925800
3587 15925800 14709970 13700544 12789447 12026490 11351960 10832204 10296917 9825875 9384220
3578 9384220 9033055 8714770 8344101 7986972 7747698 7497378 7263027 7114836 6990266 6878439
3568 6878439 6813883 6700633 6645152 6620144 6527686 6411978 6400961 6366604 6261038 6197724 6227025
3557 6227025 6221066 6261425 6239198 6258767 6349011 6459092 6572051 6561038 6608973 6639997 6688602
$$ packed form
3621E4630714M308459L558582K505557J501621O66214j27424o83747q29407o87081
3612F4843488m01850O6661N72641Q71480J043007J026020N09423j46052q43732
3603F7541086j704278k594724l444312m079616m464728m666159m659610m557024
3595C7370635m081999l743321l265172k870959k371135j979712j710881j421656
3587A5925800j215830j009426r11097p62957o74530n19756n35287m71042m41655
3578I384220l51165l18285l70669l57129k39274k50320k34351j48191j24570j11827
3568F878439o4556j13250n5481k5008r2458j15708j1017l4357j05566o3314K9301
3557F227025n959M0359k2227J9569R0244J10081J12959j1013M7935L1024M8605
$$ plain form
3546 6688602 6689555 6728710 6757797 6820160 6935890 7091481 7233325 7418077 7550200 7779383 8087243
3535 8087243 8353570 8741755 9153470 9518934 9817069 10145010 10380736 10581468 10751845 10917770
3525 10917770 11066394 11159616 11259616 11365697 11419320 11548608 11705035 11770001 11818292 11865416
3515 11865416 11988365 12042911 11984307 11952241 11834223 11627387 11491269 11301122 11136400 11041711
3505 11041711 10968513 10956589 10882550 11034821 11277909 11570937 11856719 12345851 12956107 13621741
3495 13621741 14459091 15378195 16500667 17707713 19209694 20902935 22825742 25068754
3487 25068754 27503451 30203310 33225496 36401816 39949546 43795975 48010372 52520223
3479 52520223 57384449 62648242 68189335 74069014 80134730 86227296 92234741 98028993
$$ packed form
3546F688602R53L9155K9087O2363J15730J55591J41844J84752J32123K29183L07860
3535H087243K66327L88185M11715L65464K98135L27941K35726K00732J70377J65925
3525A0917770J48624R3222J00000J06081N3623J29288J56427O4966M8291M7124
3515A1865416J22949N4546n8604l2066j18018k06836j36118j90147j64722r4689
3505A1041711p3198j1924p4039J52271K43088K93028K85782M89132O10256O65634
3495A3621741Q37350R19104J122472J207046J501981J693241J922807K243012
3487B5068754K434697K699859L022186L176320L547730L846429M214397M509851
3479E2520223M864226N263793N541093N879679O065716O092566O007445N794252
$$ plain form
3471 98028993 103491500 108569254 113101845 116976340 120312794 123235129 125811795 128112946
3463 128112946 130262916 132106568 133768186 135066879 135834872 135926553 135334175 134016131 131870166
3454 131870166 128953607 125300217 121031304 116335935 111247898 105912267 100428652 94978433
3446 94978433 89600828 84490334 79679791 75238389 71596527 68686155 66793653 66039611
3438 66039611 66515494 68338204 71378273 75603628 80852598 86768825 93193083 99703162
3430 99703162 105825137 111239223 115733591 119058115 121246992 122495984 122717207 122043538
3422 122043538 120828748 119193883 117614670 116096142 114799096 113904062 113417595 113248393
3414 113248393 113274366 113304365 113173014 112711678 111645462 109786006 107104716 103665951 99310355
$$ packed form
3471I8028993N462507N077754M532591L874495L336454K922335K576666K301151
3463A28112946K149970J843652J661618J298693P67993R1681n92378j318044k145965
3454A31870166k916559l653390m268913m695369n088037n335631n483615n450219
3446I4978433n377605n110494m810543m441402l641862k910372j892502p54042
3438F6039611M75883J822710L040069M225355N248970N916227O424258O510079
3430I9703162O121975N414086M494368L324524K188877J248992K21223o73669
3422A22043538j214790j634865j579213j518528j297046q95034m86467j69202
3414A13248393K5973K9999j31351m61336j066216j859456k681290l438765m355596
$$ plain form
3405 99310355 94262249 88699537 82821760 76888049 71009737 65325398 59937505 54911883
3397 54911883 50237568 45933585 42103250 38614030 35462817 32663500 30168610 28026470
3389 28026470 26090847 24396646 22911121 21612633 20432013 19419486 18609343 17952436
3381 17952436 17294223 16753241 16306161 16051812 15769309 15447311 15245925 15166348 15127837 15169936
3371 15169936 15331559 15534171 15745495 16120984 16676318 17303416 18036475 18771207 19568894
3362 19568894 20294048 20940581 21630906 22320059 22792735 23140889 23353505 23380772 23216324 22796762
3352 22796762 22273527 21823069 21253334 20605268 19825756 19060844 18242255 17300211 16299103
3343 16299103 15326569 14372381 13548939 12759348 12117858 11588419 11067493 10723061 10524777
$$ packed form
3405I9310355n048106n562712n877777n933711n878312n684339n387893n025622
3397E4911883m674315m303983l830335l489220l151213k799317k494890k142140
3389B8026470j935623j694201j485525j298488j180620j012527q10143o56907
3381A7952436o58213n40982m47080k54349k82503l21998k01386p9577l8511M2099
3371A5169936J61623K02612K11324L75489N55334O27098P33059P34732P97687
3362A9568894P25154O46533O90325O89153M72676L48154K12616K7267j64448m19562
3352B2796762n23235m50458n69735o48066p79512p64912q18589r42044j001108
3343A6299103r72534r54188q23442p89591o41490n29439n20926l44432j98284
$$ plain form
3334 10524777 10362409 10293003 10208001 10168065 10186486 10265189 10383376 10515556 10746631 10944422
3324 10944422 11169037 11497531 11942668 12436642 13057220 13839351 14764583 15792637 17100799
3315 17100799 18677465 20628957 23062214 25961503 29516711 33841879 38760450 44371310
3307 44371310 50538543 57141959 64008703 70907786 77735687 84282054 90172944 95031232
3299 95031232 98524028 100479008 100762406 99356241 96338497 91943570 86463617 80083394
3291 80083394 73174968 66104122 59176048 52574246 46482238 40939648 35982332 31689812
3283 31689812 28077238 24950323 22243782 20006003 18087980 16549842 15200745 14086273
3275 14086273 13086132 12205648 11446919 10802959 10318943 9791002 9419741 9041051 8639353
$$ packed form
3334A0524777j62368o9406q5002l9936J8421P8703J18187J32180K31075J97791
3324A0944422K24615L28494M45137M93974O20578P82131R25232J028054J308162
3315A7100799J576666J951492K433257K899289L555208M325168M918571N610860
3307D4371310O167233O603416O866744O899083O827901O546367N890890M858288
3299I5031232L492796J954980K83398j406165l017744m394927n479953o380223
3291H0083394o908426p070846o928074o601802o092008n542590m957316m292520
3283C1689812l612574l126915k706541k237779j918023j538138j349097j114472
3275A4086273j000141q80484p58729o43960m84016n27941l71261l78690m01698
$$ plain form
3266 8639353 8226796 7918179 7628275 7392247 7173515 7036534 6865244 6656799 6471894 6250745
3256 6250745 6058241 5969127 5884887 5856945 5810027 5745171 5723314 5718755 5746377 5713509 5677386
3245 5677386 5700370 5733039 5771204 5792338 5837208 5736858 5676909 5591988 5453509 5256146 5054411
3234 5054411 4858347 4693058 4557997 4376091 4248427 4139188 4042208 3900108 3884434 3822337
3224 3822337 3782191 3745222 3645462 3421273 3345838 3367488 3264660 3249537 3219832 3157856 3153090
3213 3153090 3048299 3001546 2989452 3021765 2988785 2991710 3062834 3112038 3146230 3141095 3098209 3187262
3201 3187262 3277184 3259352 3231830 3303800 3295162 3254405 3293523 3269480 3233000 3288707 3395235
3190 3395235 3433547 3476898 3577902 3613773 3680407 3735407 3747712 3705532 3697336 3763469 3786009
$$ packed form
3266H639353m12557l08617k89904k36028k18732j36981j71290k08445j84905k21149
3256F250745j92504q9114q4240k7942m6918o4856k1857m559K7622l2868l6123
3245E677386K2984L2669L8165K1134M4870j00350n9949q4921j38479j97363k01735
3234E054411j96064j65289j35061j81906j27664j09239r6980j42100j5674o2097
3224C822337m0146l6969r9760k24189p5435K1650j02828j5123k9705o1976m766
3213C153090j04791m6753j2094L2313l2980K925P1124M9204L4192n135m2886Q9053
3201C187262Q9922j7832k7522P1970q638m0757L9118k4043l6480N5707J06528
3190C395235L8312M3351J01004L5871O6634N5000J2305m2180q196O6133K2540
$$ plain form
3179 3786009 3678975 3607711 3519359 3519607 3541443 3546980 3467817 3399582 3469597 3597966 3639812 3651338
3167 3651338 3649672 3655100 3677304 3690095 3703845 3726187 3801064 3772211 3743090 3833910 3943906 4028069
3155 4028069 4106687 4145936 4278231 4409974 4537988 4673049 4884912 5217232 5570820 5781205
3145 5781205 5962678 6083132 6054739 5980492 5932203 5883151 5912616 5883968 5995484 6121282 6259959
3134 6259959 6363265 6610758 6778831 7064373 7406949 7703358 7979389 8149464 8319962 8360039
3124 8360039 8301661 8237408 8257423 8181029 8261010 8360616 8560041 8705299 8936001 9194463 9257802
3113 9257802 9438197 9461323 9520195 9466262 9386278 9374076 9420333 9554231 9713643 9913893 10259050
3102 10259050 10738977 11219311 11855241 12501293 13242967 14081004 14892612 15605426 16236100
$$ packed form
3179C786009j07034p1264q8352K48K1836N537p9163o8235P0015J28369M1846J1526
3167C651338j666N428K2204J2791J3750K2342P4877k8853k9121R0820J09996Q4163
3155D028069P8618L9249J32295J31743J28014J35061K11863L32320L53588K10385
3145E781205J81473J20454k8393p4247m8289m9052K9465k8648J11516J25798J38677
3134F259959J03306K47493J68073K85542L42576K96409K76031J70075J70498M0077
3124H360039n8378o4253K0015p6394P9981R9606J99425J45258K30702K58462O3339
3113I257802J80395K3126N8872n3933p9984j2202M6257J33898J59412K00250L45157
3102A0259050M79927M80334O35930O46052P41674Q38037Q11608P12814O30674
$$ plain form
3093 16236100 17026172 17835394 18599132 19608905 20805750 22217416 23955420 25978614 28448697
3084 28448697 31441215 35027606 39300691 44325865 50134774 56876481 64357312 72746470
3076 72746470 82615989 94750268 110709258 133052071 165176527 209935361 267231655
3069 267231655 330601133 387774548 427071508 443391273 438478899 415792936 379758936
3062 379758936 335927836 290022008 246316870 206722487 172386320 144039720 121647830
3055 121647830 104236975 90666249 79628455 70405749 62596911 55865475 50100611 45250088
3047 45250088 41149047 37801297 35005504 32585235 30493177 28718106 27069026 25617075
3039 25617075 24308492 23077730 21967421 20928058 20052938 19344150 18771851 18276253 17789908
$$ packed form
3093A6236100P90072Q09222P63738J009773J196845J411666J738004K023194K470083
3084B8448697K992518L586391M273085N025174N808909O741707P480831Q389158
3076G2746470R869519J2134279J5958990K2342813L2124456M4758834N7296294
3069B67231655O3369478N7173415L9296960J6319765m912374k2685963l6034000
3062C79758936m3831100m5905828m3705138l9594383l4336167k8346600k2391890
3055A21647830j7410855j3570726j1037794r222706p808838o731436n764864m850523
3047D5250088m101041l347750k795793k420269k092058j775071j649080j451951
3039B5617075j308583j230762j110309j039363q75120p08788n72299m95598m86345
$$ plain form
3030 17789908 17267775 16818946 16356244 15940456 15495166 14946776 14467075 13947160 13491098
3021 13491098 12997635 12464852 12011868 11655914 11377648 11030596 10740900 10556709 10269638
3012 10269638 10014772 9735102 9474817 9206277 8901364 8584460 8330450 8020815 7757883
3003 7757883 7471656 7218334 7006662 6779377 6610562 6487982 6353867 6279617 6247379 6150949
2993 6150949 6060690 5969988 5836404 5674121 5437661 5248753 5127288 4965536 4832845 4782233
2983 4782233 4712853 4593548 4494664 4436309 4423529 4386971 4331706 4270399 4304531 4234022 4198475
2972 4198475 4221162 4218418 4196714 4176720 4116978 4141607 4084667 3975308 3948369 3954582 3904864 3942436
2960 3942436 3896493 3826505 3737404 3620859 3625752 3535328 3365819 3278725 3207128 3085029 3017195
$$ packed form
3030A7789908n22133m48829m62702m15788m45290n48390m79701n19915m56062
3021A3491098m93463n32783m52984l55954k78266l47052k89696j84191k87071
3012A0269638k54866k79670k60285k68540l04913l16904k54010l09635k62932
3003G757883k86227k53322k11672k27285j68815j22580j34115p4250l2238r6430
2993F150949r0259r0702j33584j62283k36460j88908j21465j61752j32691n0612
2983D782233o9380j19305r8884n8355j2780l6558n5265o1307L4132p0509l5547
2972D198475K2687k744k1704j9994n9742K4629n6940j09359k6939O213m9718L7572
2960C942436m5943o9988q9101j16545M893r0424j69509q7094p1597j22099o7834
$$ plain form
2949 3017195 2917799 2785858 2781887 2762321 2653943 2732481 2758581 2669826 2678718 2606109 2493237
2938 2493237 2450100 2419646 2304278 2234598 2166406 2073049 1950705 1855207 1836681 1819487 1832828
2927 1832828 1740949 1712877 1740385 1772153 1800105 1839026 1774115 1722584 1759267 1748745 1740329 1779324
2915 1779324 1770022 1725550 1691323 1674720 1662875 1685657 1615818 1622327 1652734 1664395 1744856 1790773
2903 1790773 1856765 1837586 1841053 1903352 1977432 1936676 1803189 1807620 1787612 1801387 1828486 1774604
2891 1774604 1699154 1666036 1665508 1600113 1587033 1485082 1527288 1536537 1554936 1577491 1553500 1512627
2879 1512627 1512828 1478559 1476386 1579386 1587421 1562701 1532521 1515859 1552554 1555880 1454918 1409524
2867 1409524 1404052 1396567 1301217 1244123 1221080 1117756 1036651 971535 1044318 999820 913894 917100
$$ packed form
2949C017195r9396j31941l971j9566j08378P8538K6100q8755Q892p2609j12872
2938B493237m3137l0454j15368o9680o8192r3357j22344r5498j8526j7194J3341
2927A832828r1879k8072K7508L1768K7952L8921o4911n1531L6683j0522q416L8995
2915A779324r302m4472l4227j6603j1845K2782o9839O509L0407J1661Q0461M5917
2903A790773O5992j9179L467O2299P4080m0756j33487M431k0008J3775K7099n3882
2891A774604p5450l3118n28o5395j3080j01951M2206R249J8399K2555k3991m0873
2879A512627K01l4269k173J03000Q035k4720l0180j6662L6695L326j00962m5394
2867A409524n472p485r5350n7094k3043j03324q1105o5116P2783m4498q5926L206
$$ plain form
2855 917100 905783 926798 922223 893139 805355 763298 771953 825439 865527 862145 875615 890080
2843 890080 883747 934079 1013115 974814 990744 995950 1027980 1044275 1022348 1050059 1048388 1042037
2831 1042037 1014263 1002834 1008440 970665 1005685 967898 952667 928569 976088 1065132 1066792 1047169
2819 1047169 1018053 1073909 1040758 1023360 1057574 1031861 1027539 1050050 971508 1009166 1023493 984840
2807 984840 1023648 1049936 1044459 1071925 1045318 1021691 1021836 976095 1017083 1051190 1056433 1116626
2795 1116626 1076283 1116306 1226736 1335029 1344052 1446737 1690470 1966203 2208066 2438887
2785 2438887 2623678 2777686 2904624 2855577 2738768 2572201 2379716 2136991 1879854 1621592
2775 1621592 1568843 1509153 1351620 1213072 1097113 1052399 1034485 1080037 965373 984308 975971
$$ packed form
2855I17100j1317K1015m575k9084q7784m2057Q655N3486M0088l382J3470J4465
2843H90080o333N0332P9036l8301J5930N206L2030J6295k1927K7711j671o351
2831A042037k7774j1429N606l7775L5020l7787j5231k4098M7519Q9044J660j9623
2819A047169k9116N5856l3151j7398L4214k5713m322K2511p8542L7658J4327l8653
2807I84840L8808K6288n477K7466k6607k3627J45m5741M0988L4107N243O0193
2795A116626m0343M0023J10430J08293R023J02685K43733K75733K41863K30821
2785B438887J84791J54008J26938m9047j16809j66567j92485k42725k57137k58262
2775A621592n2749n9690j57533j38548j15959m4714j7914M5552j14664J8935q337
$$ plain form
2764 975971 975366 952749 896109 985301 940236 940840 1015426 994774 947891 908965 940924 940004 969575
2751 969575 990975 992396 939058 977974 983228 954604 901851 894627 891099 893101 870908 881269 876907
2738 876907 835705 849971 887598 846388 785095 776940 791966 669868 651450 626794 563134 614674
2726 614674 571331 591357 558996 522403 508156 483210 440927 415037 399324 468637 436840 460757
2714 460757 492988 591275 627683 579813 515396 471242 429083 521814 556466 524025 526121 584785
2702 584785 586324 599020 575922 568093 625438 681415 608707 623080 621611 618551 615820 625888 624368
2689 624368 610765 621944 579167 564296 536730 603078 541849 585333 685441 666869 802593
2678 802593 759568 716545 711411 724505 755455 747177 768243 782997 840535 904101 897809 780863
$$ packed form
2764I75971o05k2617n6640Q9192m5065O04P4586k0652m6883l8926L1959r20K9571
2751I69575K1400J421n3338L8916N254k8624n2753p224l528K002k2193J0361m362
2738H76907m1202J4266L7627m1210o1293q155J5026j22098j8418k4656o3660N1540
2726F14674m3343K0026l2361l6593j4247k4946m2283k5890j5713O9313l1797K3917
2714D60757L2231R8287L6408m7870o4417m4154m2159R2731L4652l2441K096N8664
2702E84785J539J2696k3098p829N7345N5977p2708J4373j469l060k731J0068j520
2689F24368j3603J1179m2777j4871k7566O6348o1229M3484J00108j8572J35724
2678H02593m3025m3023n134J3094L0950q278K1066J4754N7538O3566o292j16946
$$ plain form
2666 780863 722304 800185 900925 900581 810627 735773 688250 751874 824947 839413 784094 711126
2654 711126 643173 695750 652494 558276 638695 614290 545421 485015 479294 474146 393338 398179
2642 398179 429641 378881 387729 365618 460732 442896 404380 436953 483497 477381 562631 574019
2630 574019 465165 429938 421247 421411 447703 404566 434527 545697 522677 463327 431130 469500
2618 469500 502423 500156 516952 477860 504377 559845 530387 552014 573786 567683 613446 563949
2606 563949 543388 584136 626941 630207 670421 761569 706995 706643 670489 669004 658636 623753
2594 623753 589147 573405 591968 548543 539559 523278 532142 593206 614895 604869 643925 671936
2582 671936 725255 748827 807954 829713 893132 852242 751975 687259 639887 542035 532305 513824
$$ packed form
2666G80863n8559P7881J00740l44q9954p4854m7523O3624P3073J4466n5319p2968
2654G11126o7953N2577m3256r4218Q0419k4405o8869o0406n721n148q0808M841
2642C98179L1462n0760Q848k2111R5114j7836l8516L2573M6544o116Q5250J1388
2630E74019j08854l5227q691J64K6292m3137K9961J11170k3020n9350l2197L8370
2618D69500L2923k267J6796l9092K6517N5468k9458K1627K1772o103M5763m9497
2606E63949k0561M0748M2805L266M0214R1148n4574l52l6154j485j0368l4883
2594F23753l4606j5742J8563m3425q984j6281Q864O1064K1689j0026L9056K8011
2582F71936N3319K3572N9127K1759O3419m0890j00267o4716m7372r7852r730j8481
$$ plain form
2570 513824 479443 504897 510555 508257 468016 439099 386609 403881 449255 423590 413225 488577
2558 488577 488083 529180 528205 479574 484078 491610 512052 488230 543804 537247 516623 513812 429757
2545 429757 400805 432031 444263 415064 419763 429891 478529 492872 528322 535726 504207 493920
2533 493920 483662 511560 460702 441364 460297 479860 547375 561746 587469 612083 514838 515042
2521 515042 521941 506716 498339 511930 547802 574953 500918 435823 425772 402892 386359 399568
2509 399568 421888 417883 452843 461581 453549 429247 459450 423715 461869 398802 374550 391309
2497 391309 370428 390467 401504 373814 360703 364346 439690 468807 465935 404663 413270 484920
2485 484920 451076 433616 383296 427963 429531 436414 441183 467573 486242 468694 468850 483715 526629
$$ packed form
2570E13824l4381K5454N658k298m0241k8917n2490J7272M5374k5665j0365P5352
2558D88577m94M1097r75m8631M504P532K0442k3822N5574o557k0624k811q4055
2545D29757k8952L1226J2232k9199M699J0128M8638J4343L5450P404l1519j0287
2533D93920j0258K7898n0858j9338J8933J9563O7515J4371K5723K4614r7245K04
2521E15042O899j5225q377J3591L5872K7151p4035o5095j0051k2880j6533J3209
2509C99568K2320m005L4960Q738q032k4302L0203l5735L8154o3067k4252J6759
2497C91309k0881K0039J1037k7690j3111L643P5344K9117k872o1272Q607P1650
2485D84920l3844j7460n0320M4667J568O883M769K6390J8669j7548J56J4865M2914
$$ plain form
2472 526629 478279 452320 517095 490839 452166 428644 421243 450906 449085 533927 521796 519646
2460 519646 556789 535306 515771 482297 513081 498303 466118 490707 466835 492338 530593 506168
2448 506168 528879 564433 527436 512414 478928 479479 435856 468642 476640 437887 441327 432999 435446
2435 435446 473437 504579 510601 436782 407040 439443 413155 381762 414528 370762 396839 395628
2423 395628 454581 525012 445884 416012 466327 555113 513966 431509 450572 491931 451162 463957
2411 463957 438853 442918 476864 466533 450239 503950 486480 480125 578050 601932 593923 526587
2399 526587 557199 609203 662123 645213 670381 621027 688828 680047 691485 742893 648675 588007
2387 588007 567330 651349 638388 656346 684642 726633 727223 746723 701105 679156 679988 787059
$$ packed form
2472E26629m8350k5959O4775k6256l8673k3522p401K9663j821Q4842j2131k150
2460E19646L7143k1483j9535l3474L0784j4778l2185K4589k3872K5503L8255k4425
2448E06168K2711L5554l6997j5022l3486N51m3623L2786P998l8753L440q328K447
2435D35446L7991L1142O022p3819k9742L2403k6288l1393L2766m3766K6077j211
2423C95628N8953P0431p9128k9872N0315Q8786m1147q2457J9063M1359m0769J2795
2411D63957k5104M065L3946j0331j6294N3711j7470o355R7925K3882q009o7336
2399E26587L0612N2004N2920j6910K5168m9354O7801q781J1438N1408r4218o0668
2387E88007k0677Q4019j2961J7958K8296M1991N90J9500m5618k1949Q32J07071
$$ plain form
2375 787059 766792 787443 856064 847163 772581 771574 768577 731858 738695 734786 745254 795573 805146
2362 805146 852310 952097 1018145 982890 918437 903189 909460 899772 899608 858774 867723 886536 966105
2349 966105 1018024 1067555 1119680 1210434 1274546 1441485 1507435 1526130 1671564 1771100 1850048
2338 1850048 1973024 2108895 2241149 2406346 2631835 2979687 3445476 4101139 4897543 5654644
2328 5654644 6304202 6803648 7393837 7887733 8534249 9413541 10635952 12289793 14660186
2319 14660186 18239693 24381979 34315346 49171938 65715828 78570317 83611238 82678386
2311 82678386 79047853 71227455 61356094 51387227 42421841 34718954 27815338 22033701
2303 22033701 17978360 15230623 13541713 12376294 11581678 10721503 9781835 8968422 8268011
$$ packed form
2375G87059k0267K0651O8621q901p4582j007k997l6719O837l909J0468N0319R573
2362H05146M7164R9787O6048l5255o4453j5248O271r688j64m0834Q949J8813P9569
2349I66105N1919M9531N2125R0754O4112J66939O5950J8695J45434R9536P8948
2338A850048J22976J35871J32254J65197K25489L47852M65789O55663P96404P57101
2328E654644O49558M99446N90189M93896O46516Q79292J222411J653841K370393
2319A4660186L579507O142286R933367J4856592J6543890J2854489N040921r32852
2311H2678386l630533p820398r871361r968867q965386p702887o903616n781637
2303B2033701m055341k747737j688910j165419p94616q60175r39668q13413p00411
$$ plain form
2294 8268011 7470711 6801488 6288628 5845440 5411020 5085106 4720231 4502195 4237283 4047763
2284 4047763 3936553 3709778 3555237 3467488 3368035 3302605 3161448 3129636 3040868 2900256
2274 2900256 2882956 2835469 2789711 2667875 2612848 2475185 2401458 2350937 2307598 2212241 2157165
2263 2157165 2066933 1993855 1952400 1881244 1878557 1835659 1791574 1784580 1786024 1737911 1698001 1616650
2251 1616650 1539762 1556054 1531016 1465938 1461430 1426034 1379340 1450339 1409847 1378705 1405777 1407768
2239 1407768 1379694 1366118 1323804 1219312 1197155 1214784 1126723 1079925 1112323 997243 905596
2228 905596 939820 959673 939015 970953 953451 863195 831751 850745 864732 849665 827943 875646
2216 875646 932532 858479 884357 880214 852574 867264 899005 885224 890400 848988 843913 862821
$$ packed form
2294H268011p97300o69223n12860m43188m34420l25914l64875k18036k64912j89520
2284D047763j11210k26775j54541q7749r9453o5430j41157l1812q8768j40612
2274B900256j7300m7487m5758j21836n5027j37663p3727n0521m3339r5357n5076
2263B157165r0232p3078m1455p1156k687m2898m4085o994J444m8113l9910q1351
2251A616650p6888J6292k5038o5078m508l5396m6694P0999m0492l1142K7072J991
2239A407768k8074j3576m2314j04492k2157J7629q8061m6798L2398j15080r1647
2228I05596L4224J9853k0658L1938j7502r0256l1444J8994J3987j5067k1722M7703
2216H75646N6886p4053K5878m143k7640J4690L1741j3781N176m1412n075J8908
$$ plain form
2204 862821 855094 766409 751426 783836 766432 662352 650325 687750 674895 676557 662271 635953
2192 635953 621511 601420 617083 597036 620934 649672 699198 690342 696501 693340 681840 601882
2180 601882 583384 600610 589700 644884 603020 588262 561193 533938 579203 675757 654617 612416
2168 612416 579093 536014 494995 490752 545804 524561 548493 530537 492976 486968 424673 477088
2156 477088 476907 471842 464793 440469 423506 439589 430888 487609 473285 462131 451866 386384 420809
2143 420809 451551 411702 447628 444395 383690 375876 403022 383590 400243 426818 426630 430509 369966
2130 369966 328204 332813 442251 416430 358121 376579 366277 360849 417908 491180 446280 436866
2118 436866 452800 445769 458726 411163 384373 353432 401219 450577 371585 347012 344288 406447
$$ packed form
2204H62821p727q8685j4983L2410j7404j04080j2027L7425j2855J662j4286k6318
2192F35953j4442k0091J5663k0047K3898K8738M9526q856O159l161j1500p9958
2180F01882j8498J7226j0910N5184m1864j4758k7069k7255M5265R6554k1140m2201
2168F12416l3323m3079m1019m243N5052k1243K3932j7956l7561o008o2295N2415
2156D77088j81n065p049k4324j6963J6083q701N6721j4324j1154j0265o5482L4425
2143D20809L0742l9849L5926l233o0705p814K7146j9432J6653K6575j88L879o0543
2130C69966m1762M609J09438k5821n8309J8458j0302n428N7059P3272m4900r414
2118D36866J5934p031J2957m7563k6790l0941M7787M9358p8992k4573k724O2159
$$ plain form
2106 406447 389732 374057 403179 434800 399529 408128 332619 335272 361507 339860 372699 323315
2094 323315 356550 378740 343723 318378 303986 362148 394780 421845 394644 300381 397086 513278
2082 513278 497441 428485 376486 363746 345111 329696 388409 355705 368556 317980 341042 341679
2070 341679 281952 266859 275182 254053 280419 275774 204613 248720 300467 262674 212942 260337
2058 260337 246863 228624 299884 243618 294769 365604 364017 369350 343071 418450 484081 489174
2046 489174 625858 745569 703139 703834 707272 731257 704738 643535 630011 513259 481898 545480
2034 545480 508008 444472 410425 351302 416624 402608 356522 369601 407187 442431 436923 390547
2022 390547 411868 436288 428112 417344 441695 452078 431041 396368 357375 382084 406326 378593
$$ packed form
2106D06447j6715j5675K9122L1621l5271Q599p5509K653K6235k1647L2839m9384
2094C23315L3235K2190l5017k5345j4392N8162L2632K7065k7201r4263R6705J16192
2082E13278j5837o8956n1999j2740j8635j5415N8713l2704J2851n0576K3062O37
2070C41679n9727j5093Q323k1129K6366m645p1161M4107N1747l7793m9732M7395
2058B60337j3474j8239P1260n6266N1151P0835j587N333k6279P5379O5631N093
2046D89174J36684J19711m2430O95L438K3985k6519o1203j3524j16752l1361O3582
2034E45480l7472o3536l4047n9123O5322j4016m6086J3079L7586L5244n508m6376
2022C90547K1321K4420q176j0768K4351J0383k1037l4673l8993K4709K4242k7733
$$ plain form
2010 378593 340763 314465 319150 301944 276205 298422 266879 310895 205559 212657 233216 309077
1998 309077 290124 356477 389338 387429 255887 199070 222479 157019 200168 252296 270162 280706
1986 280706 218227 264745 209076 229113 235071 233786 261545 273010 234404 210243 150223 199210
1974 199210 265450 242711 214994 188592 221443 225821 280258 246868 272937 300678 304358 250654
1962 250654 225095 259914 274037 239829 269397 303611 216194 186545 229021 303852 362052 247212
1950 247212 242105 242001 310132 339253 303051 322040 303946 314112 395168 379315 305860 251190
1938 251190 239347 255553 308837 323090 308991 264891 317961 309700 270857 288558 221528 250905
1926 250905 281244 227023 324252 296911 261674 169714 235694 264573 342784 316808 270899 303650
$$ packed form
2010C78593l7830k6298M685j7206k5739K2217l1543M4016j05336P098K0559P5861
1998C09077j8953O6353L2861j909j31542n6817K3409o5460M3149N2128J7866J0544
1986B80706o2479M6518n5669K0037N958j285K7759J1465l8606k4161o0020M8987
1974A99210O6240k2739k7717k6402L2851M378N4437l3390K6069K7741L680n3704
1962B50654k5559L4819J4123l4208K9568L4214q7417k9649M2476P4831N8200j14840
1950B47212n107j04O8131K9121l6202J8989j8094J0166Q1056j5853p3455n4670
1938B51190j1843J6206N3284J4253j4099m4100N3070q261l8843J7701o7030K9377
1926B50905L0339n4221R7229k7341l5237r1960O5980K8879P8211k5976m5909L2751
$$ plain form
1914 303650 278030 217283 219951 211955 203678 163845 200009 257605 247306 224223 214043 210960
1902 210960 197453 188119 167187 225817 207234 190901 213739 213346 232511 267409 225909 208913
1890 208913 239215 225102 190612 189938 249219 280972 245045 281232 301209 330186 277999 295912
1878 295912 306651 324516 330341 307315 309062 333068 297890 259093 237452 303146 241813 213847
1866 213847 176057 224557 213650 209326 227568 222239 275083 238147 210788 252676 255937 236227
1854 236227 264650 207324 196722 213158 164633 181964 250282 241777 236113 207679 194978 168272
1842 168272 129703 108846 126797 184792 243451 240656 254275 271798 204773 195910 205438 156758
1830 156758 187460 208432 168104 218945 158970 161266 162065 162722 220245 233642 180902 183031 217560
$$ packed form
1914C03650k5620o0747K668p996q277l9833L6164N7596j0299k3083j0180l083
1902B10960j3507r334k0932N8630j8583j6333K2838l93J9165L4898m1500j6996
1890B08913L0302j4113l4490o74N9281L1753l5927L6187J9977K8977n2187J7913
1878B95912J0739J7865N825k3026J747K4006l5178l8797k1641O5694o1333k7966
1866B13847l7790M8500j0907m324J8242n329N2844l6936k7359M1888L261j9710
1854B36227K8423n7326j0602J6436m8525J7331O8318q505n664k8434j2701k6706
1842A68272l8569k0857J7951N7995N8659k795J3619J7523o7025q863R528m8680
1830A56758L0702K0972m0328N0841n9975K296P99O57N7523J3397n2740K129L4529
$$ plain form
1817 217560 231777 153095 174782 242077 230426 257192 238935 191773 218030 227863 192642 230100
1805 230100 199363 265023 272454 323307 263258 234106 285120 299459 276943 262011 217591 178062
1793 178062 169637 248037 213967 206710 243554 189497 208668 212091 292650 259324 207330 196469
1781 196469 125226 85496 181624 200479 230686 164562 167672 206213 135300 131811 142391 128321
1769 128321 55114 73597 144740 70925 61746 65938 81414 137277 218348 201838 225093 199893
1757 199893 208101 232086 238178 217470 182200 253366 236211 243566 219441 180899 160196 196765
1745 196765 173043 112123 204409 236187 214491 194406 154305 201936 205899 191166 271246 246540
1733 246540 231788 275700 249918 238909 237297 271955 243362 175063 187205 233800 256416 262415
$$ packed form
1817B17560J4217p8682K1687O7295j1651K6766j8257m7162K6257R833l5221L7458
1805B30100l0737O5660P431N0853o0049k9152N1014J4339k2516j4932m4420l9529
1793A78062q425P8400l4070p257L6844n4057J9171L423Q0559l3326n1994j0861
1781A96469p1243l9730R6128J8855L0207o6124L110L8541p0913l489J0580j4070
1769A28321p3207J8483P1143p3815r179M192J5476N5863Q1071j6510K3255k5200
1757A99893Q208K3985O092k0708l5270P1166j7155P355k4125l8542k0703L6569
1745A96765k3722o0920R2286L1778k1696k0085m0101M7631L963j4733Q0080k4706
1733B46540j4752M3912k5782j1009j612L4658k8593o8299J2142M6595K2616N999
$$ plain form
1721 262415 261909 227952 221526 252932 202967 172595 124645 160671 208787 261130 238962 157557
1709 157557 176792 209452 207453 300687 240335 127019 186812 237458 236831 250780 186531 210519
1697 210519 176594 208417 185866 151801 157518 113774 159917 219010 196436 170246 93227 80943
1685 80943 50771 109539 168981 189753 173918 180544 203577 203728 259597 266106 249117 208540 275574
1672 275574 256547 207778 163616 158028 255655 224237 195754 246596 186130 250904 277036 273161
1660 273161 229024 226506 230954 162626 169764 182351 227015 222034 209360 312424 267896 209654
1648 209654 172185 221796 269111 207162 227571 254768 166645 165031 208743 171078 194100 247449
1636 247449 245006 102664 93931 136715 197857 169476 106149 109771 86947 167005 140391 174135
$$ packed form
1721B62415n06l3957o426L1406m9965l0372m7950L6026M8116N2343k2168q1405
1709A57557J9235L2660j999R3234o0352j13316N9793N0646o27J3949o4249K3988
1697B10519l3925L1823k2551l4065N717m3744M6143N9093k2574k6190p7019j2284
1685H0943l0172N8768N9442K0772j5835O626K3033J51N5869O509j6989m0577O7034
1672B75574j9027m8769m4162n588R7627l1418k8483N0842o0466O4774K6132l875
1660B73161m4137k518M448o8328P138J2587M4664m981j2674J03064m4528n8242
1648B09654l7469M9611M7315o1949K0409K7197q8123j614M3712l7665K3022N3349
1636B47449k443j42342q733M2784O1142k8381o3327L622k2824Q0058k6614L3744
$$ plain form
1624 174135 144838 163841 193627 151223 131645 180639 166158 200316 113781 103336 121677 119973
1612 119973 140949 161994 143455 123944 150195 137427 164789 194478 209267 225342 199770 194221
1600 194221 171992 160609 108869 126973 154546 145659 159748 174082 200592 213704 249966 219024
1588 219024 249302 254117 278669 239714 219408 208837 247370 198748 223194 277396 244949 216001
1576 216001 205441 159978 146001 168466 122739 41649 100619 120281 91302 87834 72790 141616
1564 141616 114238 70969 93962 145280 95236 106628 130217 81306 110162 126400 190900 174057
1552 174057 135954 152062 124292 112094 153296 105883 106917 145390 233127 209886 196740 198487
1540 198487 172796 92422 120924 140394 178634 161082 187550 240537 186213 244917 253058 207555
$$ packed form
1624A74135k9297J9003K9786m2404j9578M8994j4481L4158q6535j0445J8341j704
1612A19973K0976K1045j8539j9511K6251j2768K7362K9689J4789J6075k5572n549
1600A94221k2229j1383n1740J8104K7573q887J4089J4334K6510J3112L6262l0942
1588B19024L0278M815K4552l8955k0306j0571L8533m8622K4446N4202l2447k8948
1576B16001j0560m5463j3977K2465m5727q1090N8970J9662k8979l468j5044O8826
1564A41616k7378m3269K2993N1318n0044J1392K3589m8911K8856J6238O4500j6843
1552A74057l8103J6108k7770j2198M1202m7413J034L8473Q7737k3241j3146J747
1540A98487k5691q0374K8502J9470L8240j7552K6468N2987n4324N8704Q141m5503
$$ plain form
1528 207555 242287 206383 182390 243984 292527 265292 233803 262010 220779 218547 192610 182895
1516 182895 229424 235272 238577 313044 282059 236999 195997 199527 136355 108269 164064 232626
1504 232626 173574 127297 134750 111197 60656 48540 111620 156647 166404 209211 67482 69155
1492 69155 84287 101858 61856 104880 135563 98669 110590 51161 69563 79988 77515 88845
1480 88845 123598 115726 146152 137420 88741 76992 146724 161665 69626 110992 195810 213267
1468 213267 181157 195674 200781 189317 170106 138455 137515 196630 292066 233610 210460 224186
1456 224186 197828 229316 221009 208409 200451 200322 230792 221286 218431 193841 145175 170768 235053
1443 235053 223829 274093 182800 182126 231943 258283 208040 173668 159207 170232 119920 106166
$$ packed form
1528B07555L4732l5904k3993O1594M8543k7235l1489K8207m1231k232k5937r715
1516A82895M6529N848L305P4467l0985m5060m1002L530o3172k8086N5795O8562
1504B32626n9052m6277P453k3553n0541j2116O3080M5027R757M2807j41729J673
1492F9155J5132J7571m0002M3024L0683l6894J1921n9429J8402J0425k473J1330
1480H8845L4753p872L0426q732m8679j1749O9732J4941r2039M1366Q4818J7457
1468B13267l2110J4517N107j1464j9211l1651r40N9115R5436n8456k3150J3726
1456B24186k6358L1488q307j2600p958j29L0470r506k855k4590m8666K5593O4285
1443B35053j1224N0264r1293o74M9817K6340n0243l4372j4461J1025n0312j3754
$$ plain form
1431 106166 161856 159873 166709 155662 156170 106581 110774 120916 100056 152306 56419 -7724 85826
1418 85826 155892 128324 97855 131508 135861 5642 -24227 66662 69174 67517 55005 132514
1406 132514 116185 65295 141584 152739 223157 199889 132943 159189 177675 161982 170328 129103
1394 129103 93444 115946 156646 231183 188194 128460 134051 175883 149257 211793 169690 139634
1382 139634 198029 253643 228166 211251 263082 172646 180917 178040 178389 156544 175754 217459
1370 217459 167800 220354 193710 145659 167781 188856 171296 176235 127231 159742 107320 117229
1358 117229 145834 81297 85249 117861 91287 59894 72405 21466 63320 66694 73860 68569
1346 68569 62123 55449 58662 89205 78360 83333 76294 52798 53638 21768 54251 47508 -10229
$$ packed form
1431A06166N5690j983O836j1047N08m9589M193J0142k0860N2250r5887o4143R3550
1418H5826P0066k7568l0469L3653M353j30219k9869R0889K512j657j2512P7509
1406A32514j6329n0890P6289J1155P0418k3268o6946K6246J8486j5693Q346m1225
1394A29103l5659K2502M0700P4537m2989n9734N591M1832k6626O2536m2103l0056
1382A39634N8395N5614k5477j6915N1831r0436Q271k877L49k1845J9210M1705
1370B17459m9659N2554k6644m8051K2122K1075j7560M939m9004L2511n2422R909
1358A17229K8605o4537L952L2612k6574l1393J2511n0939M1854L374P166n291
1346F8569o446o674L213L0543j0845M973p039k3496Q40l1870L2483o743n7737
$$ plain form
1333 -10229 6417 22734 71912 112072 146628 164439 178668 148646 83485 48168 86246 143717
1321 143717 131120 56992 32664 170563 143714 127996 146643 122110 211564 262667 167746
1310 167746 139424 200798 282585 297734 190324 230075 251953 249984 222907 236756 168519 195916
1298 195916 132002 119050 177695 139095 112619 205841 176966 153704 101742 71469 75067 51069
1286 51069 82041 128549 164275 198413 173196 119259 124793 37528 -33655 -6151 90079 162984
1274 162984 178347 139253 57384 59542 136127 119916 133430 119059 122309 92884 105855 152647
1262 152647 163263 64874 57871 132596 142284 139388 122037 108138 157363 122879 131002 93845
1250 93845 67124 123014 121558 164741 187659 189390 192755 157144 210733 193681 229320 207851
$$ packed form
1333a0229J6646J6317M9178M0160L4556J7811J4229l0022o5161l5317L8078N7471
1321A43717j2597p4128k4328J37899k6849j5718J8647k4533Q9454N1103r4921
1310A67746k8322O1374Q1787J5149j07410L9751K1878j969k7077J3849o8237K7397
1298A95916o3914j2952N8645l8600k6476R3222k8875k3262n1962l0273L598k3998
1286E1069L0972M6508L5726L4138k5217n3937N534q7265p1183K7504R6230P2905
1274A62984J5363l9094q1869K158P6585j6211J3514j4371L250k9425J2971M6792
1262A52647J0616r8389p003P4725R688k896j7351j3899M9225l4484Q123l7157
1250I3845k6721N5890j456M3183K2918J731L365l5611N3589j7052L5639k1469
$$ plain form
1238 207851 170977 172884 177384 153271 177760 179101 199041 210853 223100 248370 228224 240289
1226 240289 223474 234724 234037 205595 202398 141695 131406 177592 91266 58228 117898 152020
1214 152020 178427 133567 130684 151908 124727 111627 110218 76713 141322 177074 209343 197908
1202 197908 106052 113069 135094 157647 152636 87397 94572 142352 134330 111875 92863 129069
1190 129069 64282 35338 51519 119552 152332 130822 184660 187082 102595 95182 83732 145577
1178 145577 75103 96458 174484 133735 132939 132056 143902 134383 136382 176568 146399 118051 172219
1165 172219 162187 106092 191844 191509 155178 192941 191948 170040 109692 91800 95004 141037 154568
1152 154568 132938 141506 164729 140926 112249 128934 184477 126699 111927 144323 48106 97531
$$ packed form
1238B07851l6874J907M500k4113K4489J341J9940J1812J2247K5270k0146J2065
1226B40289j6815J1250o87k8442l197o0703j0289M6186q6326l3038N9670L4122
1214A52020K6407m4860k883K1224k7181j3100j409l3505O4609L5752L2269j1435
1202A97908r1856P017K2025K2553n011o5239P175M7780q022k2455j9012L6206
1190A29069o4787k8944J6181O8033L2780k1510N3838K422q4487p413j1450O1845
1178A45577p0474K1355P8026m0749p96q83J1846r519J999M0186l0169k8348N4168
1165A72219j0032n6095Q5752l35l6331L7763r93k1908o0348j7892L204M6033J3531
1152A54568k1630Q568K3223k3803k8677J6685N5543n7778j4772L2396r6217M9425
$$ plain form
1140 97531 110674 92240 138017 137559 156610 111087 118324 118290 87533 86067 46594 73759 90481
1127 90481 109361 65110 117134 87793 93004 168775 160296 108376 30100 78900 88381 40946
1115 40946 20403 9867 39533 70418 106112 161070 100221 110249 106873 70571 100578 96631
1103 96631 105414 117470 119733 150606 102817 84349 195570 183052 209743 172188 161729 173475
1091 173475 57857 63475 36040 20785 106832 127491 97837 87906 126293 134800 139117 94612
1079 94612 44624 115170 178484 59508 92585 155978 78351 115639 97297 80738 125908 168656
1067 168656 122835 132936 171010 154075 92346 54410 4632 14618 59283 9397 5195 55249
1055 55249 32467 60013 45771 45193 93545 94902 132388 120990 83204 61699 53076 95754 68509
$$ packed form
1140I7531J3143j8434M5777m58J9051m5523P237l4l0757j466l9473K7165J6722
1127I0481J8880m4251N2024k9341N211P5771q479n1920p8276M8800R481m7435
1115D0946k0543j0536K9666L0885L5694N4958o0849J0028l376l6302L0007l947
1103I6631Q783J2056K263L0873m7789j8468J11221j2518K6691l7555j0459J1746
1091A73475j15618N618k7435j5255Q6047K0659k9654r931L8387Q507M317m4505
1079I4612m9988P0546O3314j18976L3077O3393p7627L7288j8342j6559M5170M2748
1067A68656m5821J0101L8074j6935o1729l7936m9778R986M4665m9886m202N0054
1055E5249k2782K7546j4242n78M8352J357L7486j1398l7786k1505q623M2678k7245
$$ plain form
1042 68509 104371 130015 80457 77790 105980 153853 187572 157204 142529 87226 37882 36916
1030 36916 48402 96896 144593 179692 173261 141583 176772 157034 163753 199052 128168 85462
1018 85462 93222 121798 134097 157865 96929 69301 80355 114456 72181 67568 75379 97741
1006 97741 30545 12612 43828 76969 108529 83505 21363 -15475 26226 -33762 35334 16457
994 16457 63698 108425 124272 145266 158237 178207 175804 135995 143580 167222 113085 95809
982 95809 153239 155015 180630 205064 194362 156421 103221 148842 116202 169801 120231 141050
970 141050 161037 87951 105463 144869 187227 173722 101560 81593 104625 130556 99927 49414
958 49414 122325 130424 126533 108419 50655 81388 68415 20985 35937 1452 21833 100853
$$ packed form
1042F8509L5862K5644m9558k667K8190M7873L3719l0368j4675n5303m9344r66
1030C6916J1486M8494M7697L5099o431l1678L5189j9738O719L5299p0884m2706
1018H5462P760K8576J2299K3768o0936k7628J1054L4101m2275m613P811K2362
1006I7741o7196j7933L1216L3141L1560k5024o2142l6838M1701n9988O9096j8877
994A6457M7241M4727J5847K0994J2971J9970k403l9809P585K3642n4137j7276
982I5809N7430J776K5615K4434j0702l7941n3200M5621l2640N3599m9570K0819
970A41050J9987p3086J7512L9406M2358j3505p2162j9967K3032K5931l0629n0513
958D9414P2911Q099l891j8114n7764L0733j2973m7430J4952l4485K0381P9020
$$ plain form
946 100853 107419 121381 102786 127100 167923 121670 78637 73968 85888 84444 99465 159217
934 159217 134113 94394 84796 91907 124166 88636 97008 105566 66118 30738 19407 111479 136929
921 136929 134320 189182 100493 114151 122821 154117 111562 64575 43063 98971 38752 83607
909 83607 150431 134300 164835 163082 192288 101700 174063 153635 112435 144582 167433 170839
897 170839 168616 104730 137132 92098 55917 70729 -16964 29100 80918 40509 101421 77375
885 77375 136761 115160 60399 66004 131629 77862 82403 117114 116060 119256 95435 88192 26425
872 26425 60040 77237 -25639 8475 19142 -19967 30204 44086 59303 -2205 2136 28662
860 28662 118692 141096 73984 96536 100389 68089 132013 122680 91986 101643 121628 130700 85108
$$ packed form
946A00853O566J3962j8595K4314M0823m6253m3033m669J1920j444J5021N9752
934A59217k5104l9719r598P111L2259l5530Q372Q558l9448l5380j1331R2072K5450
921A36929k609N4862q8689J3658Q670L1296m2555m6987k1512N5908o0219M4855
909H3607O6824j6131L0535j753K9206r0588P2363k0428m1200L2147K2851L406
897A70839k223o3886L2402m5034l6181J4812q7693M6064N1818m0409O0912k4046
885G7375N9386k1601n4761N605O5625n3767M541L4711j054L196k3821p243o1767
872B6425L3615J7197j02876L4114J0667l9109N0171J3882J5217o1508M341K6526
860B8662R0030K2404o7112K2552L853l2300O3924r333l0694R657J9985R072m5592
$$ plain form
847 85108 116627 137849 56021 173331 253404 267602 238492 173011 132599 39869 61971 78963
835 78963 41932 96417 170502 150612 196843 195693 181356 172199 65955 96191 25200 8075
823 8075 43525 77878 83182 114861 166049 77308 69271 60969 71995 68310 32535 -11907 5318
810 5318 47325 45991 163335 106506 10562 -20054 -6455 76507 89388 59935 8636 49225
798 49225 32643 -1428 78844 67873 48983 46500 -374 -23978 -44440 -49567 -49536 -21466 32633
785 32633 39303 18637 71911 67357 55398 71116 -14003 25906 62724 110095 100238 94116 57121
772 57121 129751 138188 102425 89473 130234 195148 142912 158952 149359 134634 144931 146288 234782
759 234782 185714 126039 157790 169737 235628 226297 209941 162180 93407 159318 199868 228101
$$ packed form
847H5108L1519K1222q1828J17310Q0073J4198k9110o5481m0412r2730K2102J6992
835G8963l7031N4485P4085j9890M6231j150j4337r157j06244L0236p0991j7125
823H075L5450L4353N304L1679N1188q8741q037q302J1026l685l5775m4442J7225
810E318M2007j334J17344n6829r5944l0616J3599Q2962J2881k9453n1299M0589
798D9225j6582l4071Q0272j0971j8890k483m6874k3604k0462n127L1K8070N4099
785C2633O670k0666N3274m554j1959J5718q5119L9909L6818M7371r857o122l6995
772E7121P2630Q437l5763j2952M0761O4914n2236J6040r593j4725J0297J357Q8494
759B34782m9068n9675L1751J1947O5891r331j6356m7761o8773O5911M0550K8233
$$ plain form
747 228101 160236 158000 183598 61874 129401 119147 72494 896 -4407 9443 57763 68198
735 68198 76045 29751 61065 54903 83828 106119 60213 35204 29461 -26642 9954 -44059 -89370
722 -89370 -94308 -44195 -3156 29947 31183 27880 49646 38732 10006 7254 82805 76883 35820
709 35820 41135 44655 96149 61868 83463 149414 93979 54694 109366 95844 92953 99642 95064
696 95064 115771 143650 195255 100566 71383 84363 86189 129572 137763 146018 176916 120448 111315
683 111315 87825 99869 153168 190009 156067 157264 149299 192580 125699 151513 147813 133543
671 133543 103049 93091 72572 50147 18918 104391 110089 109720 47770 52454 36866 3465 7915
658 7915 123873 94741 74824 63924 74975 72641 62879 29240 1941 43246 100943 138960
$$ packed form
747B28101o7865k236K5598j21724O7527j0254m6653p1598n303J3850M8320J0435
735F8198P847m6294L1314o162K8925K2291m5906k5009n743n6103L6596n4013m5311
722h9370m938N0113M1039L3103J236l303K1766j0914k8726k752P5551n922m1063
709C5820N315L520N1494l4281K1595O5951n5435l9285N4672j3522k891O689m578
696I5064K0707K7879N1605r4689k9183J2980J826M3383Q191Q255L0898n6468r133
683A11315k3490J2044N3299L6841l3942J197p965M3281o6881K5814l700j4270
671A33543l0494r958k0519k2425l1229Q5473N698l69o1950M684j5588l3401M450
658G915J15958k9132j9917j0900J1051k334r762l3639k7299M1305N7697L8017
$$ plain form
646 138960 56022 88538 48301 68550 24602 91620 54930 58745 130178 86234 17277 26725
634 26725 8510 51474 78332 102480 46005 63685 143033 159525 94731 145686 146946 139894
622 139894 189111 158317 170233 158552 101874 85348 136353 85587 46568 74912 122486 123492
610 123492 84344 89113 76896 148938 193870 166215 104651 174394 147764 64551 72334 103319
598 103319 128708 105097 103003 122448 82782 133048 166194 131457 123256 116781 97110 115047
586 115047 112334 53025 2150 16194 -21849 -4069 11387 -7195 -18938 28726 51589 50299
574 50299 37173 -1047 5082 -26758 -2449 14601 4007 -14246 54354 43368 46124 67149
562 67149 83287 101333 118414 104485 124875 131374 114658 108801 83500 94403 141308 129057
$$ packed form
646A38960q2938L2516m0237K0249m3948O7018l6690L815P1433m3944o8957R448
634B6725j8215M2964K6858K4148n6475J7680P9348J6492o4794N0955J260p052
622A39894M9217l0794J1916j1681n6678j6526N1005n0766l9019K8344M7574J006
610A23492l9148M769j2217P2042M4932k7655o1564O9743k6630q3213P783L0985
598A03319K5389k3611k094J9445l9666N0266L3146l4737q201o475j9671J7937
586A15047k713n9309n0875J4044l8043J7780J5456j8582j1743M7664K2863j290
574E0299j3126l8220O129l1840K4309J7050j0594j8253O8600j0986K756K1025
562F7149J6138J8046J7081j3929K0390O499j6716n857k5301J0903M6905j2251
$$ plain form
550 129057 89960 121784 124440 39519 141846 217639 198593 170857 231505 193573 178652 175508
538 175508 159119 196194 236014 167824 119267 109000 117561 167355 161889 110384 40200 93524
526 93524 51155 115365 171999 97184 111594 83346 67842 55347 28700 117427 129955 44858
514 44858 55109 70006 57090 16306 24374 37147 35997 40790 15038 -5337 -7680 12887 42190
501 42190 64927 -24388 -75641 -41361 -4354 22871 -15449 -33997 -14470 34800 50719 52258
489 52258 35662 25540 96747 89044 111455 131845 81456 49415 72537 40223 68179 98139
477 98139 89005 124175 129589 156883 213526 252449 207442 121910 125671 172450 145260 148056 122853
464 122853 105462 154903 173202 179837 147174 148938 141145 165098 142994 96172 96513 133209 64429
$$ packed form
550A29057l9097L1824K656q4921J02327P5793j9046k7736O0648l7932j4921l144
538A75508j6389L7075L9820o8190m8557j0267Q561M9794n466n1505p0184N3324
526I3524m2369O4210N6634p4815J4410k8248j5504j2495k6647Q8727J2528q5097
514D4858J0251J4897j2916m0784Q068J2773j150M793k5752k0375k343K0567K9303
501D2190K2737q9315n1253L4280L7007K7225l8320j8548J9527M9270J5919J539
489E2258j6596j0122P1207p703K2411K0390n0389l2041K3122l2314K7956K9960
477I8139r134L5170N414K7294N6643L8923m5007q5532L761M6779k7190K796k5203
464A22853j7391M9441J8299O635l2663J764p793K3953k2104m6822L41L6696o8780
$$ plain form
451 64429 83283 55796 8728 53717 60717 80129 46057 -3087 6005 30420 19100 27837 -18942
438 -18942 107769 100882 36144 61411 77130 28305 -30184 510 23472 24570 67249 -12831
426 -12831 -53190 3369 3952 62324 84098 42015 72098 50063 42747 12368 81382 109619 81662
413 81662 73246 32318 20152 49798 171804 132557 112964 126508 195663 184698 150802 110617
401 110617 106723 121093 126797 110343 67051 90693 51522 90495 151825 158098 115410 82265
389 82265 95944 63038 62153 27937 34304 19029 129644 125993 101355 38043 21438 58549 98113
376 98113 115375 109859 118172 105150 147667 114033 143762 133424 138908 186931 64066 47722
364 47722 -5750 -46862 20280 -6951 16141 23411 20708 73327 58631 31139 65775 32858
$$ packed form
451F4429J8854k7487m7068M4989P000J9412l4072m9144R092K4415j1320Q737m6779
438a8942J26711o887o4738K5267J5719m8825n8489L0694K2962J098M2679q0080
426a2831m0359N6559N83N8372K1774m2083L0083k2035p316l0379O9014K8237k7957
413H1662q416m0928j2166K9646J22006l9247j9593J3544O9155j0965l3896m0185
401A10617l894J4370N704j6454m3292K3642l9171L8973O1330O273m2688l3145
389H2265J3679l2906q85l4216O367j5275J10615l651k4638o3312j6605L7111L9564
376I8113J7262n516Q313j3022M2517l3634K9729j0338N484M8023j22865j6344
364D7722n3472m1112O7142k7231K3092P270k703N2619j4696k7492L4636l2917
$$ plain form
352 32858 99066 67991 74948 109787 67375 85439 44526 -10179 20326 54280 73656 51588
340 51588 -16164 11780 -2266 -7720 57016 72532 77377 49107 53189 48704 103678 86440 36379
327 36379 37803 102489 116401 109753 121009 74167 98678 130706 160679 90626 102606 150530
315 150530 180431 212410 177638 145424 129502 123852 73929 36836 33150 104534 117593 88335
303 88335 156688 66350 88554 63511 26600 33314 45384 118303 73446 94946 59826 34461
291 34461 -16826 12108 68554 57295 55431 24922 -27310 44821 23499 31892 64813 68127 13053
278 13053 -15852 -4567 35145 62778 60243 82331 41243 43033 19508 46783 129288 100323
266 100323 100402 112246 110167 112527 159147 176708 87282 44478 111136 35232 60866 44920 62576
$$ packed form
352C2858O6208l1075O957L4839m2412J8064m0913n4705L0505L3954J9376k2068
340E1588o7752K7944j4046n454O4736J5516M845k8270M082m485N4974j7238n0061
327C6379J424O4686J3912o648J1256m6842K4511L2028K9973p0053J1980M7924
315A50530K9901L1979l4772l2214j5922n650m9923l7093l686P1384J3059k9258
303H8335O8353r0338K2204k5043l6911O714J2070P2919m4857K1500l5120k5365
291C4461n1287K8934N6446j1259j864l0509n2232P2131k1322Q393L2921L314n5074
278A3053k8905J1285L9712K7633k535K2088m1088J790k3525K7275Q2505k8965
266A00323P9J1844k079K360M6620J7561q9426m2804O6658p5904K5634j5946J7656
$$ plain form
253 62576 97399 44814 45610 74014 115387 110347 66751 61164 102512 53477 71356 51610 57091
240 57091 36936 75324 92647 43781 53734 85975 87003 62845 87303 126329 171866 117315
228 117315 40835 21863 119057 125983 63537 83210 78958 81612 51715 43533 62392 94116 100987
215 100987 44077 33601 47987 41593 28494 94053 16237 -58118 1485 -16813 -16139 -15657 46359
202 46359 3930 10363 -45252 12951 -56622 -62114 -68900 -55999 -43219 1052 4907 46752 132069
189 132069 134499 122210 102335 60184 84139 77451 69263 65068 60179 96835 47269 58215 40959
176 40959 -21773 -47346 -46376 -9725 -10593 -741 45259 94041 78627 87524 2910 3082 -13859 -28243
162 -28243 83579 47269 -5908 -3816 21306 23148 34423 -21213 -15342 -14139 32437 69175 24164
$$ packed form
253F2576L4823n2585P96K8404M1373n040m3596n587M1348m9035J7879j9746N481
240E7091k0155L8388J7323m8866R953L2241J028k4158K4458L9026M5537n4551
228A17315p6480j8972R7194O926o2446J9673m252K654k9897q182J8859L1724O871
215A00987n6910j0476J4386o394j3099O5559p7816p4355N9603j8298O74M82O2016
202D6359m2429O433n5615N8203o9573n492o786J2901J2780M4271L855M1845Q5317
189A32069K430j2289j9875m2151K3955o688q188m195m889L6656m9566J0946j7256
176D0959o2732k5573R70L6651q68R852M6000M8782j5414Q897q4614J72j6941j4384
162b8243J11822l6310n3177K092K5122J842J1275n5636N871J203M6576L6738m5011
$$ plain form
149 24164 -7474 13600 44896 41390 -15305 -17136 -43391 21418 59344 -8464 -23052 32639
137 32639 -13492 -31405 -102745 -33370 -4893 -15043 39944 35355 30888 58846 20468 284
125 284 12788 20783 -2650 6993 36592 -31035 -11472 -33649 -62414 -13546 -2180 13371 13456
112 13456 -12735 -60184 -49606 -12028 -27509 -134413 -76985 -81062 -34402 33875 22592 91213
100 91213 76812 10908 34959 45004 -34711 -36850 -49223 -13845 18276 34564 35748 -9094
88 -9094 -32508 -62127 -17706 -47684 -128759 -103909 -59448 -69693 -63941 -48954 -62367 -41410 -15705
75 -15705 -29578 -50872 -6943 -43465 -78517 -46731 -27787 -81940 -111458 -91952 -73535 -107025
63 -107025 -83899 -110136 -122032 -68118 -18030 -29426 3295 28839 -56051 -85203 -80651 -115127
$$ packed form
149B4164l1638K1074L1296l506n6695j831k6255O4809L7926o7808j4588N5691
137C2639m6131j7913p1340O9375K8477j0150N4987m589m467K7958l8378k0184
125B84J2504P995k3433R643K9599o7627J9563k2177k8765M8868J1366J5551Q5
112A3456k6191m7449J0578L7578j5481j06904N7428m077M6660O8277j1283O8621
100I1213j4401o5904K4051J0045p9715k139j2373L5378L2121J6288J184m4842
88i094k3414k9619M4421k9978q1075K4850M4461j0245N752J4987j3413K0957K5705
75a5705j3873k1294M3929l6522l5052L1786J8944n4153k9518J9506J8417l3490
63a07025K3126k6237j1896N3914N0088j1396L2721K5544q4890k9152M552l4476
$$ plain form
51 -115127 -90156 -71523 -45703 -38624 -70921 -60194 -101428 -103707 -83110 -103888 -98928 -73338 -57255
38 -57255 -124895 -150595 -106514 -85324 -97788 -89943 -105186 -92538 -37333 -93076 -102365 -88682 -98958
25 -98958 -160083 -170385 -144141 -113982 -109680 -120505 -157510 -160515 -130100 -165194 -174624 -160059 -152477
12 -152477 -150089 -129233 -122873 -105001 -114012 -99051 -82110 -78741 -69460 -81402 -146204 -159082
0 -159082
$$ packed form
51a15127K4971J8633K5820P079l2297J0727m1234k279K0597k0778M960K5590J6083
38e7255o7640k5700M4081K1190j2464P845j5243J2648N5205n5743r289J3683j0276
25i8958o1125j0302K6244L0159M302j0825l7005l005L0415l5094r430J4565P582
12a52477K388K0856O360J7872r011J4961J6941L369R281j1942o4802j2878
0a59082
$$ Imaginary data points
##PAGE= N=2
##DATA TABLE= (X++(I..I)), XYDATA
$$ plain form
16383 -1164046 -1115525 -1084062 -1083392 -1067988 -1024621 -979442 -1021057 -1044509 -1038051 -966976 -931315 -910880
16371 -910880 -906862 -868920 -873108 -904728 -921840 -894339 -890258 -868895 -816224 -844766 -827588 -792875
16359 -792875 -779146 -793810 -777190 -760828 -734887 -711823 -717505 -684496 -667189 -638187 -670019 -660922
16347 -660922 -620664 -613684 -595999 -588906 -581806 -583146 -538550 -519847 -510352 -503423 -539819 -525272 -494402
16334 -494402 -506075 -450953 -445937 -436045 -413306 -430774 -422269 -410096 -399751 -409579 -429189 -407973
16322 -407973 -376201 -377460 -353418 -321550 -305352 -267942 -237380 -194613 -238171 -270741 -298887 -249287
16310 -249287 -188764 -149585 -143189 -49162 -46238 -92236 -89997 -75062 -103559 -104166 -75641 -109246
16298 -109246 -48629 -12220 7167 85227 68632 35696 57840 65014 83785 75744 52588 100117
$$ packed form
16383a164046M8521L1463O70J5404M3367M5179m1615k3452O458P1075L5661K0435
16371i10880M018L7942m188l1620j7112K7501M081K1363N2671k8542J7178L4713
16359g92875J3729j4664J6620J6362K5941K3064n682L3009J7307K9002l1832R097
16347f60922M0258O980J7685P093P100j340M4596J8703R495O929l6396J4547L0870
16334d94402j1673N5122N016R892K2739j7468Q505J2173J0345r828j9610K1216
16322d07973L1772j259K4042L1868J6198L7410L0562M2767m3558l2570k8146M9600
16310b49287O0523L9179O396R4027K924m5998K239J4935k8497o07K8525l3605
16298a09246O0617L6409J9387P8060j6595l2936K2144P174J8771q041k3156M7529
$$ plain form
16286 100117 88898 102742 145637 165949 207683 133924 62682 151177 197701 175749 176074 150647
16274 150647 185711 241973 271484 236812 234089 242801 240671 226480 211991 202444 250470 192381
16262 192381 242035 292867 246985 232540 294979 326376 277199 288355 299352 350320 346117 349139
16250 349139 392954 397413 395271 436668 406297 393951 464048 446889 436465 419142 419471 433207
16238 433207 495760 528116 525564 500499 496566 548150 518582 577150 504249 498522 585510 600363
16226 600363 577068 595629 594581 643135 614909 624825 628478 637577 646075 592338 624358 639568
16214 639568 670515 703009 740509 746671 757748 708112 693424 688517 696589 699599 710707 728037
16202 728037 745869 690696 690773 724500 768082 749100 730008 758558 764645 791186 766281 749930
$$ packed form
16286A00117j1219J3844M2895K0312M1734p3759p1242Q8495M6524k1952L25k5427
16274A50647L5064N6262K9511l4672k723Q712k130j4191j4489r547M8026n8089
16262A92381M9654N0832m5882j4445O2439L1397m9177J1156J0997N0968m203L022
16250C49139M3815M459k142M1397l0371j2346P0097j7159j0424j7323L29J3736
16238D33207O2553L2356k552k5065l933N1584k9568N8568p2901n727Q6988J4853
16226F00363k3295J8561j048M8554k8226R916L653R099Q498n3737L2020J5210
16214F39568L0947L2494L7500O162J1077m9636j4688m907Q072L010J1108J7330
16202G28037J7832n5173P7L3727M3582j8982j9092K8550O087K6541k4905j6351
$$ plain form
16190 749930 720648 763694 833996 746218 731234 758501 763240 771918 774193 719811 704382 743206
16178 743206 817312 778884 714529 705138 687422 767769 774486 773735 810784 759832 828892 793986
16166 793986 817975 837137 808802 833753 879388 816731 874244 915352 842355 856005 843421
16155 843421 790845 828470 905902 913144 927590 997988 980837 992834 975560 1029746 1099016 1063125
16143 1063125 994609 982753 939416 970219 1032178 1011785 1028348 995331 1024793 964990 998058
16132 998058 1044066 1034371 954998 951331 915069 942627 904608 893112 900165 978275 942522 992318
16120 992318 1019087 969981 965160 985175 937994 884586 929960 942855 995866 974569 937406 930875
16108 930875 928351 949351 912086 954277 924113 845423 872832 894100 873116 915047 903454 953340
$$ packed form
16190G49930k9282M3046P0302q7778j4984K7267M739Q678K275n4382j5429L8824
16178G43206P4106l8428o4355r391j7716Q0347O717p51L7049n0952O9060l4906
16166G93986K3989J9162k8335K4951M5635o2657N7513M1108p2997J3650j2584
16155H43421n2576L7625P7432P242J4446P0398j7151J1997j7274N4186O9270l5891
16143A063125o8516j1856m3337L0803O1959k0393J6563l3017K9462n9803L3068
16132I98058M6008r695p9373l667l6262K7558l8019j1496P053P8110l5753M9796
16120I92318K6769m9106m821K0015m7181n3408M5374J2895N3011k1297l7163o531
16108I30875k524K1000l7265M2191l0164p8690K7409K1268k0984M1931j1593M9886
$$ plain form
16096 953340 950923 949791 945693 902902 931509 971990 941138 907638 913198 980207 975170 935300
16084 935300 984329 1004627 982420 980215 949899 978537 1053608 1056670 1044854 1050834 1015449 969047
$$ packed form
16096I53340k417j132m098m2791K8607M0481l0852l3500N560O7009n037l9870
16084I35300M9029K0298k2207k205l0316K8638P5071L062j1816N980l5385m6402
$$ [...]
##END NTUPLES=NMR SPECTRUM
##END=
