##TITLE=1H_DE-80H_X3
 200.13MHz, d2o
 8 sc
 
 19ns.26.2.2025
##JCAMPDX= 6.0         $$ Bruker NMR JCAMP-DX V2.0
##DATA TYPE= NMR SPECTRUM
##DATA CLASS= NTUPLES
##ORIGIN= UXNMR, Bruker Analytische Messtechnik GmbH
##OWNER= pz
$$ XWIN-NMR		Version 3.5
$$ Thu Jul  2 10:45:37 2026 Russian Standard Time (UT+4h)  Yarkov@DPX200
##.OBSERVE FREQUENCY= 200.1313
##.OBSERVE NUCLEUS= ^1H
##.ACQUISITION MODE= SIMULTANEOUS
##.ACQUISITION SCHEME= undefined
##.AVERAGES= 8
##.DIGITISER RES= 18
##SPECTROMETER/DATA SYSTEM= spect
##.PULSE SEQUENCE= zg30
##.SOLVENT NAME= DMSO
##.SHIFT REFERENCE= (INTERNAL, DMSO, 0, 15.5023)
##AUDIT TRAIL= $$ (NUMBER, WHEN, WHO, WHERE, WHAT)
$$ ##TITLE= Audit trail, XWIN-NMR		Version 3.5
$$ ##JCAMPDX= 5.01
$$ ##ORIGIN= Bruker BioSpin GmbH
$$ ##OWNER= Yarkov
$$ C:/Bruker/XWIN-NMR/data/yarkov2/nmr/H-C/1/pdata/1/auditp.txt
$$ ##AUDIT TRAIL=  $$ (NUMBER, WHEN, WHO, WHERE, WHAT)
(   1,<2026-07-02 10:44:53.98 +0400>,<Yarkov>,<DPX200>,
      <created by zg, POWCHK disabled, PULCHK disabled
       configuration hash MD5:
       00 E9 B6 7A A2 85 ED C7 34 08 36 98 17 FE 4E 26
       data hash MD5: 16K
       E7 00 81 CA 0A DB D2 E8 37 5D E5 5D 72 89 A7 A5>)
(   2,<2026-07-02 10:44:59.06 +0400>,<Yarkov>,<DPX200>,
      <Start of raw data processing
       efp BC_mod = 2 LB = 0.25 FT_mod = 6 PKNL = 1 PHC0 = -6894.148 PHC1 = 6.42196 SI = 16K 
       data hash MD5: 16K
       6F A1 0E D5 20 87 37 87 E0 1B 99 F8 01 86 93 57>)
$$ ##END=
$$ 
$$ hash MD5
$$ C6 D4 E8 47 AA 1B F0 71 72 BD 29 60 91 DF 4E 09
##$RELAX= 
##$RELAX= 
##$RELAX= 
##$RELAX= 
##$RELAX= 
##$RELAX= 
$$ Bruker specific parameters
$$ --------------------------
##$DU= <C:/Bruker/XWIN-NMR>
##$EXPNO= 1
##$NAME= <H-C>
##$PROCNO= 1
##$TYPE= <nmr>
##$USER= <yarkov2>
##$AMP= (0..31)
100 100 100 100 100 100 100 100 100 100 100 100 100 100 100 100 100 100 
100 100 100 100 100 100 100 100 100 100 100 100 100 100 
##$AQSEQ= 0
##$AQ_mod= 1
##$AUNM= <au_zg>
##$AUTOPOS= <>
##$BF1= 200.13
##$BF2= 200.13
##$BF3= 200.13
##$BF4= 200.13
##$BF5= 200.13
##$BF6= 200.13
##$BF7= 200.13
##$BF8= 200.13
##$BYTORDA= 1
##$CFDGTYP= 0
##$CFRGTYP= 5
##$CHEMSTR= <none>
##$CNST= (0..31)
1 1 145 1 1 1 1 1 1 1 1 1 1 1 1 1 1 1 1 1 1 1 1 1 1 1 1 1 1 1 1 1 
##$CPDPRG= <>
##$CPDPRG1= <>
##$CPDPRG2= <>
##$CPDPRG3= <>
##$CPDPRG4= <mlev>
##$CPDPRG5= <mlev>
##$CPDPRG6= <mlev>
##$CPDPRG7= <mlev>
##$CPDPRG8= <mlev>
##$CPDPRGB= <>
##$CPDPRGT= <>
##$D= (0..31)
0 0.7 0 0 0 0 0 0 0 0 0 0.03 0 0 0 0 0 0 0 0 0 0 0 0 0 0 0 0 0 0 0 0 
##$DATE= 1782974693
##$DBL= (0..7)
120 120 120 120 120 120 120 120 
##$DBP= (0..7)
150 150 150 150 150 150 150 150 
##$DBP07= 0
##$DBPNAM0= <>
##$DBPNAM1= <>
##$DBPNAM2= <>
##$DBPNAM3= <>
##$DBPNAM4= <>
##$DBPNAM5= <>
##$DBPNAM6= <>
##$DBPNAM7= <>
##$DBPOAL= (0..7)
0.5 0.5 0.5 0.5 0.5 0.5 0.5 0.5 
##$DBPOFFS= (0..7)
0 0 0 0 0 0 0 0 
##$DE= 6
##$DECBNUC= <off>
##$DECIM= 32
##$DECNUC= <off>
##$DECSTAT= 4
##$DIGMOD= 1
##$DIGTYP= 9
##$DL= (0..7)
0 120 120 120 120 120 120 120 
##$DP= (0..7)
$$ [...]
##$SUBNAM2= <"">
##$SUBNAM3= <"">
##$SUBNAM4= <"">
##$SUBNAM5= <"">
##$SUBNAM6= <"">
##$SUBNAM7= <"">
##$SUBNAM8= <"">
##$SUBNAM9= <"">
##$SW= 18.0517328524113
##$SWIBOX= (0..15)
0 0 2 0 0 0 0 0 0 0 0 0 0 0 0 0 
##$SW_h= 3612.71676300578
##$TD= 16384
##$TD0= 1
##$TE= 0
##$TE2= 300
##$TE3= 300
##$TEG= 300
##$TL= (0..7)
0 120 120 120 120 120 120 120 
##$TP= (0..7)
150 150 150 150 150 150 150 150 
##$TP07= 0
##$TPNAME0= <>
##$TPNAME1= <>
##$TPNAME2= <>
##$TPNAME3= <>
##$TPNAME4= <>
##$TPNAME5= <>
##$TPNAME6= <>
##$TPNAME7= <>
##$TPOAL= (0..7)
0.5 0.5 0.5 0.5 0.5 0.5 0.5 0.5 
##$TPOFFS= (0..7)
0 0 0 0 0 0 0 0 
##$TUNHIN= 0
##$TUNHOUT= 0
##$TUNXOUT= 0
##$USERA1= <user>
##$USERA2= <user>
##$USERA3= <user>
##$USERA4= <user>
##$USERA5= <user>
##$V9= 5
##$VALIST= <valist>
##$VCLIST= <CCCCCCCCCCCCCCC>
##$VD= 0
##$VDLIST= <DDDDDDDDDDDDDDD>
##$VPLIST= <PPPPPPPPPPPPPPP>
##$VTLIST= <TTTTTTTTTTTTTTT>
##$WBST= 1024
##$WBSW= 4
##$XGAIN= (0..3)
0 0 0 0 
##$XL= 0
##$YL= 0
##$YMAX_a= 212295
##$YMIN_a= -180227
##$ZGOPTNS= <>
##$ZL1= 120
##$ZL2= 120
##$ZL3= 120
##$ZL4= 120
##$ABSF1= 0
##$ABSF2= 0
##$ABSG= 0
##$ABSL= 0
##$ALPHA= 0
##$AQORDER= 0
##$ASSFAC= 0
##$ASSFACI= 0
##$ASSFACX= 0
##$ASSWID= 0
##$AUNMP= <proc_1d>
##$AZFE= 0.1
##$AZFW= 0.1
##$BCFW= 0
##$BC_mod= 2
##$BYTORDP= 0
##$COROFFS= 0
##$CY= -3
##$DATMOD= 1
##$DC= 0
##$DFILT= <>
##$DTYPP= 0
##$F1P= 0
##$F2P= 0
##$FCOR= 1
##$FTSIZE= 16384
##$FT_mod= 6
##$GAMMA= 0
##$GB= 0
##$INTBC= 1
##$INTSCL= 3.241238e-09
##$ISEN= 128
##$LB= 0.25
##$LEV0= 0
##$LPBIN= 0
##$MAXI= 10000
##$MC2= 0
##$MEAN= 0
##$ME_mod= 0
##$MI= 1.114404
##$NCOEF= 0
##$NC_proc= -6
##$NLEV= 6
##$NOISF1= 3.799351
##$NOISF2= 2.8
##$NSP= 0
##$NTH_PI= 0
##$NZP= 0
##$OFFSET= 15.50229
##$PC= 1
##$PHC0= -6894.148
##$PHC1= 6.42196
##$PH_mod= 1
##$PKNL= yes
##$PPARMOD= 0
##$PSCAL= 0
##$PSIGN= 0
##$REVERSE= no
##$SF= 200.130003884557
##$SI= 16384
##$SIGF1= 3
##$SIGF2= 2
##$SINO= 0.751879
##$SIOLD= 32768
##$SREGLST= <19F.Aceton>
##$SSB= 0
##$STSI= 16384
##$STSR= 0
##$SW_p= 3612.71676300578
##$SYMM= 0
##$S_DEV= 0
##$TDeff= 16384
##$TDoff= 0
##$TI= <>
##$TILT= no
##$TM1= 0
##$TM2= 0
##$TOPLEV= 0
##$USERP1= <user>
##$USERP2= <user>
##$USERP3= <user>
##$USERP4= <user>
##$USERP5= <user>
##$WDW= 1
##$XDIM= 16384
##$YMAX_p= 329428984
##$YMIN_p= -572913
$$ End of Bruker specific parameters
$$ ---------------------------------
##NTUPLES= NMR SPECTRUM
##VAR_NAME=  FREQUENCY,     SPECTRUM/REAL,   SPECTRUM/IMAG
##SYMBOL=    X,             R,               I
##VAR_TYPE=  INDEPENDENT,   DEPENDENT,       DEPENDENT
##VAR_FORM=  AFFN,          ASDF,            ASDF
##VAR_DIM=   16384,         16384,           16384
##UNITS=     HZ,            ARBITRARY UNITS, ARBITRARY UNITS
##FACTOR=    0.220516191357247, 1,           1
##FIRST=     3102.47331229663, 0,            0
##LAST=      -510.243450709149, 0,           0
##MIN=       -510.243450709149, -572913,     0
##MAX=       3102.47331229663, 329428984,    0
$$ Real data points
##PAGE= N=1
##DATA TABLE= (X++(R..R)), XYDATA
$$ [...]
6174b45519K6303j1598j8061Q559J5063L055j1110J4078j7751l0797Q37K7475
6162b39466L9066k5098j670L7648m1507j1119K0360j7700l864n59j0888L902Q488
6149b42407J8051J6880J2723k2603L0343m451k0675m1641J0439R193M6769K2862
6137a64517J5241r40l424l8703l6623K7328K2160o346J0245r788j6907j4078j4804
6124b31156L8648k7657k6811J3506M6148k2476j0597j6736K0837M7050k1372K8746
6112a61870Q297k2122N728J2887j1329j6275M761l518Q803N956j3696J2376l922
6099a73924l9100K7287J1948l0218k8141K2799K823l0113k7229j412L3795k5146
6087b56631J4002J5459O878O564j3619J0836L643k4196r04J7986K0100k8596l245
$$ plain form
6174 -245519 -219216 -230814 -248875 -240316 -225253 -222198 -233308 -219230 -236981 -267778 -266941 -239466
6162 -239466 -200400 -225498 -227168 -189520 -231027 -242146 -221786 -239486 -243350 -243909 -254797 -250895 -242407
6149 -242407 -224356 -207476 -194753 -217356 -187013 -191464 -212139 -253780 -243341 -234148 -187379 -164517
6137 -164517 -149276 -150216 -153640 -192343 -228966 -201638 -179478 -185824 -175579 -185367 -202274 -216352 -231156
6124 -231156 -192508 -220165 -246976 -233470 -187322 -209798 -220395 -237131 -216294 -169244 -190616 -161870
6112 -161870 -153573 -175695 -169967 -157080 -168409 -184684 -179923 -183441 -174638 -168682 -182378 -170002 -173924
6099 -173924 -213024 -185737 -173789 -204007 -232148 -209349 -206526 -236639 -263868 -265280 -231485 -256631
6087 -256631 -242629 -227170 -220292 -213728 -227347 -216511 -212868 -237064 -237968 -219982 -199882 -228478 -231723
6074b31723m344l6229J0871J7319J0671N777m0112J0486K1129j466K330k105J7979
6061b19417l5653K5112K4045j3573j3381K8567j6262o075Q306l582o256j6430
6049b44599k3885K7089l9K2291N507k7435k65j9251J3925K3175k02j1888j4321
6036b49898k6668L0126k7662j357N2364K3541k7406J524K9081l9501l5280R481
6024b61655K6639k7280k3187L6744M4023j5610J09K1637K0380p901k508l7907
6012b26516j1298L313k331L4592q689k0150k8313K9900J0064J332j0109J6855
6000b11350j1888o054M472J3797k1788k4956L0214L9720l1305K942m084j3936
5988b34216J4749n351J2240J3296r418j8100O123J8742r886j6825Q132N064o378
$$ plain form
6074 -231723 -236067 -272296 -261425 -244106 -233435 -227658 -267770 -257284 -236155 -237621 -235291 -237396 -219417
6061 -219417 -255070 -229958 -205913 -219486 -232867 -204300 -220562 -226637 -218331 -221913 -228169 -244599
6049 -244599 -268484 -241395 -241434 -219143 -213636 -241071 -241336 -260587 -246662 -223487 -223689 -235577 -249898
6036 -249898 -276566 -246440 -274102 -275459 -223095 -199554 -226960 -225436 -196355 -235856 -271136 -261655
6024 -261655 -235016 -262296 -285483 -248739 -204716 -220326 -220217 -198580 -178200 -186101 -188609 -226516
6012 -226516 -237814 -234501 -236832 -202240 -210929 -231079 -259392 -229492 -219428 -218096 -228205 -211350
6000 -211350 -223238 -229292 -224820 -211023 -232811 -257767 -227553 -187833 -219138 -216196 -220280 -234216
5988 -234216 -219467 -224818 -212578 -199282 -208700 -226800 -220677 -201935 -211821 -228646 -220514 -215450 -221828
5975b21828J6729n444k7419K6145N921L4960K2121J4447l355j7224N295l8721
5963a88373j9283n705l0415P252J2624J8771J0478j1785k4487N731j665o201L4577
5950a98481j8193j5554L0409Q695L223j3379j262j3905k7351r659L0187K6511
5938a98759l0056k8940L0764K0696k2479J3302K518K8862O13l4028J9595j6780
5926b14692J5205K2586n348j217l3171l8529J758J7109O898J2761K3798n4392
5914b47234J2275q622M2890j9072K8505J834K057J6169n1491J0504p274J1349
5902b08110j381r104L095k481J7834J8054r144k7291k4770M4231j5675k7455L7113
5889b05084r436l6613J8232K8550M034k7373J6362Q528j500Q370J4807j9939Q763
$$ plain form
5975 -221828 -205099 -210543 -237962 -211817 -205896 -170936 -148815 -134368 -137723 -154947 -149652 -188373
5963 -188373 -207656 -213361 -243776 -236524 -223900 -205129 -194651 -206436 -230923 -225192 -226857 -233058 -198481
5950 -198481 -216674 -232228 -201819 -193124 -189901 -203280 -204542 -218447 -245798 -255457 -225270 -198759
5938 -198759 -228815 -257755 -226991 -206295 -228774 -215472 -212954 -184092 -183479 -217507 -197912 -214692
5926 -214692 -199487 -176901 -182249 -183466 -216637 -255166 -253408 -236299 -229401 -216640 -192842 -247234
5914 -247234 -234959 -243581 -200691 -219763 -191258 -189424 -187367 -171198 -222689 -212185 -219459 -208110
5902 -208110 -209491 -218595 -215500 -217981 -200147 -182093 -191237 -218528 -243298 -199067 -214742 -242197 -205084
5889 -205084 -214520 -251133 -232901 -204351 -200317 -227690 -211328 -202800 -204300 -195930 -181123 -201062 -192299
5876a92299j306k849l93M1642l4120j9936J152K9191m1313M224P325K3277k0052
5863b05457J7596K9310k0389L223M1273K062j7782l2528K2520N6790L236K2288
5851g7858K3094J3646j2585L9041N658L4266J008K0570p540k577j8953K5494K3320
5838F6584Q199p161k0314N7023j5427K9722m2557j4305j9598l7359K327m6737
5826c9603K8681k1814Q245j0452j8967j9817J2454K217k268j8731O844n3533k1768
5813a48512M4601L2185m9984l8143M7806R432m3592j6371N3895J6803j2724O812
5801i7792r719j1613o991J4396L4886k750j3651k1363l0906K8163J1102K2982
5789h3256J7426p331l195L078K0492o885j0660Q04N0218R436j9837P2092k2313
$$ plain form
5876 -192299 -193605 -196454 -196847 -155205 -189325 -209261 -208109 -178918 -220231 -216007 -208682 -185405 -205457
5863 -205457 -187861 -158551 -178940 -175717 -134444 -132382 -150164 -182692 -160172 -103382 -100146 -77858
5851 -77858 -54764 -41118 -53703 -14662 -9004 25262 26270 46840 39300 36723 17770 43264 66584
5838 66584 74783 67622 47308 104331 88904 118626 76069 61764 42166 4807 7134 -39603
5826 -39603 -10922 -32736 -24491 -34943 -53910 -73727 -61273 -59056 -61324 -80055 -73211 -126744 -148512
5813 -148512 -103911 -71726 -121710 -159853 -112047 -102615 -146207 -162578 -108683 -91880 -104604 -97792
5801 -97792 -107511 -119124 -126115 -111719 -76833 -79583 -93234 -114597 -145503 -117340 -106238 -83256
5789 -83256 -65830 -73161 -76356 -73278 -52786 -59671 -70331 -69527 -19309 -9873 -29710 42382 20069
5776B0069K22L4647N1339M7043L4763J6258M8874L0605M3355J09082J10076J39266
5764F85599J52743K05303L26405M80592R26407J461028J707361J618467P80152
5755H344057P2391k50284p01337j085817r91690r25020q50915p06201o22586n38230
5745A744368l71244k32485j43171j25849j64643r0025m6919o6375q3986k8866
5735C90805k1280o9127l4345k8489P704l7343K936m2801j9694j6488p257j9448
5723A05173j676n245j5538K7013k7510J8324m0893J090q285k7362J0757K9929
5711F5777k1501M293l8166j8098L0688k0111K191J8365o871k7018L9036j8805
5699I780l9326Q551M8862k2199l0276j204j4694K2021j6465r234J0945P161K7888
$$ plain form
5776 20069 20291 54938 106277 153320 188083 204341 253215 283820 327175 436257 546333 685599
5764 685599 838342 1043645 1370050 1850642 2777049 4238077 5945438 7563905 8344057
5755 8344057 8416448 8166164 7464827 6379010 5387320 4462300 3611385 2905184 2282598 1744368
5745 1744368 1373124 1140639 997468 871619 706976 616951 570032 503657 419671 390805
5735 390805 369525 300398 266053 237564 245268 207925 210861 168060 148366 131878 124621 105173
5723 105173 103497 98252 82714 109727 82217 100541 59648 60738 52453 25091 35848 65777
5711 65777 44276 48569 10403 -7695 22993 2882 5073 23438 16567 -10451 28585 9780
5699 9780 -29546 -20995 27867 5668 -24608 -25812 -40506 -18485 -34950 -44184 -33239 -26078 1810
5686A810M359j5312R639j818J0522p432O177J7990k5331l768o918K9065M1946
5673F0929l456j5130L184K1407o622k705j2497R809L7463k9580J675M893j6208
5660E3162J9280L2786j0364j6026K0632k2964L6427n699J3889p222j9780P590
5648A01711L2986K7419L6742j7104l0393p310K911L788J8283l250J6475J1594
5636A93852m0843K394J7738Q873j7728J4157q428L8768K2339P997l3665m3338
5624A62116L3815M6894K3783J754N0173K3843j6868K7127K1787J9552M1257J7346
5612D52579k223L5506N5202M4478N8418L2977M1957Q6923Q7969j4349q491L0758
5600I01704J0266K5422K0900O701M5669L8017K7399O6225l551K8374K5328K547
$$ plain form
5686 1810 6169 -9143 496 -1322 9200 1768 7945 25935 604 -3164 -10082 18983 60929
5673 60929 57473 42343 45527 66934 60312 57607 45110 54919 92382 62802 64477 69370 53162
5660 53162 72442 105228 94864 78838 99470 76506 112933 107234 121123 113901 94121 101711
5648 101711 134697 162116 198858 181754 151361 144051 146962 150750 169033 165783 182258 193852
5636 193852 153009 155403 173141 182014 164286 178443 170015 208783 231122 239119 205454 162116
5624 162116 195931 242825 266608 268362 318535 342378 325510 352637 374424 393976 435233 452579
5612 452579 450356 485862 541064 585542 643960 676937 718894 805817 893786 879437 870946 901704
5600 901704 911970 937392 958292 964993 1010662 1048679 1076078 1142303 1138752 1167126 1192454 1195001
5588A195001k3201l5000l1007J6241K9980l3722N7455O2825K2258J4579J4977
5577A290386J04567K2356K0895M4139K7882O5487M0397P0590N2381P0795Q1710
5566A891585J09528J17358N6781J00064J11864J28649J34496J26549J62008J73061
5556C111943K03549K28181K40548K51262K99871L84687L78797M02335N10891O12136
5546F624200O51948P59782J019519J216125J635782J996617K572900L308762M097915
5537B3883550M943812N443972N416479M644535L412760K028774Q39459j40592
5529E0472749m57712j78262M45983J125491J578506J438404N57447p03945j977170
5520E2301491l141979m065131m561300m661872m524046m184437l757301l246113
$$ plain form
5588 1195001 1171800 1136800 1105793 1122034 1152014 1118292 1175747 1238572 1260830 1275409 1290386
5577 1290386 1394953 1417309 1438204 1482343 1510225 1575712 1616109 1686699 1739080 1809875 1891585
5566 1891585 2001113 2118471 2175252 2275316 2387180 2515829 2650325 2776874 2938882 3111943
5556 3111943 3315492 3543673 3784221 4035483 4335354 4720041 5098838 5501173 6012064 6624200
5546 6624200 7276148 8035930 9055449 10271574 11907356 13903973 16476873 19785635 23883550
5537 23883550 28827362 34271334 39687813 44332348 47745108 49773882 50613341 50472749
5529 50472749 50015037 49836775 50282758 51408249 52986755 54425159 54982606 54278661 52301491
5520 52301491 49159512 45094381 40533081 35871209 31347163 27162726 23405425 20159312
5512B0159312k678987k229372j854954j494343j197807j060942q71919p14986
5504H056002o34671n61445m95396m75530m09187l68021l23489k32713k52588k52204
5494D050758k53938j89821j91982j32484j39172j36276q8208j56752r9946q4591
5484B577588j29780n8741r3854p8558p1979q6374n9644k4872r9053p9402M147
5473A799478n5706o5665p3394j2328o8140n7773j9918l7384n5180o4018o1746
5462A228226q889l8673m8746j9187k2056n8341m1839k2818m0663p4954j2525L5784
5450H75319j5065k2246l5611n881L0806k6246P288J3364n3301l2465J7687M3866
5438G97515m3179m8981N5039K358j7235j9697p898k789J504k3526M0L2249m3023
$$ plain form
5512 20159312 17480325 15250953 13395999 11901656 10703849 9642907 8770988 8056002
5504 8056002 7421331 6859886 6364490 5888960 5479773 5111752 4788263 4555550 4302962 4050758
5494 4050758 3796820 3606999 3415017 3282533 3143361 3007085 2918877 2762125 2662179 2577588
5484 2577588 2447808 2389067 2295213 2216655 2144676 2058302 1998658 1973786 1874733 1795331 1799478
5473 1799478 1743772 1678107 1604713 1592385 1524245 1466472 1446554 1409170 1353990 1289972 1228226
5462 1228226 1219337 1180664 1131918 1112731 1090675 1032334 990495 967677 927014 852060 839535 875319
5450 875319 860254 838008 802397 796516 827322 801076 808364 821728 768427 735962 753649 797515
5438 797515 754336 705355 760394 762752 745517 725820 717922 715133 716637 693111 693151 725400 682377
5425F82377k066k778p55j8384l7472J4084m59j9844j5923K5602j6762M188o434
5412F05374K9249J7825k5581Q600L3983k8998k2605J2459j1978J2349r524J7080
5400F38233J7752r652m661L7037M6182l9978k4341J4371k1904k9371l830N9879
5388F79717L489L678O396K6227k3278j1696J1754j6305J0825k443M3723J6619
5376G48706j2353Q460M1163K5246m934K1411k8760L9960J7327l0792O3195K8800
5364I17429M4758L3475R660K967k2162P6716J8680J8381l0521J1878N8192p426
5352A132027L667N7940J7267j1671j3210P607K2083J6926l5445K5268M7714l0
5340A270143M6295O9970O0307L5386P0615M2039L6058M7027L7577P5621P2782
$$ plain form
5425 682377 680311 677533 676778 658394 620922 635006 634547 614703 598780 624382 607620 611808 605374
5412 605374 634623 652448 626867 635467 669450 640452 617847 630306 618328 630677 621153 638233
5400 638233 655985 646333 641672 678709 724891 684913 660572 674943 653039 623668 619838 679717
5388 679717 683206 686884 693280 719507 696229 684533 696287 679982 690807 688364 732087 748706
5376 748706 736353 744813 785976 811222 806288 827699 798939 838899 856226 825434 888629 917429
5364 917429 962187 995662 1005322 1008289 986127 1062843 1081523 1099904 1069383 1081261 1139453 1132027
5352 1132027 1135694 1193634 1210901 1199230 1186020 1193627 1215710 1232636 1197191 1222459 1270173 1270143
5340 1270143 1316438 1386408 1446715 1482101 1552716 1594755 1630813 1677840 1715417 1791038 1863820
5329A863820M0301N4689R8494Q1236R1099J36568M8911R7093J17365J67365J86135
5318B983076J71572J93682J72719J82499J96699K59352L06790L21532L49496M08979
5308E546396N76308O60814Q30549J046287J206150J510678K026644K938598M372070
5299B0714494O444918Q392764R126580P649231M396523J431193p76701k891389
5291E4487613l809445l315650j811267O30634L291835N259933N381387L018540
5283F3133580n8990k328620m590494o223866o614241o288201n671337n023640
5275B6334191m351996l535948k799905k211676j673643j296333j097617r00589
5267H466484p35409n62181n06066m49750l88509l53221l55226l13427k71866k47355
$$ plain form
5329 1863820 1904121 1958810 2057304 2138540 2229639 2366207 2415118 2512211 2629576 2796941 2983076
5318 2983076 3154648 3348330 3521049 3703548 3900247 4159599 4466389 4787921 5137417 5546396
5308 5546396 6122704 6783518 7614067 8660354 9866504 11377182 13403826 16342424 20714494
5299 20714494 27159412 35552176 44678756 52327987 56724510 58155703 57379002 54487613
5291 54487613 50678168 47362518 45551251 46181885 49473720 54733653 60115040 63133580
5283 63133580 63074590 60745970 56155476 49931610 43317369 37029168 31357831 26334191
5275 26334191 21982195 18446247 15646342 13434666 11761023 10464690 9367073 8466484
5267 8466484 7731075 7168894 6662828 6213078 5824569 5471348 5116122 4802695 4530829 4283474
5257D283474k23081k31109j96769j57026j96779j79699j21528j07329j11087j00398
5247B658669r3545o6535o8644o3525n8307m6062q9071q9069o8836o2163n5455
5236A897457m8480k0417o3342n0811q2870p3274l3796l8348m8700n6688k1144
5225A359587m9046l6405J9918j2791k7614l9205J4671k01j4735j0859l6692m1100
5213A125528j152P1j269m2073n0347K3344q048m2298l1607k8782j2702n323j0366
5200I14976M202j2356l0623m7525l2395j8132l1588j2232J2284l2376n6043N520
5188F63712L0291k2768o1310K5775j887n6587j9745J0059j9783R073J506k3458
5176E34878k5709l3847j0657m570j2672n534j1505K8094l3455k9521K219p87k7655
$$ plain form
5257 4283474 4060393 3829284 3632515 3475489 3278710 3099011 2977483 2870154 2759067 2658669
5247 2658669 2565124 2498589 2429945 2366420 2308113 2262051 2172980 2083911 2015075 1952912 1897457
5236 1897457 1848977 1828560 1765218 1714407 1631537 1558263 1524467 1486119 1437419 1380731 1359587
5225 1359587 1310541 1274136 1294054 1281263 1253649 1214444 1229115 1228914 1214179 1203320 1166628 1125528
5213 1125528 1124376 1124447 1123178 1081105 1030758 1054102 1046054 1003756 972149 943367 930665 925342 914976
5200 914976 919178 906822 876199 828674 796279 778147 746559 734327 746611 714235 658192 663712
5188 663712 694003 671235 609925 635700 633813 577226 557481 567540 547757 556830 558336 534878
5176 534878 509169 475322 464665 460095 447423 441889 430384 458478 425023 395502 397721 396934 369279
5163C69279l1921j492n763J8703J7998J4769q278q107l1609j9974K3520k3704
5151C13421k0966M6001o554k176j8431J8308q086m62j8325J7544l0776k9374K7177
5138B87301L549o022K5393Q023l3633N49r714K9179K3804K0538k3282P729P635
5125C41049O686k2012L7544r954j524j296J5197M425j6943k0137J3997k8J2117
5112C59121q72n773q895k3246M827k781n255M714P954l5378L4988j3044K995o708
5098C12647l6572Q308L4796j5129j3470J9234R435l8757j2228j1857k5342o72
5086B30393M910O457k7681j1668j5287L4785J0168l1699m0554l7677K1956j0925
5074A33178K668j4384j3628K774K8340k343k947m860j7171J5651L0513J6755L4683
$$ plain form
5163 369279 337358 335866 330103 348806 366804 381573 373295 365188 333579 313605 337125 313421
5151 313421 292455 338456 331902 329726 311295 329603 321517 321055 302730 320274 289498 260124 287301
5138 287301 290850 284828 310221 318244 284611 285160 275446 304625 328429 348967 325685 333414 341049
5125 341049 347735 325723 363267 353313 351789 350493 365690 370115 353172 333035 347032 347004 359121
5112 359121 358249 352476 343581 320335 325162 322381 317126 321840 329794 294416 329404 316360 319355 312647
5098 312647 276075 284383 319179 304050 290580 309814 319249 280492 268264 256407 231065 230393
5086 230393 235303 241760 214079 202411 187124 221909 232077 200378 159824 122147 144103 133178
5074 133178 135846 121462 107834 110608 138948 136605 133658 128798 111627 127278 157791 174546 209229
5061B09229k0014j4634n065N0998k659j2620L4107L5877q209j609J3871M8463
5049C27735O093m5251k8315J417Q200j4284K701j0991m581r08j4224j5158R067
5036B21501k8155J6644j6329J5164l1100J3587k1161k810M862q395N772m0777
5024A28803J0388L3007k0841l738J9708k1376J138p755K898J7986N319k2408P249
5011A50378j1558J7782J5998J0793J0220o086j5559n735L0556j0704l1348L383
4999A58120Q618J0840k1972J8612P0394j3749K5262N0165R1422O7203K5657k4215
4987D66357j8387J7873L0849k5882K955M7482r034r388k8689n0692j5741j2507
4975C95196k3335P190K0498J5719r632J6306j1690q095n8939l947r268k9591j7685
$$ plain form
5061 209229 189215 174581 169516 220514 217855 205235 239342 275219 267010 265401 279272 327735
5049 327735 333828 288577 260262 261679 269879 255595 258296 247305 242724 241816 227592 212434 221501
5036 221501 193346 209990 193661 208825 177725 191312 170151 167341 172203 163808 169580 128803
5024 128803 139191 172198 151357 147619 167327 145951 147089 139334 142232 160218 165537 143129 150378
5011 150378 138820 156602 172600 183393 193613 187527 171968 166233 196789 186085 154737 158120
4999 158120 166738 177578 155606 174218 244612 230863 256125 306290 397712 464915 490572 466357
4987 466357 447970 465843 496692 470810 473765 521247 512213 502825 474136 423444 407703 395196
4975 395196 371861 379051 399549 415268 405636 421942 410252 402157 343218 339271 330003 300412 282727
4962B82727n3842l9133l202p154j4811J0491o874k3306K3059N191l0602J3051
4950A55595L6062j9659l8458j7338Q832M9722j1518r519M150J8694l2869R138
4938A52832P010O164N472N3806J778j5313m902n380l1179j1756o123k974N2699
4925B02134J8964k2507j1367Q745j3243K2554J8566j8510k4430K3234J4406J4286
4913B32832j4904M4239k4877j4820r540L1693M2999k6466j8653J7734L5817j4453
4901B81601o691Q611J2425k9100r511K6866L9671l4464Q004N0290N563q672J4006
4888C58599j4227j5839J3910O41J1322l0804J0721j648l1501j7039j957L7095
4876C19273K1642j4324j990l571j0756j6756K5362J3502Q081K940J6591Q271M255
$$ plain form
4962 282727 228885 189752 186550 179396 164585 175076 168202 144896 167955 173146 142544 155595
4950 155595 191657 171998 133540 116202 125034 174756 163238 153719 157869 176563 143694 152832
4938 152832 159842 166006 171478 225284 227062 211749 206847 201467 170288 158532 152409 149435 202134
4925 202134 221098 198591 187224 195969 182726 205280 223846 205336 180906 204140 218546 232832
4913 232832 217928 262167 237290 222470 212930 244623 287622 261156 242503 260237 296054 281601
4901 281601 274910 283521 295946 266846 257335 284201 323872 289408 297412 347702 353265 344593 358599
4888 358599 344372 328533 342443 343084 354406 323602 334323 332675 301174 284135 282178 319273
4876 319273 340915 326591 324601 321030 310274 293518 318880 332382 340463 343403 359994 368265 372520
4863C72520k2944k2059M796r749M348M2216L0403n669Q760J8401O9833P5086K2191
4850E88133K0651L7779k120K4311j3507p022j221k0286m0073m3975K1438l891
4838E60217J7150L3186M0549K3186L7443L9465Q2631L1715N2373P9779J25119
4827A122813J45973K23690L75762P03493J075436J264935J140148N38021L349
4818F593620k02198n57911p49470o58625o74499n76790n53436m07544l53670k51234
4808A608243j70543r3683q5954l2088o6205o8484n1655j8917l0165l9405j8913
4797I32231j1150n3532r176K3373l5307j0822j2147P995j3724J4078J5439J265
4785H48523j5870p226o0657L296J2492L4628q793L6568k2081k9680J4976j5103
$$ plain form
4863 372520 349576 327517 332313 322564 326912 369128 399531 393862 402622 421023 490856 565942 588133
4850 588133 608784 646563 644443 668754 655247 648225 647004 626718 586645 542670 564108 560217
4838 560217 577367 610553 651102 674288 711731 751196 833827 865542 917915 997694 1122813
4827 1122813 1268786 1492476 1868238 2571731 3647167 4912102 6052250 6590271 6593620
4818 6593620 6391422 5833511 5084041 4425416 3750917 3174127 2620691 2213147 1859477 1608243
4808 1608243 1437700 1344017 1258063 1225975 1159770 1091286 1039631 1020714 990549 951144 932231
4797 932231 921081 867549 858373 881746 846439 835617 823470 831465 817741 831819 847258 848523
4785 848523 832653 825427 764770 768066 780558 815186 806393 842961 820880 791200 806176 791073
4773G91073M491L760J7956K8565K3567j9837M468l4712n357l194Q079l890L1162
4760H46131n121J6814k5870j6067J0187M183m989K900O634P3L6158n227J6450
4747H82256p644K2982O047J0202m132L6109r232k9868k8615N7794J9352j2162
4735I43089q069j490R306J1744L1598j4600p064l089N6913M4592J0481q337Q657
4722A073731K2608L5591j5348J2488m1329j4490O5707K5913r35J3579L2720k3102
4710A187133l2564P3984N5027J3868j7446M2439J8130k9049K3752J0630K4596
4699A370500N869M5595J8454K2497L2062K480p965J4866J9425N7397K3006L9554
4687A643740K8097K7455j241K2533J8275L18L8224J6841j2684J4961M6064J3915
$$ plain form
4773 791073 795564 799324 817280 845845 869412 849575 854043 819331 813974 810780 818859 814969 846131
4760 846131 841010 857824 831954 815887 826074 830257 825268 828168 834802 834875 871033 865806 882256
4747 882256 874612 897594 903641 913843 909711 945820 936588 906720 878105 935899 955251 943089
4735 943089 935020 933530 942836 954580 986178 971578 964514 961425 1018338 1062930 1073411 1065074 1073731
4722 1073731 1096339 1131930 1116582 1129070 1087741 1073251 1138958 1164871 1163936 1177515 1210235 1187133
4710 1187133 1154569 1228553 1283580 1297448 1280002 1322441 1340571 1311522 1335274 1345904 1370500
4699 1370500 1376369 1421964 1440418 1462915 1494977 1497457 1489492 1504358 1523783 1581180 1604186 1643740
4687 1643740 1671837 1699292 1698051 1720584 1738859 1739177 1777401 1794242 1781558 1796519 1842583 1856498
4675A856498L270L9940M6900K1218M6994L8607P720k4938N5329K1831N0939j0742
4663B153566O8707M2686K7589K9084J2804O3252J7393K3145M0239M9533Q173N2156
4651B588327R6628N8480J5180L3605k328N0347M3002p235J295P0394M3411J2758
4639C003864N7368O1338N9538L6197O6574R0016L4312Q1603J18423J23829K35555
4628C968617L24575M32218L58916K36085J02723O1870o7834j58353j31636j41679
4618D985502r8256j01387J1277j7132L5074J09517J61547J88500K15279K25747
4608E715668K61883K11119J68556J87375K23800K43718L19768L91016L55708K93726
4598H372337K22777J27790R6317J73346K54089L12822L22001K81672J40210L6242
$$ plain form
4675 1856498 1859768 1899708 1946608 1967826 2014820 2053427 2061147 2036209 2091538 2113369 2164308 2153566
4663 2153566 2222273 2264959 2292548 2321632 2334436 2397688 2415081 2438226 2478465 2527998 2536171 2588327
4651 2588327 2684955 2743435 2758615 2792220 2789892 2840239 2883241 2876006 2877301 2947695 2991106 3003864
4639 3003864 3061232 3122570 3182108 3218305 3284879 3374895 3409207 3490810 3609233 3733062 3968617
4628 3968617 4293192 4725410 5084326 5320411 5423134 5485004 5417170 5258817 5127181 4985502
4618 4985502 4887246 4785859 4797136 4780004 4815078 4924595 5086142 5274642 5489921 5715668
4608 5715668 5977551 6188670 6357226 6544601 6768401 7012119 7331887 7722903 8078611 8372337
4598 8372337 8595114 8722904 8819221 8992567 9246656 9559478 9881479 10163151 10303361 10339603
4588A0339603p6975q6176p9466J7429P269M0389o5258j54441j31212j46520j57256
4577I507386j60599j05603j08524q8013k7598p7645j13158r2349p4398p3557l9058
4566H546884r360O2467Q6670J25791K00680K06217K81885M01597N67862O51398
4556A1122091Q57203J000050J188394J354589J489899J481465J357624J158629
4548B1009944J059876R80348R89573J155642J511111J804556J912318J755465
4540C2178833J283251N97769K3017l77492q12759r50347j081096j085650j017178
4531B8758348r82105j073042j098200j138482j213217j224990j240889j265506
4523A9521917j259297j179332j088161q97416q07780o63464m92872l68389l13941
$$ plain form
4588 10339603 10262628 10176452 10096986 10114415 10121684 10162073 10096815 9942374 9811162 9664642 9507386
4577 9507386 9346787 9241184 9132660 9044647 9017049 8939404 8826246 8733897 8659499 8585942 8546884
4566 8546884 8537524 8599991 8686661 8812452 9013132 9219349 9501234 9902831 10470693 11122091
4556 11122091 11979294 12979344 14167738 15522327 17012226 18493691 19851315 21009944
4548 21009944 22069820 23050168 24039741 25195383 26706494 28511050 30423368 32178833
4540 32178833 33462084 34059853 34082870 33705378 32892619 31942272 30861176 29775526 28758348
4531 28758348 27776243 26703201 25605001 24466519 23253302 22028312 20787423 19521917
4523 19521917 18262620 17083288 15995127 15097711 14289931 13626467 13133595 12765206 12451265
4514A2451265j99746j30840o2230K4521Q5096J94403L27454M79373P10743J241369
4504A5121408J781526K200409K124166J541596P78630L24744P6405j11413j45823
4495B3691648J43759Q42102K023093L056596L337718K388682P97644l52859r23343
4486C5005040j390287j826020j907878j776672j255126o66419k51657j85600m92751
4477B5252630q78486j125214j271344j384142j495540j519305j459451j354477
4469A4764671j225819j086914q23998o12992m65457l90664l36679k71258k32589
4460I318301k53585j77945k00959k15283j23893j31506j22168j42251r6712j02353
4450G751646q3253j28830j31091p6355q2191q8938o9710p8925o8020p2892k2132
$$ plain form
4514 12451265 12251519 12120679 12058449 12082970 12168066 12362469 12689923 13169296 13880039 15121408
4504 15121408 16902934 19103343 21227509 22769105 23547735 23872479 23948884 23837471 23691648
4495 23691648 23835407 24677509 26700602 29757198 33094916 35483598 36281242 35928383 35005040
4486 35005040 33614753 31788733 29880855 28104183 26849057 26182638 25930981 25745381 25252630
4477 25252630 24374144 23248930 21977586 20593444 19097904 17578599 16119148 14764671
4469 14764671 13538852 12451938 11627940 11014948 10549491 10158827 9822148 9550890 9318301
4460 9318301 9064716 8886771 8685812 8470529 8346636 8215130 8092962 7950711 7853999 7751646
4450 7751646 7668393 7539563 7408472 7332117 7249926 7160988 7091278 7012353 6944333 6871441 6849309
4439F849309n6438r1527o5879p6497p8282r7512q2780l7447n0125m9505o6946
4428F096371q0828o0455q8502o9966p2490p7246o6435j17085p7149m9514o4798
4417E271903q9766m4698p0615m0117m7031p5953p4464p8679m4312n7415n3195
4406D595658m8510l8438o6051j9683o4251k0570o5151n1150o2792j4883l4287
4395D109892k5355m8369l3578k2203m4015M186k8003n9065m8741k4811l3576j4058
4383C732304n4022k8148l4896J8108k3393o240j7554l0567o7266m1885m2218m0260
4371C363963m7522m7131j6646l5053n090l8660m8757m5814l811l1806k2387n3708
4359B967578l0185k5511j074l6512l081O255j5177M0706L861L9101N8241J04213
$$ plain form
4439 6849309 6792871 6701344 6635465 6558968 6480686 6383174 6300394 6262947 6212822 6163317 6096371
4428 6096371 6015543 5955088 5866586 5796620 5724130 5646884 5580449 5463364 5386215 5336701 5271903
4417 5271903 5182137 5137439 5066824 5026707 4979676 4903723 4829259 4750580 4706268 4648853 4595658
4406 4595658 4547148 4508710 4442659 4422976 4358725 4338155 4273004 4221854 4159062 4144179 4109892
4395 4109892 4084537 4036168 4002590 3980387 3936372 3940558 3912555 3853490 3804749 3779938 3746362 3732304
4383 3732304 3678282 3650134 3615238 3633346 3609953 3603713 3586159 3555592 3488326 3446441 3404223 3363963
4371 3363963 3316441 3269310 3252664 3217611 3212521 3173861 3125104 3079290 3075479 3043673 3021286 2967578
4359 2967578 2937393 2911882 2910808 2874296 2871215 2877470 2862293 2902999 2906860 2945961 3004202 3108415
4347C108415K051J141m6416q0057o2397q5190p7850q2541k2639o8636q1799j9634
4335B484448r055j7766n9036n2671r834r013p262j6681j4360m2967j1241n274
4323B229288k7493K1335k6765p76k3079m848j1827O760k727j536Q006J9961k8540
4310B157759l7298M7887J5353k2051Q253K2048l612J0021k5737L7674O313J9091
4298B235701r026K6538K8830K5266j2098K9372N0310M8598J6846L9708Q3581N1530
4286B615156M0384O4349Q2399J07223P5416M4653J37179J47671J69891J98705
4276C683026K19026K11949K38591K12503K43657K12972J88934K18600J62421J73025
4266E764704J80823K50038K90771L59274M41629N04660N85304O08661N50477N30308
$$ plain form
4347 3108415 3110466 3111607 3065191 2985134 2922737 2837547 2759697 2677156 2654517 2585881 2504082 2484448
4335 2484448 2475393 2457627 2398591 2345920 2336086 2327073 2319811 2303130 2288770 2245803 2234562 2229288
4323 2229288 2201795 2223130 2196365 2195589 2172510 2167662 2155835 2162595 2159868 2158332 2166338 2186299 2157759
4310 2157759 2120461 2168348 2183701 2161650 2169903 2191951 2188339 2198360 2172623 2210297 2216610 2235701
4298 2235701 2226675 2253213 2282043 2307309 2295211 2324583 2374893 2423491 2440337 2480045 2563626 2615156
4286 2615156 2655540 2719889 2802288 2909511 2984927 3029580 3166759 3314430 3484321 3683026
4276 3683026 3902052 4114001 4352592 4565095 4808752 5021724 5210658 5429258 5591679 5764704
4266 5764704 5945527 6195565 6486336 6845610 7287239 7791899 8377203 8985864 9536341 10066649
4256A0066649N61927M41315L93956L06676K31692K17195K63711L04599M20036
4247A3207756M97482O38898P46271Q16272Q35450Q06956P69878O21929L88578
4238A9329470J81270O1523j22007k18798j80177j03853j8379J91050L59048N90483
4228B0069630O42100O67013N60486L85685Q1869k45840n23358p33889q66045q88645
4218A9149006p92707o74353l97335k48546k2164J54355J65776R2369m5628l23878
4208A7056895n93655p86718r20926r96460r42021r14510p50096n95892m89302
4199A0067315l41822k19037j73607k11657k45084l85001l96517n24438n79065
4190F991087n60897n08283m38485m32624l54025k68578k23143k08374j81984j55874
$$ plain form
4256 10066649 10628576 11069891 11463847 11770523 12002215 12219410 12483121 12787720 13207756
4247 13207756 13705238 14344136 15090407 15906679 16742129 17549085 18318963 18940892 19329470
4238 19329470 19510740 19572263 19450256 19231458 19051281 18947428 18929049 19120099 19479147 20069630
4228 20069630 20711730 21378743 21939229 22324914 22406783 22160943 21637585 20903696 20037651 19149006
4218 19149006 18356299 17681946 17284611 17036065 17013901 17168256 17334032 17426401 17380773 17056895
4208 17056895 16463240 15676522 14755596 13759136 12817115 11902605 11152509 10556617 10067315
4199 10067315 9725493 9506456 9332849 9121192 8876108 8491107 8094590 7570152 6991087
4190 6991087 6430190 5921907 5483422 5050798 4696773 4428195 4205052 3996678 3814694 3658820
4180C658820j48655j55877j67427j88492j74182j92238j13864j40456j62189j03843
4170B111597p5974p1076q6495n6030m6294p0020p7690j8945k1341m5319m6041
4159A496372j8913l8299n0329j2005n020j2677o6936l3440J2832k1904k5450l1589
4147A192642k2408l4389j4236n623j8660J416n9342j9967j2821P63k9845k5902
4135I51628R678n382m0231j5463l659l7873j9698j6576q590j9366m0839L726J0199
4122G67554o508k1620k371p637l6815r807O668J0751j7698p239l8591m968R44
4109F32663n0877K2663k0642j2990K1462j2634J5904Q408m7634k9005K3364j1029
4097E39653J5440p225r094l272K1977j8072N643k0157Q369j763k8843j0602L4519
$$ plain form
4180 3658820 3510165 3354288 3186861 2998369 2824187 2631949 2518085 2377629 2215440 2111597
4170 2111597 2035623 1964547 1878052 1822022 1775728 1705708 1628018 1609073 1587732 1542413 1496372
4159 1496372 1477459 1439160 1388831 1376826 1371806 1359129 1292193 1258753 1271585 1249681 1224231 1192642
4147 1192642 1170234 1135845 1121609 1115986 1097326 1098742 1039400 1019433 1006612 1007375 977530 951628
4135 951628 961306 955924 915693 900230 896571 858698 839000 822424 813834 794468 753629 757355 767554
4122 767554 761046 739426 737055 729418 692603 682796 689464 700215 682517 675278 636687 631719 632663
4109 632663 581786 604449 583807 570817 592279 579645 595549 603957 556323 527318 550682 539653
4097 539653 555093 547868 538774 535502 557479 539407 545050 524893 533262 531499 502656 492054 526573
4084E26573r591j8782M3406p242m761M268K0426k6706n421J1694L1047K1189J6529
4071F02629m633p840K2672L582m0965J0300L8026j1414L3230j5349K9018k4629
4059F34627N361l570J3639L204m878K0116k5404Q469P440L1315N961l2477J9096
4046F82899l870R072m398j1350j9097q636K6713k6432L0939J6725R951k1843J8512
4033F99185O992o822o972j7926j7617o174p971k0819Q507m9213k403O95o2764
4020E16698j0850L7981j964k2145j7966l5551K4418j4150n774l8752J0979J8411
4008D61335j0148m8513j0497J7735n348j423N048m5412k4802M5916k955j2000
3996C68936J8820P480K699j1125l3005K5344k1899n834L290k2260j957L5868J8165
$$ plain form
4084 526573 516982 498200 541606 534364 529603 533871 554297 527591 522170 533864 564911 586100 602629
4071 602629 597996 590156 612828 616410 575445 585745 623771 612357 645587 630238 659256 634627
4059 634627 639988 636418 650057 653261 648383 668499 643095 651564 659004 690319 696280 663803 682899
4046 682899 679029 688101 683703 672353 653256 644620 671333 644901 675840 692565 702516 680673 699185
4033 699185 706177 699355 692383 674457 656840 650666 642695 621876 630383 581170 578767 579462 516698
4020 516698 505848 543829 541865 519720 501754 466203 490621 476471 470697 431945 442924 461335
4008 461335 451187 402674 392177 409912 404564 403141 408189 362777 337975 383891 380936 368936
3996 368936 387756 395236 397935 386810 353805 379149 357250 351416 354706 332446 330489 366357 384522
3983C84522j4363P215q137l752j5184L7898J971K991k7007J9311P788M6664j91
3970D39726j6347j071k9254R678j8473J2276k4412M3684m4077J7631j2401n324
3958C71636J775q598J4428j3027k8657n829N3950J5490N1736N1252O9368Q3441
3946F56965J91553J95920J84462J03947R194J9689n5139j25041o4750j00183r8662
3935I17955p4339l6608p1238o8456L9886k6972J0002N388L0401L1255J0351p2768
3923F94857M9226K1379N3771l7217j2827M9621P2562J04347J55518J82345J66405
3912A499987J17416K4311N99q6636r1811j17102j09150j17260p0018p5025n7880
3901I17431q0969p20M679n0948m7799q99j7841q149L8839J7736j0546l7453J5676
$$ plain form
3983 384522 370159 377374 369237 365485 350301 388199 390170 393161 366154 385465 393253 439917 439726
3970 439726 423379 422308 393054 402732 384259 396535 372123 415807 371730 389361 376960 371636
3958 371636 373411 364813 379241 366214 337557 331728 385678 401168 452904 504156 573524 656965
3946 656965 848518 1044438 1228900 1332847 1342041 1361730 1306591 1181550 1116800 1016617 917955
3935 917955 843616 807008 735770 667314 707200 680228 690230 695618 726019 757274 767625 694857
3923 694857 744083 765462 819233 782016 769189 818810 891372 995719 1151237 1333582 1499987
3912 1499987 1617403 1641714 1642313 1555677 1463866 1346764 1237614 1120354 1050336 975311 917431
3901 917431 836462 835742 840421 789473 741674 740775 722934 714785 753624 771360 760814 723361 739037
3888G39037j6603o948p520m5898J6437Q360q230k0414j2151j0788K2422l7094
3876F20610j6576j8731m636l2336K6058N555k1971L2841k1723K5846N267m633
3864E95571J9119L3806m0790K2095O964k5622K5728j4780O679J1124K9642K0946
3852F90482j0268L3353K3006K5028k363j2435R9821K4179J7047O91P016K8282
3840I23839L3678q68L2607P5260J2553K0398K9420M1827J6355J6549Q463P1124
3828A281205N833N8213N4924R336J5011K1664k501M217L5427O3157Q956M6414
3816A601856J03719L9292J23831Q2804N1458R5733J31680O2618J72756J54460
3806B620207J68990J66729K53003K75617L26528M16017M90734O21052P29091R07611
$$ plain form
3888 739037 722434 715486 707966 662068 678505 686865 678635 658221 646070 635282 657704 620610
3876 620610 604034 585303 580667 548331 574389 579944 557973 590814 569091 594937 600204 595571
3864 595571 614690 648496 607706 629801 636765 611143 636871 622091 628770 639894 669536 690482
3852 690482 680214 713567 736573 761601 759238 746803 846624 870803 887850 888541 895557 923839
3840 923839 957517 956649 989256 1064516 1077069 1097467 1126887 1168714 1185069 1201618 1210081 1281205
3828 1281205 1287038 1345251 1400175 1409511 1424522 1446186 1443685 1447902 1483329 1546486 1555442 1601856
3816 1601856 1705575 1744867 1868698 1951502 2002960 2098693 2230373 2292991 2465747 2620207
3806 2620207 2789197 2955926 3208929 3484546 3811074 4227091 4717825 5338877 6067968 6975579
3796F975579R68974J202106J249799J365780J415945J425815J365569J245337
3788A7214904J007369Q65275O10671L96775K41605N9854o7744j07296q1237l4911
3778B0105265K8489O5169J31912Q0116O6941m9348j61598l27072m84140o69396
3768A8786338q89345j090902j174083j213092j242942j255538j204428j064062
3760I651946r83330q61479p55195o16944n33175m59005l95241l27222k81787k62363
3750D176205k19372k07198j39088j62928j07778j30519j17523n1268m8301j06952
3740B885278o1799p7382k9322l0994m5099n3966k2326l4994o0573k4808r6042
3729B347973o0912o1320k8146m7389p3917n4414Q495j270j3550k4057L8642L4217
$$ plain form
3796 6975579 7944553 9146659 10396458 11762238 13178183 14603998 15969567 17214904
3788 17214904 18222273 19087548 19698219 20094994 20336599 20396453 20328709 20221413 20140176 20105265
3778 20105265 20133754 20198923 20330835 20410951 20477892 20428544 20266946 19939874 19455734 18786338
3768 18786338 17896993 16806091 15632008 14418916 13175974 11920436 10716008 9651946
3760 9651946 8668616 7807137 7051942 6434998 5901823 5442818 5047577 4720355 4438568 4176205
3750 4176205 3956833 3749635 3610547 3447619 3339841 3209322 3091799 3040531 2992230 2885278
3740 2885278 2823479 2746097 2716775 2685781 2640682 2586716 2564390 2529396 2468823 2444015 2347973
3729 2347973 2287061 2225741 2197595 2150206 2076289 2021875 2030370 2029100 2015550 1991493 2030135 2064352
3717B064352q271l220L8710K0815m0470O687Q659J1946n289O085j8667o393j5354
3704B059590k5019K635O820P9125J7104N3995M336K0355O4501Q631r76L9329L7394
3691B367820K9770O884k218m2665L6465L7958j0660K0548n03P608K6644N7992
3679B535643N0351L8294J0337M8379J0474L4710K3399R3841R90Q2065M1108N0779
3667C020370L2405Q1762O2123Q6384J15804O9749J03674J39282J41100J04023
3657C956676J98461K06835K87451K87791L35199L70125M08237M52045N54988N73029
3647G630837O55412O55988O85466O64259O40588O06923M98299M57758L24929K88833
3637A3109292K47719K37149K59372L26030M79685O95180J058469J406177J803177
$$ plain form
3717 2064352 2056081 2052861 2091571 2112386 2071916 2078603 2087262 2099208 2093919 2100004 2081337 2074944 2059590
3704 2059590 2034571 2037206 2044026 2123151 2140255 2194250 2198586 2218941 2283442 2292073 2291097 2330426 2367820
3691 2367820 2397590 2404474 2402256 2359591 2396056 2434014 2423354 2443902 2443399 2451007 2477651 2535643
3679 2535643 2585994 2624288 2634625 2683004 2693478 2728188 2751587 2845428 2846418 2928483 2969591 3020370
3667 3020370 3052775 3134537 3196660 3283044 3398848 3468597 3572271 3711553 3852653 3956676
3657 3956676 4155137 4361972 4649423 4937214 5272413 5642538 6050775 6502820 7057808 7630837
3647 7630837 8286249 8942237 9627703 10291962 10932550 11539473 12037772 12495530 12820459 13109292
3637 13109292 13357011 13594160 13853532 14179562 14659247 15354427 16412896 17819073 19622250
3628A9622250K275924K746665L118344L389061L400132L212415K924858K470061
3620D3159710J856437J232560O06855M6270l24767m71611m33799k58041K0523
3611D5434137M12114O97802Q10244Q58348P10387L84458l963n13034j029833j489179
3601D6271481j826333k043491k026022j924926j633195j275515q86730n59637
3593C4095632j70852R7942K00282K49190J14508j1439k05404m71940q02273j091834
3583C2003812j340488j536243j687100j740640j759003j704759j603599j470029
3575A9161951j331211j117287j008118q05661o24824m58985k82411j56326n9218
3566A3317910Q0835K35530L86417N15731O31724P80132Q92228J017535J117289
$$ plain form
3628 19622250 21898174 24644839 27763183 31152244 34552376 37764791 40689649 43159710
3620 43159710 45016147 46248707 46855562 46901832 46577065 46105454 45671655 45413614 45434137
3611 45434137 45846251 46544053 47354297 48212645 48923032 49307490 49303527 48790493 47760660 46271481
3601 46271481 44445148 42401657 40375635 38450709 36817514 35541999 34655269 34095632
3593 34095632 33924780 34022722 34223004 34472194 34586702 34575263 34369859 33897919 33095646 32003812
3583 32003812 30663324 29127081 27439981 25699341 23940338 22235579 20631980 19161951
3575 19161951 17830740 16713453 15705335 14899674 14274850 13815865 13533454 13377128 13317910
3566 13317910 13398745 13634275 14020692 14536423 15168147 15948279 16840507 17858042 18975331
3557A8975331J182928J196083J225575J203142J066563R69245Q18175N34285L32454
3548B7503781J28637j50657l63753n96864p47869r05138j009586j048188j085546
3539B1724817j092921j034995q57787p85803p30830n64584m13762l17233k71431
3530A5655471k13756j57628j98018j90974j24741j15730j27256j28202o8735k1648
3520A4308783Q277M1863O8679R8277P2687Q4446J18863J09075P1059P9776P4663
3509A5136448P1879R6723J64389K44789K77896L90432M37662N41377N75288O28563
3499A8565446O97876P47419P50893Q23297Q75343R20966R26027J011865J119737
3490B6438869J265235J459413J631691J788940K061864K342914K578296K863552
$$ plain form
3557 18975331 20158259 21354342 22579917 23783059 24849622 25818867 26637042 27171327 27503781
3548 27503781 27632418 27481761 27118008 26521144 25773275 24868137 23858551 22810363 21724817
3539 21724817 20631896 19596901 18739114 17953311 17222481 16657897 16244135 15926902 15655471
3530 15655471 15441715 15284087 15086069 14895095 14770354 14654624 14527368 14399166 14330431 14308783
3520 14308783 14317060 14358923 14427602 14525879 14598566 14683012 14801875 14910950 14982009 15061785 15136448
3509 15136448 15208327 15305050 15469439 15714228 15992124 16382556 16820218 17361595 17936883 18565446
3499 18565446 19263322 20010741 20761634 21584931 22460274 23381240 24307267 25319132 26438869
3490 26438869 27704104 29163517 30795208 32584148 34646012 36988926 39567222 42430774
3482D2430774L182760L621791M043659M473652M865328N207455N451753N584884
3474G8862056N613980N516179N270933M952368M460829M078340L680727L365881
3466A15801293L051355K839796K664000K484058K178320J790274J253622N98953
3458A32661671j48882q27214j639718k365836l018296l691834m185868m564727
3450A12219296m840158m998292n019150n031614m943386m794709m529411m173396
3442G3889180l688502l158939k411795j633631p48632J70748J037516J774443
3434F5230388K472025K970591L211865L249838K984405K519156J870103J254906
3426H5763277N80448j6370n56791r26785j221542j303621j256155j090933q33573
$$ plain form
3482 42430774 45613534 49235325 53278984 57752636 62617964 67825419 73277172 78862056
3474 78862056 84476036 89992215 95263148 100215516 104676345 108754685 112435412 115801293
3466 115801293 118852648 121692444 124356444 126840502 129018822 130809096 132062718 132661671
3458 132661671 132512789 131685575 130045857 127680021 124661725 120969891 116784023 112219296
3450 112219296 107379138 102380846 97361696 92330082 87386696 82591987 78062576 73889180
3442 73889180 70200678 67041739 64629944 62996313 62247681 62418429 63455945 65230388
3434 65230388 67702413 70673004 73884869 77134707 80119112 82638268 84508371 85763277
3426 85763277 86343725 86327355 85770564 84843779 83622237 82318616 81062461 79971528 79137955
3417G9137955n64286l00392p6541L8884J2496j32091m38198r12553j472818k004825
3407G3287631k583660l062305l442713l707700l874252l882291l806177l688647
3399D5239886l426741l250661l003844k706391k501594k266994k016601j841327
3391B4225733j600670j425582j307238j159061j048112r07546q40078p26125o34963
3382A4576358n92079n29782l86882l54126k85738k49566j90094j04358m7785j7733
3372A1818215K8409J10006J74467K05244L12645M47102M81628M87196N74679O18116
3362A5257707O15812N56370N10301M68262L56955K30511P0139p3631k25921l42786
3352A7423719l93159m44471m53167n22968n73353o23755o28832o77499p05201
$$ plain form
3417 79137955 78573669 78273277 78196736 78235620 78248116 78116025 77677827 76765274 75292456 73287631
3407 73287631 70703971 67641666 64198953 60491253 56617001 52734710 48928533 45239886
3399 45239886 41813145 38562484 35558640 32852249 30350655 28083661 26067060 24225733
3391 24225733 22625063 21199481 19892243 18733182 17685070 16777524 15937446 15211321 14576358
3382 14576358 13984279 13454497 13067615 12713489 12427751 12178185 11988091 11883733 11835948 11818215
3372 11818215 11846624 11956630 12131097 12336341 12648986 13096088 13577716 14064912 14639591 15257707
3362 15257707 15873519 16429889 16940190 17408452 17765407 17995918 18066057 17992426 17766505 17423719
3352 17423719 17030560 16586089 16132922 15609954 15036601 14412846 13784014 13106515 12401314
3343A2401314o54387n67834n25241m45010l52781k94947k26277k06940j08188
3334I019709r6923k9255q248O7744P1180J16923J49894J72135K15472L07903L48522
3323A0335056L81359M60955N46841O64483P63900R46828J096487J363174J626775
3314A8185858K061533K465923K961134L517794M195831M808788N355302N727827
3306D9279990O091807O319051O306002O174927N804470N139529M102760K925619
3298I2144155J508013m721j422426k818209m029951m909188n660250o090563o267532
3289F2449328o199041n996286n523053n118253m568030l997548l526750k992402
3281B4527965k571305k183378j895821j599308j378872j201451r70377q75594
$$ plain form
3343 12401314 11746927 11179093 10653852 10208842 9856061 9561114 9334837 9127897 9019709
3334 9019709 8922786 8893531 8885283 8953027 9024207 9141130 9291024 9463159 9678631 9986534 10335056
3323 10335056 10716415 11177370 11724211 12388694 13152594 14099422 15195909 16559083 18185858
3314 18185858 20247391 22713314 25674448 29192242 33388073 38196861 43552163 49279990
3306 49279990 55371797 61690848 67996850 74171777 79976247 85115776 89218536 92144155
3298 92144155 93652168 93647447 92225021 89406812 85376861 80467673 74807423 68716860 62449328
3289 62449328 56250287 50254001 44730948 39612695 35044665 31047117 27520367 24527965
3281 24527965 21956660 19773282 17877461 16278153 14899281 13697830 12727453 11851859
3273A1851859p64158o38697n13663n18912m84892l99584l72018l30769k38694
3264G590472k51180k55337j80361j47064k22704j54410j13733j68647j44210j34907
3254E817919p9356p4215j2506m3947m2314j9421k6212k2910R870J1256K7030k0642
3242E524552o0600n9085l5660k7321j08019m1532o9957j75746j37190j13526j94159
3231D501757j61576j42109j30094j38254r6835o9772n9541n5663q6781M975l4702
3220C531405k1130k1409j5841p3591p1583o2350Q548O694j6203J361j0924m373
3208C250604L4898j3951l9014L7132l0355R603p415K6197P7492N6614N2880O9076
3196C523761M1120N5172L2620J8532K6972M7063j6267J8893j8880M6724O5910
$$ plain form
3273 11851859 11087701 10449004 9935341 9416429 8931537 8531953 8159935 7829166 7590472
3264 7590472 7339292 7083955 6903594 6756530 6533826 6379416 6265683 6097036 5952826 5817919
3254 5817919 5738563 5664348 5651842 5607895 5565581 5546160 5519948 5497038 5506908 5518164 5545194 5524552
3242 5524552 5463952 5404867 5369207 5341886 5233867 5192335 5122378 4946632 4809442 4695916 4501757
3231 4501757 4340181 4198072 4067978 3929724 3832889 3763117 3703576 3647913 3561132 3566107 3531405
3220 3531405 3510275 3488866 3473025 3399434 3327851 3265501 3274049 3280743 3264540 3265901 3254977 3250604
3208 3250604 3285502 3271551 3232537 3269669 3239314 3248917 3241502 3267699 3345191 3401805 3454685 3523761
3196 3523761 3564881 3620053 3652673 3671205 3698177 3745240 3728973 3747866 3728986 3775710 3841620
3185C841620K2131O1140L2184J05266J1507J6586N818K2120j0580K4086L409j515
3173D133772L2913P9539J6681L9193L8342L0046P6660P1388Q9592P5418J20188
3162D803732R4823J44580J00521J05237J31433J14931J00762R4453J31060J40794
3152E962326J80631J81711K09994K48213K30789K10429J53899J67985J46272J35751
3142G828000J20242J01072J13631J22603R6463J53455J30408J26497J37903J64993
3132I095267J37874J46953J67151J07694J58200J60994K10544K81176L01717L34933
3122A1102503N21804N93721O26588N82250M82650L24453J93543J00494K5791l1977
3112A4521820L14j8474N193Q5409J44683J83053K72819L08623L51364M66335N20595
$$ plain form
3185 3841620 3863751 3924891 3957075 4062341 4073848 4090434 4096252 4118372 4107792 4131878 4135287 4133772
3173 4133772 4166685 4246224 4262905 4302098 4340440 4370486 4447146 4518534 4608126 4683544 4803732
3162 4803732 4898555 5043135 5143656 5248893 5380326 5495257 5596019 5690472 5821532 5962326
3152 5962326 6142957 6324668 6534662 6782875 7013664 7224093 7377992 7545977 7692249 7828000
3142 7828000 7948242 8049314 8162945 8285548 8382011 8535466 8665874 8792371 8930274 9095267
3132 9095267 9233141 9380094 9547245 9654939 9813139 9974133 10184677 10465853 10767570 11102503
3122 11102503 11624307 12218028 12844616 13426866 13909516 14233969 14427512 14528006 14553797 14521820
3112 14521820 14522134 14503660 14508853 14594262 14738945 14921998 15194817 15503440 15854804 16321139 16841734
3101A6841734N44774O27499P41542P76550R24703J073476J301904J531332J798308
3092B6161822K019055K344991K638569L058288L583046M241740N195981O365287
3084E5608779Q143845J0672668J3851182J7327914J9938666K0248220J7782708
3077A63573982J3296394Q823611N545376M700432P526018J4396294K3084931K9451683
3069B70398721K9482503K1307322Q240438m852393j6334314k5426410l0476379
3062B52339488l1742822l0416535k7847585k4559552k0891936j7150154j3783285
3055H5947619j0944554q838022p287447o129783n213720m448132l819522l266684
3047C5999755k887529k500623k145923j841458j667236j486809j317153j176675
$$ plain form
3101 16841734 17386508 18014007 18755549 19532099 20456802 21530278 22832182 24363514 26161822
3092 26161822 28180877 30525868 33164437 36222725 39805771 44047511 49243492 55608779
3084 55608779 63752624 74425292 88276474 105604388 125543054 145791274 163573982
3077 163573982 176870376 185693987 191239363 195939795 203465813 217862107 240947038 270398721
3069 270398721 299881224 321188546 329428984 324576591 308242277 282815867 252339488
3062 252339488 220596666 190180131 162332546 137772994 116881058 99730904 85947619
3055 85947619 75003065 66165043 58877596 52747813 47534093 43085961 39266439 35999755
3047 35999755 33112226 30611603 28465680 26624222 24956986 23470177 22153024 20976349
3039B0976349j066657r37067q59545p58700p04640o61945o13596n79874n19343
3030A4274982m37641m24793m47403l51543l77698l59613l90964l31225k96877
3021A0857225k90422k18015k71969k35619k13258k05988k28004k66912k44988
3012H682050k31994k53257k23509k39041k12079k27450k55087j97130j89010k48026
3002F405467k29008k10444k04884j67507j72847j31248j24949p0479o0807o6488
2992D966806r0152j05889q2723j35617p9411l2796j12347p3929p3473n9923j0844
2981D109702m0320o9733j18054n1275n2694m1381o4009j2200m9020r6161k6096
2970C488759k8516m1636m3675l9867n5561q4026q1582l9697p2530m1231m6969
$$ plain form
3039 20976349 19909692 18972625 18113080 17354380 16649740 15987795 15374199 14794325 14274982
3030 14274982 13837341 13412548 12965145 12613602 12235904 11876291 11485327 11154102 10857225
3021 10857225 10566803 10348788 10076819 9841200 9627942 9421954 9193950 8927038 8682050
3012 8682050 8450056 8196799 7973290 7734249 7522170 7294720 7039633 6842503 6653493 6405467
3002 6405467 6176459 5966015 5761131 5593624 5420777 5289529 5164580 5094101 5033294 4966806
2992 4966806 4876654 4770765 4688042 4552425 4473014 4440218 4327871 4253942 4180469 4120546 4109702
2981 4109702 4069382 3999649 3881595 3830320 3777626 3736245 3672236 3660036 3611016 3514855 3488759
2970 3488759 3460243 3418607 3374932 3335065 3279504 3195478 3113896 3074199 3001669 2960438 2913469
2959B913469n4923o6835q8455o2079q8522r8401l3166R859k9265n3207m4601m6076
2947B257798m4809J0473L0572J8994j1981k0759m8120j5667m6910l3606l4938
2936B061047j3549n3400J3499j2911k3098P896m6970J1459r0396n8091m7257J2156
2924A760385r651L045m314K0910N950k5154k2334K9844k6184J0009J8676k3524
2912A737658J92k3317M6388N008J7625M433J7241l956K533j9507j6938k9416q968
2899A728976m3725j0677l8763l8715l0103q310r469m0665j2073l5632j6263r3955
2887A350626j5465j12j8909p1969j2227k1598m3439j6493P086k2206n5771N064
2875A084587K7189J3056k9265n820K456N09O442J8378l5649n5492j3304j2921
$$ plain form
2959 2913469 2858546 2791711 2703256 2641177 2552655 2454254 2421088 2430947 2401682 2348475 2303874 2257798
2947 2257798 2212989 2223462 2254034 2273028 2261047 2240288 2192168 2176501 2129591 2095985 2061047
2936 2061047 2047498 1994098 2007597 1994686 1971588 1979484 1932514 1943973 1853577 1795486 1748229 1760385
2924 1760385 1750734 1753779 1749465 1770375 1776325 1751171 1728837 1758681 1732497 1742506 1761182 1737658
2912 1737658 1737850 1714533 1760921 1765929 1783554 1787987 1805228 1801272 1803805 1784298 1767360 1737944 1728976
2899 1728976 1685251 1674574 1635811 1597096 1566993 1558683 1549214 1508549 1496476 1460844 1444581 1350626
2887 1350626 1335161 1335049 1316140 1244171 1231944 1210346 1166907 1150414 1157500 1135294 1079523 1084587
2875 1084587 1111776 1124832 1095567 1089747 1092203 1092712 1099154 1117532 1081883 1026391 1013087 1000166
2863A000166J0505j7878l2582m2464n5888k7750j8543k5801K183j0676J8312L153
2851H02737k8707m98j1502L1633j4079O627N1419K3487Q822Q585j2724J7238j1626
2838H71412q257M526k033K4311p95J0843k9490j5162J0874J2871l5219r470J3366
2825H47777r348k9490j2469L1863J3474l0091j4823j3173J4016L6152J3379L6259
2813H83526J7009L5213j7338P0015J3273L812k208K8714K8442L0886M1726O5428
2801A198498J7017L8920K8052O7596P6765P8339J00557O1509R4945J4486P2820
2790A849504J2651J03063Q4756J48611J51090Q1579J0917l4120r6468j46415j37315
2779B027853j52238j64409j80874j15232j18889r0677q9147q7575r1832k5492
$$ plain form
2863 1000166 1010671 992793 960211 917747 861859 834109 815566 789765 791948 781272 799584 802737
2851 802737 774030 773532 762030 793663 779584 786211 837630 861117 869939 878524 865800 883038 871412
2838 871412 863155 867681 865648 889959 889164 900007 870517 855355 866229 879100 843881 834411 847777
2825 847777 838429 808939 796470 828333 841807 811716 796893 783720 797736 833888 847267 883526
2813 883526 900535 935748 918410 988425 1001698 1005510 1003302 1032016 1060458 1091344 1133070 1198498
2801 1198498 1215515 1254435 1282487 1350083 1426848 1505187 1605744 1667253 1762198 1776684 1849504
2790 1849504 1862155 1965218 2049974 2198585 2349675 2431254 2442171 2408051 2311583 2165168 2027853
2779 2027853 1875615 1711206 1530332 1415100 1296211 1205534 1116387 1028812 936980 911488
2769I11488k0494m4642K047p3239l5989l0606l7916M119J1534N887j09l5118m8765
2756F08197n456j063M2L6104K2699J1775k9443K30j3622j6169k6172m4824O96
2743E42994J0992k968J6060K3877k6789M2442K3386J990j1955o391Q799Q898P74
2730F32109m3784K399P027l2469J297K2895j9945K7306l1325K2375K9819k7822
2718E89882m512j6940J2119k734M245n3227q630m466k9931j9493K2570j063J260
2705D89080j9682L0209l4018k3622l690K7095N637q176J0860J2289K651L29J3724
2692E02686j9622n1J0750M9681l7034k313j8817J474m0623M3343K6630r405L9551
2679E46250r115L659J5292M488k2741M882k8400M685j8927M7265k1192k3583l8346
$$ plain form
2769 911488 890994 846352 848399 775160 739171 708565 670649 674768 686302 692189 692080 656962 608197
2756 608197 602741 601678 601720 637824 660523 672298 642855 643085 629463 613294 587122 542298 542994
2743 542994 553986 551018 567078 590955 564166 606608 629994 631984 620029 613638 622437 631335 632109
2730 632109 588325 590724 597751 565282 566579 589474 569529 596835 565510 587885 617704 589882
2718 589882 585370 568430 580549 577815 582060 528833 520203 515737 485806 466313 488883 487820 489080
2705 489080 469398 499607 465589 441967 438277 465372 471009 462833 473693 485982 488633 488962 502686
2692 502686 483064 483013 493763 543444 506410 504097 485280 486754 446131 489474 516104 506699 546250
2679 546250 537135 540794 556086 560574 537833 542715 514315 519000 500073 547338 526146 502563 464217
2666D64217j3868j6168j0031q493j7058j2102j2471L6346l947J959k4061q261
2654C76062k8841J3860j9841p260l4733K9234K3173K347k3135J775L4897K829
2642C70367M4772j5796j4736l1403N866k4815k8544q63j212N3315o347O582j888
2629C55298R432N0793O630k9050m6181l186L9244J7925J960o915J5558k5905K9485
2616D15088o529l814j9688L8326J5018N550j3511l7621L4044o986J8015k1143
2604D16749K1473o751R825j0573J3576L911k3742J2023K4380K5044p483M092j1443
2591D71081m512o602K0493K895L313J9877K8275L4331N2522R39J8176K6290o312
2578F60766l0786m1499l3260m6998L8368m1358m3735o523J9428k2720K8246m1997
$$ plain form
2666 464217 450349 434181 424150 415657 398599 386497 374026 410372 406425 408384 384323 376062
2654 376062 347221 361081 341240 333980 299247 328481 351654 354001 330866 332641 367538 370367
2642 370367 415139 399343 384607 353204 359070 334255 305711 304848 303636 356951 350604 357186 355298
2629 355298 364730 415523 422153 393103 346922 343736 382980 400905 402865 395950 411508 385603 415088
2616 415088 408559 404745 385057 423383 438401 443951 430440 392819 426863 419877 437892 416749
2604 416749 438222 431471 441296 430723 444299 448210 424468 436491 460871 485915 478432 482524 471081
2591 471081 466569 459967 480460 483355 486668 506545 534820 569151 621673 622612 640788 667078 660766
2578 660766 629980 588481 555221 508223 546591 505233 461498 454975 474403 451683 479929 437932
2566D37932R045l5223K6833K7514o4948n2379j0703L3881P245J9869j4842j5713
2554C68511l2081K8678l3472J8925o55l2706p1515K4243R691J8164m1430o409
2542B49944J1266l3825L4473l535J6188n065o741q088N2141k8190k5201J4399
2530B67766J0306J5899L647l2768J3400Q649k1871J1650J3851o651L3510L0200
2518C47588m8630J9091k3321r662l4170k964k394L3849J6538n0573r262L368J0408
2505B49866n086L5732k7985J5040j0747L2365L363l5261j6204J7258Q740N024
2493B72105K0722n186J0823k9085P9M497N204J5286J5953m5410J4300j8197J8447
2480B79538J436l166M0107L0958j6414j9666L4287J356j4156j9650j3624m673
$$ plain form
2566 437932 446977 411754 438587 466101 401153 348774 338071 371952 379197 399066 384224 368511
2554 368511 336430 365108 331636 350561 349906 317200 245685 269928 279619 297783 256353 249944
2542 249944 261210 227385 261858 258323 274511 269446 262705 254617 306758 278568 253367 267766
2530 267766 278072 293971 297618 264850 278250 286899 265028 276678 290529 283878 317388 347588
2518 347588 298958 318049 294728 285066 250896 247932 245538 279387 295925 245352 236090 239458 249866
2505 249866 244780 280512 252527 267567 256820 289185 292548 257287 241083 258341 267081 272105
2493 272105 292827 287641 298464 269379 269458 273955 279159 294445 310398 264988 279288 261091 279538
2480 279538 280974 277808 317915 348873 332459 312793 347080 348436 334280 314630 301006 296333
2468B96333o409j7547N0709J7013q709o2138k475K3875L609j685l488J6976n36
2455C05528L4078J1104j1192n9444L0644l0849q412o820n159J9841M701N474l3241
2442B56253L2875j9159J6292k8577M6240l1968j4883l805K4834m0198K4461J0626
2430B72991J9918q46M261J521j9912L760j5704N3317l4113K3131l577p435n1605
2417B45707O5341k7374M8018l1162m0217J8270L3553K1710J1395N153k9107m326
2405C16961K4910L6686n7165m77m166L2994l2590L6619j085J2201q07M646L0070
2392C98797J4914j981k6516N1057L534o362r218M2486o597K6619K3136J0358m1866
2379D78361J7487k4350k2293P512j1326J1248K976K6001M8294J9817m403p224
$$ plain form
2468 296333 289924 272377 323086 340099 331390 269252 266777 290652 294261 292576 289088 306064 305528
2455 305528 339606 350710 339518 280074 310718 279869 271457 264637 259478 279319 284020 289494 256253
2442 256253 289128 269969 286261 257684 303924 271956 257073 253268 278102 237904 262365 272991
2430 272991 292909 292063 296324 297845 277933 281693 265989 319306 285193 308324 304747 297312 245707
2417 245707 311048 283674 331692 300530 260313 278583 312136 333846 345241 350394 321287 316961
2405 316961 341871 378557 321392 320915 316749 349743 317153 353772 352687 364888 364081 368727 398797
2392 398797 413711 411730 385214 436271 439805 433443 424225 466711 460114 486733 509869 520227 478361
2379 478361 495848 471498 449205 456717 445391 456639 459615 485616 533910 553727 549324 542100
2367E42100m234K5585J094K3949l2565M1746M4737Q197j994k011K1124J028K587
2354F71343M0463O4415O831M8243j0974Q282L3738Q2093J9767K2500K5143j6922
2342I94922Q0672J0270O6107M8373Q7702P0127J19454R4480J31904K02321L11566
2331B217898L64644L49099K37197J68247J73476J87192L00986M04806O07243Q51654
2321E862442J136232J650286K805711N060771P009936Q020520O454773K232988
2313D0233659k96560j834701m157862n019074m604525m187906l567669l229450
2305A3335912k665226j936695j397668q46200n67678m27806m05507l91438l43459
2296D354235l64366m03314l26884k83631k46113k24882j94788j18429j06707j32885
$$ plain form
2367 542100 537866 563451 564545 588494 555929 597675 642412 650609 648615 646604 667728 668756 671343
2354 671343 711806 776221 783052 831295 820321 828603 862341 944434 964201 986701 1011844 994922
2342 994922 1075594 1085864 1151971 1200344 1288046 1358173 1477627 1572107 1704011 1906332 2217898
2331 2217898 2582542 2931641 3168838 3337085 3510561 3697753 3998739 4403545 5010788 5862442
2321 5862442 6998674 8648960 11454671 16515442 23525378 31545898 38000671 40233659
2313 40233659 39937099 38102398 33944536 28925462 24320937 20133031 16565362 13335912
2305 13335912 10670686 8733991 7336323 6490123 5922445 5494639 5089132 4697694 4354235
2296 4354235 3989869 3586555 3259671 2976040 2729927 2505045 2310257 2191828 2085121 1952236
2286A952236j55720q2260r2401M243o8045j6239p6643o0421m4987n8353k9923
2275A271487m6519m4362Q385m0610n1683j6774j8710j4851n7366n196p229K4752
2263A001324p0417j4089n8520k3781o48J974k1122l2677M2756P26l9502o8076
2251G17948J4372P820m7544o3938k3619j5787N408N06K3472k7667k550j3384J4447
2238E89484m17n4398L635K4500J7736k1879K2886r873n322k6360J5918J5822J897
2225E73629o7095m583L4623j8574l1927j1109M1225k3952K479l114L295n453j0227
2212D79217l5765l393l1683k3226R301K0917Q453k4793o431l4753j6960l7259
2200C03625M7413M984J0784l9903K0672l3640l784Q000J7047k185k5899R922l3656
$$ plain form
2286 1952236 1796516 1714256 1621855 1626098 1558053 1541814 1465171 1404750 1359763 1301410 1271487
2275 1271487 1224968 1180606 1188991 1148381 1096698 1079924 1061214 1046363 988997 983801 976572 1001324
2263 1001324 930907 916818 858298 834517 833869 835843 814721 782044 824800 825526 786024 717948
2251 717948 732320 740140 692596 628658 605039 589252 594660 595166 618638 590971 588421 575037 589484
2238 589484 589067 534669 538304 562804 580540 558661 581547 571674 566352 539992 555910 571732 573629
2225 573629 506534 501951 536574 518000 486073 474964 516189 492237 494716 491602 494897 489444 479217
2212 479217 443452 440059 408376 385150 394451 415368 423821 399028 392597 357844 340884 303625
2200 303625 351038 356022 366806 326903 347575 313935 310151 318151 335198 333013 307114 317036 283380
2187B83380J6384r934L7618l2918k9749Q282K2999l2373K683j8074L7624m231
2175B81691j0903l179l3307J281l7593L1874J886K4229n7070K5068J1995n073
2163B30899p365J6504N809k526k456M436J0705O371j1667k7966K7393J620M2297
2150B94054l1802j694q040J3752m5648L5626k2760j1421K5697J8175j7610j304
2138B47025J6810L3666j8684m6195P0j5063K4438r022j167m939J0586j533L9643
2125B75635m968O304J3735m0641m538O643K5732l3011j4743J9257N4953j1575
2113B92783k0010p258j5640l992O877k916K010L195o253J9833k886O837k6056
2100B46524J559r175r88l8449K0841l532k5725m054L5882j4815m757j771N1154
$$ plain form
2187 283380 299764 289830 327448 294530 264781 273063 296062 263689 266372 248298 285922 281691
2175 281691 270788 267609 234302 235583 197990 229864 231750 255979 198909 223977 235972 230899
2163 230899 223534 240038 245847 243321 240865 245301 256006 262377 250710 222744 250137 251757 294054
2150 294054 262252 260558 252518 266270 220622 256248 233488 222067 247764 265939 248329 247025
2138 247025 263835 297501 278817 232622 232692 217629 242067 233045 231878 226939 237525 235992 275635
2125 275635 270667 276971 290706 250065 245527 252170 277902 244891 230148 249405 304358 292783
2113 292783 272773 265515 249875 245883 252760 249844 251854 255049 248796 268629 265743 272580 246524
2100 246524 248083 238908 237920 199471 220312 216780 191055 187001 222883 208068 203311 201540 252694
2087B52694j2425l9509L5586L975P167k1990j6207j1789k856p913J521k1469k1274
2074A45511r197L0139M5906l1282j411L832p689k1738J1061K1691K1358k9682
2062A78499Q328m458k5518J7314J1126J1563l0455M584M2366l59k8487M6868M359
2049B35730J4161K4594M3291L8871Q616j7992K4013M842k7405p3304k974j9887
2037B52556l2625O242M02K069J2776P565l0067L347j1321L7285l4873k9205j476
2024A82675K478O347j8861j8213J8309r52J5924l619L921J7149q065J9746j254
2011B15585J307l4614L4949j8244K4907j8801J1841p779k8347P519M4790K424
1999B35537k4088L7788m2175J0453K635L416l700K1640k0093Q62k8582j3548J4612
$$ plain form
2087 252694 240269 200760 236346 240321 247488 225498 209291 197502 194646 186733 188254 166785 145511
2074 145511 136314 166453 212359 181077 179666 183498 175809 154071 165132 186823 208181 178499
2062 178499 186827 182369 156851 174165 185291 196854 166399 170983 213349 212990 184503 231371 235730
2049 235730 249891 274485 317776 356647 365263 347271 371284 376126 348721 275417 272443 252556
2037 252556 219931 226173 226575 228644 241420 248985 218918 222265 210944 248229 213356 184151 182675
2024 182675 185153 191500 172639 154426 172735 171783 187707 184088 188009 205158 197093 216839 215585
2011 215585 216892 182278 217227 198983 223890 205089 216930 209151 180804 188323 233113 235537
1999 235537 211449 249237 207062 217515 220150 223566 219866 241506 221413 222275 193693 180145 194757
1986A94757k8507M572M688l3737j4858M6676K3864l2409k6796k984J9311J7809
1974A72386m38J9775j7188k0685j7567O327J8228j8267L3667N416k3988k9100
1962A28566K5765m175K4944P31k8920p627l5749J6610k1776K8727L4795j9983
1950A41908L249K1451N698J3894o5933k2938K3642K157L927p350k1756K0171J4423
1937A32543j2185l2684M1762J0183j3699L2336j9704J7580l8274J5449K796L8338
1925A74441l036j2631q093k3394L820J957M1882l3657n400L8161R092n086j7108
1912A60948J5829k120o4369K2575Q683j557L23J1869K1857k416N778J3335q652
1899A82083j3563k175L750N563p203j3508k777J3159m1458j4581Q144L9081j0995
$$ plain form
1986 194757 166250 170822 175510 141773 126915 173591 197455 165046 138250 135266 154577 172386
1974 172386 171948 191723 174535 153850 136283 142610 160838 142571 176238 181654 157666 128566
1962 128566 154331 150156 175100 175831 146911 139284 103535 120145 98369 127096 161891 141908
1950 141908 145157 166608 172306 186200 120267 97329 120971 123128 127055 119705 97949 118120 132543
1937 132543 120358 87674 129436 139619 125920 158256 138552 156132 117858 133307 136103 174441
1925 174441 171405 158774 150681 127287 131107 133064 174946 141289 135889 174050 183142 178056 160948
1912 160948 176777 174657 110288 132863 141546 139989 140312 152181 174038 171622 177400 190735 182083
1899 182083 168520 166345 170095 175658 168455 154947 152170 165329 123871 109290 117434 156515 145520
1886A45520j1911L0634K8554l3836K7042R010k4139K1372n9577K3397k1150L24
1874A35240j5229K7952k2641r126j9290j4314K0172N41K8899j3715J7204J0332
1862A46025J0308l7817L522Q825J3812k9935J5232J4823n110k2047N0735k9253
1850A39120j8141K834m050K2653j6877l2859q785L1035j4975J2913l401J9881
1838A29348l1563J2733J5925k1667j7948q544M6967K2453k5303k6746J8241Q742
1826A22638k3595m870L9680K1578k398j8967j4693j0580J4553J5805J5563r96
1814A53718J0188L014n6509J6745N564J0738N178j3630Q725K5672l493k7773j455
1801A36682L3253K674j5134M3551k5850j3898j4841J2625L844J5117k1942j5165
$$ plain form
1886 145520 133609 164243 192797 158961 186003 195013 170874 192246 132669 156066 134916 135240
1874 135240 120011 147963 125322 116196 96906 82592 102764 103305 132204 118489 135693 146025
1862 146025 156333 118516 122038 130863 144675 114740 129972 144795 139685 117638 168373 139120
1850 139120 120979 123813 119763 142416 125539 92680 83895 114930 99955 112868 109467 129348
1838 129348 97785 110518 126443 104776 86828 78284 125251 147704 122401 95655 113896 122638
1826 122638 99043 94173 133853 155431 153033 134066 119373 108793 123346 139151 154714 153718
1814 153718 163906 166920 110411 127156 132720 143458 148636 135006 143731 169403 165910 138137 136682
1801 136682 169935 172609 157475 201026 175176 161278 146437 159062 162906 178023 156081 140916
1789A40916Q754j6616n88L7639K5131m6623k8348q252p76o915L2352L4574N4818
1776B26066p1712p776j840J7866j6255q462N562k0097N762K4720J5930k7492j4780
1763A27492L945o855l8182n145K0439j8557r00P718j078J3949m2209j0182K1664
1750G2099J1280o840K796J2755j7040l7483j0098L2373J2156L8106j8510j9044
1738G2550j0307L0922K3960M0065j2484r365l0294l186k4136R536L4547m2772
1726G9036K3376j3087k3784j5078M173k6271K7018j8143Q854O554L9511J2146
1714A04305P868m464J7114k1623l566K6197J9680n9814k863o063N031J017J4970
1701I7789M6363J2790n093l3422k1535K0949p69l125L0591j0617k4734M390J0688
$$ plain form
1789 140916 149670 133054 132466 170105 195236 148613 120265 112013 111237 104322 136674 171248 226066
1776 226066 154354 146578 144738 162604 146349 137887 143449 123352 129114 153834 169764 142272 127492
1763 127492 131437 124582 86400 81255 101694 83137 82237 89955 88877 102826 60617 50435 72099
1750 72099 83379 76539 79335 92090 75050 37567 27469 59842 71998 110104 91594 72550
1738 72550 62243 93165 117125 157190 144706 135341 105047 101861 77725 87261 121808 79036
1726 79036 102412 89325 65541 50463 54636 28365 55383 37240 46094 52648 92159 104305
1714 104305 112173 107709 124823 103200 99634 125831 145511 85697 82834 76771 81802 82819 97789
1701 97789 144152 156942 151849 118427 96892 117841 117072 113947 144538 133921 109187 113577 124265
1688A24265p194L3732J0888l8552K131L8788J7468l909k9369Q424r486J0710l528
1675A54368J8690M822l0901L716m482r804l2838K3673j6107L4941j5025p453M9588
1662A73188j5069k6746q523l198L034k1770k8396j148L4801K1316k3210J8846
1650A23125k8230J3118q744L776j3797j2878k9143L5176j3324P925J9231L4934
1638A31169m315k9810J9860k0119l4763q659J7026p881n916j2910k286L7293m082
1625G4607R766J1231k7579m547l999O893m354k9626L6602L2165m854m0609l4110
1612B1586j3180J4348J3416K8015J6343k1372n03K964Q129j6397L1997n568o898
1599G2880j7174J5068N1733l1121m9726q488M1269p167j2670L0308J3017o0835
$$ plain form
1688 124265 117071 150803 161691 123139 125270 164058 181526 177617 148248 156672 147186 157896 154368
1675 154368 173058 177880 146979 150695 146213 136409 103571 127244 111137 146078 131053 123600 173188
1662 173188 158119 131373 122850 119652 122686 100916 72520 71372 106173 127489 104279 123125
1650 123125 94895 108013 99269 103045 89248 76370 47227 82403 69079 77004 96235 131169
1638 131169 126854 97044 116904 96785 62022 53363 70389 62508 56592 43682 41396 78689 74607
1625 74607 84373 95604 68025 63478 59479 66372 62018 32392 68994 101159 96305 55696 21586
1612 21586 8406 22754 36170 64185 80528 59156 58653 61617 69746 53349 85346 79778 72880
1599 72880 55706 70774 122507 91386 41660 33172 74441 67274 54604 84912 97929 37094
1587C7094K1051J8379L420k3432M243K5610J0509o62j2774R472j1430P381O162
1574I5023R403j1383l844K2360L5223j4156j7908R198p505K080N7742l6172j1605
1561A28456q984m917J0294L4189j8450l3969K5229K2028l293m49J8204k0072j8028
1548A30238K3833j6638k5195j6972j2310L8415L7078k8929l6487N771P593j6457
1536H9940K5465Q18m2773l6747O2616J3575R117q168k4316J1507k6705j5530N358
1523F4157j0808j0398J3965L2646J8301m7811l9316J0785K0659M383J0099j7836
1511D8826N272n787j3285J2413K0689K5736k8079j1201Q735m6520N5901J5617
1499H8317m1630J4022J5935j7924q179J123M158J1867Q901M1448O327l8662j3252
$$ plain form
1587 37094 58145 76524 79944 56512 60755 86365 96874 96212 83438 92910 81480 88861 95023
1574 95023 104426 93043 89199 111559 146782 132626 114718 123916 116411 118491 176233 140061 128456
1561 128456 119472 114555 124849 159038 140588 106619 131848 153876 150583 150134 168338 148266 130238
1548 130238 154071 137433 112238 95266 82956 121371 158449 129520 93033 98804 106397 89940
1536 89940 115405 116223 73450 36703 99319 112894 122011 113843 89527 101034 74329 58799 64157
1523 64157 53349 42951 56916 89562 107863 60052 20736 31521 52180 56563 66662 48826
1511 48826 54098 48311 35026 47439 68128 93864 65785 54584 63319 16799 72700 88317
1499 88317 46687 60709 76644 58720 50541 51664 55822 67689 76590 118038 124365 85703 72451
1486G2451k1876M4363K0978k7022p777p57q929M431L8658O430j8738K3026m3371
1473H1867m69r259k9772M0059m037O52L3622Q05l7319K3903M414N543m7808j6976
1459D5225M4758K3025J8887o469J7728j0973m0343P535L417n66J033k0737N2937
1446A35457q474k5406o703k305J420p872R83J704P768p055n157M7755j130n7683
1432G3302M7647M81l7412L1828L8958l2319m1467m2277M4180K1295p265J8725
1420A15676k0914J6387m4721J5103O893P143j3580L1964J0356o596J715n787L770
1407A17409n7687O713M1688J9214l7278K237m738K5769l3279J7159l992K1718
1395A14933m2211l3638J7822q065J5358k8809j955J5751j8396m220K9497p507
$$ plain form
1486 72451 50575 94938 115916 88894 81117 80360 71431 75862 114520 120950 102212 125238 81867
1473 81867 81398 72139 42367 82426 78389 79041 112663 113468 76149 100052 104466 110009 62201 45225
1459 45225 89983 113008 131895 125426 143154 132181 91838 99373 102790 102224 103257 82520 135457
1446 135457 126983 101577 94874 92569 93989 86117 87100 88804 96572 89517 84360 132115 130985 73302
1432 73302 120949 121430 84018 115846 154804 122485 81018 38741 82921 104216 96951 115676
1420 115676 94762 111149 66428 81531 88424 95567 81987 113951 124307 117711 119426 113639 117409
1407 117409 59722 66435 108123 127337 90059 92296 87558 113327 80048 97207 93215 114933
1395 114933 72722 39084 56906 48841 64199 35390 33435 49186 30790 26570 56067 48560
1383D8560J6034m2000J2858J2221L5919O837k3004j9339J293J2823J3115m8095
1371B7222O333K3114j2930P560j1296m093N372J6689J3500n570j7531j1796l107
1358C3467J7430K1321J2474Q583Q492l0194K1932m693j3182M3365k0498p845l302
1345H7350k3078J6248m411Q323Q55J5043J6125j6400j2053j6337K5315K8818k2718
1332A03080K322k292o08j0178K9096J3473j6877k2186K096r015K1381k1955l3426
1319E4911L1253M3245k0306l1164L2474J854j4634k696N1749j00k0162j5364j4510
1306I6550O0316j7596m215j1236j8374l7792p538l549J0724L6666P101K374j9513
1293I3918j4794Q668j7857k4654K0950j6801Q743J1500K5406M799k569l7371j2405
$$ plain form
1383 48560 64594 22594 35452 47673 83592 90429 67425 48086 49379 62202 75317 27222
1371 27222 33555 56669 43739 51299 40003 35910 41282 57971 71471 65901 48370 36574 33467
1358 33467 50897 72218 84692 93275 101767 71573 93505 88812 75630 118995 98497 90652 87350
1345 87350 64272 80520 76109 84432 85287 100330 116455 100055 88002 71665 96980 125798 103080
1332 103080 105402 103110 102502 92324 121420 134893 118016 95830 97926 88911 110292 88337 54911
1319 54911 86164 129409 109103 77939 110413 112267 97633 94937 146686 146586 126424 111060 96550
1306 96550 156866 139270 135055 123819 105445 67653 60115 56566 67290 103956 111057 113431 93918
1293 93918 79124 87792 69935 45281 66231 49430 58173 69673 95079 99878 97309 59938 47533
1280D7533j8486J8977N6J285L0034j2605n001j9218J5854j4066J0124Q450j0355
1267E2582Q111j4057j3238m644N380R734R037l1805J4844M3597J5575j0448l886
1254H0782j4139k5269j3338L452J9227m268j6673K37m149M4632K4688j9431k0153
1241E5598J3936O415O528j8342o70q483K4864k205O116k0027j3193N0175j9748
1228H0964m7948L8946K2145J01k2231j2619K0645P792k1305j3961K8284p412K482
1215G5883J1635Q893k9074R401n268K5610M6099R137n5049j8310k8497o652j4253
1202B9555K0208L4441J7880j2619n684j5824M0944L1541o0438J7135J641J0658
1190A09438l4211k2830K8991l939j8430K055M110o020N146K5073j6615L227j4828
$$ plain form
1280 47533 29047 48024 48080 49365 79399 66794 61793 42575 58429 44363 54487 62937 52582
1267 52582 60693 46636 33398 28754 34134 43868 52905 21100 35944 79541 95116 84668 80782
1254 80782 66643 41374 28036 31488 50715 46447 29774 30011 25862 70494 95182 75751 55598
1241 55598 69534 75949 82477 64135 63465 54982 79846 77641 83757 63730 50537 100712 80964
1228 80964 33016 71962 94107 94208 71977 59358 80003 87795 66490 52529 80813 73401 75883
1215 75883 87518 96411 67337 76738 71470 97080 143179 152316 97267 78957 50460 43808 29555
1202 29555 49763 84204 102084 89465 83781 67957 108901 140442 80004 97139 98780 109438
1190 109438 75227 52397 81388 77449 59019 61074 65184 59164 64310 89383 72768 75995 61167
1177F1167k755M891j7439L1215P434j0317m6712K6335l6375N39L5235o453L692
1164E0457K2891p987l0630k562j0471K3439j8252j6525J3682K1157m467K1743
1152F2475q499k1601J4604P053n924J4993j6503M972j2895l082J4811J857L759
1139E6020q671J4213k8127o202K0284J6445j3075k5085K4517K4848J7642k7597
1127F5212l8198K6905J5669J9046j008p917l7530j7411L6209K3246l8015Q206
1115E4414J318L378R536q797m0164j0328n388M8441J4694o977J1343J9284p622
1102H3132n489j1669p793K7079K558K0890k8992K282J8961p710k0219P007J6911
1089I6948J9504k6340K993N319Q261l1482Q092J4902K239k400J3466k1367j8013
$$ plain form
1177 61167 58412 63303 45864 77079 84513 74196 27484 53819 17444 17983 53218 46765 50457
1164 50457 73348 65361 34731 32169 21698 45137 26885 10360 24042 45199 40732 62475
1152 62475 53976 32375 46979 54032 48108 63101 46598 51570 38675 35593 50404 52261 56020
1139 56020 47349 61562 33435 27233 47517 63962 50887 25802 50319 75167 92809 65212
1127 65212 27014 53919 69588 88634 87626 79709 42179 24768 60977 84223 46208 54414
1115 54414 55732 59110 68646 59849 19685 9357 3969 52410 67104 60127 71470 90754 83132
1102 83132 77643 65974 58181 85260 87818 108708 79716 81998 100959 93249 73030 80037 96948
1089 96948 116452 90112 93105 98424 106685 75203 83295 98197 100436 98036 111502 90135 72122
1076G2122J4047J1731l539l8295Q602j2857J2097k5787n2909L8355J9911K9650
1064G3128m079m1229r631j8017L0373n273Q296L3917j7592O423n094k2336m036
1051B4850M207R582K2000m9271J4635j0746J5867J5476j73j548K8347N720m0256
1038C8690P12j0575j4981m172L1448q924j2020J9111n034o804m13j1242K1137
1025C6933j1265K0476K7011q286R356K597J4787j6114q356l1492J0911K1681p797
1012F0442q129k1471J8903K708J586K9472P966k1915p521k9873L9395r097Q876
999G1342j555J8620J8818j8364M423L457k5415p752M0923l4515J40J9343K1530
986A10995p03j7780j1419p627l7744J481L7116M607O12l548M771k8429J8933P695
$$ plain form
1076 72122 86169 97900 94361 56066 64668 51811 63908 38121 -14788 23567 43478 73128
1064 73128 69049 27820 18189 172 30545 25272 33568 67485 49893 56316 51222 28886 24850
1051 24850 29057 38639 60639 11368 26003 15257 31124 46600 46427 44879 73226 78946 38690
1038 38690 39402 28827 13846 9674 41122 32198 20178 39289 34255 27451 27038 15796 36933
1025 36933 25668 46144 73155 64869 74225 76822 91609 75495 67139 35647 46558 68239 60442
1012 60442 52313 30842 49745 52453 54039 83511 91477 69562 62041 32168 71563 62466 71342
999 71342 69787 88407 107225 88861 93284 96741 71326 63574 104497 69982 70122 89465 110995
986 110995 110292 92512 81093 73466 35722 37203 74319 78926 79538 75990 80761 52332 71265 78960
972G8960k4110k9161L5179K4298o675j1637n036Q116j4745O352p4j7667j5473
959B8327J1043L4836R580J0335k8061m5982J1272r201p934Q670M238L782p353
946B3552r005J2925m02k149J7891K2962P694o1282J5786J6350j2721j2443K5348
933D4506k4352M720l818K0699R091j2285J9811j9540r230j3780J8933J3346R23
920D9024k4762L1744m447k5533j285j4367M808l405K2811j9112k2175P625P385
907H311K909L4248p28j3981K8229K6366l0876J86k0971J5995l871J2297K733n0336
893A0511M9637k450j4990j1352J4821j5865R356j8630j5347R405K0352l1482K5358
880B9324j550j2578j3742L7482J1j0204K1443M0990J709k5175K508j3945L0927
$$ plain form
972 78960 54850 25689 60868 85166 78491 66854 61818 69934 55189 61541 61467 43800 28327
959 28327 39370 74206 83786 94121 66060 20078 31350 22149 14215 22885 27123 30905 23552
946 23552 14547 27472 27070 24921 42812 65774 73468 12186 27972 44322 31601 19158 44506
933 44506 20154 24874 21056 41755 50846 38561 58372 38832 29602 15822 34755 48101 49024
920 49024 24262 56006 51559 26026 24741 10374 15182 11777 34588 15476 -6699 926 8311
907 8311 11220 45468 44740 30759 58988 85354 54478 54664 33693 49688 45817 58114 60847 10511
893 10511 60148 57698 42708 31356 46177 30312 39668 21038 5691 15096 35448 3966 29324
880 29324 27774 15196 1454 38936 38947 28743 50186 91176 92885 67710 70218 56273 87200
867H7200k7098n3005j5431N7891J6658j7357K3642M911J0153o082M1709k6953
855I6238k1864O793J6411p7661j8300N771K090L3970L5121j2646L3385k1828j8864
842E8616K6499m2894k4621n867J7762p950J5699j6380J7104l188M3414m5730P94
829C3258J7740j1170J4k2095l2611J6591K1048m996K2872O904K9770k5661j4093
816C7571j9024J9099J164j1615J625o254K0996j786J1080J6286r668m9523M9360
803E9311j3268k1411K7617K8264j1233O66n2917J6352l221p238K4640R329o622
790E0269j1859l581Q473N540j7443J1111j8163L1838o20j7143k8993K4221P396
777D1046l7304L1541L1032j4351J9694j8490Q77j5882l6850O2445k2223J1292
$$ plain form
867 87200 60102 7097 -8334 49557 66215 48858 72500 77411 87564 81482 123191 96238
855 96238 74374 81167 97578 19917 1617 7388 9478 43448 78569 65923 99308 77480 58616
842 58616 85115 42221 17600 11733 29495 21545 37244 20864 37968 34780 78194 32464 33258
829 33258 50998 39828 39842 17747 -14864 1727 22775 17779 40651 47555 77325 51664 37571
816 37571 18547 37646 38810 27195 28820 22566 43562 41776 52856 69142 59474 9951 59311
803 59311 46043 24632 52249 80513 69280 69946 17029 33381 30160 22922 47562 56891 50269
790 50269 38410 34829 43302 48842 31399 42510 24347 56185 55565 38422 9429 33650 41046
777 41046 3742 35283 66315 51964 71658 53168 54045 38163 1313 63758 41535 52827
765E2827j0188K1043J3503j875l2306j6045J5351K3918j2390k1150J3706l7339
753I055j151L2332K941l348L25j9293L1962q799J1316l066l959k7782k2607K5052
739B2978n540L1802k6027o130j6403L0215Q921P21k4498J3535k445k7358j4215
726a4444J9153K7193Q273k0618k0185L9874p419J8950l1366o24l8949N0298k0339
713I797J5420j940K3322r817r989J1597k5947J5142K1079M175k4780j2006j0083
700E970M4762j5499p042j9054K7283K588n702k8552j29N060j4531j0529o015M8609
686B7219j1138K7837K0690l2729k2004J6737m8696J0197K4902J9945k4106K6954
674C5808j8007k129J2980l6556P482K8179J5199J1113j4028k6544M6848m0529
$$ plain form
765 52827 42639 63682 77185 75310 43004 26959 42310 66228 53838 32688 46394 9055
753 9055 7904 40236 43177 39829 40154 20861 52823 44024 55340 52274 48315 20533 -2074 22978
739 22978 17438 49240 23213 17083 680 30895 39816 40537 16039 29574 27129 -229 -14444
726 -14444 4709 31902 40175 19557 -628 39246 31827 50777 19411 18787 -20162 30136 9797
713 9797 25217 23277 46599 36782 26793 38390 12443 27585 48664 52839 28059 16053 5970
700 5970 50732 35233 28191 9137 36420 39008 33306 4754 4625 9685 -4846 -15375 -21390 27219
686 27219 16081 43918 64608 31879 9875 26612 -22084 -11887 13015 32960 8854 35808
674 35808 17801 15672 28652 -7904 -422 27757 42956 54069 40041 13497 60345 19816
662A9816J7652P302J283j2482j0789j0745O775K5347M117M0279o2087K1554k4462
649B3560J874l6630l875J5409K9592M687r309R812K5416l3377p849L7224k3751
636C2783K3516R78j3415l2144J4663P208K5995l6164J5433n213J3876k3692j1268
623A2556Q266K9988k3958J2955L5099l052J8139j7775j1033j8559r796K834L832
610C9496J6730L1032j6306r029Q832p662J6454P783J072k8741p429k6030K6586
597E2788P862k7372k5712k0498J6553K6578l4795q713m839K4853J6722p215M5913
584F2125K487o53l0473K0712N4l004l1943j7320K9403p144p771M8784k8023l3058
570D176K9356r679L835p698j786r104J7111l4924L8708m3895k346K6708j0060
$$ plain form
662 19816 37468 44770 46053 33571 22782 12037 18812 44159 48276 88555 26468 48022 23560
649 23560 25434 -11196 -15071 338 29930 34617 25308 35120 60536 27159 19310 56534 32783
636 32783 56299 57277 43862 11718 26381 33589 59584 23420 38853 33640 47516 23824 12556
623 12556 20822 50810 26852 39807 74906 71854 89993 72218 61185 42626 32830 35664 39496
610 39496 56226 87258 70952 61923 70755 63093 79547 87330 88402 59661 52232 26202 52788
597 52788 60650 33278 7566 -12932 3621 30199 -4596 -13309 -18148 6705 23427 16212 62125
584 62125 64612 63959 33486 54198 54252 51248 19305 1985 31388 24244 16473 65257 37234 4176
570 4176 33532 23853 27688 19990 18204 9100 26211 -8713 29995 -13900 -16246 10462 402
557D02J0395K8881k9091k106J3926k6079L3881J8705j9059j5264L2864k5837p994
544A3624j7006K9216K8568L4113k7837j7859j9505K5588K1437l6911j3850N041
532B4619L5514Q851R726j3053j9264J7031N119m8708N0839j9202j9544L4653k1875
519D4706P308l5988M029j9705L9270p523K4614l2553j4536J7291j3824L553k1954
506e312J884K6854o236J3461k2338j4326Q045k5484J8962j3555M0706k9389M521
493b207r28L4388j254k4773L5261R688J144j4722J7126L638p149R51J4626j2844
479E2945l7752P07K2637j4347K2364K4501j9706o473q390q578j7228n623Q082
466A3139J7487m88l1959n1928K6336J1895R776k3776K5201J143j4570j7711K2782
$$ plain form
557 402 10797 39678 10587 8481 22407 -3672 30209 48914 29855 14591 47455 21618 13624
544 13624 -3382 25834 54402 88515 60678 42819 23314 48902 70339 33428 19578 24619
532 24619 60133 68984 78710 65657 46393 63424 68543 19835 70674 51472 31928 66581 44706
519 44706 52014 16026 20055 350 39620 32097 56711 24158 9622 26913 13089 16642 -5312
506 -5312 -3428 23426 17190 30651 8313 -6013 2032 -23452 -4490 -18045 22661 -6728 -2207
493 -2207 -3135 31253 29999 5226 40487 50175 51319 36597 53723 57361 50212 51163 65789 52945
479 52945 15193 15900 38537 24190 46554 71055 51349 44876 36486 27908 10680 5057 13139
466 13139 30626 30138 -1821 -53749 -27413 -15518 -5742 -29518 -4317 -3174 -17744 -35455 -12673
453a2673M108n6791L4902l1048N3051m0718M4640O543L0323J4058J7372k9161
441C4606m3174L1976K8905m4050K3656L0046l2149k8593K4469N5127k1185J4468
429G4102l3013J6708n8121J9565l4099j5385J3040J0120L0841O100K492r037J235
416B4548N79K3723k0783J2956k990Q739P464J3247l7916K9030l557k8652j9294
403G094J612K0933N72j919o5582J4292K6300K1584m1088L7280R482q315k2298
390e3R674K9063K3195k9325K884q118l0306J9647n697L6017p302k075j1384J0840
376C7060j3605O546k3705o719J0874P71l781J4204R897m3935K0239k0698K5015
363A2163j0762L7219m2462J2907M514N2476o604l7712j0059Q023O677j3855K0265
$$ plain form
453 -12673 -8565 -65356 -30454 -61502 -8451 -49169 -4529 2014 32337 46395 63767 34606
441 34606 -8568 23408 52313 8263 31919 61965 29816 1223 25692 80819 59634 74102
429 74102 41089 57797 -324 19241 -14858 -30243 -17203 -7083 23758 29858 32350 23313 24548
416 24548 25127 48850 28067 41023 38033 46772 54236 67483 29567 58597 55040 26388 7094
403 7094 8706 29639 30211 28292 -37290 -22998 3302 24886 -16202 21078 30560 22245 -53
390 -53 9621 38684 61879 32554 35438 27320 -2986 16661 10964 46981 39679 37604 26220 37060
376 37060 23455 30001 6296 -423 10451 11222 7441 21645 31542 -12393 7846 -12852 12163
363 12163 1401 38620 -3842 9065 13579 66055 59451 21739 11680 19703 26380 12525 32790
350C2790J0295R436j9149n637o256M2k4362J3552k4454R392K1901Q597k1975j2122
336g950K9782L39l449k0237J5217K0856J9705n9276J981J3684m764L2128j5008
323B3008k3595j1892L3609L5770K734j7427M066k9349K572j5951N1491k4792K2504
310E2748l1130l639p230k33R871j2666J7452k1248k9420K3471J8381n210j3292
297b145K7470L7543m4769j9749q364K6710j7827K8017J4494q597L4688l3707L1901
284F5665R27j7414j7442J1040J1453m0447N467L721k9574M094J2595J3779m9624
271b5760K6480J6856j4647K096l404M2745m0361J3391l2931J0733p863k3911J5817
258b0759J5987N709J2468L436Q80r228R265J7692r952j0242l7416k381k4321L6833
$$ plain form
350 32790 43085 52521 33372 27735 21479 21521 -2841 10711 -13743 -4351 17550 26147 4172 -7950
336 -7950 21832 22171 18722 -1515 13702 34558 54263 -5013 -3032 10652 5888 38016 23008
323 23008 -587 -12479 21130 56900 59634 42207 46273 16924 19496 3545 55036 30244 52748
310 52748 21618 17979 10749 10516 20387 7721 25173 3925 -25495 -2024 16357 11147 -2145
297 -2145 25325 62868 18099 -1650 -10014 16696 -1131 26886 41380 32783 67471 33764 65665
284 65665 66592 49178 31736 42776 54229 13782 19249 22970 -6604 -2510 10085 23864 -25760
271 -25760 720 17576 2929 5025 1621 44366 4005 17396 -15535 -4802 -12665 -36576 -20759
258 -20759 -4772 937 13405 16841 17721 8493 17758 35450 25498 15256 -22160 -24541 -48862 -12029
244a2029n182N5270j3368k4615m2663L1187L3278k6622j5k674j029j7987K1890
231d559J8539Q685m0899J5615j4419j2046L756O3016k7145k2690Q128l0801N011
218b9809j0477K3353J691J739K3341R04K375J7027N780k1429K1225K4200m4625
205A5295q477K70r042K5295j1280J1044j5945Q541j2807J8495l3694K5239q297
192D637K163J1560J0927o633L0448m688k5555N137k8968j526j4203K1673l848
179A124M429j5556J2655k4060J578K439L8297J9647l0373j3064j0837J0855O48
166b218m360l0274Q125k1285j544j7160R036J6095J5223j3503Q466r999L0378
153a3020J9354m4616L1974l5270M046j0474P843N63m682Q617K1153j0814o040
$$ plain form
244 -12029 -17211 38059 24691 76 -42587 -11400 21878 -4744 -4759 -7433 -8462 -26449 -4559
231 -4559 13980 22665 -18234 -2619 -17038 -29084 -25328 37688 10543 -12147 -4019 -34820 -29809
218 -29809 -40286 -16933 -15242 -13503 9838 10742 13117 30144 35924 14495 35720 59920 15295
205 15295 6818 7088 -1954 23341 12061 23105 7160 15701 2894 21389 -12305 12934 4637
192 4637 6800 18360 29287 22654 53102 48414 22859 27996 -972 -2498 -16701 4972 1124
179 1124 5553 -10003 2652 -21408 -19830 -17391 20906 40553 10180 -2884 -13721 -2866 -2218
166 -2218 -6578 -36852 -28727 -50012 -51556 -68716 -59680 -43585 -28362 -41865 -33399 -43398 -13020
153 -13020 6334 -38282 -6308 -41578 -37532 -48006 -40163 -39600 -44282 -35665 -14512 -25326 -31366
140c1366k5262J0699Q461k786k1534L0345k755J1461j4655K325l618m1586M5089
127c5182l0668K6908k422r51m101k1001k5499Q593L47Q693K4747j5347M3J5091
113e0749K9173j8595q556k7251KK786K8816m037K110o668K3287J1400k3967J205
99d1044j8828L3142K1244k0817M138n936J84J0161j9850j2121l6521K5139Q720
86e2389J1666j5678j5726J3796m222L0961L033k0667K85j794o515l1628J5635
73g3243K8792j8347n855J3461j0563l790J8705p79j9637k3395K5060j3307j1514
60i4412o38j2284j748J8812q896j3751K2152m024k0611p83J6045k4840L241l657
46a25394k6211K0667o878l643M368P86J0682K2358j6177q703m25l2219j8092J6728
$$ plain form
140 -31366 -56628 -45929 -37468 -40254 -61788 -31443 -34198 -22737 -37392 -35067 -38685 -80271 -35182
127 -35182 -65850 -38942 -41364 -42315 -46416 -67417 -92916 -84323 -83976 -75283 -50536 -65883 -65840 -50749
113 -50749 -21576 -40171 -48727 -75978 -75976 -73190 -44374 -48411 -46301 -52969 -29682 -18282 -42249 -41044
99 -41044 -59872 -26730 -5486 -26303 -22165 -28101 -27917 -17756 -37606 -49727 -86248 -61109 -52389
86 -52389 -40723 -56401 -72127 -58331 -62553 -31592 -28559 -49226 -48941 -50735 -57250 -88878 -73243
73 -73243 -44451 -62798 -68653 -55192 -65755 -69545 -50840 -51619 -71256 -94651 -69591 -82898 -94412
60 -94412 -95050 -107334 -109082 -90270 -99166 -112917 -90765 -94789 -115400 -116183 -100138 -124978 -121737 -125394
46 -125394 -151605 -130938 -137816 -141459 -137091 -136305 -125623 -103265 -119442 -128145 -128570 -160789 -178881 -162153
32a62153J8304p324M820r90L5452j7470k0443J55J3316l0367M630j2235J0619
19a63686K8523n638J9134j8858J116q146J5356j4382j4369k7522J801k531J2353
6a76849K34J9690J0034n130J191K4185
0a26645
$$ plain form
32 -162153 -143849 -151173 -146353 -147343 -111891 -129361 -149804 -149649 -136333 -166700 -162070 -174305 -163686
19 -163686 -135163 -140801 -121667 -140525 -139409 -147555 -132199 -146581 -160950 -188472 -186671 -189202 -176849
6 -176849 -176615 -156925 -146891 -152021 -150830 -126645
0 -126645
$$ Imaginary data points
##PAGE= N=2
##DATA TABLE= (X++(I..I)), XYDATA
16383a020718J4626q354L6061m597L1933K4588J3219J2341J4720k469J2912K1807
16371h53931j4442K3910j4556K661J6585L4515P985N149L1020J6738o882K0472
16359g30776J3037J2367j3848K4453J5435m495k768L431K0552J8007K4184N726
16347f14695O269L107J4346J3658J5740J1488J9619k284J7043j0498Q594Q512
16335e09101J952P920R445M7723k161P031J7449K9099L3985N846N633O022J7009
16322c22148J5416p686q50P995J6619K6811K7975l546o377J1059j2157K9144K7864
16309a89881K0199K4941L313K9262K4990j4729j1879K8503J4995R947k087L4594
16297b7832O592m1129L3433L4614K1848K4366k3512K6348K2002p789L6218K2807
$$ plain form
16383 -1020718 -1006092 -1014446 -978385 -982982 -951049 -926461 -913242 -900901 -886181 -888650 -875738 -853931
16371 -853931 -868373 -844463 -859019 -856358 -839773 -805258 -797273 -792124 -761104 -744366 -751248 -730776
16359 -730776 -717739 -705372 -719220 -694767 -679332 -683827 -686595 -683164 -662612 -644605 -620421 -614695
16347 -614695 -608426 -605319 -590973 -577315 -561575 -550087 -530468 -532752 -515709 -526207 -517613 -509101
16335 -509101 -507149 -499229 -489784 -442061 -444222 -437191 -419742 -390643 -356658 -350812 -345179 -339157 -322148
16322 -322148 -306732 -314418 -315268 -307273 -290654 -263843 -235868 -239414 -245791 -234732 -246889 -217745 -189881
16309 -189881 -169682 -144741 -141428 -112166 -87176 -101905 -113784 -85281 -70286 -60339 -62426 -27832
16297 -27832 -21240 -62369 -28936 5678 27526 51892 28380 54728 76730 68941 105159 127966
16285A27966L644k0033k3888N448O704L247J5433M1957J0059J8308P662P806K612
16272B06925J8276P736j2734J1892K771K0050K3237k0642P43K6626m199k5226
16260B55455K7014J6159M3881J4922j0467j1506J0162o630M411L7259j3230J3562
16248C80992k6374Q059j4125L5926k3355K0739J2191J9193p962K802n733J4092
16236D16445M2919k0930j573p103L722o559R160K0377k574M045L3981j6680K8236
16223E03466j725J0988j8326J8964j3693j5508K1529J4776K2859k637L6996K35
16211E77924k5469J982J2071Q594n063J4447L1683k0934K0738j54J8367J8332
16199F52518n177J9785J3640m2779J9413L0777J2801k5603J0839K3495q51K4645
$$ plain form
16285 127966 131610 111577 87689 93137 99841 103088 118521 160478 170537 188845 196507 204313 206925
16272 206925 225201 232937 220203 232095 234866 254916 278153 257511 258254 284880 280681 255455
16260 255455 282469 298628 342509 357431 346964 335458 345620 338990 343401 380660 367430 380992
16248 380992 354618 362677 348552 384478 361123 381862 394053 413246 405284 408086 402353 416445
16236 416445 459364 438434 436861 429758 433480 426921 436081 456458 453884 457929 491910 475230 503466
16223 503466 501741 512729 494403 513367 499674 484166 505695 520471 543330 540693 577689 577924
16211 577924 552455 554437 566508 575102 570039 584486 616169 595235 615973 615819 634186 652518
16199 652518 647341 667126 680766 637987 657400 688177 700978 675375 686214 709709 708858 733503
16187G33503k7114K3755k1022k5344P837J3305L1212O650P863L958J4847N036
16175G74486r913R899j774q41P490K2269L859k0860m267p340m7407J3900M4779
16162G84280k5306L172M5758k2659O60P333k1031l78L0746p141J3645M1826Q15
16149H51720m2012K0138L3788m9649l4658M1228L2590j5844j003l196J653m2743
16137G92012M3459K834m525J7806l4188J3049P88N866N369J8777m7032P891j3099
16124H09007J2022K7310r63k2964o629k3704K3196M865n295Q522o923m196p074
16111H07174J7282k7611K0267J1398J3340j5252K2648k3936J0532P869L4628k0452
16099H57887j6200K0552o758j3816l158J4105J4919j623K6255K1147k6809l570
$$ plain form
16187 733503 706389 730144 709122 683778 691615 704920 736132 742782 750645 754603 769450 774486
16175 774486 764573 774472 772698 771857 779347 801616 805475 784615 780348 773008 725601 739501 784280
16162 784280 758974 762146 807904 785245 785905 793238 772207 771829 802575 795434 809079 850905 851720
16149 851720 809708 829846 863634 813985 779327 820555 853145 837301 836298 833102 834755 792012
16137 792012 835471 838305 833780 851586 817398 830447 831235 837101 842470 861247 814215 822106 809007
16124 809007 821029 848339 847376 824412 817783 794079 817275 822140 816845 825367 818444 814248 807174
16111 807174 824456 796845 817112 828510 841850 826598 849246 825310 835842 843711 878339 857887
16099 857887 841687 862239 855481 841665 838507 852612 867531 865908 892163 913310 886501 882931
16087H82931j1062J5285m898o498K8L2493k7299K080K6488N870j4890j9581K3358
16074I04305j967J7449J356Q120o935r048J8421M0954J025l2607j7262K7433J109
16061I52353l359P986M66l4047M23Q040p922j2347m079K8506K5555J630l9177
16048I24028L0626O811j3215k1179O203R061P537J1150K2039N902n4663n23k8485
16035I05292m226J1801J4152J1324J7786m2280k8683Q112j145N916P845J6872
16023I22766L909J814j1427R890k633P648k7159l827k2829J1574K1418M138l2101
16010H83181J68N443j3638k6919J5547K9030l8689k3246K7751N7688k7923o7680
15998H20713N4167N2739j3554l2247J1488j8485o440q200K9108J5717R950J4709
$$ plain form
16087 882931 871869 887154 882256 875758 875786 908279 880980 883060 909548 915418 900528 880947 904305
16074 904305 902338 919787 921143 929263 922328 913280 931701 972655 973680 941073 923811 951244 952353
16061 952353 948994 956980 957446 923399 923822 931862 923940 911593 907514 936020 961575 963205 924028
16048 924028 954654 961465 948250 927071 933274 942335 949872 961022 983061 988963 934300 933777 905292
16035 905292 901066 912867 927019 938343 956129 913849 885166 893278 892133 898049 905894 922766
16023 922766 926675 928489 917062 926952 924319 931967 904808 900981 878152 889726 911144 915282 883181
16010 883181 883349 888792 875154 848235 863782 892812 854123 830877 858628 916316 888393 820713
15998 820713 874880 927619 914065 881818 893306 874821 868381 860181 889289 905006 914956 929665
15986I29665M846j578k1102k9243K1072l0415O487j1851Q156J242j5009L1209
15974H93479o263L4669m0771K8552J1308M1056j6083p102o968o259J478J1791
15962I38887k0090K1276L989K7019m285l0003J976j1037O360l038K2939K61r622
$$ plain form
15986 929665 934511 932933 911831 882588 903660 873245 879732 867881 876037 877279 862270 893479
15974 893479 887216 921885 881114 909666 920974 962030 945947 938845 931877 925618 927096 938887
15962 938887 918797 940073 944062 971081 966796 936793 938769 927732 934092 931054 953993 954254 944632
$$ [...]
##END NTUPLES=NMR SPECTRUM
##END=
