##TITLE=1H_DE-80H_X3
 200.13MHz, d2o
 8 sc
 
 19ns.26.2.2025
##JCAMPDX= 6.0         $$ Bruker NMR JCAMP-DX V2.0
##DATA TYPE= NMR SPECTRUM
##DATA CLASS= NTUPLES
##ORIGIN= UXNMR, Bruker Analytische Messtechnik GmbH
##OWNER= pz
$$ XWIN-NMR		Version 3.5
$$ Thu Jul  2 10:39:49 2026 Russian Standard Time (UT+4h)  Yarkov@DPX200
##.OBSERVE FREQUENCY= 200.1313
##.OBSERVE NUCLEUS= ^1H
##.ACQUISITION MODE= SIMULTANEOUS
##.ACQUISITION SCHEME= undefined
##.AVERAGES= 8
##.DIGITISER RES= 18
##SPECTROMETER/DATA SYSTEM= spect
##.PULSE SEQUENCE= zg30
##.SOLVENT NAME= DMSO
##.SHIFT REFERENCE= (INTERNAL, DMSO, 0, 15.5023)
##AUDIT TRAIL= $$ (NUMBER, WHEN, WHO, WHERE, WHAT)
$$ ##TITLE= Audit trail, XWIN-NMR		Version 3.5
$$ ##JCAMPDX= 5.01
$$ ##ORIGIN= Bruker BioSpin GmbH
$$ ##OWNER= Yarkov
$$ C:/Bruker/XWIN-NMR/data/yarkov2/nmr/H-C/1/pdata/1/auditp.txt
$$ ##AUDIT TRAIL=  $$ (NUMBER, WHEN, WHO, WHERE, WHAT)
(   1,<2026-07-02 10:39:03.06 +0400>,<Yarkov>,<DPX200>,
      <created by zg, POWCHK disabled, PULCHK disabled
       configuration hash MD5:
       00 E9 B6 7A A2 85 ED C7 34 08 36 98 17 FE 4E 26
       data hash MD5: 16K
       66 DA 09 AC D6 26 A3 4E DC A8 B2 03 DF C2 59 35>)
(   2,<2026-07-02 10:39:09.31 +0400>,<Yarkov>,<DPX200>,
      <Start of raw data processing
       efp BC_mod = 2 LB = 0.25 FT_mod = 6 PKNL = 1 PHC0 = -6894.148 PHC1 = 6.42196 SI = 16K 
       data hash MD5: 16K
       4B 4D E2 9E 28 7C B6 0A C6 08 A5 56 1B 3C A9 F2>)
$$ ##END=
$$ 
$$ hash MD5
$$ 89 BC 88 7E B7 35 D0 7D A0 9E 59 5C AA F6 62 F4
##$RELAX= 
##$RELAX= 
##$RELAX= 
##$RELAX= 
##$RELAX= 
##$RELAX= 
$$ Bruker specific parameters
$$ --------------------------
##$DU= <C:/Bruker/XWIN-NMR>
##$EXPNO= 1
##$NAME= <H-C>
##$PROCNO= 1
##$TYPE= <nmr>
##$USER= <yarkov2>
##$AMP= (0..31)
100 100 100 100 100 100 100 100 100 100 100 100 100 100 100 100 100 100 
100 100 100 100 100 100 100 100 100 100 100 100 100 100 
##$AQSEQ= 0
##$AQ_mod= 1
##$AUNM= <au_zg>
##$AUTOPOS= <>
##$BF1= 200.13
##$BF2= 200.13
##$BF3= 200.13
##$BF4= 200.13
##$BF5= 200.13
##$BF6= 200.13
##$BF7= 200.13
##$BF8= 200.13
##$BYTORDA= 1
##$CFDGTYP= 0
##$CFRGTYP= 5
##$CHEMSTR= <none>
##$CNST= (0..31)
1 1 145 1 1 1 1 1 1 1 1 1 1 1 1 1 1 1 1 1 1 1 1 1 1 1 1 1 1 1 1 1 
##$CPDPRG= <>
##$CPDPRG1= <>
##$CPDPRG2= <>
##$CPDPRG3= <>
##$CPDPRG4= <mlev>
##$CPDPRG5= <mlev>
##$CPDPRG6= <mlev>
##$CPDPRG7= <mlev>
##$CPDPRG8= <mlev>
##$CPDPRGB= <>
##$CPDPRGT= <>
##$D= (0..31)
0 0.7 0 0 0 0 0 0 0 0 0 0.03 0 0 0 0 0 0 0 0 0 0 0 0 0 0 0 0 0 0 0 0 
##$DATE= 1782974342
##$DBL= (0..7)
120 120 120 120 120 120 120 120 
##$DBP= (0..7)
150 150 150 150 150 150 150 150 
##$DBP07= 0
##$DBPNAM0= <>
##$DBPNAM1= <>
##$DBPNAM2= <>
##$DBPNAM3= <>
##$DBPNAM4= <>
##$DBPNAM5= <>
##$DBPNAM6= <>
##$DBPNAM7= <>
##$DBPOAL= (0..7)
0.5 0.5 0.5 0.5 0.5 0.5 0.5 0.5 
##$DBPOFFS= (0..7)
0 0 0 0 0 0 0 0 
##$DE= 6
##$DECBNUC= <off>
##$DECIM= 32
##$DECNUC= <off>
##$DECSTAT= 4
##$DIGMOD= 1
##$DIGTYP= 9
##$DL= (0..7)
0 120 120 120 120 120 120 120 
##$DP= (0..7)
$$ [...]
##$SUBNAM2= <"">
##$SUBNAM3= <"">
##$SUBNAM4= <"">
##$SUBNAM5= <"">
##$SUBNAM6= <"">
##$SUBNAM7= <"">
##$SUBNAM8= <"">
##$SUBNAM9= <"">
##$SW= 18.0517328524113
##$SWIBOX= (0..15)
0 0 2 0 0 0 0 0 0 0 0 0 0 0 0 0 
##$SW_h= 3612.71676300578
##$TD= 16384
##$TD0= 1
##$TE= 0
##$TE2= 300
##$TE3= 300
##$TEG= 300
##$TL= (0..7)
0 120 120 120 120 120 120 120 
##$TP= (0..7)
150 150 150 150 150 150 150 150 
##$TP07= 0
##$TPNAME0= <>
##$TPNAME1= <>
##$TPNAME2= <>
##$TPNAME3= <>
##$TPNAME4= <>
##$TPNAME5= <>
##$TPNAME6= <>
##$TPNAME7= <>
##$TPOAL= (0..7)
0.5 0.5 0.5 0.5 0.5 0.5 0.5 0.5 
##$TPOFFS= (0..7)
0 0 0 0 0 0 0 0 
##$TUNHIN= 0
##$TUNHOUT= 0
##$TUNXOUT= 0
##$USERA1= <user>
##$USERA2= <user>
##$USERA3= <user>
##$USERA4= <user>
##$USERA5= <user>
##$V9= 5
##$VALIST= <valist>
##$VCLIST= <CCCCCCCCCCCCCCC>
##$VD= 0
##$VDLIST= <DDDDDDDDDDDDDDD>
##$VPLIST= <PPPPPPPPPPPPPPP>
##$VTLIST= <TTTTTTTTTTTTTTT>
##$WBST= 1024
##$WBSW= 4
##$XGAIN= (0..3)
0 0 0 0 
##$XL= 0
##$YL= 0
##$YMAX_a= 225948
##$YMIN_a= -191907
##$ZGOPTNS= <>
##$ZL1= 120
##$ZL2= 120
##$ZL3= 120
##$ZL4= 120
##$ABSF1= 0
##$ABSF2= 0
##$ABSG= 0
##$ABSL= 0
##$ALPHA= 0
##$AQORDER= 0
##$ASSFAC= 0
##$ASSFACI= 0
##$ASSFACX= 0
##$ASSWID= 0
##$AUNMP= <proc_1d>
##$AZFE= 0.1
##$AZFW= 0.1
##$BCFW= 0
##$BC_mod= 2
##$BYTORDP= 0
##$COROFFS= 0
##$CY= -3
##$DATMOD= 1
##$DC= 0
##$DFILT= <>
##$DTYPP= 0
##$F1P= 0
##$F2P= 0
##$FCOR= 1
##$FTSIZE= 16384
##$FT_mod= 6
##$GAMMA= 0
##$GB= 0
##$INTBC= 1
##$INTSCL= 3.241238e-09
##$ISEN= 128
##$LB= 0.25
##$LEV0= 0
##$LPBIN= 0
##$MAXI= 10000
##$MC2= 0
##$MEAN= 0
##$ME_mod= 0
##$MI= 1.114404
##$NCOEF= 0
##$NC_proc= -6
##$NLEV= 6
##$NOISF1= 3.799351
##$NOISF2= 2.8
##$NSP= 0
##$NTH_PI= 0
##$NZP= 0
##$OFFSET= 15.50229
##$PC= 1
##$PHC0= -6894.148
##$PHC1= 6.42196
##$PH_mod= 1
##$PKNL= yes
##$PPARMOD= 0
##$PSCAL= 0
##$PSIGN= 0
##$REVERSE= no
##$SF= 200.130003884645
##$SI= 16384
##$SIGF1= 3
##$SIGF2= 2
##$SINO= 0.751879
##$SIOLD= 32768
##$SREGLST= <19F.Aceton>
##$SSB= 0
##$STSI= 16384
##$STSR= 0
##$SW_p= 3612.71676300578
##$SYMM= 0
##$S_DEV= 0
##$TDeff= 16384
##$TDoff= 0
##$TI= <>
##$TILT= no
##$TM1= 0
##$TM2= 0
##$TOPLEV= 0
##$USERP1= <user>
##$USERP2= <user>
##$USERP3= <user>
##$USERP4= <user>
##$USERP5= <user>
##$WDW= 1
##$XDIM= 16384
##$YMAX_p= 290941972
##$YMIN_p= -417869
$$ End of Bruker specific parameters
$$ ---------------------------------
##NTUPLES= NMR SPECTRUM
##VAR_NAME=  FREQUENCY,     SPECTRUM/REAL,   SPECTRUM/IMAG
##SYMBOL=    X,             R,               I
##VAR_TYPE=  INDEPENDENT,   DEPENDENT,       DEPENDENT
##VAR_FORM=  AFFN,          ASDF,            ASDF
##VAR_DIM=   16384,         16384,           16384
##UNITS=     HZ,            ARBITRARY UNITS, ARBITRARY UNITS
##FACTOR=    0.220516191357247, 1,           1
##FIRST=     3102.473312298, 0,              0
##LAST=      -510.243450707785, 0,           0
##MIN=       -510.243450707785, -417869,     0
##MAX=       3102.473312298, 290941972,      0
$$ Real data points
##PAGE= N=1
##DATA TABLE= (X++(R..R)), XYDATA
$$ [...]
6152a89555K4969j3520k1067n483J909J4759R657L1752l0539J9935k0077K6974
6140a50286J716k3532j50J5928J7792k8969k4743M2227J630k4785l568K2216O809
6127a47715k6590l793O539l790P971m755J1061L3990L280n407k4014k5526k2571
6114b01320K3800N200K8976K844j160q699j4946p768K2983N741j2300L9388m002
6101a21263l4509Q325j9660j6258j5435L861J9789J8372j7639m3739K8463K2162
6089a67531l7709J4799L656j6419K1823k498m1966o362L0917J6715o358l738M1985
6076a52686r571L1197j3525k2512j3391J7535K0372J1215q480J0663l4813k807
6064a66803K5641l3530J0426L598nj2528R850J4643p123j1475J8064L912Q610
$$ y = [-189555, -164586, -178106, -199173, -204656, -202747, -187988, -178331, -146579, -177118, -157183, -177260, -150286, -148570, -172102, -172252, -156324, -138532, -167501, -192244, -150017, -148387, -173172, -176740, -154524, -147715, -174305, -178098, -171559, -175349, -167378, -172133, -161072, -127082, -123802, -129209, -153223, -178749, -201320, -177520, -172320, -143344, -140500, -141660, -150359, -165305, -173073, -150090, -144349, -156649, -117261, -121263, -155772, -147447, -167107, -183365, -198800, -194939, -175150, -156778, -174417, -218156, -189693, -167531, -205240, -190441, -186785, -203204, -181381, -183879, -225845, -232207, -201290, -184575, -190933, -194671, -152686, -162257, -131060, -144585, -167097, -180488, -162953, -142581, -131366, -139846, -129183, -163996, -166803, -141162, -174692, -164266, -160668, -160673, -173201, -163351, -148708, -155831, -167306, -149242, -145330, -136720]
6051a36720J0058r134J2986l7435K0002j4212l7876J1824O879K1979Q710R02j84
6038a42221l364l3988L5991N934l3406k7560R608N865l1814L827K8057M609k2049
6025b00511K3892J1277k0801k820R125K7528R619j28J4026K4907l1165K5147j8123
6012a28027m4278K904M4083P431j9391K180K8330k5429k387J5332O177l8378k2389
5999a73842N682J3486N780r766N602L2098R440l3606K8565j012j012J1646J5974
5986i0965k1019P681l2383q841j6450j2193J676K4396L7235q029N3410j1375k6177
5973a03034N472j54n204j3463l753j3860M3793k4211J8891l3434k837K6798k0297
5960a25293J0101j0151Q627P521j0853j6506J5314q203k5334P646L4980j5789
$$ y = [-136720, -126662, -135796, -122810, -160245, -140243, -154455, -192331, -180507, -173628, -151649, -142939, -142037, -142221, -145585, -179573, -143582, -137648, -171054, -198614, -189006, -183141, -214955, -211128, -183071, -178462, -200511, -176619, -165342, -186143, -188963, -179838, -152310, -142691, -142819, -128793, -103886, -135051, -109904, -128027, -172305, -169401, -125318, -117887, -137278, -135098, -106768, -132197, -134584, -119252, -113075, -151453, -173842, -168160, -154674, -148894, -158660, -153058, -120960, -111520, -145126, -116561, -117573, -118585, -106939, -90965, -111984, -104303, -136686, -145527, -161977, -174170, -172494, -148098, -110863, -118892, -65482, -76857, -103034, -97562, -97716, -102920, -116383, -120136, -133996, -90203, -114414, -95523, -128957, -131794, -104996, -125293, -115192, -125343, -116716, -109195, -120048, -136554, -121240, -129443, -154777, -147131, -112151, -127940]
5948a27940j6644K9183K8864k2745l0262m737J0986j5863r553J6613m603j0009
5936a56710L1488Q201o0013j8394N1420K4753r867n950r145J8001K0628J5260
5924i0328o146l1146K946J4462L227J205j4141q564n110n874n596J1161k3303
5911a57207P071J8523J0822o166p616j7292k1025K1433j4703J8348k2157l988
5899a73957Q556J1049O213m4147K8048K649K1005L2818j2856l1943k4184j8733
5887a95482N70J6135j0646M2241K1750j6399Q108O050N1226k261m5299l1638K8973
5874a26672J5430j8486L6604j0766K5124N88l573K167Q22K2343j2178r819p642
5861h6058M8896P385o700q131R173K3097k153P6005N5245K6412Q094r544N6800
$$ y = [-127940, -144584, -115401, -86537, -109282, -139544, -144281, -133295, -149158, -158711, -142098, -146701, -156710, -125222, -117021, -177034, -195428, -144008, -119255, -129122, -135072, -144217, -126216, -105588, -90328, -96474, -127620, -124674, -110212, -106985, -105780, -119921, -128485, -133595, -139469, -145065, -133904, -157207, -150136, -131613, -120791, -126957, -134573, -151865, -172890, -151457, -166160, -147812, -169969, -173957, -165401, -154352, -148139, -192286, -164238, -161589, -140584, -107766, -120622, -152565, -176749, -195482, -194912, -178777, -189423, -147182, -125432, -141831, -133723, -127673, -76447, -78708, -124007, -155645, -126672, -111242, -129728, -93124, -103890, -78766, -78178, -81751, -79584, -78762, -56419, -68597, -78416, -86058, -37162, -29777, -36477, -44608, -35435, -12338, -14491, 61514, 116759, 143171, 151265, 141721, 198521]
5848A98521L8129N7165N674m7905K6646l1843Q073L5500N882J2873l0197n503
5836B73015j9644k1462P43O621l4597k3575n1411r802j1935o9120j9429p072k959
5823I373o389K3186k4674q975k8533J9384K8489k7189J850l1869k1086k2109M0314
5810d8228J0989K7592j9694j896K1021k6175K9714J7326P281m435j1294l7964
5798c5763L2635L1207M1619l251r868j63J4526J4389k0003j6086j747p437M487
5785D4545L8185K1965l1660M5130o636J5993L7771N164M5121L2119K1279K1336
5773B90312M6662J7264J1141J04336P2192N2517N9548P5750J06112J46581K16594
5762A199009L80398N90375R70175J443523J675319J332273O18741J07605j94472
$$ y = [198521, 236650, 293815, 299489, 251584, 278230, 246387, 254460, 289960, 295842, 308715, 278518, 273015, 253371, 231909, 232652, 239273, 204676, 181101, 129690, 119888, 107953, 38833, 19404, 12332, 9373, 2984, 26170, 1496, -7479, -36012, -16628, 11861, -15328, -13478, -45347, -66433, -88542, -48228, -37239, -9647, -29341, -31237, -10216, -36391, -6677, 10649, 17930, 13495, 2201, -35763, -3128, 28079, 69698, 66447, 56579, 56416, 70942, 85331, 65328, 49242, 47495, 40058, 44545, 82730, 104695, 73035, 118165, 111529, 127522, 165293, 170457, 215578, 247697, 268976, 290312, 336974, 354238, 365379, 469715, 541907, 594424, 653972, 729722, 835834, 982415, 1199009, 1579407, 2169782, 3139957, 4583480, 6258799, 7591072, 8209813, 8317418, 8122946]
5753H122946o62106r59977j007644j006513p90487o89453o14176m97342l80479
5744A514769k49912j72395j14208j25709r7646n9912r2911m2132p5003k6448m8240
5733D10253p640Q724l9274k4449j2191j9065M896j6904k6473j8335J444K4633
5721B85619N703J976Q875r968m8383J48K0465M454j2198j025L6789k9105j2579
5708B50771r576J5405J5190M412q078l5755J2042K2365r051R055K3629j4418J5238
5695B91229q493m2977j1684j9225L0458M2665m5598p739K6632j2633j023M819
5683B46431J5976n0294L791J0262M0586l2420J715L4205j1571j278J5867r635
5671B63635k7218r124k3082N693K124l0767J3184L9024m914K0425K2585j254o870
$$ y = [8122946, 7460840, 6500863, 5493219, 4486706, 3696219, 3006766, 2392590, 1895248, 1514769, 1264857, 1092462, 978254, 852545, 754899, 694987, 602076, 559944, 484941, 458493, 410253, 402613, 411337, 372063, 347614, 335423, 316358, 321254, 304350, 277877, 259542, 260986, 285619, 291322, 293298, 302173, 292205, 243822, 243970, 264435, 268889, 256691, 255666, 292455, 263350, 250771, 241195, 256600, 271790, 276202, 268124, 232369, 244411, 266776, 257725, 266780, 290409, 275991, 291229, 282736, 239759, 228075, 208850, 239308, 281973, 236375, 228636, 255268, 242635, 241612, 246431, 262407, 212113, 215904, 226166, 266752, 234332, 236047, 270252, 258681, 257403, 273270, 263635, 236417, 227293, 204211, 209904, 212028, 181261, 194445, 233469, 228555, 248980, 271565, 270311, 263441]
5658B63441l2477R522J3775J0672k1511L052M5330Q998L1119J715J1612J1173
5646C56421P474K1921k326K4223L9613k6413L8204N2286J8839J8616K7171J7786
5634E93815p362j1678O694J1227L5287L5600J6562P555J5831q521m847O026K6249
5621G22438K6371K0360Q121J3221j0210K0386K0854r675k6360k764J7395M0696
5609H40833M9669Q9647R623M7082N6963K0971J0600L7003k366j1279M0232J9251
5597A208229P3168R664L5892P7725K6870O27K7182R839L917M8730k0494j5409
5585A485940J7481M9887K9653N6635M2088M2825Q2970R5075Q5813Q7371P4676
5574B150414J03669Q8015R4364J12460J29432J03925J54984J95500J72115J80554
$$ y = [263441, 230964, 240486, 254261, 264933, 243422, 246474, 291804, 300802, 331921, 333636, 345248, 356421, 363895, 385816, 383490, 407713, 447326, 420913, 459117, 511403, 530242, 548858, 576029, 593815, 586453, 574775, 581469, 592696, 627983, 663583, 680145, 687700, 703531, 695010, 690163, 696189, 722438, 748809, 769169, 777290, 790511, 780301, 800687, 821541, 811866, 785506, 782742, 800137, 840833, 890502, 980149, 989772, 1036854, 1093817, 1114788, 1125388, 1162391, 1160025, 1148746, 1188978, 1208229, 1281397, 1291061, 1326953, 1404678, 1431548, 1432175, 1459357, 1469196, 1473113, 1521843, 1501349, 1485940, 1503421, 1553308, 1582961, 1639596, 1681684, 1724509, 1807479, 1902554, 1988367, 2075738, 2150414, 2254083, 2342098, 2436462, 2548922, 2678354, 2782279, 2937263, 3132763, 3304878, 3485432]
5564C485432J77149K61364K18797K49448K87852K90672L34818L95166M58333N00277
5554F659308N55190O32036O73616P48574Q74786R46293J086229J334725J569886
5545A5080643J849574K253993K872636L671604M706394N954607P285230Q419316
5537E2093997Q895059Q333735O780659M734069K624695Q35332k95311n87422J4766
5528H3429579J057177K006610K266385J593358N8481j910961l862604n614703
5520G9023322o969751p617855p725898p352340o786723n964261n064956m229185
5512B7312353l486036k854339k361365j944347j622822j341594j180360r90639
5504A1530851q72038p28221o12767n28377m67430m57195m18227l57355l09749
$$ y = [3485432, 3662581, 3923945, 4142742, 4392190, 4680042, 4970714, 5305532, 5700698, 6159031, 6659308, 7214498, 7846534, 8520150, 9268724, 10143510, 11089803, 12176032, 13510757, 15080643, 16930217, 19184210, 22056846, 25728450, 30434844, 36389451, 43674681, 52093997, 60989056, 69322791, 76103450, 80837519, 83462214, 84297546, 84002235, 83414813, 83429579, 84486756, 86493366, 88759751, 90353109, 90411590, 88500629, 84638025, 79023322, 72053571, 64435716, 56709818, 49357478, 42570755, 36606494, 31541538, 27312353, 23826317, 20971978, 18610613, 16666266, 15043444, 13701850, 12521490, 11530851, 10658813, 9930592, 9317825, 8789448, 8322018, 7864823, 7446596, 7089241, 6779492]
5495F779492l04658k63446k63194k43331k40083k05146j85788j62335j61942j48226
5485D601343j44131j38200j35995j00946j19804j23067j02473q5040q1396r9381
5475C470910r3841j29670j03176n9251j03666r7330n5377j10631j18768o2784
5465B536416n3667p4399r6341n4312l4961n3422p7577j6338o1617r2980k2320
5454A898482r706n1567n0253l2892j8628m1064m6536m7294n2008O153m3027m8072
5442A463588m3024m8485j1168n7740n7896j3542m293n9453N128p116n8230l8948
5430A068821k8422j1909K2245m4434j6372N305l3463J2343q727n484m3736k1247
5418H94920K1059J9068J2358j1284l8226K3086L140n695N4950k0065k3823j5439
$$ y = [6779492, 6474834, 6211388, 5948194, 5704863, 5464780, 5259634, 5073846, 4911511, 4749569, 4601343, 4457212, 4319012, 4183017, 4082071, 3962267, 3839200, 3736727, 3651687, 3570291, 3470910, 3377069, 3247399, 3144223, 3084972, 2981306, 2883976, 2828599, 2717968, 2599200, 2536416, 2482749, 2408350, 2312009, 2257697, 2222736, 2169314, 2091737, 2075399, 2013782, 1920802, 1898482, 1888776, 1837209, 1786956, 1754064, 1735436, 1694372, 1647836, 1600542, 1548534, 1554687, 1511660, 1463588, 1420564, 1372079, 1360911, 1303171, 1245275, 1231733, 1227440, 1167987, 1173115, 1165999, 1107769, 1068821, 1040399, 1028490, 1050735, 1006301, 989929, 995234, 961771, 974114, 965387, 959903, 916167, 894920, 915979, 935047, 947405, 936121, 897895, 920981, 924121, 918426, 973376, 953311, 929488, 914049]
5406I14049K2134j7604J7731M9414p372j4764J7581K2657k9057M397P403m5957
5394I40612l467J7211k934r481o638L118L507K588J9383J2058k2038l6729j2347
5381I04843k2139k0883q303k7176l50k3405j2261p810L585l3429m4275j2861j0575
5368F84961K9322J0264j0214k583K7479j0585l059P50K7545j5742J2471L3076
5356G83685L64P438M2071O202j0707j2520P932O098j8633l499J0222K8999O2173
5343I09825K6465J5957J967J9211K9237L2874K6306K7314R2899L1623J1319o801
5331A218196M5803M4342N1335P3376Q3757O2199P1631Q1950R7965N8816Q3340
5320A972710J21583J85956J35065J69275K14107K08510K23996K42654K37937K24579
$$ y = [914049, 936183, 918579, 936310, 985724, 978352, 963588, 981169, 1003826, 974769, 979166, 986569, 940612, 937145, 954356, 951422, 941941, 935303, 938421, 941928, 944516, 963899, 975957, 953919, 917190, 904843, 882704, 861821, 853518, 826342, 825992, 802587, 790326, 782516, 786101, 752672, 708397, 695536, 684961, 714283, 724547, 714333, 711750, 739229, 728644, 725585, 726335, 753880, 738138, 750609, 783685, 784049, 791487, 833558, 839760, 829053, 816533, 824465, 830563, 811930, 808431, 818653, 847652, 909825, 936290, 952247, 954214, 973425, 1002662, 1035536, 1061842, 1089156, 1182055, 1213678, 1224997, 1218196, 1263999, 1308341, 1359676, 1433052, 1516809, 1579008, 1650639, 1732589, 1830554, 1889370, 1972710, 2094293, 2280249, 2415314, 2584589, 2798696, 3007206, 3231202, 3473856, 3711793, 3936372]
5310C936372K98491L63534M39203N33294O71408P44310Q70763J111703J474334
5301A0443412K019460L065862M595121O128461O975663O294600M189843J827221
5293D5539643j04405j688127k744283k872091j883218j21927J966900L564558
5285D1657050M034062K781675P03924j231475k959296m405625n187615n180382
5277C0212318m717866m105835l541190k993761k357891j816869j368689j099767
5269H210450r10019p54462o37848m95847l95855l32965k65791k04794k14390j80343
5259C818136j69018j73540k13999j72058j08232r4776j06921r4873q0436r2918
5249B511365q1284o2225n1729r2151l5805o1217n9166k0669o7625o3454k7522
$$ y = [3936372, 4234863, 4598397, 5037600, 5570894, 6242302, 6986612, 7857375, 8969078, 10443412, 12462872, 15528734, 20123855, 26252316, 33227979, 39522579, 43712422, 45539643, 45435238, 43747111, 41002828, 38130737, 36247519, 36125592, 38092492, 41657050, 45691112, 48472787, 49176711, 47945236, 44985940, 40580315, 35392700, 30212318, 25494452, 21388617, 17847427, 14853666, 12495775, 10678906, 9310217, 8210450, 7300431, 6545969, 5908121, 5412274, 5016419, 4683454, 4417663, 4212869, 3998479, 3818136, 3649118, 3475578, 3261579, 3089521, 2981289, 2886513, 2779592, 2684719, 2604283, 2511365, 2430081, 2367856, 2316127, 2223976, 2188171, 2126954, 2067788, 2047119, 1979494, 1916040, 1888518]
5238A888518j8791q2956o1198k7552j2409m7276n7298j7640j3417o1726j4585
5227A473670j0276k3631m3870N432k7752L190n940K3858J515K621m081K094k1868
5214A374962k6833o902m3329j2446k3812N394j8421m85j3594o6760l4934k6072
5202A106768j7907p2585o8127m2803n8870m3055k536k7443n9107n5840j9678j8803
5190F20014m507M0946k8219l0149l6879l4191j4796k208J2396J5348n089j7047
5178E15619l736J3034J0111m1953m319K0357L1668n986K644m4488l964k1855r045
5165D58087o502K5543l1365J0478K7498j4354J2921l0740J4155l4564k8047K086
5153D05196R283L181n92J6020l812l9779J1265R048J5671n5018J5157j8505k1655
$$ y = [1888518, 1869727, 1786771, 1725573, 1698021, 1685612, 1638336, 1581038, 1563398, 1549981, 1488255, 1473670, 1463394, 1439763, 1395893, 1401325, 1373573, 1376763, 1370823, 1394681, 1396196, 1398817, 1394736, 1396830, 1374962, 1348129, 1341227, 1297898, 1285452, 1261640, 1267034, 1248613, 1248128, 1234534, 1167774, 1132840, 1106768, 1088861, 1016276, 948149, 905346, 846476, 803421, 800885, 773442, 714335, 658495, 638817, 620014, 615507, 656453, 628234, 598085, 561206, 527015, 512219, 510011, 522407, 537755, 532666, 515619, 511883, 524917, 535028, 493075, 488756, 509113, 540781, 534795, 537439, 492951, 488987, 467132, 458087, 451585, 477128, 445763, 456241, 483739, 469385, 482306, 451566, 465721, 431157, 403110, 405196, 414479, 417660, 417068, 433088, 429276, 389497, 400762, 409810, 425481, 370463, 385620, 367115, 345460]
5140C45460K400j9773j7595r974K6719j9990k0612k992r548j1706R88J5276N923
5127B84576n15l044l7820J8303M2956L356J1998k5893j3743J2241M9344j9911
5115C21848k2065J7547L0637J2187j0087L933L4192k7316j513l503N1819M22K3176
5102D31277K0872k2608k15J4750K9124M440q332m3471j1430l1373m132N006j6321
5089C67587Q89p714K4759l4591o496k2205j6300j7850j5168n489R659n669l7573
5076B33839Q808j9367m736o269J2313K99O406J0275J5258J0652j1192k4000R615
5063B41901O975m941J0519L1572L947K6530J43J6701k8474O76M8778l2147n244
5050C16936K682k2009N6855J399j1113L493K7715j0729k6956j0082j1696m900
$$ y = [345460, 347860, 328087, 310492, 300518, 327237, 307247, 286635, 283643, 274095, 262389, 263377, 278653, 284576, 284061, 281017, 243197, 261500, 304456, 307812, 319810, 293917, 280174, 292415, 341759, 321848, 299783, 317330, 347967, 360154, 350067, 354000, 388192, 360876, 359363, 355860, 407679, 408101, 431277, 452149, 429541, 429326, 444076, 473200, 477640, 469308, 425837, 414407, 383034, 378902, 383908, 367587, 368476, 360762, 385521, 350930, 344434, 322229, 305929, 288079, 272911, 267422, 277081, 271412, 233839, 242647, 223280, 218544, 212275, 224588, 224887, 231293, 241568, 256826, 267478, 256286, 232286, 241901, 248876, 243935, 254454, 286026, 289973, 316503, 316646, 333347, 304873, 305549, 354327, 322180, 316936, 319618, 297609, 354464, 355863, 344750, 348243, 375958, 365229, 338273, 328191, 316495, 311595]
5038C11595L276l585J2988J5921L905k0288j4961j5271N172j513j8633Q62j1515
5025B67953K4242r749j8167L620l1105Q784K1559p717N750j8595j259L2954p891
5012B70379l0862O661Q57L689L4074J7880m3475R399K7918K6305N278J1143J7679
4999C56925K275J0973R261J6475J9321M9572L8742R952N0607M4556J3139j8815
4987F02983j1701M3554l3842J7045M0210n96m0274k3822k2931l0784K0771J1365
4975E71978k1027L8033J3678j2445j671M431k512j0595l462k5254l6798m883j9356
4962D90117J4893q614n1429j9550j3994M238j8137J1212n855j1822J9594K8266
4950D38919k092k3085J3496j7511m1596K2173K0649k2743J5211K395K253K9190
$$ y = [311595, 314871, 311286, 324274, 340195, 344100, 323812, 308851, 293580, 298752, 297239, 278606, 279468, 267953, 292195, 282446, 264279, 267899, 236794, 245578, 267137, 259420, 265170, 246575, 245316, 278270, 270379, 239517, 246178, 247035, 250724, 284798, 302678, 259203, 268602, 296520, 322825, 328103, 339246, 356925, 359200, 370173, 379434, 395909, 415230, 464802, 503544, 513496, 564103, 608659, 621798, 602983, 591282, 634836, 600994, 618039, 658249, 657653, 617379, 593557, 570626, 539842, 560613, 571978, 550951, 588984, 602662, 590217, 588546, 592977, 590465, 579870, 576408, 551154, 514356, 509473, 490117, 505010, 496396, 444967, 425417, 411423, 415661, 397524, 408736, 402881, 391059, 410653, 438919, 436827, 413742, 427238, 409727, 368131, 390304, 410953, 388210, 403421, 405816, 408069, 437259]
4938D37259k9180L9040j172R843r320Q560m2013R182K0462r184k5044L2660J6682
4925D57775P830j1983m5888J3456n810J5302J1814M3182L188J6817n6935j3524
4913D35224m538J0837L6053j6962J3201j3295M0474k1660o802K6286K340r690
4901D91468o826j5534J3365n287k2381M434K234l434N0958J1629J240Q579r331
4888E21114K1281J1146J6012p979p654j4752Q136k2382J9445J820L3384k8816
4876E50755l146J0125L614m361k5237L1638j4275J6522J1537J4007J6021n225
4864F01975K0557L3383M931l2315J7236k391L7M0084R980K0156N3603L2172M0902
4851H40310O0757K9369K1379L2278l7599m9383j8086Q051R655J7066k5107J5231
$$ y = [437259, 408079, 447119, 445947, 455790, 446470, 455030, 413017, 422199, 442661, 433477, 408433, 441093, 457775, 465605, 453622, 407734, 421190, 415380, 430682, 442496, 485678, 488866, 505683, 448748, 435224, 430686, 441523, 477576, 460614, 473815, 460520, 500994, 479334, 472532, 498818, 501158, 491468, 484642, 469108, 482473, 477186, 454805, 459239, 461473, 458039, 508997, 520626, 521866, 530445, 521114, 542395, 553541, 569553, 561574, 553920, 539168, 547304, 524922, 544367, 546187, 579571, 550755, 547609, 557734, 561348, 556987, 531750, 563388, 549113, 565635, 577172, 591179, 607200, 601975, 622532, 655915, 660846, 628531, 645767, 643376, 643413, 683497, 693477, 713633, 767236, 799408, 840310, 901067, 930436, 951815, 984093, 946494, 897111, 879025, 887076, 896731, 913797, 888690, 903921]
4839I03921K0679J112J4044M7032P3435L7029O5694L8764P5376O8223R3954J53021
4827A592284K08418L06239O09127R27242J166615J094703O64384J78034o3433
4818F683613l17473o54959p44151o80926n83133n25990m57891l91598k82647j70714
4808A874131j33074j27121q6496p2700o4374m9796j0537l5807n9791M0469n8906
4797A215998r760J9600l6901L1164l2974q970K892l461j9880Q686k0004K0530
4785A166920J2612L7398p609k3447O287L7149k699J0956J4066P045K648k3239
4773A238087l853K5743K477j1803j5986K2900N9486K5644K1106j3461K8066L13
4761A378719Q0j665l1436j2160K1539k7322N86M6903K3467K3470L582k126J9510
$$ y = [903921, 924600, 925712, 939756, 986788, 1060223, 1097252, 1162946, 1201710, 1277086, 1345309, 1439263, 1592284, 1800702, 2106941, 2716068, 3643310, 4809925, 5904628, 6569012, 6747046, 6683613, 6366140, 5711181, 4967030, 4286104, 3702971, 3176981, 2719090, 2327492, 2044845, 1874131, 1741057, 1613936, 1527440, 1454740, 1390366, 1340570, 1330033, 1294226, 1234435, 1274904, 1215998, 1206238, 1225838, 1188937, 1220101, 1187127, 1178157, 1181049, 1177588, 1157708, 1166394, 1146390, 1166920, 1179532, 1216930, 1209321, 1185874, 1192161, 1229310, 1226611, 1237567, 1251633, 1258678, 1261326, 1238087, 1234234, 1259977, 1262454, 1250651, 1234665, 1257565, 1317051, 1342695, 1363801, 1350340, 1378406, 1378719, 1378799, 1377134, 1345698, 1333538, 1355077, 1327755, 1328341, 1375244, 1398711, 1422181, 1425763, 1423637, 1443147]
4748A443147P177K9126N280j283K580N5389j343j1435l329n859M8022K1411p268
4735A581615k4864P407M5019J70K973M7438M0047J632j5665J6086J506j6904n327
4722A681133J9677Q961J4331O3733p267L9285L720L0626J0164r57J7170L2743
4710A913319N0058j6241K4908k9190n116M1327K7165J9253J0832M2952M223J8974
4698B102464j1711J1569N1090K3058l2284N658M7529K1766L1433p596K3353J9826
4686B286155J2070r233K6745J4375K842K7262L5049M32J6966K3522Q006M1046
4674B485237K7487P448K2170M608j661N3131J8145J9094N5605p359K0527R1291
4662B795723L0170q544M6135M2446K1717M1822Q9342N7418P804L8284N4211L9845
$$ y = [1443147, 1450324, 1479450, 1484730, 1483447, 1486027, 1541416, 1540073, 1528638, 1525309, 1519450, 1567472, 1588883, 1581615, 1556751, 1564158, 1609177, 1609347, 1612320, 1659758, 1699805, 1701437, 1685772, 1701858, 1703364, 1686460, 1681133, 1700810, 1709771, 1724102, 1787835, 1780568, 1819853, 1823573, 1854199, 1864363, 1863406, 1880576, 1913319, 1963377, 1947136, 1972044, 1942854, 1937738, 1979065, 2006230, 2025483, 2036315, 2079267, 2083490, 2102464, 2090753, 2102322, 2153412, 2176470, 2144186, 2149844, 2197373, 2219139, 2250572, 2242976, 2266329, 2286155, 2298225, 2288992, 2315737, 2330112, 2332954, 2360216, 2395265, 2395697, 2412663, 2436185, 2444191, 2485237, 2512724, 2520172, 2542342, 2546950, 2545289, 2598420, 2616565, 2635659, 2691264, 2683905, 2704432, 2795723, 2825893, 2817349, 2863484, 2905930, 2927647, 2969469, 3058811, 3116229, 3124033, 3162317, 3216528, 3256373]
4650C256373N2369J5744K8140M4987J7772K6605J2898J1948O4620K4193J6382
4639C572031K516K2906N5666J4978M0200M7526O0612O6626Q1623R1024K01154
4628D256862L27559L49513L11833K29599R2153j3716n6066j47872j84956j40314
4618E024595j15744r1426m5312m2088N0903P3298J09630J61913J87496J96488
4608E509753J98038J64740J96964J68865J57308K37337K86873L43042K91338K71697
4598G825955J85540J47137J28283J37063K18019K39206K45476K41451O3400J3593
4588I445123o3780r6234q2127n3910k5540l4266K250j27112j68641k09318j46077
4577H440368j27720j21419j06612j21501j12794q3519n1964j24014o5855k6428
$$ y = [3256373, 3308742, 3324486, 3352626, 3397613, 3415385, 3441990, 3454888, 3466836, 3531456, 3555649, 3572031, 3574547, 3597453, 3653119, 3668097, 3708297, 3755823, 3816435, 3883061, 3964684, 4055708, 4256862, 4584421, 4933934, 5245767, 5475366, 5567519, 5553803, 5497737, 5349865, 5164909, 5024595, 4908851, 4817425, 4772113, 4730025, 4780928, 4854226, 4963856, 5125769, 5313265, 5509753, 5707791, 5872531, 6069495, 6238360, 6395668, 6633005, 6919878, 7262920, 7554258, 7825955, 8011495, 8158632, 8286915, 8423978, 8641997, 8881203, 9126679, 9368130, 9431530, 9445123, 9381343, 9285109, 9202982, 9149072, 9123532, 9089266, 9091516, 8964404, 8795763, 8586445, 8440368, 8312648, 8191229, 8084617, 7963116, 7850322, 7766803, 7714839, 7590825, 7524970, 7498542]
4567G498542m773K9651P7239J27164J70295K39645K97783L88038N10910O37206
4557I971700P97974R87297J281096J569342J889539K197919K312192K365107K184964
4548B5557130J984447J785275J612195J680436J875610K253774K729440K922179
4540D2400486K689763K005520J116169L24737m37962j162884j653404j883896
4532D3398529j948121j856247j783248j840302j941671j973126k057866k150351
4524B7847597k168255k228891k207259k081035j908135j697749j446039j210877
4516A2899357r70099p69321o30414n30757l52544l32326k81836j08335p9942k2866
4506H820917L8877J23975J64338K95863N44347Q78847J259608J554683J573623
$$ y = [7498542, 7493769, 7523420, 7600659, 7727823, 7898118, 8137763, 8435546, 8823584, 9334494, 9971700, 10769674, 11756971, 13038067, 14607409, 16496948, 18694867, 21007059, 23372166, 25557130, 27541577, 29326852, 30939047, 32619483, 34495093, 36748867, 39478307, 42400486, 45090249, 47095769, 48211938, 48536675, 48098713, 46935829, 45282425, 43398529, 41450408, 39594161, 37810913, 35970611, 34028940, 32055814, 29997948, 27847597, 25679342, 23450451, 21243192, 19162157, 17254022, 15556273, 14110234, 12899357, 11929258, 11159937, 10529523, 9998766, 9646222, 9313896, 9032060, 8923725, 8843783, 8820917, 8859794, 8983769, 9148107, 9443970, 9988317, 10867164, 12126772, 13681455, 15255078]
4497A5255078J180667P54753M94949K47349o2409k06374m967M56743J286212K132999
4487B1535000K378443J789273R01644J74606k19929r10640j530562j646741j577746
4478B0893348j237039o72122k41303k56677m17491n46511o61630q71786j117434
4469A4871355j270884j238043j214415j139139r59025q17536o72343n32494l67040
4460F660436k98295l04470k15671j68034k21138j33092j36083p9216p6700p6500
4450D951237o8321r7642n3114l1505m8662q6614n4538l8105n0292K4940m843l2494
4438D410047j1747n1685l130m8325q7626l8169m9469p2232n4813r852j4728l6060
4426C932211n7333m0206l0497n9595m5702n8550k4057m8863j4223o6826l0750
$$ y = [15255078, 16435745, 17190498, 17685447, 17932796, 17870387, 17664013, 17659046, 18115789, 19402001, 21535000, 23913443, 25702716, 26604360, 26778966, 26559037, 25648397, 24117835, 22471094, 20893348, 19656309, 18984187, 18742884, 18486207, 18068716, 17522205, 16860575, 15988789, 14871355, 13600471, 12362428, 11148013, 10008874, 9049849, 8232313, 7559970, 7027476, 6660436, 6362141, 6057671, 5842000, 5673966, 5452828, 5319736, 5183653, 5104437, 5027737, 4951237, 4882916, 4785274, 4732160, 4700655, 4651993, 4565379, 4510841, 4472736, 4422444, 4447384, 4442541, 4410047, 4398300, 4346615, 4343485, 4295160, 4207534, 4169365, 4119896, 4047664, 3992851, 3982999, 3968271, 3932211, 3874878, 3834672, 3804175, 3744580, 3698878, 3640328, 3616271, 3567408, 3553185, 3486359, 3455609]
4415C455609n7957p7744k8064l2129q1975k9750j553j9935k5239m7471o0373m0479
4403B952940M404j9084k1040o1705l1388J0611k8915m1268m8477m433l7944k9751
4391B643950j3917l983m0819k6479k1896Q66J1381p081n7868k8826k1007k0379
4379B413942L753k3760L343k5814J4047Q625J3865m9371m1334j4858j8265p075
4367B277098M086j3110k4894l553j8441r346M3j4463m4920j1168l071K8192k543
4354B163910j4033l619J4011K7488M0573j016N819L7804q408j9476m4281m2954
4342B155818p6662j1319n0488n9130O667J364j6917K4023l8942L658j7966k0464
4330A899642j4620L6223j5665k7501J1153o0228k6095k68M4914J2257m5087j5073
$$ y = [3455609, 3397652, 3319908, 3291844, 3259715, 3177740, 3147990, 3146437, 3126502, 3101263, 3053792, 2993419, 2952940, 2957344, 2938260, 2917220, 2855515, 2824127, 2834738, 2805823, 2764555, 2716078, 2711645, 2673701, 2643950, 2630033, 2626050, 2585231, 2558752, 2536856, 2537722, 2549103, 2542022, 2484154, 2455328, 2434321, 2413942, 2417695, 2393935, 2397278, 2371464, 2385511, 2394136, 2408001, 2358630, 2317296, 2302438, 2284173, 2277098, 2281184, 2268074, 2243180, 2239627, 2221186, 2211840, 2211883, 2197420, 2152500, 2141332, 2138261, 2166453, 2163910, 2149877, 2146258, 2160269, 2187757, 2228330, 2227314, 2233133, 2270937, 2262529, 2243053, 2198772, 2155818, 2079156, 2067837, 2017349, 1958219, 1964886, 1966250, 1949333, 1973356, 1934414, 1938072, 1920106, 1899642, 1885022, 1921245, 1905580, 1878079, 1889232, 1829004, 1802909, 1802641, 1847555, 1859812, 1814725, 1799652]
4318A799652M1310j5297J1976j8240J3279L3454N773K743N073J1904K672K0691
4306A914990O471L1464L902K9471J9648J7673L9986q14L210P9494L7794K3976
4294B207265L4313N1509Q9848R8268R6900J03722P6404J02369R7064R1913R0488
4283C140063J22346J77497J70008J67842K32841L00455L06208L30143L60154L95024
4273E702581L08594K74532K67079K18870J84975K10332K81785L24182M42174N69447
4263H784551O33825P31194P52338P70370O81693O30737N12566L98929L04596J93196
4253A4393995J90193J81852K78030L80429N26783P07067Q27380R03907Q28560
4244A9218196P60451O76560M67468K89633J08517o8387k11490k05973k26399j55782
$$ y = [1799652, 1840962, 1825665, 1837641, 1819401, 1832680, 1866134, 1871907, 1874650, 1879723, 1891627, 1894299, 1914990, 1921461, 1952925, 1956827, 1986298, 2005946, 2023619, 2063605, 2062791, 2066001, 2145495, 2183289, 2207265, 2241578, 2293087, 2382935, 2481203, 2578103, 2681825, 2758229, 2860598, 2957662, 3049575, 3140063, 3262409, 3439906, 3609914, 3777756, 4010597, 4311052, 4617260, 4947403, 5307557, 5702581, 6011175, 6285707, 6552786, 6771656, 6956631, 7166963, 7448748, 7772930, 8215104, 8784551, 9418376, 10149570, 10901908, 11672278, 12353971, 12984708, 13497274, 13896203, 14200799, 14393995, 14584188, 14766040, 15044070, 15424499, 15951282, 16658349, 17485729, 18389636, 19218196, 19978647, 20655207, 21122675, 21412308, 21520825, 21452438, 21240948, 21034975, 20808576, 20652794]
4234B0652794m0527R6887K25381K94971L81363L70190L36190K41502L2725j93804
4224B2397672m24467o09369p89869q37215p73889p15992n88622m76702k97733
4215A6883814j38816q4673o3737n0102k31051m05971n34634o74941q17334q63436
4205A3019119q69435p62580o75220n45129m35009l57185k73371j90420k31571
4196H679199k23414l16619l64153m13380m42307m48072m38079l76029l36156l12896
4186E008094k85335k13297j95445j79127j49604j26271j34528j14866j83488j46854
4176C279279j80414j44763j21371j57849j12267r5745p3337r4429j06952n2483
4166B139669o1449l9573p9100q1525k9841k6322n1647k0054q2408n3751j5883
$$ y = [20652794, 20612267, 20709154, 20934535, 21229506, 21610869, 21981059, 22317249, 22558751, 22591476, 22397672, 21973205, 21363836, 20573967, 19736752, 18962863, 18246871, 17658249, 17181547, 16883814, 16744998, 16660325, 16596588, 16546486, 16315435, 15909464, 15374830, 14699889, 13882555, 13019119, 12149684, 11387104, 10711884, 10166755, 9731746, 9374561, 9101190, 8910770, 8679199, 8455785, 8139166, 7775013, 7361633, 6919326, 6471254, 6033175, 5657146, 5320990, 5008094, 4722759, 4509462, 4314017, 4134890, 3985286, 3859015, 3724487, 3609621, 3426133, 3279279, 3098865, 2954102, 2832731, 2674882, 2562615, 2466870, 2393533, 2299104, 2192152, 2139669, 2078220, 2038647, 1959547, 1878022, 1848181, 1821859, 1770212, 1750158, 1667750, 1613999, 1598116]
4155A598116m2799m1919l7235l1122k8252k9463k9819m2465P038l4882j9757m0512
4143A226929l2133k2955m1300l6680m3695p814k390P977l0018k7720k332k015
4131I85854j6662k7476k148j2462k0265l641m3719o701M399q090j5208j2849P5
4118H21107R211l2840r451N609k3815k0659J1370k633j7827L992P367j1664P639
4105G47406k6913j3621K5741j7479k2029K3047j0877j4791M860j2330k1908k1012
4093F40094k093k5681K1059L0750j4164l6160n534J5611J2339L3089j4548L67
4081F55129n999L8187K0023j4502K5515j3262K7686p277j4683q571O485q712j5321
4068F84698J6714K489J2583k339K1028R126j5917P705k4583l0344R5Q750M442
$$ y = [1598116, 1555317, 1513398, 1476163, 1445041, 1416789, 1387326, 1357507, 1315042, 1322080, 1287198, 1267441, 1226929, 1194796, 1171841, 1130541, 1093861, 1050166, 1042352, 1039962, 1047939, 1017921, 990201, 987869, 985854, 969192, 941716, 939568, 927106, 906841, 903200, 859481, 852780, 857179, 849089, 833881, 821032, 821107, 830318, 797478, 788027, 793636, 769821, 749162, 760532, 757899, 740072, 744064, 751431, 739767, 747406, 720493, 706872, 732613, 715134, 693105, 716152, 705275, 690484, 695344, 683014, 661106, 640094, 638001, 612320, 633379, 664129, 649965, 613805, 608271, 623882, 636221, 669310, 654762, 655129, 649130, 687317, 707340, 692838, 718353, 705091, 732777, 725500, 710817, 702246, 708731, 700019, 684698, 701412, 703901, 716484, 714145, 735173, 744299, 728382, 736087, 711504, 681160, 681255, 690005, 694447]
4055F94447j7776r231l1693l9215L251j2161j9909P045r736K6447j8175k8996
4043E44298k4076l2733j0600M3180K2761j1692m538k7265R289L0849K5320j3098
4031E51695J8395j7547j3575j4507r073K1628l2995j5093N246J7752j4935j1100
4019D85891K5950J445J5730J362K2884r004m8580n770k0652J7981N9183k1250
4007E25170l2826K0496M7608K5856n230j1080J1952m2696l0960K9440J4449J2094
3995E64273O402l6339k0146J9811p205p617J5722K729j2269L5940M5064J090J0388
3982F17843j6605J6264q600j9823P6615N4290P314L608K4047j891L6502M1846
3970H31410j9500k4027M450J1582m39m81q073n375K0315l3851p978o556m1168
$$ y = [694447, 676671, 667440, 635747, 596532, 599783, 587622, 567713, 574758, 565022, 591469, 573294, 544298, 520222, 487489, 476889, 520069, 542830, 531138, 526600, 499335, 508624, 539473, 564793, 551695, 570090, 552543, 538968, 524461, 515388, 537016, 504021, 488928, 494174, 511926, 496991, 485891, 511841, 513286, 529016, 530378, 553262, 544258, 495678, 489908, 469256, 487237, 546420, 525170, 492344, 512840, 560448, 586304, 581074, 569994, 581946, 539250, 508290, 537730, 552179, 564273, 570675, 534336, 514190, 534001, 526796, 519179, 534901, 537630, 525361, 561301, 606365, 607455, 617843, 601238, 617502, 608902, 589079, 665694, 719984, 727298, 730906, 754953, 753062, 789564, 831410, 811910, 787883, 792333, 803915, 803476, 802995, 794922, 789547, 809862, 776011, 768033, 761477, 720309]
3957G20309J7932j4175L9290J4606J8006k8484K236N0916O4646J32237J21255
3946A138774J91113J86409R6762M563N598n0855j06195j08739p9514p0415q2637
3935A124864q6222l1184j1693l3575M880k1952m874p782j052K7076j120J8693
3923I76059K1323O803L0952l236O8735O3580P3059J47051J89829J70709R7821
3912A842685J186J4233k2967j07413q5786o7784n9263j23705p7618o4176l3196
3901A216196l1045o353n0947r958q277J1419J3917l31m4776L4686K5814J8610
3889A168955m919k374k5923J5010l556K3486K4794j9904R160J3066m898K538p732
3876A187703r342O656J1062J6559k037J9460R967O470K9367K5576j7180k873j6500
$$ y = [720309, 738241, 724066, 763356, 777962, 795968, 767484, 769720, 820636, 885282, 1017519, 1138774, 1329887, 1516296, 1613058, 1617621, 1623219, 1572364, 1466169, 1357430, 1277916, 1207501, 1124864, 1038642, 1007458, 995765, 962190, 967070, 945118, 940244, 932462, 931410, 958486, 957366, 976059, 997382, 1004185, 1035137, 1031901, 1100636, 1164216, 1237275, 1384326, 1574155, 1744864, 1842685, 1843871, 1858104, 1835137, 1727724, 1641938, 1574154, 1514891, 1391186, 1313568, 1249392, 1216196, 1185151, 1178798, 1127851, 1117893, 1109616, 1121035, 1134952, 1134621, 1089845, 1124531, 1150345, 1168955, 1164036, 1161662, 1135739, 1150749, 1147193, 1170679, 1195473, 1175569, 1184729, 1197795, 1192897, 1195435, 1187703, 1178361, 1185017, 1196079, 1212638, 1210601, 1230061, 1240028, 1246498, 1275865, 1301441, 1284261, 1281388, 1264888]
3863A264888L7685J398J1903M0944O8586J585L9157J9116O6910N7362N7251M8643
3851A715428P1617O9441N8362J09884O9054Q7930P3349J07926J29608R3982R9964
3840B686545R7566J02631R7183J13145J08842J00745N9210Q0553Q4122Q2669O0664
3829C673875O3205K8059K563M8336N2938N3027P5601P2554N6368K4986P7182P9233
3817D307927R7743J19484J37366J43061J86587J80715J88315K35887K48425K76719
3807F122229K99024L86797M51922N17159O04298P05647Q77355J076910J241745
3798A2283086J472985J715566J905519K116630K273412K329731K269245K120277
3790B8486451J888514J639590J319338Q99348N28788K75133J4980j38734k06874
$$ y = [1264888, 1302573, 1303971, 1315874, 1356818, 1425404, 1426989, 1466146, 1485262, 1552172, 1609534, 1666785, 1715428, 1787045, 1856486, 1914848, 2024732, 2093786, 2181716, 2255065, 2362991, 2492599, 2586581, 2686545, 2784111, 2886742, 2983925, 3097070, 3205912, 3306657, 3365867, 3446420, 3530542, 3613211, 3673875, 3737080, 3765139, 3767702, 3816038, 3868976, 3922003, 3997604, 4070158, 4126526, 4151512, 4228694, 4307927, 4405670, 4525154, 4662520, 4805581, 4992168, 5172883, 5361198, 5597085, 5845510, 6122229, 6421253, 6808050, 7259972, 7777131, 8381429, 9087076, 9964431, 11041341, 12283086, 13756071, 15471637, 17377156, 19493786, 21767198, 24096929, 26366174, 28486451, 30374965, 32014555, 33333893, 34233241, 34762029, 35037162, 35052142, 34913408, 34706534]
3781C4706534k29502j78042q4286L781M0963M3999j9502j20161l77623o79957
3771C3106204r69175j256611j549658j793461j993233k095968k108666k076650
3763A9262782j929533j755290j587282j384043j235115j052838r21389p34706
3755H662586o44417n79336m75817m02471l46471l00301k59786j84894j86723j91214
3745E091156j88990j35174j02986j02697r2457p0542r6595n9329r8950j13736
3735D029700k8412p8252j03131r7223n2971n5523o9611o0213p0982p8704o6518
3724C268160l6758m6754m7956k5902j7751l9335k9097k2361j1927m3021J8103
3713B965401j8873k0979o2870m4049K7816k2346l9429n604l4471l1062j239l975
$$ y = [34706534, 34477032, 34298990, 34214704, 34218485, 34259448, 34303447, 34283945, 34163784, 33786161, 33106204, 32137029, 30880418, 29330760, 27537299, 25544066, 23448098, 21339432, 19262782, 17333249, 15577959, 13990677, 12606634, 11371519, 10318681, 9397292, 8662586, 8018169, 7438833, 6963016, 6560545, 6214074, 5913773, 5653987, 5469093, 5282370, 5091156, 4902166, 4766992, 4664006, 4561309, 4468852, 4398310, 4301715, 4242386, 4143436, 4029700, 4001288, 3923036, 3819905, 3722682, 3669711, 3614188, 3544577, 3484364, 3413382, 3334678, 3268160, 3231402, 3184648, 3136692, 3110790, 3093039, 3053704, 3024607, 3002246, 2990319, 2947298, 2965401, 2946528, 2925549, 2862679, 2818630, 2846446, 2824100, 2784671, 2779067, 2744596, 2713534, 2712295, 2708320]
3701B708320K4587j1237j5025M2686J7496j1894J7263L2091K9100M217j2474O657
3689B831787K3872J2997l9497m124Q838j1429Q751J1936K6104M752K8270K6704
3677B928961M9859M493L3238O0913M7928M8808N9334K2632L9969O8839O9341J08039
3665C542354J34722J19149J23558J45842J43130K01172K15550K65315L27009L60673
3655E578474M36222M76962N69482O33429P08336Q16517Q81828R07375J016986
3646A2025611R88600R12822Q32463P19988N85204M18224K47381Q5102o3219j95282
3636A6556894k40198k40682j41520K3204K14165N06608Q22517J254594J643612
3627B0399194K031129K321282K503816K600712K500150K252180J888419J456858
$$ y = [2708320, 2732907, 2721670, 2706645, 2749331, 2766827, 2754933, 2772196, 2804287, 2833387, 2837604, 2825130, 2831787, 2855659, 2868656, 2829159, 2825035, 2833873, 2822444, 2831195, 2843131, 2869235, 2873987, 2902257, 2928961, 2978820, 2983313, 3016551, 3077464, 3125392, 3174200, 3233534, 3256166, 3296135, 3364974, 3434315, 3542354, 3677076, 3796225, 3919783, 4065625, 4208755, 4409927, 4625477, 4890792, 5217801, 5578474, 6014696, 6491658, 7061140, 7694569, 8402905, 9219422, 10101250, 11008625, 12025611, 13014211, 13927033, 14759496, 15479484, 16064688, 16482912, 16730293, 16815395, 16752176, 16556894, 16316696, 16076014, 15934494, 15957698, 16171863, 16678471, 17500988, 18755582, 20399194, 22430323, 24751605, 27255421, 29856133, 32356283, 34608463, 36496882, 37953740]
3619C7953740R87912N21738J07642j61048k73184k68194m5498J68149L94252O65375
3609D0050884Q38185Q41267Q52315O84257L83318J05035j83945m35184n34677
3600D2601455n03346l39132j40242K01218O04473R08251J149054J338284J284813
3591D7104828J167210R24048M98818R747n46322r85159j500362j945838k331381
3582D2395589k525479k632798k680777k625924k445127k235295j956651j754473
3574B3539065j430065j182872r12805n94277l67530j30172O8620K77269N09799
3565A9777032P54846J003044J164858J376508J546990J729454J897344J930502
3557C1180578K049351J968501J879950J714877J407271J141673Q34005M61310
$$ y = [37953740, 38941652, 39463390, 39571032, 39409984, 39136800, 38868606, 38823108, 38991257, 39385509, 40050884, 40889069, 41730336, 42582651, 43266908, 43650226, 43755261, 43571316, 43136132, 42601455, 42098109, 41758977, 41618735, 41819953, 42424426, 43332677, 44481731, 45820015, 47104828, 48272038, 49196086, 49694904, 49704651, 49158329, 48173170, 46672808, 44726970, 42395589, 39870110, 37237312, 34556535, 31930611, 29485484, 27250189, 25293538, 23539065, 22109000, 20926128, 20013323, 19419046, 19051516, 18921344, 18989964, 19267233, 19777032, 20531878, 21534922, 22699780, 24076288, 25623278, 27352732, 29250076, 31180578, 33229929, 35198430, 37078380, 38793257, 40200528, 41342201, 42176206, 42637516]
3549D2637516j397l62815p80309j108570j404134j666562j790432j900587j878405
3540C1744305j891515j813700j642605j506546j310121j108160r15934p65185
3532B0790539o27720n74422m44480l76653l07761l04427l33388k66141k04088
3523A7351459j65460j19729k7309J613O4639J19197J19409J63773J76461J53290
3513A7837343J49323J66789J81217J98844K19971L25568L96019M79412N94237
3504B0548723O62816P71877Q29056Q41782Q67899R08207R40669R20529R15482
3495B8207040R00650R19160R72094R93976J081580J232378J396379J600809J827679
3486C9131745K102031K478004K853905L284295L783969M261189M743528N163176
$$ y = [42637516, 42636119, 42273304, 41492995, 40384425, 38980291, 37313729, 35523297, 33622710, 31744305, 29852790, 28039090, 26396485, 24889939, 23579818, 22471658, 21555724, 20790539, 20162819, 19588397, 19143917, 18767264, 18459503, 18155076, 17821688, 17555547, 17351459, 17185999, 17066270, 17038961, 17040574, 17105213, 17224410, 17343819, 17507592, 17684053, 17837343, 17986666, 18153455, 18334672, 18533516, 18753487, 19079055, 19475074, 19954486, 20548723, 21211539, 21983416, 22812472, 23654254, 24522153, 25430360, 26371029, 27291558, 28207040, 29107690, 30026850, 30998944, 31992920, 33074500, 34306878, 35703257, 37304066, 39131745, 41233776, 43711780, 46565685, 49849980, 53633949, 57895138, 62638666, 67801842]
3478F7801842N627225N898074O096143O176616O035952N857373N539080N180046
3470A14212351M802592M412195M102256L799064L522548L211482K813504K424179
3462A43300171J872611J194607M47588l73842j200660k013755k858078l545235
3454A36823407m149221m673246n081166n357794n529732n650917n631650n567321
3446I5182360n466170n287875n015506m632637m220993l728789l085501k368244
3438F1376645j579038p95618n2192O95158J300163J793192K026117K097872J948936
3429F8811235J651864J268776Q40695K97438j62293n30058q49800j039434j084838
3420F9203585j042310r05286p43465m93158l16258j63064n7373k9708j90021m17507
$$ y = [67801842, 73429067, 79327141, 85423284, 91599900, 97635852, 103493225, 109032305, 114212351, 119014943, 123427138, 127529394, 131328458, 134851006, 138062488, 140875992, 143300171, 145172782, 146367389, 146814977, 146441135, 145240475, 143226720, 140368642, 136823407, 132674186, 128000940, 122919774, 117561980, 112032248, 106381331, 100749681, 95182360, 89716190, 84428315, 79412809, 74780172, 70559179, 66830390, 63744889, 61376645, 59797607, 59001989, 58949797, 59644955, 60945118, 62738310, 64764427, 66862299, 68811235, 70463099, 71731875, 72572570, 72870008, 72707715, 72177657, 71327857, 70288423, 69203585, 68161275, 67255989, 66512524, 66019366, 65703108, 65540044, 65482671, 65452963, 65262942, 64845435]
3410F4845435p89015j180053j632161k016002k406187k698260k883124k999791
3402D8240842k991802k984981k921437k795493k614037k437105k269592k100834
3394B7125561j840299j729710j529362j381413j209295j106793j010350r11161
3386A6407178p93462p12754o63387o27820m96860m79529m12924l64665k61216
3377A1594561k36966j86466j26016n2810l9804P322R5754J41372J91579K80237
3367A1668763L92801M04963M70995N22537N50668N21649N27430M74125M62286
3358A5996217K98371J38170j3658j42151k56178l34573l85504m15166m61604n17386
3348A3906538n75238n72622n58508n99520n20961n02616m98354l79836l25723
$$ y = [64845435, 64056420, 62876367, 61244206, 59228204, 56822017, 54123757, 51240633, 48240842, 45249040, 42264059, 39342622, 36547129, 33933092, 31495987, 29226395, 27125561, 25285262, 23555552, 22026190, 20644777, 19435482, 18328689, 17318339, 16407178, 15613716, 14900962, 14237575, 13609755, 13112895, 12633366, 12220442, 11855777, 11594561, 11357595, 11171129, 11045113, 10992303, 10952499, 10959821, 11055575, 11196947, 11388526, 11668763, 12061564, 12466527, 12937522, 13460059, 14010727, 14532376, 15059806, 15533931, 15996217, 16294588, 16432758, 16419100, 16276949, 16020771, 15686198, 15300694, 14885528, 14423924, 13906538, 13331300, 12758678, 12200170, 11600650, 11079689, 10577073, 10078719, 9698883, 9373160]
3339I373160k63473k18182j03210n5135k1386j2031M4750P7496J09207J69701
3329I100897K12326K69082K97319L64455M22888M80486N47806O78290P24095Q52542
3319A3950186J029429J221560J465310J725563K105891K519299K990721L611983
3311C0619942M184350M832753N364190N806447O122978O376852O451556O386298
3303G6145366O017656N392736M521075L350332K021218N29418r42671k330989
3295I4704141l663802m740358n564685o082238o502023o574994o350383o071145
3287D9154513n636756n103594m525147l951559l425472k997620k520443k098959
3279A8894963j825164j510525j283757j092730r12537p88679o67731n57702m58048
$$ y = [9373160, 9109687, 8891505, 8788295, 8733160, 8711774, 8699743, 8744493, 8821989, 8931196, 9100897, 9313223, 9582305, 9879624, 10244079, 10666967, 11147453, 11695259, 12373549, 13097644, 13950186, 14979615, 16201175, 17666485, 19392048, 21497939, 24017238, 27007959, 30619942, 34804292, 39637045, 45001235, 50807682, 56930660, 63307512, 69759068, 76145366, 82163022, 87555758, 92076833, 95427165, 97448383, 97977801, 97035130, 94704141, 91040339, 86299981, 80735296, 74653058, 68151035, 61576041, 55225658, 49154513, 43517757, 38414163, 33889016, 29937457, 26511985, 23514365, 20993922, 18894963, 17069799, 15559274, 14275517, 13182787, 12270250, 11481571, 10813840, 10256138, 9798090]
3270I798090m28299l96514l83256l00332k50486k36694k18508j82710k14403j76330
3260G010558j47667j14632j32784j58272j17587o7557l8575m4180l0628N74J3544
3249F172794L685M2608J4383j1392M6592R0445N1648K4162m3751r7755q3592j11180
3237F098647j34975j67956j59999j80895j84971j64691j66050j78075j40856j39302
3227D480877j05522j02997j15016j06060k4630n1757p1812q1616q0106p3611p7377
3216C590373m6856m8232m5654k4476n1024m1264j1259K6693j1412m3439K719j5604
3204C280565k8146l2860J2464O143R651N8936K019L0143M3272L3358R1106O7786
3192C574437L9039M6337J07528M7435P4713J39665R9390O9025N9410Q1319R0262
$$ y = [9798090, 9369791, 8973277, 8590021, 8289689, 8039203, 7802509, 7584001, 7401291, 7186888, 7010558, 6862891, 6748259, 6615475, 6457203, 6339616, 6272059, 6233484, 6189304, 6158676, 6159250, 6172794, 6176479, 6219087, 6233470, 6222078, 6268670, 6359115, 6410763, 6434925, 6391174, 6293419, 6209827, 6098647, 5963672, 5795716, 5635717, 5454822, 5269851, 5105160, 4939110, 4761035, 4620179, 4480877, 4375355, 4272358, 4157342, 4051282, 4026652, 3974895, 3903083, 3821467, 3741361, 3667750, 3590373, 3543517, 3495285, 3449631, 3425155, 3374131, 3332867, 3321608, 3348301, 3336889, 3293450, 3296169, 3280565, 3252419, 3219559, 3232023, 3238166, 3247817, 3306753, 3308772, 3338915, 3382187, 3415545, 3506651, 3574437, 3613476, 3659813, 3767341, 3814776, 3889489, 4029154, 4128544, 4197569, 4256979, 4338298, 4428560]
3181D428560P0472Q0402J07699P2365P5338L2304P7803Q4285J09644Q4451J06820
3170E330143J07138R6869J08385J05693N5927R1782J24443P0418N3711P7777J20201
3159F342487J15018J30432J47329J76086K14523K65065K85795L72927L68762L57054
3149H775478L53957L15077K45993K29022J17148J03884J11223Q8472Q9260J11716
3139A0541230P7431O2698Q0901O5049P8285J19645J26977J63673J61415J72676
3129A1649980J84186K60910L24853M27456N85473Q11977J130813J392039J462567
3120A8230254J269227Q66105M49715J07614k23181m57711n75713n56055m42760
3111A8667495k94811j76426k8213J30919K32644L30362M31889N35284O33520Q18447
$$ y = [4428560, 4499032, 4579434, 4687133, 4759498, 4834836, 4867140, 4944943, 5029228, 5138872, 5223323, 5330143, 5437281, 5534150, 5642535, 5748228, 5804155, 5895937, 6020380, 6090798, 6144509, 6222286, 6342487, 6457505, 6587937, 6735266, 6911352, 7125875, 7390940, 7676735, 8049662, 8418424, 8775478, 9129435, 9444512, 9690505, 9919527, 10036675, 10140559, 10251782, 10340254, 10429514, 10541230, 10618661, 10681359, 10762260, 10827309, 10905594, 11025239, 11152216, 11315889, 11477304, 11649980, 11834166, 12095076, 12419929, 12847385, 13432858, 14244835, 15375648, 16767687, 18230254, 19499481, 20365586, 20815301, 20922915, 20699734, 20242023, 19666310, 19110255, 18667495, 18372684, 18196258, 18168045, 18298964, 18531608, 18861970, 19293859, 19829143, 20462663, 21281110]
3101B1281110R92371J196868J441382J622867J769564K037234K354563K654808
3093C5350767L144739L663802M213482M744464N395244O249789P461152R410473
3085G9633912J2289251J6308724K1328948K6223745K8909090K7705120K2337715
3078B34736505J4562411O719733K35580l777431l991677r8317O385968J2061761
3070B66834533J3448981R262199J396259p023142j4819410k1523614k5914897
3063B21660909k7438270k6472774k4112651k1299626j8209218j4992590j1980997
3056G7154783r604600p785090o440864n508504m769711m065740l416556k863855
3048C2699863k359400j931253j661560j416293j267416j158322j021872r35985
$$ y = [21281110, 22273481, 23470349, 24911731, 26534598, 28304162, 30341396, 32695959, 35350767, 38495506, 42159308, 46372790, 51117254, 56512498, 62762287, 70223439, 79633912, 91923163, 108231887, 129560835, 155784580, 184693670, 212398790, 234736505, 249298916, 256018649, 256254229, 252476798, 248485121, 248386804, 254772772, 266834533, 280283514, 289545713, 290941972, 283918830, 269099420, 247575806, 221660909, 194222639, 167749865, 143637214, 122337588, 104128370, 89135780, 77154783, 67550183, 59765093, 53324229, 47815725, 43046014, 38980274, 35563718, 32699863, 30340463, 28409210, 26747650, 25331357, 24063941, 22905619, 21883747, 20947762]
3040B0947762r11181q28628p05933o68205n96536n49046n30872n06182m70639
3031A5180540m47155m26138l90444l89286l66844l52922l08347l20849k75150
3022A1903405k67040k43063k76995l03281k53485k67295k57769k79311k99884
3013I455282k57140k60132k77189k74623k60656k82128k53140k61403k04483k09011
3003F915377k05547j99485j42911k09967j71720j42323j68322j14374j05468r1849
2993E363411j07551p4782j13950j10540j09239j39073j71824j16553q9527j13750
2983D216622j40654j07802j22458q8318r8257r3169j10687q4717q2550l3769l6863
2972C217378n8311m0345m7757q0511o2947o5406o9208j9748j8547j7996J3584
$$ y = [20947762, 20036581, 19207953, 18502020, 17833815, 17237279, 16688233, 16157361, 15651179, 15180540, 14733385, 14307247, 13916803, 13527517, 13160673, 12807751, 12499404, 12178555, 11903405, 11636365, 11393302, 11116307, 10813026, 10559541, 10292246, 10034477, 9755166, 9455282, 9198142, 8938010, 8660821, 8386198, 8125542, 7843414, 7590274, 7328871, 7124388, 6915377, 6709830, 6510345, 6367434, 6157467, 5985747, 5843424, 5675102, 5560728, 5455260, 5363411, 5255860, 5181078, 5067128, 4956588, 4847349, 4708276, 4536452, 4419899, 4330372, 4216622, 4075968, 3968166, 3845708, 3757390, 3659133, 3565964, 3455277, 3370560, 3288010, 3254241, 3217378, 3159067, 3118722, 3070965, 2990454, 2927507, 2862101, 2792893, 2773145, 2754598, 2736602, 2750186]
2961B750186k4460m9330j2914l7715N168q54l0719j8719k321n0721m7422j5894
2949B464285L300k4504k4186l5132j9921p489m41m7033q6610l3998l3419m0658
2937B114194o1135l6913p668l5848l0815m6052o6530o1702l6378k9386j8925j2213
2925A670629m1014l297n0833j0780p5488m5201J502m9446o3041k4610j6987l5133
2913A256301J2454p1684k5506J7146q1642J2646k6289k9507j1836l3568Q970J5010
2901A042495o056m6619N79l521R819J0441R537j2568K378o78L367j9051j8333
2888I71790j1723l7845j6457j8256M6095L81k7822l003J633J3997k9522k0851
2876H68417K7516l1421l7275l4099R851j0535k9649J4154L764m57o3968M7999
$$ y = [2750186, 2725726, 2676396, 2663482, 2625767, 2630935, 2630081, 2599362, 2580643, 2578322, 2527601, 2480179, 2464285, 2467585, 2443081, 2418895, 2383763, 2363842, 2356353, 2355912, 2308879, 2222269, 2188271, 2154852, 2114194, 2053059, 2016146, 2008478, 1972630, 1941815, 1895763, 1829233, 1767531, 1731153, 1701767, 1682842, 1670629, 1629615, 1626318, 1575485, 1564705, 1489217, 1444016, 1445518, 1396072, 1333031, 1308421, 1291434, 1256301, 1268755, 1197071, 1171565, 1188711, 1107069, 1119715, 1093426, 1063919, 1052083, 1018515, 1027485, 1042495, 1036439, 989820, 990399, 986878, 996697, 1007138, 1016675, 1004107, 1006485, 1005807, 1009174, 990123, 971790, 960067, 922222, 905765, 887509, 933604, 933985, 906163, 903160, 904793, 918790, 889268, 868417, 895933, 864512, 827237, 793138, 802989, 792454, 762805, 776959, 780723, 780266, 716298, 764297]
2864G64297l6652k0045J682m036O072o684k7428j2326N037J991j4589m0009R63
2851F18273k2258q369J4102N1787J5464N903j3874J0807L078l016n091K907j519
2838F68194J988l262R449M3619J1949j903k9243J2884j7315k1883j9976n1564
2826F02937N934j0073P028J0397o347j4810j9194L592L3002k0648j8336K3854
2814E97336K4200J4835r677M1673k9650M3003N7873N0640K2285J8394M6438K7655
2802I05005M9272J28809R0980O7517R9621J19001J39816Q9477P6060M815l6101
2791A734272P531O529O3233O7037L4807N0707j3470l4044o0951q8086r1902j45437
2779A530226j09099j00558j00130j01435j29864m7526n8804m4033l1228k6419
$$ y = [764297, 727645, 707600, 709282, 705246, 711318, 704634, 677206, 664880, 669917, 671908, 657319, 617310, 618273, 596015, 587646, 601748, 653535, 668999, 674902, 661028, 671835, 674913, 671897, 666806, 669713, 668194, 670182, 666920, 676369, 719988, 731937, 730034, 700791, 713675, 696360, 674477, 654501, 602937, 608871, 598798, 605826, 616223, 609876, 595066, 575872, 579464, 612466, 591818, 573482, 597336, 621536, 636371, 626694, 668367, 638717, 681720, 739593, 790233, 812518, 830912, 877350, 905005, 954277, 1083086, 1174066, 1241583, 1341204, 1460205, 1600021, 1689498, 1765558, 1770373, 1734272, 1741803, 1748332, 1811565, 1878602, 1913409, 1964116, 1950646, 1916602, 1855651, 1767565, 1675663, 1530226, 1421127, 1320569, 1220439, 1119004, 989140, 941614, 882810, 838777, 807549, 781130]
2769G81130n0584K2246j7462n7002k7793M19o3849J415J8300P134L5497Q224j284
2756F56391j8770J3765J830l6160M059j076l282m3336j2592q53j5119k389o0352
2743D82116R105l273n111j1435j1288R018O289K1156j7722P284K715l4124J8092
2730D72822m7177L499M8147K7107j2493l0918j4471J0567L266l5452q724n24M4263
2717D59912j7482k4895L5035j1037j5055q452J6113J7454J3800l3769j5487K0549
2705D36686J7701J578k0194m6557j310J2344n685l3649k0843L269K0426L9016
2693D02782j9329k9033j6986J5561J2300q423j3829J9092K2850j8341l2452K707
2681C36899k0746k188L2110p018J3651j3325M959j1568k1683k4729J4526k881
$$ y = [781130, 730546, 752792, 735330, 678328, 650535, 650954, 587105, 588520, 606820, 613954, 649451, 657675, 656391, 637621, 651386, 653216, 617056, 621115, 620039, 616757, 573421, 560829, 559976, 544857, 542468, 482116, 491221, 487948, 482837, 471402, 460114, 469132, 475421, 496577, 478855, 486139, 488854, 454730, 472822, 425645, 429144, 477291, 504398, 491905, 460987, 446516, 457083, 460349, 424897, 416173, 415649, 459912, 442430, 417535, 452570, 441533, 426478, 418026, 434139, 451593, 465393, 431624, 416137, 436686, 454387, 455965, 435771, 389214, 387904, 400248, 394563, 360914, 340071, 343340, 363766, 402782, 383453, 354420, 337434, 352995, 365295, 356872, 343043, 362135, 384985, 366644, 334192, 336899, 316153, 313965, 346075, 339057, 352708, 339383, 344342, 332774, 311091, 286362, 300888, 298007]
2669B98007M340o994J0235R90o475Q38j1887L988P256J106n1044j6655k215j7443
2655B14047k6878R389J644j1268J459K9643Q298n259O88K1665k4550k1243K144
2642A99779L0239J110K6690J855j1158n3146o62J7475j1220m928k5803j1934L2535
2629A90832J9029k398k928j4720j0631K7539l0502j0051k0128q266L1295K3153
2617A92224M224q561k243k0602L8598Q689n68k1157R539j0680o81k6516K3119
2604A85385O939J3146J9940K4427P422J7967J7257L01p018K1531J8787J324j1023
2591C16385J0214L5706l3668j3972L666K6992L3124P467M0680L3908J6009l4913
2579D41598l6026k0189N91p8204k3572j4067m680o45J3310k0756m6029K4268N067
$$ y = [298007, 302347, 295353, 305588, 306578, 300103, 300941, 289054, 293042, 300298, 301404, 250360, 233705, 231490, 214047, 187169, 196558, 198202, 186934, 188393, 218036, 226334, 221075, 221763, 243428, 218878, 197635, 199779, 230018, 231128, 257818, 259673, 248515, 195369, 194707, 212182, 200962, 196034, 170231, 158297, 190832, 209861, 207463, 204535, 189815, 179184, 206723, 176221, 166170, 146042, 137776, 169071, 192224, 196448, 187887, 185644, 165042, 203640, 212329, 211761, 190604, 200143, 189463, 188782, 162266, 185385, 192324, 205470, 225410, 249837, 257259, 275226, 292483, 292784, 285766, 307297, 326084, 327408, 316385, 326599, 362305, 328637, 314665, 318331, 345323, 378447, 385914, 426594, 460502, 476511, 441598, 405572, 385383, 385974, 307770, 284198, 270131, 265451, 264806, 278116, 257360, 211331, 235599, 240666]
2566B40666J7030R343k440k2356R778J002J3218p864q679l989J7705J4018j4333
2553B63099j5036J2605P203k3438Q960k0269J3113m528K665J071k6943K1204l524
2540B36182J6339l6622r668l564K1003k300k3313j3384M9727r668L1438m529p042
2527B44599j3941k1847l424R980L6221r895l196M2876O031m9476J6556L6117J1081
2514C01682l308j1898J4854o499l4251K319L7531q101l7200P718J4578j5480l4666
2501B27279M928K2036k0071J1278J4300N606k238K2178j071m0313j675p133J6440
2488B51544L1121j230l6816r007j150J4318l6280j036j4435N569o392K0618L38
2475B17162j508j3740l659K615K2528J1239l9583M753N748J3530j918j2883J6615
$$ y = [240666, 257696, 267039, 264599, 242243, 252021, 253023, 266241, 258377, 249698, 245709, 263414, 277432, 263099, 248063, 260668, 267871, 244433, 253393, 233124, 246237, 241709, 244374, 245445, 218502, 239706, 236182, 252521, 215899, 206231, 202667, 223670, 221370, 198057, 184673, 234400, 224732, 256170, 251641, 244599, 230658, 208811, 205387, 215367, 251588, 241693, 238497, 281373, 287404, 237928, 254484, 290601, 301682, 298374, 286476, 301330, 294831, 260580, 262899, 300430, 292329, 255129, 262847, 277425, 261945, 227279, 232207, 254243, 234172, 245450, 259750, 265356, 263118, 285296, 284225, 243912, 242237, 235104, 251544, 282665, 281435, 244619, 235612, 234462, 248780, 212500, 211464, 197029, 202598, 196206, 216824, 217162, 215654, 201914, 198255, 200870, 223398, 234637, 195054, 199807, 205555, 219085, 217167, 204284, 220899]
2462B20899O718k0305L182J594J8626j0835j1698L7260l5161j5780l0729J9323
2450A83094J1230j1984K2072M2223l9307k0461K2386L6345K5879L078q808m612
2438B61135q712l1969J4340k4860K1399r747L1325K724k7143O918j0195k666M2029
2425B64578L6027j6139m162l3717K6409N2060J8842k4634l3423K3616j0839j6274
2413B82344j203M2957k3251O274l3265l5676J464r775L6038n51K7622K6892L550
2400C23420l0845K5202j2713j9496J1309j2696K8264l3136j2812M2933k9258l304
2388B76868N1967k915l4270M3503L648k3229L5670K1741L3596P799J5382J2219
2376D41979L1061l2516l4724j5247p030r090J99L1350m868l9059j0483R500K7119
$$ y = [220899, 227617, 207312, 210494, 212088, 230714, 219879, 208181, 245441, 210280, 194500, 163771, 183094, 194324, 182340, 204412, 246635, 207328, 186867, 209253, 245598, 271477, 274555, 265747, 261135, 252423, 220454, 234794, 209934, 231333, 221586, 252911, 255635, 228492, 235410, 225215, 222549, 264578, 300605, 284466, 280304, 246587, 272996, 325056, 343898, 319264, 285841, 309457, 298618, 282344, 281141, 324098, 300847, 307121, 273856, 238180, 239644, 229869, 265907, 265356, 292978, 319870, 323420, 292575, 317777, 305064, 285568, 296877, 284181, 312445, 279309, 266497, 309430, 280172, 276868, 328835, 325920, 291650, 335153, 338801, 315572, 351242, 372983, 406579, 414378, 429760, 441979, 473040, 440524, 405800, 390553, 383523, 374433, 374632, 405982, 401114, 362055, 351572, 361072, 388191]
2363C88191K1213L2979J6265L5076L0760N166L3758K9220J3685L9094K4827J9433
2351F89667j9525M83K71J5104M8172L7941M4683M3615J07988M9399K9485N6361
2339A103644O9985J44727J46701J87708K22423K35489L12297L05158L17918K69576
2329C315626K28824K74196K51699K87643L63308N38776Q20955J191660J933403
2320I206090L362385N363599P183802P298469M746678J513687l91583j954767
2312C6328360l893728m756543m632896m029476l451610l123135k515018j818300
2304H107654j200164p69772n76047m68068m61523m14557l49363l52041l71614
2295C144505k48348k32425j79751j69765j68798j33640j00718r9490q3152n6130
$$ y = [388191, 409404, 442383, 458648, 493724, 524484, 529650, 563408, 592628, 606313, 645407, 670234, 689667, 670142, 670625, 670896, 686000, 734172, 772113, 816796, 860411, 968399, 1017798, 1047283, 1103644, 1173629, 1318356, 1465057, 1652765, 1875188, 2110677, 2422974, 2728132, 3046050, 3315626, 3544450, 3818646, 4070345, 4357988, 4721296, 5260072, 6081027, 7272687, 9206090, 12568475, 17932074, 25115876, 32414345, 37161023, 38674710, 38283127, 36328360, 32434632, 27678089, 23045193, 19015717, 15564107, 12440972, 9925954, 8107654, 6907490, 6137718, 5561671, 5093603, 4632080, 4217523, 3868160, 3516119, 3144505, 2896157, 2663732, 2483981, 2314216, 2145418, 2011778, 1911060, 1811570, 1728418, 1672288]
2285A672288m6018l9372j3494n6807n5985l5425o3819k6769l0171j0986n8145
2274A235297k2789o7256m4685j4338m2664q222j593k6468l3298M06r940m9092
2262I15358L644k8230p97m0052m3873j1633J151l9033p611n6983m1275j2912l6588
2249F01166J8162R722q613n4360m2943Q730J1138J5310m770j02m33n798l6183
2236E11026r618P867k6507j2368l0098j8116j6108L149J797K4430j1086j2940
2224D11428K103k6890J1982m7418k3217L4047k1540K273l0813K0382O850j585
2212C37602K0195m1132J5816P830j7517P891k3818N301p27j382k3477j556M3497
2199C28523k5838J1815k5324j888J4871k9546K8904n176Q859L727j0260J3068
$$ y = [1672288, 1626270, 1586898, 1573404, 1516597, 1460612, 1425187, 1361368, 1334599, 1304428, 1293442, 1235297, 1212508, 1145252, 1100567, 1086229, 1043565, 1035343, 1033750, 1007282, 973984, 974390, 964450, 915358, 919002, 890772, 889975, 849923, 806050, 794417, 795568, 756535, 748924, 691941, 650666, 637754, 601166, 619328, 629050, 620437, 566077, 523134, 531864, 543002, 558312, 553542, 553440, 553007, 547209, 511026, 501408, 509275, 482768, 470400, 440302, 422186, 406078, 409227, 411024, 435454, 424368, 411428, 413531, 386641, 398623, 351205, 327988, 362035, 340495, 342768, 311955, 332337, 339187, 337602, 357797, 316665, 332481, 340311, 322794, 330685, 306867, 312168, 311441, 310059, 286582, 285026, 328523, 302685, 314500, 289176, 287288, 302159, 272613, 301517, 296341, 305200, 308927, 298667, 311735]
2187C11735k9009m81K9636k3163m546l1468j8100J8161J292J8807j4135o433j3432
2174B38864J7962j193r935J7340l3610P661K6953O212n3774M962j2510j1709K2406
2161B19629J0985K74k4278k109k1937m2112j940M0370O501l7862N905N1953l5089
2148A70290m5010J7810K7845p782L316K6615k7520M497J969j0452j7566L3985
2136A77997J9605m2692N693j046J9615K9973J246J7566l042l9750k3890m748L9100
2123A95627k5845l8827J9949M4676J6297j7381l7671j5903K7781j6413j2901j4097
2111A25292J3877K177j0763Q854J2882k5537j9970M48J8981j3821k0539p506O959
2098I1334K2220K338J2548N595K166k9713M012k1059J3697M6776J2493j7795j2671
$$ y = [311735, 282726, 282245, 311881, 288718, 284172, 252704, 234604, 252765, 254057, 272864, 258729, 252296, 238864, 256826, 255633, 245698, 263038, 229428, 237089, 264042, 270254, 216480, 221442, 208932, 197223, 219629, 230614, 230888, 206610, 204501, 182564, 140452, 138512, 178882, 185383, 147521, 153426, 205379, 170290, 125280, 143090, 170935, 163153, 166469, 193084, 165564, 170061, 172030, 161578, 144012, 177997, 197602, 154910, 160603, 159557, 179172, 209145, 210391, 227957, 224915, 185165, 161275, 156527, 195627, 169782, 130955, 150904, 195580, 211877, 194496, 156825, 140922, 168703, 152290, 139389, 125292, 139169, 141346, 130583, 139437, 152319, 126782, 106812, 107260, 126241, 112420, 91881, 84375, 91334, 113554, 115892, 128440, 134035, 136201, 106488, 110500, 89441, 103138, 149914, 162407, 144612, 131941]
2085A31941P394p166Q23o76J1678K0401o858J3892l1444k684l552j7872M713L7156
2071A57746j1584k3764J8117R155k6999K7266m356r740r451j8847L1449r12o545
2058A31535J3935j9140o450K0386J719j1699K9464J8775N9793J5317R798N2089
2046C15522o304j7654j0240m1662O699m764k3417j7512p039o73l3291L0298j7625
2033A72338J181L940o788j2459j0744J9153K275k7225M955m696K5366K8360N441
2020B01097m2799j1032p278k0797J4492j2633J7820K4600m6048M994j6977K4393
2008A29832k886M612r90J9582J4357m6150k0795N0669J1130p600j2279M440l719
1995A40203k0888J9445j5355j6505o502R67K186J7794P281k9479j1177J2313R353
$$ y = [131941, 139335, 132169, 132992, 132316, 143994, 164395, 157537, 171429, 139985, 137301, 133749, 115877, 120590, 157746, 146162, 122398, 140515, 149670, 122671, 149937, 145581, 135841, 126390, 107543, 138992, 138080, 131535, 145470, 126330, 119880, 140266, 141985, 130286, 159750, 178525, 238318, 253635, 263433, 315522, 309218, 291564, 281324, 239662, 246361, 241597, 218180, 200668, 193629, 192956, 159665, 189963, 172338, 173519, 177459, 170671, 158212, 147468, 166621, 168896, 141671, 146626, 141930, 167296, 195656, 201097, 158298, 147266, 139988, 119191, 133683, 121050, 138870, 163470, 117422, 122416, 105439, 129832, 126946, 131558, 130568, 150150, 164507, 118357, 97562, 148231, 159361, 151761, 139482, 143922, 140203, 119315, 138760, 123405, 106900, 100398, 101365, 103551, 121345, 128626, 99147, 87970, 100283, 109636]
1982A09636j3856K0170j1412L358R811J0605K899l8581n405j5037J9302M669j228
1969I4931L0750r805l6428P305m253L3320J0834l1874k0472J7402j3088k8559
1957E0063J2177j1727L8324J4602k5564R883M4794j2281l2147j5324M962L3139
1945A10901j8946K1440k6765j79j7738K5854j8678q432j9399J2151L4137l1839
1933F2507k301n122K5812K649J770j2647j2607N437K8317R445j2563m1508J0586
1920E9775j566j9570L6317q086j3721L4360O949r301K0740k9119j652Q341k6582
1907E6885J404J6786m596R127J5579l59k1481l326J7592J1260k2763o1m726J1505
1893H2826J364j9516o186Q424k855L411k0340K0246L3320N621J1835j0593k3145
$$ y = [109636, 95780, 115950, 104538, 107896, 117707, 128312, 131211, 92630, 87225, 72188, 91490, 96159, 94931, 125681, 115876, 79448, 86753, 82500, 115820, 126654, 94780, 74308, 91710, 78622, 50063, 62240, 50513, 88837, 103439, 77875, 87758, 132552, 120271, 88124, 72800, 77762, 110901, 91955, 113395, 86630, 86451, 68713, 94567, 75889, 67457, 48058, 60209, 94346, 62507, 60206, 55084, 80896, 83545, 85315, 72668, 60061, 65498, 93815, 103260, 90697, 49189, 59775, 58209, 38639, 74956, 66870, 53149, 87509, 94458, 85157, 105897, 76778, 75126, 83467, 56885, 58289, 75075, 70479, 79606, 95185, 94826, 73345, 70019, 87611, 98871, 76108, 76047, 71321, 82826, 84190, 64674, 58488, 66912, 64057, 67468, 47128, 67374, 100694, 106315, 118150, 107557, 84412]
1880H4412j6144j4398K6316J2255l0010K837j3160R997l371q401M4746j9631o150
1867F9298J641r52O284k5842k422l579K9008K1406r27n001j2732j2917K3600j1950
1853G4915K7083l3015k6305J5632k0943r691K6758N557J9003k3387r563J5073
1841F1117j8241J243k909O171N748L4235J0994j2176j1018J5591k1513l2302J9970
1828E6910m4274j594N467O944O666L5419J214L507K6008m479k006p802p605k336
1814G2039J9273m3838N967J1882k8186K2565J738J5766q617o295K8227n480l3661
1801E1380M250j0592j1086n55L3359n025J1921l6253r800N5991k2164K1035k3608
1788E8853K3789n06k1837l328L379j1089K7712Q669j2174l043o478k5240j78J6474
$$ y = [84412, 68268, 53870, 80186, 92441, 62431, 65268, 52108, 62105, 58734, 50333, 95079, 75448, 69298, 70939, 69987, 76271, 50429, 48007, 44428, 73436, 94842, 93915, 88914, 76182, 63265, 86865, 74915, 101998, 68983, 42678, 58310, 37367, 27676, 54434, 59991, 78994, 55607, 46044, 61117, 42876, 44119, 41210, 47381, 53129, 87364, 98358, 86182, 75164, 90755, 69242, 36940, 56910, 12636, 11042, 16509, 23453, 30119, 65538, 66752, 70259, 96267, 91788, 89782, 81980, 74375, 72039, 91312, 47474, 53441, 65323, 37137, 59702, 61440, 77206, 68589, 62294, 90521, 85041, 51380, 55630, 45038, 33952, 33397, 66756, 61731, 73652, 37399, 27599, 83590, 61426, 82461, 58853, 82642, 82136, 60299, 56971, 60350, 49261, 76973, 85642, 73468, 70425, 63947, 38707, 38529, 55003]
1774E5003L126q632K050K9286j945l1208L791j3704J7517K249j0283J141j1164
1761C7227K033J0340p557j7817M091L9386j80n95M5117M476k6038Q566J4877m3894
1747G0032l352l1993L1533K567j8360j3693k3339L3194M1971p092L173k4585j9823
1734D0233K3128j5752p778o442K1820R610k382j5345J4504J352j1087J3443k3453
1721D1851L0490N688k0788j8662N157J3084j378J9226n923j3412k6914r738M0329
1708E9010p743j705J8261k5229J7405n606j0842O032K1138j4086j994Q771O661
1695G0073M381q268J3940Q524l4498j0123K6869K1911j8453L251n508k5862j909
1682D4328j4807K463K7190L4724N60k9572q377j1239j749K3834p494p239K6386
$$ y = [55003, 58129, 49497, 51547, 80833, 78888, 47680, 51471, 37767, 55284, 57533, 47250, 48391, 37227, 39260, 49600, 42043, 24226, 28317, 67703, 67523, 66928, 112045, 116521, 90483, 99049, 113926, 70032, 66680, 34687, 66220, 68787, 50427, 36734, 13395, 46589, 88560, 81468, 84641, 60056, 40233, 63361, 47609, 39831, 33389, 55209, 64819, 62437, 47092, 61596, 62948, 51861, 65304, 41851, 72341, 78029, 57241, 38579, 43736, 56820, 55442, 74668, 68745, 55333, 28419, 18681, 59010, 51267, 49562, 67823, 42594, 59999, 54393, 43551, 49583, 70721, 56635, 54641, 63412, 70073, 74454, 66186, 80126, 88650, 54152, 44029, 70898, 92809, 74356, 77607, 72099, 46237, 44328, 29521, 31984, 59174, 93898, 94458, 64886, 56509, 45270, 43521, 67355, 59861, 52622, 79008]
1669G9008L2373l6423Q440j9053L475J4290k1534J184J4073j1711j1425J0229
1657F2926J9852m3599J8502K1919k6601k111J328j3450j8516l5861L215M2608
1645C0212o585j1657R982M6915J9358j8556j9230n554k8336M994Q101K2647k0902
1632C1389K7805L803J7884l286j785j5671j356J0743K097j0214l992L55l0329
1619B7443M239j4856k405L5306L2871k6030j0370K5156j6439j256n498J4351J5887
1606G8399l325j1023j6230K160J5396P080l9278j067k475K1918J7657J45m292
1593F5065k826r704l4786k2483K2818L3130J2826k5126n602j5030M2821K4398
1581H5501j3683P556j7529j8706j5117J2129K6732J3048p869l8634O237K9278
$$ y = [79008, 111381, 74958, 83398, 64345, 67820, 82110, 60576, 61760, 75833, 64122, 52697, 62926, 82778, 39179, 57681, 79600, 52999, 50888, 52216, 38766, 20250, -15611, -12396, 30212, 23627, 11970, 21952, 68867, 88225, 69669, 50439, 44885, 16549, 21543, 29644, 52291, 31389, 59194, 62997, 80881, 77595, 75810, 60139, 58783, 69526, 71623, 61409, 57417, 57772, 27443, 31682, 16826, 14421, 49727, 82598, 56568, 46198, 71354, 54915, 53659, 48161, 62512, 78399, 75074, 64051, 47821, 49981, 65377, 72457, 33179, 32112, 29637, 51555, 69212, 69357, 65065, 62239, 52535, 17749, -4734, 18084, 51214, 64040, 38914, 33312, 18282, 61103, 85501, 71818, 79374, 61845, 43139, 28022, 40151, 66883, 79931, 72062, 33428, 39665, 68943]
1569F8943k7699k7070J6739k4459J9464j5900K743M113j4044J3446j6290J7516
1557A7502N4739m862l2631j170N998K8399k9048O53Q78k7649L080L6949M113J1361
1543F8312K2376o645N076j77L980k1781l0071j2867K8122k8677k6961K8889j9930
1530I646L1488o025K8998K5074m2184M0258o848k2416r917J1927J5201m8346j5644
1517A1212J1214L1379L0901j5726k3903j1891J5348J7730k5165o71k0703p873
1505A1852M43K2358k5241l864J9606J0650n561j1861K657r21L08n530j1500J5272
1491A8668R02J3569K6193m0083Q227K5917l4870l307M0962J3222j2265k8947P064
1478C5252K1705k321j2112J1273j1803n8397M973J8752N1841j9838k0812R642
$$ y = [68943, 41244, 14174, 30913, 6454, 25918, 10018, 12761, 16874, 2830, 16276, -14, 17502, 72241, 67379, 34748, 33578, 39576, 67975, 38927, 39580, 40458, 12809, 15889, 52838, 56951, 68312, 90688, 84043, 89119, 88942, 92922, 71141, 41070, 28203, 56325, 27648, 687, 29576, 9646, 41134, 35109, 64107, 89181, 46997, 87255, 80407, 57991, 48074, 60001, 75202, 26856, 11212, 22426, 53805, 84706, 68980, 45077, 33186, 48534, 66264, 41099, 40428, 19725, 11852, 12295, 34653, 9412, 5548, 25154, 35804, 30243, 18382, 21039, 20118, 20426, 14896, 3396, 18668, 19570, 33139, 59332, 19249, 27476, 53393, 18523, 15216, 56178, 69400, 57135, 28188, 35252, 56957, 54636, 42524, 53797, 41994, -16403, -11430, 7322, 59163, 39325, 18513, 28155]
1466B8155j5732N458J6350K1568l3234J6309J0602J2715P99J5633j2558k916n146
1453E8003q186J6550j6900j5241K633M4261j6237l5092j0709K603r906J0590J4699
1440C7068n308L7467l5937M1488j417J5752j3722j5831k6100J5240m252J0405
1428E4853L2537J5917j7312n4489J8659M385J3980l4830j9126O105K8126k2813
1416B5992K165l28K738j5455L0636P046M907N914m1418L5328J1008j7375k5930
1403B5228Q311o99k2586K9605K5760k945o610N033K366J1799j6783l0435j4515
1390A3529J3419P769J3025n817m7431j9739J4558J4306N4380K2322k8634j8209
1378C3478J6285k0182j2206J0581Q736Q802j6271k0238o911j1720K6103p535K2923
$$ y = [28155, 12423, 17881, 34231, 55799, 22565, 38874, 49476, 62191, 62990, 78623, 66065, 63149, 58003, 49817, 66367, 49467, 34226, 36859, 81120, 64883, 29791, 19082, 21685, 11779, 22369, 37068, 31760, 69227, 33290, 74778, 73361, 89113, 75391, 59560, 33460, 48700, 44448, 54853, 87390, 103307, 85995, 31506, 50165, 54550, 68530, 33700, 14574, 20679, 48805, 25992, 28157, 27829, 30567, 15112, 45748, 52794, 57701, 63615, 22197, 57525, 68533, 51158, 25228, 33539, 32840, 10254, 39859, 65619, 62674, 56064, 61097, 63463, 75262, 58479, 28044, 13529, 26948, 34717, 47742, 41925, -5506, -25245, -10687, 3619, 57999, 80321, 51687, 33478, 49763, 29581, 17375, 27956, 36692, 45494, 29223, 8985, 2074, -9646, 16457, 8922, 31845]
1365C1845J110j0876N477L396J4135l0041K0978l255j1136J984Q730k1121R568
1352B0794K772n469K0892N306m0515q718K0371J150M476j8831o79J6190N520j2118
1338A1141J4700J1326j1651j4317K0434K5096J8297k6878m2887M302N47K7600
1326C7710k392K5116J3061m0254l5361J3358L1097k7653j3905J3884L1661l837
1314D2485l9932J3731k088q088L3009O483O597Q713k2835J1325j2409M131m826
1301C6296p052J3725j5396q259l4156J6810L8915p627K954L1040k6606L290q249
1288C5685J4449k728L271K0259m8840J5198k2188Q175l406j0466K6966K468P686
1275D6529r156n984l1589j2177l914L796K1931K032l2505K3060L2184k7937J6190
$$ y = [31845, 32955, 22079, 27556, 30952, 45087, 15046, 36024, 32769, 21633, 23617, 32347, 11226, 20794, 23566, 18097, 38989, 44295, 3780, -4938, 15433, 16583, 21059, 2228, 1549, 17739, 23259, 11141, 25841, 37167, 25516, 11199, 31633, 56729, 75026, 48148, 5261, 9563, 10110, 37710, 35318, 60434, 73495, 33241, -2120, 11238, 42335, 14682, 777, 14661, 46322, 42485, 2553, 16284, 14196, 6108, 39117, 45600, 52197, 60910, 38075, 49400, 36991, 41122, 36296, 29244, 42969, 27573, 19314, -14842, 1968, 40883, 33256, 36210, 67250, 40644, 43934, 35685, 50134, 47406, 50677, 70936, 22096, 37294, 15106, 23281, 19875, 9409, 36375, 38843, 46529, 37373, 31389, -200, -12377, -16291, -12495, 9436, 11468, -21037, 2023, 34207, 6270, 22460]
1262B2460p644J2709J8272m398L225K51n760J2999j1496k5560k3362j7125M7876
1249B2447R546k106n485O554K5855K781R591j5017Q830k3954m463M155j2392j799
1235B4543R411k936j6269O499N620r606K8897j50M959r696o600j9573j851k0283
1221g035N656J0460M53o62p478O5542o979m918k2094j0716J4445K4639N29k3611
1207C8231L385k6960K525j1369N2050k8185k3038J4014k4784L1888J2629K9626
1195G0012k6125k0953q363M1989j3239m308L0472j1301p866l4659k9734J206L721
1182i148J4591L338J9220r047j0668P491K9941k1359j9376o681l40L913J0106
1169A1981M75L2728l79r145P112j1907j305k309J9563R526l3136J5800Q407j6341
$$ y = [22460, 14816, 27525, 45797, 41399, 44624, 44875, 39115, 52114, 40618, 15058, -8304, -25429, 22447, 31993, 29887, 24402, 30956, 56811, 59592, 69183, 54166, 62996, 39042, 34579, 38734, 26342, 24543, 33954, 31018, 14749, 21248, 26868, 17262, 46159, 46009, 50968, 41272, 34672, 15099, 13248, -7035, -1379, 9081, 9534, 8872, 1394, 66936, 59957, 55039, 32945, 22229, 36674, 61313, 61842, 38231, 41616, 14656, 17181, 5812, 57862, 29677, 6639, 20653, -4131, 27757, 40386, 70012, 43887, 22934, 14571, 56560, 43321, 39013, 69485, 58184, 50318, 15659, -14075, -12869, -9148, 5443, 8781, 28001, 18954, 8286, 15777, 45718, 24359, 4983, -1698, -2038, 1875, 11981, 12456, 45184, 44805, 35660, 42772, 30865, 29560, 27251, 46814, 56340, 23204, 39004, 47411, 31070]
1155C1070R071N140P315j9544j5900j7938K0741m02P480k1577J4701M1980l2856
1142B9281k320j9080J5894l2338L0400K3214m6010j4041M1852n191J4469O71j0333
1129B6468M633r10J85j8871M4513l367o0289n384P869l0229J6215K9265R988k6489
1115f403J7734M31k2252M462j0459L5237R253r692k569K197j0289m6660N0628
1102A1618M8945J423m2626K8137k3633k0505l1398n698K8153J6866L842J3349
1090B8473l7792n554M3884j3531r166j4594j1967K163M2376R608k9445K7256P057
1077C8768K0536j2265k75l7715K765q538j0569Q347j9302l3913M4144J744j0094
1064a6367J0735L3927P171n5747M4831j9898n14j2558P120J6247J0343M269k9236
$$ y = [31070, 40141, 45281, 52596, 33052, 17152, -786, 19955, 19553, 27033, 5456, 20157, 62137, 29281, 26961, 7881, 23775, -8563, 21837, 45051, -959, -15000, 26852, 21661, 36130, 36801, 26468, 31101, 30191, 30376, 11505, 56018, 52651, -7638, -13022, -5153, -35382, -19167, 10098, 20086, -6403, 11331, 11762, -10490, -6028, -16487, 18750, 28003, 18311, 15742, 17939, 7650, -39010, 11618, 60563, 61986, 19360, 47497, 23864, 3359, -28039, -33737, -5584, 11282, 15124, 28473, -9319, -14873, 29011, 15480, 6314, -8280, -20247, -18084, 24292, 33900, 4455, 31711, 38768, 59304, 47039, 46764, 9049, 11814, 3276, -7293, 1054, -18248, -52161, -8017, -6273, -16367, -5632, 28295, 35466, -20281, 24550, 4652, 4138, -8420, -1300, 14947, 25290, 29559, 323]
1051C23Q828K687K7473J9057k3421j903j8831n511l2489K3866j486J6012j0387
1038D218K5457r741R491j0871k206J4357K2559L972n4579j1172O782K9077r874
1025A7470K7432j0071j2377k353J7389M387m262m1070J6647J2800j9028j672J9038
1012B4330M5653q178j9810j3477k13r067j2385J8059l434L511q621k1063J5405
999A0710K9938l3525J9381J2114k2926Q752q383j2880j1571l670m036J2286l704
986g514K0155k1383q516N76K2413m247J7273J5140o476j804r494l8344P001k3636
972c8856K2677M5783M143o4q624N6j29M914j2648j363k0901J6891K8736R159j0157
957C9617l6122j1073j4369J593m193J9610L920j9674J2713K1720l5206Q647J7756
$$ y = [323, 9151, 11838, 39311, 58368, 34947, 33044, 14213, 8702, -23787, 79, -1407, 14605, 4218, 29675, 19934, 29425, 18554, 16348, 30705, 53264, 57236, 2657, -8515, -1733, 27344, 17470, 44902, 34831, 22454, 20101, 37490, 41877, 37615, -3455, 13192, 25992, 6964, 5292, 24330, 69983, 61805, 41995, 28518, 28305, 19238, 6853, 24912, 21478, 24989, 16368, -4695, 10710, 40648, 7123, 26504, 38618, 15692, 24444, 16061, 3181, -8390, -12060, -16096, -3810, -7514, 12641, -8742, -17258, -16682, 5731, 1484, 18757, 33897, 27421, 25617, 16123, -22221, -15220, -38856, -16179, 29604, 33747, 33683, 25059, 25115, 24986, 29900, 17252, 15889, -5012, 11879, 40615, 49774, 39617, 3495, -7578, -21947, -20354, -24547, -4937, -1017, -20691, -7978, 13742, -21464, -12817, 4939]
944D939l155L6325J339k4558m55M9159L442l5334Q997l814l8450R610J6609L17
930B4971k8235p851J2256k4650M369n664K2572J0796J0020k2775M697K6443N086
917C2035P77O512j2362k9357j8403j6860M2538L676l743K105j707j3757j7531
904b6077o75N0045j9983j9739K1438K0425m1345p338M4139o62j2112K2906O008
891C7030k279j1175O768j2539j7419k2038k3009N240N9036n219j4001l1452Q107
878b2950J8711J3347J3521k96J040q719J4418K2786n646k0393j096j6535k5619
865a7431m731K3610J5434K7764j9996L160L1904q48j9304j4266J8164n937j6432
852B1091j8517k6131O0431j2565q690M4344Q029j9782j3107k3735J4808J2754
$$ y = [4939, 1784, 38109, 39448, 14890, 14435, 63594, 67036, 31702, 40699, 36885, -1565, 8045, 24654, 24971, -3264, -11115, 1141, -23509, -19140, -24804, -2232, 8564, 18584, -4191, 506, 26949, 32035, 32812, 39324, 26962, -2395, -20798, -37658, 4880, 8556, 4813, 6918, 5211, -8546, -26077, -26752, 23293, 3310, -16429, 5009, 25434, -15911, -23249, 20890, 20228, 8116, 31022, 37030, 34751, 23576, 30344, 17805, 386, -21652, -44661, -39421, 19615, 14396, 395, -31057, -22950, -4239, 9108, 22629, 22333, 23373, 14654, 29072, 51858, 46212, 25819, 24723, 8188, -17431, -22162, 1448, 16882, 44646, 24650, 27810, 59714, 58866, 39562, 25296, 43460, 37523, 21091, 2574, -23557, 36874, 24309, 15619, 59963, 67992, 48210, 35103, 11368, 26176, 38930]
840C8930r221j2695l7786P919j7356O914J3281L1204K872k0556p194L389J5273
827A4974k5995k9K3062N3676j4198m4871j6366J5592QJ3658J4279k9192j6570
814a1972J4308K5950M22j2452j0252J8021j7611m219L6577K1563j6248p518j8858
801A7711l6332k306N443J0728j8768q14n422L7065K0498n5804l066K7388J0940
788G261k1847J1058p433J1645J7431j5033j9768J4615k800j4516J7134j6216K548
775a5921n224K8807j6016J62j2633k7214M5465P747r147K6402r626j7518J9573
762A4857l0208p741K229J7373K6823j1906J4443m9643K9522Q381p198r241K817
749E08L261N071N261j0554r185J8169n024k311j277p689L6852k0629j3851k7496
$$ y = [38930, 29709, 17014, -20772, -12853, -30209, -23295, -10014, 21190, 24062, 3506, -3688, -299, 14974, -11021, -11050, 12012, 65688, 51490, 6619, -9747, 5845, 5853, 19511, 33790, 4598, -11972, 2336, 28286, 28708, 16256, 6004, 24025, 6414, 2195, 38772, 60335, 44087, 36569, 17711, -18621, -20927, -15484, -4756, -23524, -24338, -29760, 7305, 27803, -28001, -31067, -3679, 7261, -14586, -3528, -10961, 684, 18115, 3082, -16686, -2071, -4871, -19387, -2253, -18469, -15921, -21145, 7662, -8354, -8192, -20825, -48039, -2574, 5173, -3974, 22428, 12802, -4716, 14857, -15351, -23092, -20863, -3490, 23333, 11427, 25870, -23773, 5749, 14130, 6932, -2309, 508, 3769, 8840, 14101, 3547, -5638, 12531, 7507, 5196, 3919, -3770, 33082, 12453, -1398, -28894]
735b8894L181L5561M7596k4213m7315J3741R431L833O23J0437K048j202k2295
722B532L940J3825m6134M206N04J985j77j1047J0051K3913n1969J1887J5002m734
708b6216K2080J5348K8859j6950l0144n797K1285n629m74J4900J2825k123r048
695A8916J1917q110J4892j564j1355p022n098j751j2621l514p721k1949j4294
682d9274r09K0734K5460J8712k24k6082j615p815L5971J7337k1165j8711j4816
669b2397O323L0794J9953r957K606j1620N632k1556n704k3164r470N8992K790
656B3222l9731J694L194J7813K9056k2836j530k4668J7624J0706R2r032J051M151
642A0806k0279Q440k208m3184m48K6607j5699j914K3394K0487n914M3409j4018
$$ y = [-28894, -25713, 9848, 57444, 33231, -14084, -343, 9088, 12921, 13544, 23981, 26029, 24827, 2532, 6472, 20297, -25837, -21631, -21127, -19142, -19319, -30366, -20315, 3598, -48371, -36484, -21482, -26216, -4136, 11212, 40071, 23121, -7023, -12820, 8465, 2836, 2362, 17262, 30087, 27964, 18916, 30833, 22723, 37615, 36051, 24696, 17674, 12576, 10825, -1796, -5310, -13031, -34980, -49274, -50183, -29449, -3989, 14723, 14499, -11583, -13198, -21013, 14958, 32295, 11130, -7581, -22397, -16074, 14720, 34673, 24716, 27322, 15702, 21334, -222, -5926, -29090, -38560, 20432, 23222, -16509, -14815, -11621, 6192, 35248, 12412, 10882, -13786, 3838, 14544, 14636, 5604, 6655, 10806, -9473, -1033, -3241, -46425, -46873, -20266, -35965, -37879, -14485, 6002, 88, 43497, 29479]
629B9479l4976J5396N880l090J865j0384n953J7518o819K3890j4633K6688K4237
616F9098K3091j0109k1126O338l0716l4946l9330N208o962K9208j5271M6665k535
603A8613P189K67m6858q004L7990K0932j6386R682j6131K5937j7373j040n0481
590c5663J6719L853l0829M1108n780K1092J2464K1789p434o434r61J5128k8414
577A6638Q179j4949P195j7988m8949K3389K0019j1726J9196L6413l7239k7566
565b7388L627L1353k1823j249J5303r56o603m872J5140j3131k389K0674J8230
552B5916k4742R100r64l2305K7802j2153n191M703r469P698K4533j4411o693N235
538i41k0962N915N1964J5592k1931k7930M921j4130O089l789q522q034j5069j0839
$$ y = [29479, -5497, 9899, 15779, 12689, 14554, 4170, -1783, 15735, 8916, 32806, 18173, 44861, 69098, 92189, 82080, 60954, 67292, 36576, 1630, -37700, -32492, -39454, -10246, -25517, 21148, 18613, 25802, 26069, -20789, -28793, 9197, 30129, 13743, 23425, 7294, 33231, 15858, 14818, -35663, -18944, -15091, -45920, -4812, -10592, 10500, 22964, 44753, 37319, 30885, 29924, 45052, 16638, 24817, 9868, 17063, -925, -49874, -26485, -6466, -18192, 1004, 37417, 178, -27388, -23761, 7592, -14231, -15480, -177, -1133, -7736, -12608, 2532, -10599, -12988, 7686, 25916, 1174, 10274, 9310, -22995, 4807, -7346, -12537, -7834, -17303, -9605, 14928, 517, -6176, -941, -21903, -15988, 35976, 51568, 29637, 1707, 6628, -7502, -1413, -5202, -13724, -21758, -36827, -47666]
524d7666L2186M2285p149k8126L391m126K2563R130k8052k4311L3486O361N110
511A5082P539j1893k806j0696J1584N435l954j3233j0349J1141J4805k3313q024
498a8682k1622n0N411J4741k1725J5924L9264k8286k389j9954M0530m375K2066
485B0853j0140r915K6071J9151n336n1478J0625K5673J1094k6044k1692j9806
473c0944J5376j1234J721J2626P073m5168K1886M269k6251J8477L5003M234k744
460D324J0637N696m162k7200J6314P755j2444n887L3970j5962n3960K0477M8709
447B8267J1765k5314j9045j3268J6656o68j1047r062L788N7495o813k7333J917
434G338K009q051j3914p034J3176j4075j3875M6378J980Q379l4688p80L2413K7158
$$ y = [-47666, -15480, 26805, 19656, -8470, -5079, -9205, 13358, 22488, -5564, -29875, 3611, 9972, 15082, 22621, 10728, 7922, -2774, 8810, 14245, 10291, -2942, -13291, -2150, 12655, -10658, -18682, -40304, -40354, -34943, -20202, -41927, -26003, 13261, -15025, -17414, -37368, 3162, -1213, 20853, 10713, 798, 26869, 46020, 40684, -10794, -169, 25504, 36598, 10554, -11138, -30944, -15568, -26802, -25081, -12455, -5382, -50550, -28664, -24395, -50646, -32169, 2834, 7068, 4324, 14961, 20657, 16495, -10705, 5609, 13364, 920, -4967, 29003, 13041, -40919, -20442, 28267, 40032, 14718, -4327, -17595, -939, -1607, -12654, -21716, -17928, 39567, 32754, 5421, 7338, 9347, 1296, -12618, -19652, -6476, -20551, -34426, 11952, 13932, 22311, -12377, -13157, 19256, 46414]
420D6414k8840r011l8797q31M030M698K6928k758j5123K0385O669j4529Q081j8182
406a0866j8079j2744l140J9670J3436n424K5872r131l5301K9628L0097k9915M52
393e445m106n096p261k208o401O722k7349M3386M7941l3860q528J7261K932l4142
379a6154l8883L501J972j8380K6137L634K9278j5201l696K9339J5543j5927j5149
366a3986L1363j9121M313k1258k4579J8471Q572J2464J0613k7643K6849J401R910
353A7369k9266k2532R290L887K5711k8414n027L317J3496m197N06L2938k4427
340g349M222l3670K0408J6036m576O175k8547q686K1925q750K617K4167J5272
327A9244j4242k0644r682J1222k7616J8711l6637k2464M0585R622J8023m7971
$$ y = [46414, 17574, 8563, -30234, -31065, -27035, -22337, 4591, 1833, -13290, 7095, 13764, -765, 7316, -10866, -28945, -41689, -44829, -25159, -11723, -17147, 8725, -406, -35707, -6079, 24018, -5897, -5445, -9551, -14647, -21908, -24116, -30517, -23795, -51144, -7758, 40183, 6323, -2205, 15056, 17988, -16154, -55037, -51536, -49564, -67944, -41807, -38173, -8895, -24096, -27792, 1547, 17090, 1163, -13986, 17377, -1744, 2569, -18689, -43268, -24797, -16225, -3761, 6852, -20791, 6058, 7459, 17369, -11897, -34429, -25139, -21252, 4459, -23955, -28982, -25665, -12169, -16366, -15860, 17078, -7349, -3127, -36797, -16389, -353, -4929, 1246, -27301, -35987, -14062, -22812, -20195, 3972, 19244, 5002, -15642, -25324, -14102, -41718, -23007, -59644, -82108, -41523, -31901, -13878, -61849]
315f1849O312N404J2492J3890o989Q07J4178K9543Q014N813j3610k1647m622M741
301g523L0770k3454j3086K2637q020k1377K6304k1583k5894K0549K5193j3089
289h573J7754R457m4132K4469j2277k6702J6179K944L2636o021m1511J6988k661
276b1450J2131j8354j5245O718J0877M1153l1428J792k670K6679N043M653k5685
263e786k8523j6739l159o393J7320M7220k1013j6266J5019m013j5774K8313K0896
250A1102J2510L750n641k2902M583N950r121J1108l5116j7741J928K0375j3389
237c2604j4426N892N141K210R509k944j0914q895m214K8293l4171N065K2408k0219
223d9869N369K2836Q792j3638P45J0901R110J2881R79J1002K791j867k3942m0310
$$ y = [-61849, -55537, -50133, -37641, -23751, -30740, -29933, -15755, 13788, 21802, 27615, 14005, -7642, -12264, -7523, 23247, -207, -13293, 9344, 1324, -20053, 6251, -15332, -41226, -20677, 4516, -8573, 9181, 18638, -25494, -1025, -13302, -40004, -23825, -20881, 11755, 5734, -35777, -18789, -21450, -9319, -27673, -42918, -36200, -25323, 15830, -15598, -13806, -16476, 10203, 15246, 19899, -5786, -34309, -51048, -54207, -60600, -43280, 3940, -17073, -33339, -18320, -22333, -38107, -9794, 11102, 23612, 27362, 21721, -1181, 3402, 9352, 231, 11339, -23777, -41518, -39590, -19215, -32604, -47030, -41138, -35997, -33787, -24278, -27222, -38136, -47031, -51245, -22952, -57123, -52058, -29650, -49869, -44500, -21664, -12872, -26510, -25765, -14864, -5754, 7127, 8106, 19108, 21899, 20032, -3910, -44220]
209d4220m37K5970p947m566j2629j0019J4057L7870k1611j5115k5111j593L7798
196b7553j0197J014J0662Q298j7349J2280L406J0720j3371N118l205J2980n935
183a3132n109J8002m9464j9436J5726O427k0760J0330J0137j5106Q889P736r311
170e5071R663L9602l975k5982J7153j8603Q100Q55j1091j3195P014l019j359k2793
156g2701K3380r461J4918R333o363o562l6209L749L7346M365k6518L2243m118
143c6598q693Q439p551j7513J3228k4717K1415K2261m01l7656q943L2062J1468
130c3199j9181j2650j2969M950K3937p222p333J6204j06j0438K0479j8880j5250
117g1658O778l115K3054r948o052p63K3144k9601j3557K5716j4806L041K1566
$$ y = [-44220, -44657, -18687, -26634, -31200, -43829, -53848, -39791, -1921, -23532, -38647, -63758, -65351, -27553, -37750, -36736, -26074, -17776, -35125, -22845, -19439, -8719, -22090, -16972, -20177, -7197, -13132, -18241, -239, -49703, -69139, -53413, -46986, -67746, -57416, -47279, -62385, -53496, -45760, -55071, -45408, -5806, -9781, -35763, -18610, -37213, -29113, -28258, -39349, -52544, -45530, -48549, -49908, -72701, -49321, -58782, -43864, -34531, -40894, -47456, -83665, -79916, -42570, -38205, -64723, -32480, -36598, -45291, -36852, -44403, -61916, -48688, -73405, -51990, -29729, -30130, -67786, -76729, -44667, -33199, -52380, -65030, -77999, -73049, -49112, -56334, -63667, -47463, -47569, -58007, -37528, -56408, -71658, -64880, -67995, -44941, -54889, -60941, -61704, -38560, -68161, -81718, -56002, -70808, -67767, -46201]
104d6201k2743k8728J60J3372K3588m3414j3985J7123K1649K157R830j8609R556
91g6245Q69j7605K590l3501j2313K238K5116N082K477J3063j286O567n874j3459
77a02281L103J3447M157Q8n521k3561M595R487P51K042k0381m990J1769J2001
63i5294j2389j3211M389J5767k4838J8459n910k778N898Q586j919k5840J2694
50a16386Q967p585j1235k839J7755r440j352J4173j519n313M960L76k525p389
36a19352j3417J6029j8095J2784j3530j3949l125m838l0297K2277M1696m521j5989
23a44327J1814j3269n442P152j5340L4823j5469n861j3992k137P436j1293J838
10a64067J6931J062k365p065k5698J7856J3951K1267l741j9700
$$ y = [-46201, -68944, -97672, -97512, -84140, -60552, -103966, -117951, -100828, -79179, -77022, -67192, -85801, -76245, -75376, -92981, -90391, -123892, -136205, -133967, -108851, -103769, -101292, -88229, -89515, -82948, -88822, -102281, -99178, -85731, -81574, -81486, -87007, -110568, -105973, -96486, -95735, -93693, -114074, -119064, -107295, -95294, -107683, -120894, -116505, -100738, -125576, -107117, -113027, -115805, -109907, -101321, -103240, -129080, -116386, -107419, -115004, -126239, -129078, -111323, -120763, -122115, -107942, -109461, -114774, -109814, -109438, -111963, -119352, -132769, -116740, -134835, -122051, -135581, -149530, -152655, -157493, -187790, -165513, -123817, -128338, -144327, -132513, -145782, -151224, -144072, -159412, -124589, -140058, -145919, -159911, -162048, -154612, -165905, -164067, -147136, -146074, -148439, -155504, -181202, -163346, -149395, -128128, -131869, -151569]
0a51569
$$ y = [-151569]
$$ Imaginary data points
##PAGE= N=2
##DATA TABLE= (X++(I..I)), XYDATA
16383a147092J5715K9998M267J6021K4896O161K6039k354m900J8386J3755M8233
16371i50875K0254j3770R252k523R074K8524L5431K9124J6510m912j5500J4866
16359h24545J6059L2765J5106j297K7606k658J3856o831L7639L889M0128J7746
16347f30537k224J9537P560J9416m220n745J6314K8064J4606L1911K1671j272
16335d84919J7080K7928m666J165p39M618L3943L5879q473P207M144n188J6129
16322c55892J6855K0080K0780K6950o659l33N2K3819O357p63K4739J5025K9632
16309a79358R644K0946j7113K6186L867j681Q258k0136M2827L4767J5517K7487
16297b8789q13l607K6664J1823l424P986L3087K2994q173j8319K7631K8449J3510
$$ y = [-1147092, -1131377, -1101379, -1097112, -1081091, -1056195, -1050034, -1023995, -1026349, -1031249, -1012863, -999108, -950875, -930621, -944391, -935139, -937662, -928588, -900064, -864633, -835509, -818999, -823911, -839411, -824545, -808486, -775721, -760615, -761912, -734306, -736964, -723108, -729939, -692300, -688411, -648283, -630537, -632761, -613224, -605664, -586248, -590468, -596213, -579899, -551835, -537229, -505318, -483647, -484919, -467839, -439911, -444577, -443412, -444151, -439533, -405590, -369711, -378184, -370977, -366833, -372021, -355892, -339037, -318957, -298177, -271227, -277886, -278219, -278167, -254348, -247991, -248754, -224015, -208990, -179358, -169714, -148768, -165881, -139695, -135828, -137509, -129251, -149387, -106560, -71793, -56276, -28789, -29602, -33209, -6545, 5278, 1854, 9840, 42927, 65921, 57748, 39429, 67060, 95509, 109019]
16284A09019k2978j1428K9474K102k394M808K1790l816J1100K5496J5996L118
16272A82287K3371J2725j2608K3224J3691J9096j6586o204K8373K3793J6456j3233
16260B94385K9227j422j8347k6621M401M3852J5730K0034J117J0538M3660R66
16248D17520k507K484J153L867O75J3251K7699P5K2608L0142k2663k3541l899
16235D66864K200P507K9985p791j2230J6557K1473L1840j278m657J0105r0P559
16222E68044O906J0659J9157k976j0990K6144m27l2276R205N2525K383k9585J1456
16209F30225O136j2986K0872L7218J9608j367K4283K1129k0367j6602O673J7992
16197G32814k3103j6161K0269K3868J4705o6j955R6J2363J1006p440j0688N205
$$ y = [109019, 86041, 74613, 104087, 106189, 103795, 108603, 130393, 126577, 137677, 163173, 179169, 182287, 205658, 218383, 205775, 228999, 242690, 261786, 245200, 238996, 267369, 291162, 307618, 294385, 323612, 322190, 303843, 277222, 281623, 325475, 341205, 361239, 362356, 372894, 416554, 417520, 415013, 417497, 418650, 422517, 423192, 436443, 464142, 464217, 486825, 516967, 494304, 470763, 466864, 469064, 476571, 506556, 498765, 486535, 503092, 524565, 556405, 555127, 550470, 560575, 560485, 568044, 574950, 585609, 604766, 601790, 590800, 616944, 616517, 584241, 593446, 645971, 648354, 618769, 630225, 636361, 623375, 644247, 681465, 701073, 699706, 723989, 745118, 724751, 708149, 714822, 732814, 709711, 693550, 713819, 737687, 752392, 752326, 750371, 750467, 762830, 773836, 766396, 755708, 760913]
16184G60913J0351J8421k6771M958Q449J7580N950J7287n721j9198K7729j3089
16172H06859k4614J6725K2737J7817k9693n991R102K2244J4341j1280j2266m239
16160H21742K6904l907K4164M438j504j1270k5415R617L0235M3984l876l2365
16148H82747q787j0111j6548L882L0884J7491o316j6429J639M600J7927J6794
16136I17773J6067p001M2771N646k3384m095m572j3408L675k1146L678R556l384
16123I22176P76j1706L637j2308N583j114K5249J5931k308k5716j1346K0432J4907
16110I44193R85n103m7531L2207N1198m936p233m078K1485p782J3302k146l085
16097I81476m4955j4355J5839R934R468p505J7589j0045K9182j9487k2295Q532
$$ y = [760913, 771264, 789685, 762914, 767872, 776321, 793901, 799851, 817138, 811417, 792219, 819948, 806859, 782245, 798970, 821707, 839524, 809831, 803840, 812942, 835186, 849527, 838247, 825981, 821742, 848646, 844739, 868903, 873341, 871837, 860567, 835152, 844769, 875004, 918988, 915112, 882747, 873960, 863849, 847301, 851183, 882067, 899558, 893242, 876813, 878452, 883052, 900979, 917773, 933840, 926839, 969610, 975256, 951872, 947777, 943205, 929797, 933472, 912326, 916004, 925560, 922176, 922952, 911246, 914883, 902575, 908158, 907044, 932293, 948224, 945916, 920200, 908854, 929286, 944193, 945178, 940075, 892544, 924751, 975949, 971013, 963780, 959702, 981187, 973405, 986707, 984561, 981476, 936521, 922166, 938005, 947939, 957407, 949902, 967491, 957446, 986628, 967141, 944846, 953378]
16085I53378J2756k1092l677R367n447J5795K1958k3904K668R705L1571J5006
16073A018084m2856M4595R911N911l2772j7105L1640r503k8395M118m2819J3727
16061I54536L4688J4329l213Q003j7288J3947J3068j2888j4163k2288J631K1904
16049I92266L3152r788j2650j6520j3295J0413J2723K8081l7035q849J8446k7761
16037I69183m973o178N214k71J8277p615L0139k358j7030L239O4742q939L756
16024A047186O624l0639r536j5968N019L485J3540j5297k010p355m0741J7086
16012I71394L9272J6586K996l7548N084K2375k7727K7819K3949m91k7000o768
16000A009941J445j5279J5504j4568J763P376r254j069j8060J8004M362m207R073
$$ y = [953378, 966134, 945042, 941365, 950732, 945285, 961080, 983038, 959134, 961802, 971507, 1003078, 1018084, 975228, 1019823, 1029734, 1035645, 1002873, 985768, 1017408, 1007905, 979510, 983628, 940809, 954536, 989224, 1003553, 1000340, 1008343, 991055, 1005002, 1018070, 1005182, 991019, 968731, 970362, 992266, 1025418, 1015630, 1002980, 986460, 973165, 983578, 996301, 1024382, 987347, 978498, 996944, 969183, 964210, 958032, 963246, 962975, 981252, 973637, 1003776, 1001418, 984388, 987627, 1052369, 1043430, 1047186, 1053810, 1023171, 1013635, 997667, 1002686, 1006171, 1019711, 1004414, 1002404, 995049, 954308, 971394, 1010666, 1027252, 1030248, 992700, 997784, 1020159, 992432, 1020251, 1044200, 1043709, 1016709, 1009941, 1011386, 996107, 1011611, 997043, 998806, 1006182, 996928, 995859, 977799, 995803, 1000165, 995958, 1005031]
15987A005031l4769q709K3242N005j8208j1150N2424K6133k672J7060O508J2488
15975A072383j3713j3053j0845k2120r07K3967k318j8657j6055l3135Q654J5105
15963I89306p50K6084r43n781j0034j7628L1916M73j6808J8346L0252k3224j4575
15950A006634J7376j2587k235l6824l479J1255L778j8756L0185J91J3807j1401
15938I97944j4673J4179R909n699k8694M5653M522q268J7312q271k7830K8022
$$ y = [1005031, 970262, 961553, 984795, 989800, 971592, 960442, 1012866, 1038999, 1036327, 1053387, 1059895, 1072383, 1058670, 1045617, 1034772, 1012652, 1011745, 1035712, 1033394, 1014737, 998682, 965547, 974201, 989306, 988556, 1014640, 1013697, 1007916, 997882, 980254, 1012170, 1012643, 995835, 1014181, 1044433, 1021209, 1006634, 1024010, 1011423, 1009188, 972364, 968885, 980140, 983918, 965162, 995347, 995538, 1009345, 997944, 983271, 997450, 1007359, 1001660, 972966, 1018619, 1023141, 1014873, 1032185, 1023914, 996084, 1024106]
$$ [...]
##END NTUPLES=NMR SPECTRUM
##END=
