##TITLE=1H_DE-80H_X3
 200.13MHz, d2o
 8 sc
 
 19ns.26.2.2025
##JCAMPDX= 6.0         $$ Bruker NMR JCAMP-DX V2.0
##DATA TYPE= NMR SPECTRUM
##DATA CLASS= NTUPLES
##ORIGIN= UXNMR, Bruker Analytische Messtechnik GmbH
##OWNER= pz
$$ XWIN-NMR		Version 3.5
$$ Wed Jul  8 12:22:54 2026 Russian Standard Time (UT+4h)  Yarkov@DPX200
##.OBSERVE FREQUENCY= 200.1313
##.OBSERVE NUCLEUS= ^1H
##.ACQUISITION MODE= SIMULTANEOUS
##.ACQUISITION SCHEME= undefined
##.AVERAGES= 8
##.DIGITISER RES= 18
##SPECTROMETER/DATA SYSTEM= spect
##.PULSE SEQUENCE= zg30
##.SOLVENT NAME= DMSO
##.SHIFT REFERENCE= (INTERNAL, DMSO, 0, 15.5023)
##AUDIT TRAIL= $$ (NUMBER, WHEN, WHO, WHERE, WHAT)
$$ ##TITLE= Audit trail, XWIN-NMR		Version 3.5
$$ ##JCAMPDX= 5.01
$$ ##ORIGIN= Bruker BioSpin GmbH
$$ ##OWNER= Yarkov
$$ C:/Bruker/XWIN-NMR/data/yarkov2/nmr/H-C/1/pdata/1/auditp.txt
$$ ##AUDIT TRAIL=  $$ (NUMBER, WHEN, WHO, WHERE, WHAT)
(   1,<2026-07-08 12:21:04.43 +0400>,<Yarkov>,<DPX200>,
      <created by zg, POWCHK disabled, PULCHK disabled
       configuration hash MD5:
       00 E9 B6 7A A2 85 ED C7 34 08 36 98 17 FE 4E 26
       data hash MD5: 16K
       22 61 E9 12 BF F2 19 12 EF F5 C8 40 D2 07 EE C9>)
(   2,<2026-07-08 12:21:09.48 +0400>,<Yarkov>,<DPX200>,
      <Start of raw data processing
       efp BC_mod = 2 LB = 0.25 FT_mod = 6 PKNL = 1 PHC0 = -7176.948 PHC1 = 6.42196 SI = 16K 
       data hash MD5: 16K
       B3 15 FF 54 4B D9 C6 D4 47 A3 4C CE D2 1F 6E 2C>)
(   3,<2026-07-08 12:21:47.32 +0400>,<Yarkov>,<DPX200>,
      <pk PHC0 = -76.99996 PHC1 = 0 
       data hash MD5: 16K
       E5 78 39 57 CF 2B 49 C1 7A F7 AE 8F 19 52 5F 9F>)
$$ ##END=
$$ 
$$ hash MD5
$$ 92 AD 56 E3 B5 0A 04 38 45 A9 36 A1 85 80 A3 46
##$RELAX= 
##$RELAX= 
##$RELAX= 
##$RELAX= 
##$RELAX= 
##$RELAX= 
$$ Bruker specific parameters
$$ --------------------------
##$DU= <C:/Bruker/XWIN-NMR>
##$EXPNO= 1
##$NAME= <H-C>
##$PROCNO= 1
##$TYPE= <nmr>
##$USER= <yarkov2>
##$AMP= (0..31)
100 100 100 100 100 100 100 100 100 100 100 100 100 100 100 100 100 100 
100 100 100 100 100 100 100 100 100 100 100 100 100 100 
##$AQSEQ= 0
##$AQ_mod= 1
##$AUNM= <au_zg>
##$AUTOPOS= <>
##$BF1= 200.13
##$BF2= 200.13
##$BF3= 200.13
##$BF4= 200.13
##$BF5= 200.13
##$BF6= 200.13
##$BF7= 200.13
##$BF8= 200.13
##$BYTORDA= 1
##$CFDGTYP= 0
##$CFRGTYP= 5
##$CHEMSTR= <none>
##$CNST= (0..31)
1 1 145 1 1 1 1 1 1 1 1 1 1 1 1 1 1 1 1 1 1 1 1 1 1 1 1 1 1 1 1 1 
##$CPDPRG= <>
##$CPDPRG1= <>
##$CPDPRG2= <>
##$CPDPRG3= <>
##$CPDPRG4= <mlev>
##$CPDPRG5= <mlev>
##$CPDPRG6= <mlev>
##$CPDPRG7= <mlev>
##$CPDPRG8= <mlev>
##$CPDPRGB= <>
##$CPDPRGT= <>
##$D= (0..31)
0 0.7 0 0 0 0 0 0 0 0 0 0.03 0 0 0 0 0 0 0 0 0 0 0 0 0 0 0 0 0 0 0 0 
##$DATE= 1783498863
##$DBL= (0..7)
120 120 120 120 120 120 120 120 
##$DBP= (0..7)
150 150 150 150 150 150 150 150 
##$DBP07= 0
##$DBPNAM0= <>
##$DBPNAM1= <>
##$DBPNAM2= <>
##$DBPNAM3= <>
##$DBPNAM4= <>
##$DBPNAM5= <>
##$DBPNAM6= <>
##$DBPNAM7= <>
##$DBPOAL= (0..7)
0.5 0.5 0.5 0.5 0.5 0.5 0.5 0.5 
##$DBPOFFS= (0..7)
0 0 0 0 0 0 0 0 
$$ [...]
##$SUBNAM2= <"">
##$SUBNAM3= <"">
##$SUBNAM4= <"">
##$SUBNAM5= <"">
##$SUBNAM6= <"">
##$SUBNAM7= <"">
##$SUBNAM8= <"">
##$SUBNAM9= <"">
##$SW= 18.0517328524113
##$SWIBOX= (0..15)
0 0 2 0 0 0 0 0 0 0 0 0 0 0 0 0 
##$SW_h= 3612.71676300578
##$TD= 16384
##$TD0= 1
##$TE= 0
##$TE2= 300
##$TE3= 300
##$TEG= 300
##$TL= (0..7)
0 120 120 120 120 120 120 120 
##$TP= (0..7)
150 150 150 150 150 150 150 150 
##$TP07= 0
##$TPNAME0= <>
##$TPNAME1= <>
##$TPNAME2= <>
##$TPNAME3= <>
##$TPNAME4= <>
##$TPNAME5= <>
##$TPNAME6= <>
##$TPNAME7= <>
##$TPOAL= (0..7)
0.5 0.5 0.5 0.5 0.5 0.5 0.5 0.5 
##$TPOFFS= (0..7)
0 0 0 0 0 0 0 0 
##$TUNHIN= 0
##$TUNHOUT= 0
##$TUNXOUT= 0
##$USERA1= <user>
##$USERA2= <user>
##$USERA3= <user>
##$USERA4= <user>
##$USERA5= <user>
##$V9= 5
##$VALIST= <valist>
##$VCLIST= <CCCCCCCCCCCCCCC>
##$VD= 0
##$VDLIST= <DDDDDDDDDDDDDDD>
##$VPLIST= <PPPPPPPPPPPPPPP>
##$VTLIST= <TTTTTTTTTTTTTTT>
##$WBST= 1024
##$WBSW= 4
##$XGAIN= (0..3)
0 0 0 0 
##$XL= 0
##$YL= 0
##$YMAX_a= 349066
##$YMIN_a= -288578
##$ZGOPTNS= <>
##$ZL1= 120
##$ZL2= 120
##$ZL3= 120
##$ZL4= 120
##$ABSF1= 0
##$ABSF2= 0
##$ABSG= 0
##$ABSL= 0
##$ALPHA= 0
##$AQORDER= 0
##$ASSFAC= 0
##$ASSFACI= 0
##$ASSFACX= 0
##$ASSWID= 0
##$AUNMP= <proc_1d>
##$AZFE= 0.1
##$AZFW= 0.1
##$BCFW= 0
##$BC_mod= 2
##$BYTORDP= 0
##$COROFFS= 0
##$CY= -3
##$DATMOD= 1
##$DC= 0
##$DFILT= <>
##$DTYPP= 0
##$F1P= 0
##$F2P= 0
##$FCOR= 1
##$FTSIZE= 16384
##$FT_mod= 6
##$GAMMA= 0
##$GB= 0
##$INTBC= 1
##$INTSCL= 3.241238e-09
##$ISEN= 128
##$LB= 0.25
##$LEV0= 0
##$LPBIN= 0
##$MAXI= 10000
##$MC2= 0
##$MEAN= 0
##$ME_mod= 0
##$MI= 1.114404
##$NCOEF= 0
##$NC_proc= -6
##$NLEV= 6
##$NOISF1= 3.799351
##$NOISF2= 2.8
##$NSP= 0
##$NTH_PI= 0
##$NZP= 0
##$OFFSET= 15.50229
##$PC= 1
##$PHC0= -7253.948
##$PHC1= 6.42196
##$PH_mod= 1
##$PKNL= yes
##$PPARMOD= 0
##$PSCAL= 0
##$PSIGN= 0
##$REVERSE= no
##$SF= 200.130003884215
##$SI= 16384
##$SIGF1= 3
##$SIGF2= 2
##$SINO= 0.751879
##$SIOLD= 32768
##$SREGLST= <19F.Aceton>
##$SSB= 0
##$STSI= 16384
##$STSR= 0
##$SW_p= 3612.71676300578
##$SYMM= 0
##$S_DEV= 0
##$TDeff= 16384
##$TDoff= 0
##$TI= <>
##$TILT= no
##$TM1= 0
##$TM2= 0
##$TOPLEV= 0
##$USERP1= <user>
##$USERP2= <user>
##$USERP3= <user>
##$USERP4= <user>
##$USERP5= <user>
##$WDW= 1
##$XDIM= 16384
##$YMAX_p= 481759958
##$YMIN_p= -790025
$$ End of Bruker specific parameters
$$ ---------------------------------
##NTUPLES= NMR SPECTRUM
##VAR_NAME=  FREQUENCY,     SPECTRUM/REAL,   SPECTRUM/IMAG
##SYMBOL=    X,             R,               I
##VAR_TYPE=  INDEPENDENT,   DEPENDENT,       DEPENDENT
##VAR_FORM=  AFFN,          ASDF,            ASDF
##VAR_DIM=   16384,         16384,           16384
##UNITS=     HZ,            ARBITRARY UNITS, ARBITRARY UNITS
##FACTOR=    0.220516191357247, 1,           1
##FIRST=     3102.47331229133, 0,            0
##LAST=      -510.243450714451, 0,           0
##MIN=       -510.243450714451, -790025,     0
##MAX=       3102.47331229133, 481759958,    0
$$ Real data points
##PAGE= N=1
##DATA TABLE= (X++(R..R)), XYDATA
$$ [...]
6012c64379p4631J4362Q2947J04307P6387r3189k0386j79304M756J02311J1315
6001c35504J4580Q1905l3973K0875n552q2657L4016R589J5147O4251K8770o7585
5989b56138M9739N0998m0957j43738n643K5266K0938L3797n018K2832N9856q3052
5977b71120q3601K8115q1388J12987J21820K5680Q54q6705J4791n000l6578J5737
5965b44408O4776l0495j1951n9197n9933q3973O3726P7186Q9431m4273j41059
5954c80170l8650o0050J68793J45546J8708M5546j71146p7366r7597K5643j0243
5943d30986L9216J77495O1528o5762q9537J1835K0843K0842J9358K0344m7754
5932b62578m6203N5976J24604M9821L7203J0437p9335l5545j36856j158L1083
$$ plain form
6012 -364379 -439010 -424648 -341701 -237394 -161007 -254196 -274582 -453886 -449130 -346819 -335504
6001 -335504 -320924 -239019 -272992 -252117 -257669 -340326 -306310 -296721 -281574 -217323 -188553 -256138
5989 -256138 -206399 -155401 -196358 -340096 -345739 -320473 -299535 -265738 -270756 -247924 -188068 -271120
5977 -271120 -354721 -326606 -407994 -295007 -173187 -147507 -146653 -233358 -218567 -223567 -260145 -244408
5965 -244408 -179632 -210127 -222078 -281275 -341208 -425181 -361455 -284269 -194838 -239111 -380170
5954 -380170 -418820 -478870 -310077 -164531 -145823 -100277 -271423 -348789 -446386 -420743 -430986
5943 -430986 -391770 -214275 -152747 -218509 -308046 -296211 -275368 -254526 -235168 -214824 -262578
5932 -262578 -308781 -252805 -128201 -78380 -41177 -30740 -110075 -145620 -282476 -283634 -252551
5921b52551J0094O1965q4746j18728k7110N2941R8269P4695N5262N4948j10240
5910a85201K4514j88214M7303L1868P1739J9550j22900k7274p6841M2688J08108
5899b54660Q3787O088k831j14941r5941P212M8021Q8256J02734L2301j33179j8614
5887b51767j35327J5727l560Q6238R9002j11140k0814j9546L142M5699R9448k761
5875a95659q3200m0154J9597R933L6859K2714N7862J01484n5296k3342j10195
5864b59397j04149O9032J0240R0114l4087M2813m3881o3733O5812J4449L7164
5853a75623n4063p6166J4907l0067M2184J59312M8289J7535k2247O17j26362M1458
5841a60226R6730j1303K0090o8742l4421J029Q1011n9414l7410N4404P9064J9133
$$ plain form
5921 -252551 -242457 -180492 -265238 -383966 -411076 -358135 -259866 -185171 -129909 -74961 -185201
5910 -185201 -160687 -348901 -301598 -269730 -197991 -178441 -301341 -328615 -405456 -362768 -254660
5899 -254660 -170873 -164785 -167616 -282557 -378498 -371286 -323265 -235009 -132275 -99974 -233153 -251767
5887 -251767 -387094 -371367 -374927 -288689 -189687 -300827 -321641 -341187 -338045 -292346 -192898 -195659
5875 -195659 -278859 -319013 -299416 -289483 -252624 -229910 -172048 -70564 -125860 -149202 -259397
5864 -259397 -363546 -294514 -284274 -194160 -228247 -185434 -229315 -293048 -227236 -212787 -175623
5853 -175623 -229686 -305852 -290945 -321012 -278828 -119516 -71227 -53692 -75939 -75322 -201684 -160226
5841 -160226 -63496 -74799 -54709 -123451 -157872 -156843 -75832 -135246 -172656 -118252 -39188 -20055
5829b0055J7631o5659n8616M6799p6639L9232o1293j9466k7755r945M6314K7607
5817a61845P3681P4634j22166l4440M6266O4230M1514m4054k3433o6226N3161
5806i8678J6479J4896R6819O632J3525l2620j06759P4727Q0968Q0532p3304j7763
5794E5454m6664m4539p4850k3362J41188R5862J6340O8910q4441L4641n5436k2623
5782F0480J02749N642R8753k7492P9511P5933M6345J07929J22982J26468J29127
5771I28427R4159O2084Q3005K12891L49423K77060M29960N50890R51061J542648
5761E481608K705331L477322L796596K823883P62185l23556j763933k449128k328048
5752A2182260k228991j798082j555038j468447j063030q30183o06138l87832k78180
$$ plain form
5829 -20055 -2424 -68083 -126699 -79900 -156539 -117307 -178600 -198066 -225821 -235766 -189452 -161845
5817 -161845 -88164 -13530 -135696 -170136 -123870 -59640 -18126 -62180 -85613 -151839 -98678
5806 -98678 -82199 -67303 29516 36148 49673 17053 -89706 -14979 65989 146521 73217 55454
5794 55454 8790 -35749 -110599 -133961 7227 103089 119429 188339 103898 138539 83103 60480
5782 60480 163229 168871 267624 240132 319643 395576 441921 549850 672832 799300 928427
5771 928427 1022586 1084670 1167675 1380566 1729989 2007049 2437009 2987899 3938960 5481608
5761 5481608 8186939 11664261 15460857 18284740 19046925 18723369 16959436 14510308 12182260
5752 12182260 9953269 8155187 6600149 5131702 4068672 3238489 2632351 2244519 1966339
5743A966339j34780l41150k28378l01055j75975n1119Q143J23732M8557j06421
5733H07893j85962j41877J0708R303J1812L8276p2352m3911j90338m5980J9786
5722B17358J3091J46329K5846j09050j95836j17614j8503L8239J67282k636j7985
5711A46521J3812j17297m8002J7615N9774K13107j03700j1215o6996j77853L3094
5700d1140L6090R5921J13364J1093m5633j44242o5969m1115J41493J13643L8847
5689B12352L2183q1502j32896n5466L770J64096j6052L3873j20851j23962R968
5678g4487r080J33440m083l4816o5310o1081q3667O2553N1383J76403o1015j20108
5666h9868j10061p1388R2049R0576Q8479j4663n3297n5972m2251l0443L153P9272
$$ plain form
5743 1966339 1831559 1490409 1262031 960976 785001 733882 742025 865757 914314 807893
5733 807893 621931 480054 490762 500065 511877 550153 477801 433890 243552 197572 217358
5722 217358 230449 376778 402624 293574 97738 -19876 -38379 -140 167142 164506 146521
5711 146521 160333 43036 -4966 12649 72423 285530 181830 170615 103619 -74234 -41140
5700 -41140 -5050 90871 204235 215328 169695 25453 -40516 -81631 59862 173505 212352
5689 212352 244535 163033 30137 -25329 -21559 142537 126485 160358 39507 -84455 -74487
5678 -74487 -83567 49873 45790 10974 -54336 -115417 -199084 -136531 -85148 91255 30240 -89868
5666 -89868 -199929 -271317 -179268 -88692 -213 -14876 -68173 -124145 -166396 -196839 -193686 -114414
5654a14414Q2153L1099K8602n6264n9903j2364l7988J04188L2021j3873j23982
5643a40725q9588P1371m6609J61343N1128j24757K2652r250L3322k9115J13318
5632A3090R8873o1868j4467o0280l7804J4184L453J6187p9120O5710M1664K8433
5620B8055P6514q5516k5710j4159M504O4086l3673J3163r601N7147O3887n8098
5608H0599j941L5804m5358R6878J17116J11658o806n9389k9705p5982O9348q100
5596B84122J02266M8153J9921O8011N469l5376L2998j25359m6663k4330j2099
5585C17113k0531n3225M1147p7088L8875J07612j3002o5396j46798L2413q560
5574A52560O0359O4261j156O3768J9761m0085m1520l5802R4878l9188L2106J5711
$$ plain form
5654 -114414 -32261 -1162 27440 -28824 -88727 -101091 -139079 -34891 -2870 -16743 -140725
5643 -140725 -230313 -158942 -205551 -44208 6920 -117837 -95185 -104435 -71113 -100228 13090
5632 13090 111963 50095 35628 -24652 -62456 -48272 -44819 -28632 -107752 -42042 -378 28055
5620 28055 104569 19053 -6657 -20816 -16312 47774 14101 27264 17663 74810 138697 80599
5608 80599 78658 114462 69104 165982 283098 394756 387950 328561 298856 222874 292222 284122
5596 284122 386388 434541 454462 522473 527942 492566 525564 400205 353542 329212 317113
5585 317113 296582 243357 284504 207416 246291 353903 340901 275505 128707 161120 152560
5574 152560 212919 277180 276024 339792 359553 319468 277948 242146 337024 297836 329942 345653
5562C45653k3381J531O354J20823J16999J30442Q0932L655r3637q631P8388L17991
5550A077119K12985J88889P1565Q9742J57530J42527K29619M81276M75827N45125
5540C672204O06229P74839Q98356J229009J320226J153689R56914N83218J56463
5531A1351147n6744j40843j04552M7474K49403L86379L08123K58211j94017n37386
5521A1567195o60067q17204q88071j052033j052551j042101r54073p33843o28645
5512C738607l76180l47645l28716k29840l30958k12019k40573j88231L8433j65418
5502A357460j25711r0990K7113k4572j55606q8649j32036k0252K4807J3592J1473
5491G96629r17q7656j19560p5469k0572q7673N7945J1116K0288j0844j49244j2068
$$ plain form
5562 345653 322272 323803 330157 450980 567979 698421 779353 783008 689371 680740 759128 1077119
5550 1077119 1290104 1478993 1550558 1640300 1797830 1940357 2169976 2651252 3127079 3672204
5540 3672204 4278433 5053272 5951628 7180637 8500863 9654552 10611466 11194684 11351147
5531 11351147 11294403 11153560 11049008 11096482 11345885 11732264 12040387 12298598 12104581 11567195
5521 11567195 10907128 10089924 9201853 8149820 7097269 6055168 5101095 4367252 3738607
5512 3738607 3362427 3014782 2686066 2456226 2125268 1913249 1672676 1484445 1522878 1357460
5502 1357460 1231749 1140759 1167872 1143300 987694 899045 767009 746757 771564 785156 796629
5491 796629 795712 708056 588496 513027 492455 404782 462727 473843 494131 483287 334043 321975
5479C21975o8757Q2740Q0763k2579q444j2513k8232m6640M0012N9077M2883O0382
5467E00667q5723l0241m0219r8728P935J60674K6306L2808m8147m1265o8849j0410
5455C04808O9523k81P3771n5595n8989j1716K1490j776k3715M6004L7086K2699
5443D23309q2557q4308l5512P1642j42141K4199L6934J18773Q1958K5099j4849
5432D22547o5036N0567j0380j9597N6177n4384K94m7911q8974O3584l2760R0837
5420C64964O692K7461k9834Q9193N2718k1541P3966R25n8201m2932m3504M6510
5408D66417m381j5145O3277O0146J2818M3957K407n6454l4506m4162l83O5181
5396E59172n187J2941k0471M2080N1943j4476J9150K0376n3494j2005k8466K7210
$$ plain form
5479 321975 253218 335958 416721 394142 385698 373185 344953 298313 338325 397402 440285 500667
5467 500667 414944 384703 344484 245756 253691 414365 440671 473479 425332 384067 315218 304808
5455 304808 374331 374050 447821 392226 333237 321521 343011 341235 317520 363524 400610 423309
5443 423309 340752 256444 220932 292574 150433 174632 211566 330339 412297 437396 422547
5432 422547 357511 408078 397698 378101 434278 379894 380188 332277 243303 306887 274127 364964
5420 364964 371656 399117 369283 458476 511194 489653 563619 564544 506343 463411 419907 466417
5408 466417 462036 446891 510168 570314 583132 627089 629496 573042 538536 494374 493991 559172
5396 559172 553985 566926 546455 588535 640478 626002 645152 665528 612034 600029 571563 598773
5384E98773O4972n1343O3837K5468o1244R679O7833K9149n7022m9437N0961M5286
5372G36912Q249O6999n7596j0791p9176O8675P6762K2084J8091K6267L6696j1757
5360I01415o3341M380k2799P8975J27400L8953J2632P2413N6083l5121O9223O2479
5348A302692L2580N3139J26173J56473P6390J146J05107N9965J22417N2367P7530
5337B165979P1683J25671J49237K29977J43190M2080J35805L2055O9746N3644
5327C219067N5208N9920L8923J87760J07206P0792J71715J29342J42782K35654
5317D418369J28597J88921L05227L65941M87797M11051M31317N28972N30250N72971
5307H369413P47047Q72893J133803J343033J640361J913140K281078L076513M230460
$$ plain form
5384 598773 663745 612402 676239 701707 640463 650142 717975 747124 690102 640665 691626 736912
5372 736912 745161 812160 754564 743773 664597 733272 810034 832118 850209 876476 913172 901415
5360 901415 838074 842454 819655 898630 1026030 1064983 1077615 1150028 1206111 1170990 1240213 1302692
5348 1302692 1335272 1388411 1514584 1671057 1747447 1748593 1853700 1913665 2036082 2088449 2165979
5337 2165979 2237662 2363333 2512570 2742547 2885737 2927817 3063622 3095677 3165423 3219067
5327 3219067 3274275 3334195 3373118 3560878 3668084 3738876 3910591 4039933 4182715 4418369
5317 4418369 4546966 4735887 5041114 5407055 5894852 6305903 6737220 7266192 7796442 8369413
5307 8369413 9116460 9989353 11123156 12466189 14106550 16019690 18300768 21377281 25607741
5298B5607741O295460R237672J1974575J3131588J1430880O950698K324747j703128
5290H5250233m915111n703458m822899k785984O02614M457056P353415P811992
5282H7247858M936784O34658l474813p462015r543789r966704r318166q295278
5274D4758535p190709o030096m920806l964449l146145k440127k040275j631734
5266A3394194j257289r83761p14710p02878o94723o80341n40106m09288l26424
5257G084674l42339l22106m25083m44545l89584l46012j87447j20929j58391k10831
5247D137407j62822k37556k79279k21857j78624k5444K0617j12826j24497j55405
5237B659714j28228r8489p048k9809j2973o1082O551r6143l4439q022p1743k0070
$$ plain form
5298 25607741 31903201 41140873 53115448 66247036 77677916 84628614 86953361 85250233
5290 85250233 80335122 74631664 69808765 67022781 67625395 72082451 79435866 87247858
5282 87247858 92184642 92819300 89344487 81882472 72338683 62371979 53053813 44758535
5274 44758535 37567826 31537730 26616924 22652475 19506330 17066203 15025928 13394194
5266 13394194 12136905 11153144 10438434 9735556 9040833 8360492 7820386 7411098 7084674
5257 7084674 6742335 6420229 5995146 5550601 5161017 4815005 4627558 4506629 4348238 4137407
5247 4137407 3974585 3737029 3457750 3235893 3057269 3031825 3052442 2939616 2815119 2659714
5237 2659714 2531486 2432997 2425949 2396140 2383167 2322085 2328636 2232493 2198054 2190032 2118289 2098219
5225B098219K4081J4107n4168q6241m4953k2372J812J0425J5235j0208o3081n6040
5213A826816k062n3547j33279j9289K7746k7468k613r9779j00381j02002m5269
5202A268873l6060N0540J29223l7122l0243l1429k54189j26706m7248O6215J23511
5191A075365M4976n9742o9576m2314m5659j16320N3173J28216Q167m0191r3292
5180H42803j48576n4351Q1622R9885J91507l7879j44311n1360j48846k704J49999
5169G77789P8870P6357J3605r7347j28942k7690J1092Q6309o8751J05718K9071
5158H56081j20942j41085L48P1388K8410M0741J7699j20960r9919q0740L5958
5147D86979N2837J74153J0557K148P104j37633r8359j9544m6537j5336N9608N8054
$$ plain form
5225 2098219 2122300 2136407 2082239 1995998 1951045 1928673 1930485 1940910 1956145 1945937 1882856 1826816
5213 1826816 1824754 1771207 1637928 1618639 1646385 1618917 1616304 1516525 1416144 1314142 1268873
5202 1268873 1232813 1283353 1412576 1375454 1345211 1313782 1059593 932887 885639 951854 1075365
5191 1075365 1120341 1060599 991023 948709 903050 786730 839903 968119 976286 936095 842803
5180 842803 694227 639876 721498 821383 1012890 975011 830700 779340 630494 627790 777789
5169 777789 856659 933016 946621 849274 720332 692642 703734 790043 721292 827010 856081
5158 856081 735139 594054 594402 665790 694200 734941 752640 631680 531761 451021 486979
5147 486979 539816 713969 724526 726674 733778 596145 497786 478242 431705 416369 475977 534031
5135E34031K8422j66620j14229N4497Q5306O3463O9865o7940o6359O4022L7860
5124E22318j80831J7957J9230k8254Q189m0025n3784k0106L0701O7520J23068
5113D65983p650l2429j7233n4086k8076L6325n2465o8906J08033P5124M7955k7367
5101D45208R8362p7998q8331n6904R2958M9244O2320L2340n6779p2956j14790
5090C12674P0326O7140J16968M4835K3470j36259q5427Q45l2502P3052K754Q5447
5078E43323J2612j41379k3197k3783P9033J00734Q2633L1812l3865j26409p6129
5067D25385O4135J57346J42056O2482l7496r8220p4285o6871j7547J00389J00087
5056G57461M5321N1131o6764l7679k26L3749J27059L4011j5912o8972o0744J591
$$ plain form
5135 534031 562453 395833 281604 336101 421407 484870 554735 486795 420436 484458 522318
5124 522318 341487 359444 378674 350420 358609 318584 264800 244694 275395 342915 465983
5113 465983 458333 425904 408671 354585 326509 362834 310369 241463 349496 424620 472575 445208
5101 445208 543570 465572 377241 320337 413295 462539 524859 557199 500420 427464 312674
5090 312674 383000 450140 567108 611943 635413 499154 413727 414572 382070 455122 457876 543323
5078 543323 555935 414556 391359 367576 446609 547343 629976 661788 627923 501514 425385
5067 425385 489520 646866 788922 851404 813908 715688 641403 574532 556985 657374 757461
5056 757461 802782 853913 787149 749470 749244 782993 910052 944063 928151 859179 798435 800026
5044H00026R5522J72923L7157n9800j6899l3846p0083p075L7278J22975J50035
5033A228213K2128o0921q3104k8270J8344M2165R9442P3716L0096k189q3873M6123
5021A301870J36758j5983N1967P0788k4975M2591M5835N9559J13626J24157K03523
5010B109716J08394N8077J72526K19159J80386K84015M09790M09479N41622M34571
5000D927735N44884P91267R24114J522331K396563L534418N270766O567380O799105
4991C3278563N686551L616953P31126k013329l684624m831870m916825m610529
4983B3256016m165124l524372k861325k224281j601582j293749r22733q63867
4975E798983p08281n17990m36671k39922k60470j63039j66604j71529j34364j74962
$$ plain form
5044 800026 895548 1068471 1105628 1045828 1028929 995083 925000 917925 955203 1078178 1228213
5033 1228213 1250341 1189420 1106316 1078046 1096390 1138555 1237997 1311713 1341809 1339620 1255747 1301870
5021 1301870 1438628 1422645 1474612 1545400 1520425 1563016 1608851 1668410 1782036 1906193 2109716
5010 2109716 2218110 2276187 2448713 2667872 2848258 3132273 3542063 3951542 4493164 4927735
5000 4927735 5472619 6263886 7188000 8710331 11106894 14641312 19912078 26479458 33278563
4991 33278563 38965114 42582067 43313193 41299864 37615240 32783370 27866545 23256016
4983 23256016 19090892 15566520 12705195 10480914 8879332 7585583 6662850 5798983
4975 5798983 5090702 4572712 4136041 3896119 3635649 3472610 3306006 3134477 3000113 2825151
4965B825151j13022j82473k7743K5747j73081j44200j74842j67425j34452L2352
4955A766012M7154J3851m7246j17052j72159n7586r8212Q731J46397o8992n4332
4944A366566j76664p5742p6119k5205P3822Q4925P4952k5473j5904l3355k1166
4933A150637K1029L8680J04311N8814r2012p916j51563o1745J03511N2084Q7787
4922A303617N9366r2119j47389j18290P8770R8426P0516O4710p8711j1644k1011
4911A206241l7291K4570L4649J22292m8854K9170o3099j33083l6301M9567J36439
4900A284300Q7900J28035J67957r6018l8815l7076k7010N9325m607Q4099K8069
4889A636159M815q8477n6218O2917M8544K9338N6050N4261q931p7486J3343n1437
$$ plain form
4965 2825151 2712129 2529656 2501913 2527660 2354579 2210379 2035537 1868112 1733660 1766012
4955 1766012 1813166 1827017 1779771 1662719 1490560 1432974 1334762 1343493 1489890 1420898 1366566
4944 1366566 1189902 1114160 1038041 1012836 1086658 1171583 1246535 1221062 1205158 1171803 1150637
4933 1150637 1171666 1210346 1314657 1373471 1281459 1273543 1121980 1060235 1163746 1215830 1303617
4922 1303617 1362983 1270864 1123475 1005185 1083955 1182381 1252897 1317607 1238896 1227252 1206241
4911 1206241 1168950 1193520 1228169 1350461 1301607 1330777 1267678 1134595 1098294 1147861 1284300
4900 1284300 1372200 1500235 1668192 1572174 1533359 1496283 1469273 1528598 1523991 1608090 1636159
4889 1636159 1640974 1552497 1496279 1559196 1607740 1637078 1693128 1747389 1738458 1660972 1674315 1622878
4877A622878Q5864J53568P5614O7118P6000j0818R9338J01250J76803K34309J92907
4866B874831K75873J52761J80768K54350K82818M81385N60071O37890Q27959J043807
4856G572513J406585K334331L664491N012718O176454O212917N187371L640349
4848D1207729Q66800j672171l104391m275546m713773m552077m061977l619346
4840A6075248l025370k228685j656955j222014q42433n91677m97520m93976k96200
4831E220418k23920n8975K00439K03209N56951R50044J667210K189815K404788
4822A3109979K001276M91759k22777j116040j686323j576823j662085j395173
4814G943793j191848j032658p07664o59057m29365l39487l18184k07715l41330
$$ plain form
4877 1622878 1708742 1862310 1937924 2005042 2081042 2070224 2169562 2270812 2447615 2681924 2874831
4866 2874831 3150704 3303465 3484233 3738583 4021401 4502786 5062857 5700747 6528706 7572513
4856 7572513 8979098 11313429 14977920 19990638 26167092 32380009 37567380 41207729
4848 41207729 42074529 40402358 37297967 33022421 28308648 23756571 19694594 16075248
4840 16075248 13049878 10821193 9164238 7942224 7099791 6508114 6010594 5516618 5220418
4831 5220418 4996498 4937523 5137962 5341171 5898122 6848166 8515376 10705191 13109979
4822 13109979 15111255 15603014 15380237 14264197 12577874 11001051 9338966 7943793
4814 7943793 6751945 5719287 5011623 4352566 3923201 3583714 3265530 3057815 2716485
4805B716485j55618k9612q0080p2731j42765j11727j08385j21511P9200O6596
4795B039852n31o6847R208o6003p8083J4418P4184j6739J6113k1887m946r0196
4783A808543Q856J1144j5165J0619j34196p3470j10735j61029N2384Q2722J34949
4772A614622O4140l8063l0135j28486O1755L7359k1559K2289L9054q904r0503
4761A521569j4491M685o04N4170l1578J06K0502j35601K424j2688J6245N2295
4749A477034r8948J51023L1860J786m1j10996L2478J0791m6503J0818n2973N7679
4737A464008q5649k1722L2710J1108J28226O7624J77433j05549j00508k2115k1577
4726A523989j7770j4573J01203N1560n8199k257r4856j23845J58372J6753J16916
$$ plain form
4805 2716485 2560867 2531255 2451175 2378444 2235679 2123952 2015567 1894056 1973256 2039852
4795 2039852 2039321 1972474 1981682 1915679 1837596 1852014 1926198 1909459 1925572 1903685 1898739 1808543
4783 1808543 1817399 1828543 1813378 1823997 1689801 1616331 1505596 1344567 1396951 1479673 1614622
4772 1614622 1678762 1640699 1610564 1482078 1543833 1581192 1559633 1581922 1620976 1612072 1521569
4761 1521569 1507078 1511763 1511159 1565329 1533751 1533857 1554359 1418758 1421182 1408494 1424739 1477034
4749 1477034 1378086 1529109 1560969 1562755 1562714 1451718 1484196 1494987 1448484 1459302 1406329 1464008
4737 1464008 1378359 1356637 1389347 1400455 1528681 1596305 1773738 1668189 1567681 1545566 1523989
4726 1523989 1506219 1491646 1592849 1644409 1586210 1583953 1489097 1365252 1523624 1540377 1657293
4715A657293O3000J0225j00159m8914l2633L4386J68616Q0217k3381L3720j25500
4704A716870j1823K1653N7231J04234k0173l6350q0408o2153k8058k9091J04560
4693A736492J94068l4569L0565q7946j1185j11674L1433J64477M6179J17202j14524
4682A960518r6512K1543J04668O6601P2931J49253J1828r1417n1391M574K5036
4671B177632P1273P5481K9326m8109j867j09051k1214O5628L2190O4457M1070
4660B376816k7554l0741r1373O8198N110k6448R1262O2571J29386l6279M4573
4649B565521M9585n705J54594l9373L929O1398k7760M9662K8559j728M1997K0423
4637B901102J06750O6233R7114J8177J14090K43866J25071K47700L44458N15812
$$ plain form
4715 1657293 1720293 1730518 1630359 1581445 1548812 1583198 1751814 1832031 1808650 1842370 1716870
4704 1716870 1705047 1726700 1783931 1888165 1867992 1831642 1751234 1689081 1661023 1631932 1736492
4693 1736492 1930560 1895991 1926556 1838610 1827425 1715751 1747184 1911661 1957840 2075042 1960518
4682 1960518 1864006 1885549 1990217 2056818 2129749 2279002 2290830 2199413 2148022 2152596 2177632
4671 2177632 2248905 2324386 2353712 2305603 2303736 2194685 2173471 2239099 2271289 2335746 2376816
4660 2376816 2349262 2318521 2227148 2295346 2300456 2274008 2365270 2427841 2557227 2520948 2565521
4649 2565521 2615106 2609401 2763995 2724622 2728551 2789949 2762189 2811851 2840410 2838682 2880679 2901102
4637 2901102 3007852 3074085 3171199 3189376 3303466 3547332 3672403 3920103 4264561 4780373
4627D780373P95247O91281N80609K77712K4754j40941m86049l24078l89419l02907
4617E506582j87934k95237o9064N9061J36087L24481K48259L74599L86953L78644
4607F862431M30301L51301M11241K65420M09851M42591N50261O45034M10373M75011
4597A1253815L90692J91083K81653K21222L98854N45799N36604L98462j8940j91407
4587A4007837m28544m36512l56105o9987L1279o8131k45302m05729n87153n28498
4577A0913155n07607l35738k32032l09788k60824m25837l53833m38294l15683
4568G733519k36347j43129n2565p1169n8214O687J27481K00943K93144K17906
4558H018256L06520J94559J26827K59097K26769L09368K79652N33063M83451L85556
$$ plain form
4627 4780373 5575620 6266901 6847510 7125222 7149976 7009035 6522986 6198908 5809489 5506582
4617 5506582 5318648 5023411 4954347 5013408 5149495 5473976 5722235 6096834 6483787 6862431
4607 6862431 7292732 7644033 8055274 8320694 8730545 9173136 9723397 10368431 10778804 11253815
4597 11253815 11644507 11835590 12117243 12338465 12737319 13283118 13819722 14218184 14199244 14007837
4587 14007837 13579293 13142781 12786676 12716689 12747968 12679837 12434535 12028806 11441653 10913155
4577 10913155 10405548 10069810 9837778 9527990 9267166 8841329 8487496 8049202 7733519
4568 7733519 7497172 7354043 7301478 7230309 7172095 7178782 7306263 7507206 7800350 8018256
4558 8018256 8324776 8519335 8646162 8905259 9132028 9441396 9721048 10254111 10737562 11123118
4548A1123118K46017R0240k3493j88737k16066k25607k77612j24414j96552k08069
4538I998825r4936j46053k06366k97491j91974j88957j75861k32499k40672j67718
4528H056298j36427j60869q822K655M3294N7281O6172k1313Q5737K32146K24397
4517H440549L02410L41614K16978K88437L91139N39831P90794J052611J486493
4508A3850856K039612K986685L568514L466171K577105J361433K73168p02524
4500B9421020q41669n50856K12161J549457L542090N122494N912029M206442J566184
4491E0139352p15237l225973m054263l657547l178207k458110j320646k32300
4483C1297069M61929O76961j09389j085749k042539k715753k554088k526714k103352
$$ plain form
4548 11123118 11369135 11459375 11435882 11247145 11031079 10805472 10527860 10403446 10206894 9998825
4538 9998825 9903889 9757836 9551470 9253979 9062005 8873048 8697187 8464688 8224016 8056298
4528 8056298 7919871 7759002 7750180 7752835 7796129 7853410 7919582 7898269 7984006 8216152 8440549
4517 8440549 8742959 9084573 9301551 9589988 9981127 10520958 11311752 12364363 13850856
4508 13850856 15890468 18877153 22445667 25911838 28488943 29850376 30123544 29421020
4500 29421020 28579351 28028495 28240656 29790113 33332203 38454697 44366726 48573168 50139352
4491 50139352 49424115 46198142 42143879 38486332 35308125 32850015 31529369 31297069
4483 31297069 31758998 32435959 32326570 31240821 29198282 26482529 23928441 21401727 19298375
4474A9298375j820119j577093j298433j123183q10357o04442m04350l13484l49234
4465A0997680k44712k25355k55245j70422r4008n5539n2418Q5177j1247o6365
4455I907546K0132j18854N6131R9670L9053R1097L2775J50426K04909L18840N69209
4444A1370934O67549R36749R09617J034053R77553P74515O24216L18713j05267
4435A7508632l37262p19258q62893q32491q85992o93689n79330m51824m09283
4426A1736610l57767l37703k17916j25586j82891n916M064m6807r4956m419K5048
4415A0391761L2149k0975R0982P854o2561P3758o1131o5668n4289L7013P0661
4404A0439554L738M2431J941M3878l220q6417L8054m293J20423R0302M4688J2459
$$ plain form
4474 19298375 17478256 15901163 14602730 13479547 12669190 12064748 11660398 11346914 10997680
4465 10997680 10752968 10527613 10272368 10101946 10007938 9952399 9899981 9985158 9973911 9907546
4455 9907546 9927678 9808824 9864955 9964625 10003678 10094775 10127550 10277976 10482885 10801725 11370934
4444 11370934 12038483 12975232 13884849 14918902 15896455 16670970 17295186 17613899 17508632
4435 17508632 17171370 16452112 15589219 14756728 13870736 13177047 12597717 12145893 11736610
4426 11736610 11378843 11041140 10823224 10697638 10514747 10508831 10512895 10466088 10371132 10366713 10391761
4415 10391761 10423910 10402935 10493917 10501771 10439210 10512968 10451837 10386169 10331880 10368893 10439554
4404 10439554 10443292 10485723 10487664 10531542 10528322 10441905 10479959 10475666 10596089 10686391 10731079 10743538
4392A0743538O030M8026k2524Q2717J15146N6751M5026n0420n209m7702J14349
4381A1085728Q1021J03711P8958n103r6983j7017r272N8172J39381J3882L0238
4370A1462716k9738R995l5245n3301J24598L1512R739Q724p819L3616j5001r6485
4358A1443311J5592N2686p1101J68672M3142k0757J7003P8000n910O1089l2087
4347A1749640P5186J9709j15506N1981q2528m3559P5341r3845j2671M0584m0890
4336A1623442j0328j6405K8188n7834Q9906N2660M0989k7544p86q4746j04222
4325A1533320j5373K713J3495l0845O8490j5920q964p5358j108L6125K9415J65121
4313A1701111r0939l6129q4727m8625m287Q9849O7461L2357m3948o1749j06114
$$ plain form
4392 10743538 10749568 10797594 10775070 10857787 10972933 11029684 11074710 11024290 11019081 10971379 11085728
4381 11085728 11166749 11270460 11349418 11344315 11247332 11230315 11221043 11279215 11418596 11432478 11462716
4370 11462716 11432978 11442973 11407728 11354427 11479025 11510537 11520276 11529000 11521181 11554797 11539796 11443311
4358 11443311 11458903 11511589 11440488 11609160 11652302 11631545 11648548 11726548 11720638 11781727 11749640
4347 11749640 11824826 11844535 11729029 11781010 11698482 11654923 11730264 11636419 11623748 11664332 11623442
4336 11623442 11613114 11596709 11624897 11567063 11656969 11709629 11750618 11723074 11722288 11637542 11533320
4325 11533320 11517947 11520660 11534155 11503310 11571800 11555880 11546916 11471558 11470450 11506575 11535990 11701111
4313 11701111 11610172 11574043 11489316 11440691 11436404 11526253 11593714 11626071 11582123 11520374 11414260
4302A1414260m6212N5185J5483M3095m6647n7665p9366l9105Q415R3572J56240
4291A1517255J2287n5228m9084j59621K0814J24918J15843O1993L2614n6056k4527
4280A1541208L4495J9849Q6552J52977J86519N6847K9740J9721R1385J08484K16286
4269A2544063J68620K18055K07738Q4828J70584K27960K72737K89656K72225L47476
4259A4803942L63536L68811M46435M90362O61389N32585N38804L89212L88717
4250A8983793L90043L43993L72165L45846N34236P13488R11286J066580J135359
4241B4796789J172898J123975R31281N41349M56319J92763M8082k8315J80406
4232B9415547L05260N00560P73068J128624J385399J373798J173475Q90955N14210
$$ plain form
4302 11414260 11368048 11423233 11438716 11481811 11435164 11377499 11298133 11259028 11267443 11361015 11517255
4291 11517255 11529542 11474314 11425230 11265609 11286423 11411341 11527184 11589177 11621791 11565735 11541208
4280 11541208 11575703 11595552 11682104 11835081 12021600 12078447 12108187 12127908 12219293 12327777 12544063
4269 12544063 12712683 12930738 13138476 13223304 13393888 13621848 13894585 14184241 14456466 14803942
4259 14803942 15167478 15536289 15982724 16473086 17134475 17667060 18205864 18595076 18983793
4250 18983793 19373836 19717829 20089994 20435840 20970076 21683564 22594850 23661430 24796789
4241 24796789 25969687 27093662 28024943 28566292 29022611 29215374 29263456 29235141 29415547
4232 29415547 29720807 30221367 30994435 32123059 33508458 34882256 36055731 36946686 37460896
4223C7460896j3638m16100n39294o57344n58177l62756q725L53304M67073O50312
4213C6375551O61994M48026K03915q6724o51615r27874j110095j196871r38058
4204C2778249n32996l13575m0975p7927k1435j55498m47446o31558r05584j125400
4194B8525855j192990j215747j197732r19919p30441l74104k31990j88017j91499
4185B2283416k86556n84385q31764j038825j066524r35049r96418p56490q34963
4176A4952442n90782l98021k64551k34909k05272l85495l35799l06174m70070
4167A1761369n12432n73520m89889n03304l83160l29475k75315j96575l08748
4158H188951k18121j92822j22570r2950j02401j22738j47288k15545j61718j83738
$$ plain form
4223 37460896 37447258 37031158 36491864 35834520 35276343 34913587 34904862 35258166 35725239 36375551
4213 36375551 37037545 37485571 37689486 37602762 36951147 36023273 34913178 33716307 32778249
4204 32778249 32245253 31931678 31890703 31812776 31791341 31635843 31188397 30556839 29651255 28525855
4194 28525855 27332865 26117118 24919386 23999467 23269026 22894922 22662932 22474915 22283416
4185 22283416 21996860 21412475 20580711 19541886 18475362 17540313 16543895 15787405 14952442
4176 14952442 14361660 13963639 13699088 13464179 13258907 12873412 12537613 12231439 11761369
4167 11761369 11248937 10675417 10185528 9682224 9299064 8969589 8694274 8497699 8188951
4158 8188951 7970830 7778008 7655438 7562488 7460087 7337349 7190061 6974516 6812798 6629060
4148F629060j54011j81276j22656n6994j16100o3522j37231j2826r5663l5530
4138E653251n9970j18273o4921n6178q8601m3030p6280j28181P3707m8102p3525
4127D969897J3233n9421m0343j0144j0903j62911o2276o9123m9100n4693N0967
4116D515183k3048j12385l5352l0336O7817L977j3916n4191o5978j37944r0187
4105D023640j9736j918J9989o6348J8927n9885m7899j16325n2263R4986N8163
4094C851331K7727j25945r8198j57359n7767K9530O3745O1197K7281j36155m0191
4083C445196j65411l7088O2311K7577N476q0128j06076j04296n3200K5597J13374
4072C133332N9286Q5162j10209p1567j45287j25333r372J12484J24175L7596m9157
$$ plain form
4148 6629060 6475049 6293773 6171117 6114123 5998023 5934501 5797270 5784444 5688781 5653251
4138 5653251 5593281 5475008 5410087 5353909 5265308 5222278 5145998 5017817 5091524 5043422 4969897
4127 4969897 4983130 4923709 4883366 4873222 4862319 4699408 4637132 4568009 4518909 4464216 4515183
4116 4515183 4492135 4379750 4344398 4314062 4381879 4385856 4371940 4317749 4251771 4113827 4023640
4105 4023640 4003904 4001986 4021975 3955627 3974554 3914669 3866770 3750445 3698182 3793168 3851331
4094 3851331 3879058 3753113 3654915 3497556 3439789 3469319 3533064 3594261 3621542 3485387 3445196
4083 3445196 3279785 3242697 3305008 3332585 3338061 3257933 3151857 3047561 2994361 3019958 3133332
4072 3133332 3192618 3277780 3167571 3096004 2950717 2825384 2816012 2928496 3052671 3090267 3041110
4061C041110j95699j25067M6951K6707R1014l4483m1072q8596q3334L1576M4514
4050B713621l3609L4826l1619M8430M561j37881N5940p2724K7053j11116q5235
4039B412247O0897j11892m1937n1858J29786K7601K410J40267q241p9695l2250
4028B447335p1670k409m6672J033j4451R5085K0278k04441m4977m6746k3364K6188
4016B135189L7560Q7244M9827n7398q7505p8613j4934j4318R726P1028M1702l1396
4004B148112j17921k2587j0305j626J28049L7422j5944j39122j26990m9287J7221
3993A847022R3296P6259o5992L1936p2640j31657K1149o0474P3291R6254J44761
3982B053205l6242r9902j22432j34372Q9140M4951P9910K4039n5511j7672m1001
$$ plain form
4061 3041110 2845411 2720344 2767295 2794002 2885016 2850533 2809461 2720865 2637531 2669107 2713621
4050 2713621 2680012 2714838 2683219 2731649 2736210 2598329 2654269 2581545 2608598 2497482 2412247
4039 2412247 2473144 2361252 2319315 2267457 2397243 2424844 2427254 2567521 2559280 2479585 2447335
4028 2447335 2375665 2373256 2326584 2327617 2313166 2408251 2428529 2224088 2179111 2132365 2109001 2135189
4016 2135189 2172749 2259993 2309820 2252422 2164917 2086304 2071370 2057052 2066778 2137806 2179508 2148112
4004 2148112 2030191 2007604 1997299 1995673 2123722 2161144 2145200 2006078 1879088 1829801 1847022
3993 1847022 1940318 2016577 1950585 1982521 1909881 1778224 1799373 1738899 1812190 1908444 2053205
3982 2053205 2016963 1917061 1794629 1660257 1749397 1794348 1874258 1898297 1842786 1825114 1784113
3971A784113j3222j2200l373J44454N9052L5827j9123p0149J2270n9k8463O9462
3959A958589q5386M156j09458J4188k2381N1997O8198L1487Q6076J09035K09056
3948B315557K24008L19166M34179L12869J90623J46752j69588k13830k89477j87755
3938C082504k21911j51589j09690j26319q5698q5930m020j8316n8041O1192P9483
3927B361665m5542O7658j26246J0722j2189M1475O6665n932J18644J42976K10430
3916B830326K63559L88129L80567K13301M7572l6149k22236k41906k31349k20043
3906C171771p7688k42524j05034r7182j56952o3882j77334K4475j17847J11663
3896B269466L537p7539m9284n0283J29409j6616n2803J1761m2801K4050j48998
$$ plain form
3971 1784113 1770891 1758691 1755318 1899772 1958824 1994651 1975528 1905379 1917649 1917590 1889127 1958589
3959 1958589 1873203 1877359 1767901 1782089 1759708 1811705 1879903 1911390 1997466 2106501 2315557
3948 2315557 2539565 2858731 3292910 3605779 3796402 3943154 3773566 3559736 3270259 3082504
3938 3082504 2860593 2709004 2599314 2472995 2387297 2301367 2297347 2279031 2220990 2282182 2361665
3927 2361665 2316123 2383781 2257535 2268257 2256068 2297543 2364208 2358276 2476920 2619896 2830326
3916 2830326 3093885 3482014 3862581 4075882 4123454 4087305 3865069 3623163 3391814 3171771
3906 3171771 3094083 2851559 2746525 2649343 2492391 2428509 2251175 2275650 2157803 2269466
3896 2269466 2273003 2195464 2146180 2095897 2225306 2208690 2155887 2167648 2124847 2148897 1999899
3885A999899r2577J24781l477j5642j079j14422l0845m3172j03779p7703N9229
3874A701213n302j0557j3161l5419m3691J3269j453J65529m3834r3757N390j26712
3862A511515m7303J4932P5013p0928m4734k7716j14722N6967M7824J8299J22198
3851A541345Q0376j806o0737j49410k3135r907J35853Q9253m7961m1156j03992
3840A408723Q6500n3994Q6810k642P6269j0932m305p9138r57Q6258P401j0087
3828A589906J5337N2615q4883P000m2334R812N4184J3648O3090l9915l0652n5369
3816A552439O2792J1550M1842L5497q0090P394o246P4018M4500P2400P0568M7846
3804A934510R311O4726K4152N0352J66165J76792K79132J97569K42003L26076
$$ plain form
3885 1999899 1907322 2032103 2028626 2012984 2011905 1897483 1866638 1823466 1719687 1641984 1701213
3874 1701213 1695911 1685354 1672193 1636774 1593083 1606352 1604899 1770428 1726594 1632837 1638227 1511515
3862 1511515 1464212 1479144 1554157 1483229 1438495 1410779 1296057 1353024 1400848 1419147 1541345
3851 1541345 1621721 1619915 1559178 1409768 1386633 1376726 1512579 1601832 1553871 1512715 1408723
3840 1408723 1495223 1441229 1528039 1525397 1601666 1590734 1586429 1507291 1506334 1592592 1599993 1589906
3828 1589906 1605243 1657858 1572975 1579975 1537641 1547453 1601637 1615285 1678375 1638460 1607808 1552439
3816 1552439 1615231 1626781 1668623 1704120 1624030 1631424 1625178 1699196 1743696 1816096 1886664 1934510
3804 1934510 1943821 2008547 2032699 2083051 2249216 2426008 2705140 2902709 3144712 3470788
3794C470788L16660L63778L39979K82853K47683J10925K24716K64524J45350Q8003
3784E855259N9236k7904j55309j4556k4994O2080M2750J4372L5327p5869K2978
3773E793370q9278m3892O7244o7018k29557k49783l40575k70635k75632j91008
3763D103236j43491k14756k14958l67015k61541j92614L0068N4244M5647J404
3753B840224j29406j27186p4351j1620j2818L5087J86270O9537j39315j61519
3743B474903j57514K6588K15878J8848M6259Q428r6600k15339n7645J23100N0857
3732B437763O4592l077P933j70553p6786J1570Q827O9092P2702L2613k4251n8216
3720B372209r3424K4524O0847J18568P8544K5801m75K2447o8953O1863N9329N5366
$$ plain form
3794 3470788 3787448 4151226 4491205 4774058 5021741 5132666 5357382 5621906 5767256 5855259
3784 5855259 5914495 5886591 5731282 5716726 5691732 5753812 5796562 5810934 5846261 5770392 5793370
3773 5793370 5704092 5660200 5727444 5660426 5430869 5181086 4840511 4569876 4294244 4103236
3763 4103236 3959745 3744989 3530031 3163016 2901475 2708861 2738929 2793173 2838820 2840224
3753 2840224 2710818 2583632 2509281 2497661 2484843 2519930 2706200 2775737 2636422 2474903
3743 2474903 2317389 2343977 2559855 2578703 2624962 2633390 2536790 2321451 2263806 2386906 2437763
3732 2437763 2502355 2499278 2507211 2336658 2259872 2271442 2280269 2349361 2422063 2454676 2430425 2372209
3720 2372209 2278785 2303309 2364156 2482724 2561268 2587069 2586594 2609041 2540088 2601951 2661280 2716646
3708B716646P8092K5481m9152j39195Q8943L7119J23051q3999l6819L1389J5120
3697B806676N0608l769P8119N3838m102K5185J873k3221K0786J7812J1500r0640
3685B944665J6064O6091p282K3213o083O9739P1418R8931M82M1127J45219O0759
3673C524343Q8814J32812J01749J10727P2444k6730J01165J09285L8717N1850
3663D305176K03863J24027J01051J02641J26915J40066J24418J88463J74021K13524
3653E804165J92939K44375K86188K48023K16147K48539L61883L11064L37369L39803
3643H590495L65949M37298L93933M41106M31011N43408N29818O73612P79058R37887
3633A4123575J140515J459957J670979K056365K621123L109928L747671M404143
$$ plain form
3708 2716646 2794738 2820219 2771067 2631872 2720815 2757934 2880985 2796986 2760167 2791556 2806676
3697 2806676 2857284 2853515 2931634 2985472 2981370 3006555 3008428 2985207 3005993 3023805 3035305 2944665
3685 2944665 2960729 3026820 3019538 3042751 3036668 3106407 3177825 3276756 3277238 3318365 3463584 3524343
3673 3524343 3613157 3745969 3847718 3958445 4030889 4004159 4105324 4214609 4253326 4305176
3663 4305176 4509039 4633066 4734117 4836758 4963673 5103739 5228157 5416620 5590641 5804165
3653 5804165 5997104 6241479 6527667 6775690 6991837 7240376 7602259 7913323 8250692 8590495
3643 8590495 8956444 9393742 9787675 10228781 10659792 11203200 11733018 12406630 13185688 14123575
3633 14123575 15264090 16724047 18395026 20451391 23072514 26182442 29930113 34334256
3625C4334256M865773N051058N235295M864314M432100L670758K772769J801821
3617F7028144P91425m3927o45295q61258q68787o00258j31890M32046P90687R96282
3607F6887169J094493P57142J90220l14374j236028k061541k891805l572408l980202
3598E4872666m235494m125337m026253l710535l335750k982779k454037j968394
3590B8034087j715115j468770j234725j129560j060041r96126q80440r11061q45746
3581A7792503p34434p14361o74261o62660m81571l95127l99194l22963j38271
3572A3269661j43171q0834O0760L2230K32039L31659L84604M94575N57499O70236
3562A5809258P71237R93599J106359J492658J593597K008425K260872K583420
$$ plain form
3625 34334256 39200029 44251087 49486382 54350696 58782796 62453554 65226323 67028144
3617 67028144 67819569 67775642 67130347 66269089 65400302 64800044 64668154 65100200 65890887 66887169
3607 66887169 67981662 68738804 68929024 68614650 67378622 65317081 62425276 58852868 54872666
3598 54872666 50637172 46511835 42485582 38775047 35439297 32456518 30002481 28034087
3590 28034087 26318972 24850202 23615477 22485917 21425876 20429750 19549310 18638249 17792503
3581 17792503 17058069 16343708 15669447 15006787 14525216 14130089 13730895 13407932 13269661
3572 13269661 13126490 13045656 13106416 13138646 13370685 13702344 14086948 14581523 15139022 15809258
3562 15809258 16580495 17574094 18680453 20173111 21766708 23775133 26036005 28619425
3554B8619425K841399L065669L045613K832479K487766K064244J564501Q15134
3546D7336230L80284r4044l47321n38091m49024m04909k21337L623K93215N07315
3536D6465941N78405M46045J90709j43943o34166j184805j670738j972004k056855
3527D0018589k262056k375423k303893k134377j915910j672083j277803r18158
3519B5158886p88034n45978m65682l70015k57603j05070m2207o3680l3400k45001
3509B2242216j49338j74634j92375L7681M4986J90891K53644L24553L44062L58323
3499B3280009N25545O75540P11578Q52966R31126R08226J112838J247710J416798
3490C1662336J633566J923109K244008K558446K985448L425700L850385M285998
$$ plain form
3554 28619425 31460824 34526493 37572106 40404585 42892351 44956595 46521096 47336230
3546 47336230 47716514 47622470 47275149 46737058 46288034 45883125 45661788 45665411 45958626 46465941
3536 46465941 47044346 47490391 47681100 47537157 46902991 45718186 44047448 42075444 40018589
3527 40018589 37756533 35381110 33077217 30942840 29026930 27354847 26077044 25158886
3519 25158886 24370852 23824874 23359192 22989177 22731574 22626504 22584297 22520617 22487217 22242216
3509 22242216 22092878 21918244 21725869 21763550 21808536 21999427 22253071 22577624 22921686 23280009
3499 23280009 23805554 24481094 25192672 26045638 26976764 27884990 28997828 30245538 31662336
3490 31662336 33295902 35219011 37463019 40021465 43006913 46432613 50282998 54568996
3482E4568996M737341N173423N462350N886149O153456O336680O537968O527225
3474A01383588O381411O110990N758682N318748M897889M475219M100325L787182
3466A42214034L616620L710757L897166M112562M212416M222752L932484L485589
3458A73404380K888614K085198J194206J24623p28060j730261k477917l207610
3450A71553173l629540l953960l977997m115348m053284l905736l788141l579972
3442A40549195l256453k726057k193726j444486p51109J71124R93205J845867
3434A33187560K602885L288033L631073L601977L488465K813719K019539J112180
3426A55745431J14857q21753j712975k452111l020776l361218l584225l421796
$$ plain form
3482 54568996 59306337 64479760 69942110 75828259 81981715 88318395 94856363 101383588
3474 101383588 107764999 113875989 119634671 124953419 129851308 134326527 138426852 142214034
3466 142214034 145830654 149541411 153438577 157551139 161763555 165986307 169918791 173404380
3458 173404380 176292994 178378192 179572398 179697021 178968961 177238700 174760783 171553173
3450 171553173 167923633 163969673 159991676 155876328 151823044 147917308 144129167 140549195
3442 140549195 137292742 134566685 132372959 130928473 130177364 130348488 131341693 133187560
3434 133187560 135790445 139078478 142709551 146311528 149799993 152613712 154633251 155745431
3426 155745431 155860288 155038535 153325560 150873449 147852673 144491455 140907230 137485434
3418A37485434l108112k625789k212991j659829j293605j183123j218191j392531
3410A22791263j846544k323007l041721l733736m391770m938756n382977n766749
3402I1366003n716251n676336n472762n109706m921689m569950m228980l813148
3394E1857181l389317k890722k429503k134489j750061j554757j245248r04113
3386C5558971o49651m00527j86890J38686M31908Q90327J422222K004197K685823
3377D1895066L355825L787841M172753M245605M177113L747672L470318K973787
3369G1825980K411088J885893J244161O97519J69240N821k35519k15102j63584
3360G7625497j62387j39346K5487J35942J86350J57202j33241m07938q46198j163611
$$ plain form
3418 137485434 134377322 131751533 129538542 127878713 126585108 125401985 124183794 122791263
3410 122791263 120944719 118621712 115579991 111846255 107454485 102515729 97132752 91366003
3402 91366003 85649752 79973416 74500654 69390948 64469259 59899309 55670329 51857181
3394 51857181 48467864 45577142 43147639 41013150 39263089 37708332 36463084 35558971
3386 35558971 34909320 34508793 34321903 34460589 34892497 35782824 37205046 39209243 41895066
3377 41895066 45250891 49038732 53211485 57457090 61634203 65381875 68852193 71825980
3369 71825980 74237068 76122961 77367122 78064641 78233881 78239702 78004183 77789081 77625497
3360 77625497 77463110 77323764 77349251 77485193 77671543 77828745 77695504 77287566 76441368 75277757
3350G5277757j616657k038824k509405k961077l385436l648569l813772l701327
3342E1602690l559370l425711l146839k896694k691213k443918k276514k011003
3334B9151428j627411j494778j297181j032545q85001p20855m89915l69204o3929
3325B1170609j83948K8861K29426J95666M75235P48554Q91742J156625J370810
3316B6083580J838254K117088K665102L244900L789057M501865N271996O013236
3308E5525078O641122P172231P310607P501822P351544O981023O418754N371723
3300A10273904M142099K525738R13107q08094k394314l873933m737026n385317
3292A00656164n493048n265054m798443m127857l276114k257642j291893n83209
$$ plain form
3350 75277757 73661100 71622276 69112871 66151794 62766358 59117789 55304017 51602690
3342 51602690 48043320 44617609 41470770 38574076 35882863 33438945 31162431 29151428
3334 29151428 27524017 26029239 24732058 23699513 22814512 22093657 21603742 21234538 21170609
3325 21170609 20986661 21015522 21244948 21440614 21915849 22664403 23556145 24712770 26083580
3316 26083580 27921834 30038922 32704024 35948924 39737981 44239846 49511842 55525078
3308 55525078 62166200 69338431 76649038 84150860 91502404 98483427 104902181 110273904
3300 110273904 114416003 116941741 117854848 117046754 114652440 110778507 106041481 100656164
3292 100656164 95163116 89898062 85099619 80971762 77695648 75438006 74146113 73562904
3284G3562904L8317L27005L74846J14530m17730j072098j883878k516988l242252
3275F5284656m052072m332587m687439m756171m653759m395391m036191l526491
3267C0844555l131970k777313k387854k095681j736534j467596j139289j108584
3259A4999734q08421q90267o28560n90099m78349m08721l71191l12436k52610
3250A0259080j83279o2810r0069N2688m4404q2159K3433j1750J6846j18425j00556
3239I658595q3258k27363k34326k16390j75901j35440o4627j43406k47743j69775
3229G960366k61842j10853l5452m2564o1969j04789m2719j70789j20128n4898
3219F954363j18041j32822o7431k18929j18972j88740q8162j9313q0521l7353
$$ plain form
3284 73562904 73601221 73928226 74303072 74417602 73999872 72927774 71043896 68526908 65284656
3275 65284656 61232584 56899997 52212558 47456387 42802628 38407237 34371046 30844555
3267 30844555 27712585 24935272 22547418 20451737 18715203 17247607 16108318 14999734
3259 14999734 14191313 13301046 12672486 12082387 11604038 11195317 10824126 10511690 10259080
3250 10259080 10075801 10012991 9922922 9975610 9931206 9849047 9872480 9860730 9877576 9759151 9658595
3239 9658595 9575337 9347974 9113648 8897258 8721357 8585917 8521290 8377884 8130141 7960366
3229 7960366 7698524 7587671 7552219 7509655 7447686 7342897 7300178 7129389 7009261 6954363
3219 6954363 6836322 6703500 6636069 6417140 6298168 6109428 6021266 6001953 5921432 5884079
3209E884079J1641p5811q4425p8250l4657n3061J4524J07134r3818o5907n1251
3198E480198k2634Q16P0987J26817j5385K2355n193M1822P1536M5362N9213J44807
3186F020701M8781j3359m8912r149k4074m0486J89009P9288R2535J1603N2799
3175F358736K6088P5769J4557O7375Q3721J53073J77804M9621K2430M7971M3996
3164G121141n8248M6972Q060r1727J0590J29983J7261L7413J23933J9386O2445
3153G427209k2097p9569j46032n1431N443N8107N4046J36250R9387P7848J58635
3142G717796m8119M7309J61935J07158K48467J27106J74946J17273J78205Q4826
3132H916902J54582K30175J80881L61014L05035K63480J30737K28282K70605M08139
$$ plain form
3209 5884079 5895720 5819909 5735484 5657234 5622577 5569516 5584040 5691174 5597356 5531449 5480198
3198 5480198 5457564 5458380 5529367 5656184 5640799 5663154 5657961 5699783 5771319 5816681 5875894 6020701
3186 6020701 6069482 6056123 6007211 5998062 5973988 5933502 6122511 6201799 6294334 6305937 6358736
3175 6358736 6384824 6460593 6475150 6542525 6626246 6779319 6957123 7006744 7029174 7077145 7121141
3164 7121141 7062893 7109865 7117925 7026198 7036788 7166771 7184032 7221445 7345378 7364764 7427209
3153 7427209 7405112 7325543 7179511 7128080 7133523 7191630 7245676 7381926 7481313 7559161 7717796
3142 7717796 7669677 7716986 7878921 7986079 8234546 8361652 8536598 8653871 8832076 8916902
3132 8916902 9071484 9301659 9482540 9843554 10148589 10412069 10542806 10771088 11041693 11449832
3122A1449832N04536O24040M43093M85491L58151L91606O45269N15269N59241
3113A5976528M53636M62362L60806L93938M83312L96848L87624N24185L89723
3104A9828962K95408M28150L81363L94468N69411Q48611P58006Q52805Q78493
3095B5235677Q78236J118686J165915J644094J838070K060786K356614K731736
3087C9029814L272298L798954M591975N608531O932434Q322868R662331J0626633
3079I1845838J0951173J0819862J1267266J2631489J5774622K1703498L1282615
3072B06276363M3848208N5756410O1697627N6603539L9752431J7825380l119053
3065D78640905j9607264k7148039k5334438j6729218n940302J579362J258560
$$ plain form
3122 11449832 11954368 12578408 13021501 13506992 13865143 14256749 14902018 15417287 15976528
3113 15976528 16430164 16892526 17253332 17647270 18130582 18527430 18915054 19439239 19828962
3104 19828962 20124370 20552520 20933883 21328351 21897762 22746373 23504379 24357184 25235677
3095 25235677 26113913 27232599 28398514 30042608 31880678 33941464 36298078 39029814
3087 39029814 42302112 46101066 50693041 56301572 63234006 71556874 81219205 91845838
3079 91845838 102797011 113616873 124884139 137515628 153290250 174993748 206276363
3072 206276363 250124571 305880981 367578608 424182147 463934578 481759958 478640905
3065 478640905 459033641 431885602 406551164 389821946 383881644 385461006 386719566
3058C86719566o242291j6405958k5968981l3325347l6512630l6123678l3556926
3051A98583755k9510799k5193518k1114436j7039436j3481929j0650595q653865
3044G2939177p321731o204451n295197m558655l847865l337425k859060k357945
3036C7156848k090482j725952j731681j553935j619231j462325j449854j371084
3028B4152304j155275j075989r65374q80001q27479p08186q10346p06376o74644
3019A6348634o66703n83623n94979l14795k97508k65405k06103j89640j32459
3010A3097419k63281j80521k01535k07344j16068j20976j18215j76166j89997
3001A1523316K687j72397k20643j71694k68692k54115j53967j79685j37176j56784
$$ plain form
3058 386719566 380477275 364071317 338102336 304776989 268264359 232140681 198583755
3051 198583755 169072956 143879438 122765002 105725566 92243637 81593042 72939177
3044 72939177 65617446 59412995 54117798 49559143 45711278 42373853 39514793 37156848
3036 37156848 35066366 33340414 31608733 30054798 28435567 26973242 25523388 24152304
3028 24152304 22997029 21921040 20955666 20075665 19248186 18540000 17729654 17023278 16348634
3019 16348634 15681931 15098308 14503329 14188534 13891026 13625621 13419518 13229878 13097419
3010 13097419 12834138 12653617 12452082 12244738 12128670 12007694 11889479 11713313 11523316
3001 11523316 11526003 11353606 11132963 10961269 10692577 10438462 10284495 10104810 9967634 9810850
2991I810850k12305k74395l04152k45494j77695j50279j01958j49829k74436l75833
2981G544474k56578k47631k32247k6951j21026L9985j94496k26259l02252k18564
2971E758455k07428j1754K7102j81769j80727j48970j68523k2978p6691m7466
2961D739251K4350j56330j66564k18943q477k1567j29088J52313m6170j39458
2951D029317k06026n4861l8864l4697J52026j1182j06081n2463r2063o1236K7174
2940C551044j13740j01181p6332J5088j09839l0613j5748m3111J084q007m0925
2929C027720q887p149m4877r386j6868M706l8987k7855r1175l6538o6161o5630
2917B618913O1301k55766n9960M7412p3597K0647j24243k8427j60190p6504M741
$$ plain form
2991 9810850 9598545 9324150 9019998 8774504 8596809 8446530 8344572 8194743 7920307 7544474
2981 7544474 7287896 7040265 6808018 6781067 6660041 6700026 6505530 6279271 5977019 5758455
2971 5758455 5551027 5539273 5566375 5384606 5203879 5054909 4886386 4863408 4786717 4739251
2961 4739251 4763601 4607271 4440707 4221764 4213287 4191720 4062632 4214945 4168775 4029317
2951 4029317 3823291 3768430 3729566 3694869 3846895 3835713 3729632 3677169 3585106 3523870 3551044
2940 3551044 3437304 3336123 3259791 3274879 3165040 3134427 3118679 3075568 3076652 3068645 3027720
2929 3027720 3018833 3011684 2966807 2957421 2940553 2945259 2906272 2878417 2787242 2750704 2684543 2618913
2917 2618913 2680214 2424448 2364488 2411900 2338303 2358950 2234707 2206280 2046090 1969586 1974327
2906A974327J6967K9537j4271o9347j65166j07428o4192K8605n0492m0355j69340
2895A368845J0326r4143j2955j5470N3623J70232l9427K2730o4053k6606K9284
2884A402386L2172L6154Q6725l3091r8169m66P7071m3672N1739L9033k3665K4741
2872A550958p0115l5985L8270M6924k8022N0084r071o1018O7676k9457m5188N6552
2860A531608P5954o4250k1708l0457p65k511K8776L4736n7321J2681m2826J03817
2848A567734J6723n1680m772l7934r0768N5153O758L6178O8856j3089K1537o7798
2836A506898r5301L088J03714J16688K8632k9471p7008j00996j14050K4341J29221
2825A495756L1875Q9907o9237j54278p7480q0436J0400J14290J00916l5219j62050
$$ plain form
2906 1974327 1991294 2020831 2006560 1937213 1772047 1664619 1600427 1629032 1578540 1538185 1368845
2895 1368845 1379171 1285028 1272073 1256603 1310226 1480458 1441031 1463761 1399708 1373102 1402386
2884 1402386 1434558 1470712 1557437 1524346 1426177 1425711 1502782 1459110 1510849 1549882 1526217 1550958
2872 1550958 1480843 1444858 1483128 1530052 1502030 1552114 1543043 1482025 1549701 1520244 1475056 1531608
2860 1531608 1607562 1543312 1521604 1491147 1490382 1487871 1516647 1551383 1494062 1506743 1463917 1567734
2848 1567734 1584457 1532777 1528005 1490071 1399303 1454456 1461214 1497392 1566248 1553159 1574696 1506898
2836 1506898 1411597 1414685 1518399 1635087 1663719 1634248 1557240 1456244 1342194 1366535 1495756
2825 1495756 1527631 1617538 1548301 1394023 1316543 1236107 1246507 1360797 1461713 1426494 1264444
2814A264444n7374n1509J0764R7730J15632J05148N420m8880k03636p9277R3097
2803A251559J49801J63318Q9221n2570r4689o6994P9788J84553K09666L02207
2793B215860K8385J9027o6587J28036K35268L41647M75938L13535J64324p9163
2783C776270n3005j49141n4549m044P392q920m1179q1428j96932q0850j18792
2772B994822n5223k03709j74047k34573k40490j12198r0475r1084k4524M675q6893
2761A686281j76861j55161j8465o7045J20950M849k5273l9148r0419p9632K2430
2750A182506N5557m4896m0272j31709j4119P6416J4725Q6718l9421j33305o1274
2739I50926q161r263Q5083O5576k2813k9040q8639j18876K6819K12298n5021k8937
$$ plain form
2814 1264444 1207070 1155561 1166325 1264055 1379687 1484835 1490255 1441375 1237739 1158462 1251559
2803 1251559 1401360 1564678 1653899 1601329 1506640 1439646 1519434 1703987 1913653 2215860
2793 2215860 2244245 2263272 2196685 2324721 2559989 2901636 3377574 3691109 3855433 3776270
2783 3776270 3723265 3574124 3519575 3515531 3522923 3514003 3472824 3391396 3194464 3113614 2994822
2772 2994822 2939599 2735890 2561843 2327270 2086780 1974582 1884107 1793023 1768499 1773174 1686281
2761 1686281 1509420 1354259 1335794 1268749 1389699 1394548 1369275 1330127 1239708 1160076 1182506
2750 1182506 1238063 1193167 1152895 1021186 1007067 1083483 1098208 1184926 1145505 1012200 950926
2739 950926 942765 933502 1018585 1084161 1061348 1032308 943669 824793 851612 1063910 1008889 979952
2727I79952j9865l8653j03119k2856N80J00095P2065J7377n8040j29835l4686
2716G63015q1961P2334J26426J63440n7295o9181j67405j43021N0007J26711J35347
2705I18417J44929k974j92218j14434n7106N0502Q4487N9486n365k3819j0315
2694H51590j18826R890M5968O9558N95K0683O047m3150L594N6034P4944O3959
2682A040886r1762k7313l4339p2377j16248K2908J9507P7725P2066O229r9900
2671G97382k1776q3837m5132M2598j1851M6514Q8152k8327q0323k1230j38320
2660E43850P9472m7859M5025L3909N5759m4594p5110p8213K4140K7797Q3592P9703
2648G27471q9251k4766M6946r5617p8048o603O9392r6502N3444M1014m3677q2007
$$ plain form
2727 979952 960087 921434 818315 795459 796039 896134 968199 985576 927536 797701 763015
2716 763015 681054 753388 879814 1043254 985959 916778 749373 606352 656359 783070 918417
2705 918417 1063346 1060372 868154 753720 696614 747116 831603 891089 885724 861905 851590
2694 851590 732764 742654 788622 858180 858775 879458 885505 842355 845949 901983 976927 1040886
2682 1040886 949124 921811 887472 815095 698847 721755 741262 818987 891053 897282 797382
2671 797382 775606 691769 646637 689235 677384 723898 812050 783723 703400 682170 543850
2660 543850 623322 575463 620488 654397 710156 665562 590452 512239 536379 564176 647768 727471
2648 727471 638220 613454 660400 564783 486735 480132 549524 453022 506466 547480 503803 421796
2636D21796O3666l178Q3792J3018j785l1011m7976J1076k065J3131l3432O4403
2624E51435l7643l1480m7651L7666n9796P8201N5172N8363l7301j8531J2003N013
2612E65451m1502l4791J7917R2935K9136j7028J01721L8962q1113j5895j4560
2601F41233N2758O0422n6192l8059o9905l8813p710j9290J19973K4210J3103L5461
2589G17191n2023k7850Q3025J19185N9851K1383J46196r5089P528l4354j3952
2578I31091j8765k4683j0018p292m4628j27817m1723l8012J20499J8665k6890
2567G30427j06381l1821j4898L8990j2308O5251M3973p2600K4559m3187j8215
2556F03790m237M8904r08J1J1077p7649M6147M2702k1049k7092N3128j18580n907
$$ plain form
2636 421796 485462 482284 566076 579094 577309 546298 498322 509398 507333 520464 487032 551435
2624 551435 513792 482312 434661 472327 412531 490732 545904 604267 566966 548435 560438 565451
2612 565451 523949 489158 507075 600010 629146 612118 713839 752801 671688 655793 641233
2601 641233 693991 754413 698221 660162 590257 551444 543734 524444 644417 668627 681730 717191
2589 717191 665168 637318 720343 839528 899379 920762 1066958 971869 979397 945043 931091
2578 931091 912326 887643 877625 870333 825705 697888 656165 618153 738652 757317 730427
2567 730427 624046 592225 577327 616317 604009 669260 713233 640633 665192 622005 603790
2556 603790 599553 648457 647549 647560 658637 580988 627135 669837 648788 621696 674824 556244 550337
2543E50337k5665J4296k0139K4299j9401Q0660N9977l1713M722M2632q2174p9155
2531E18676J09628k6570M0982R4435k2992k9140n6853L277q8373R7476K6547j8213
2519F48880O1277L9407o6339j09383L7951m2542K149M8064M7171j0667m978k092
2507F48898L6663k1773O7820N8808k1743o3261p6771n2184o5465J6075J19469
2496F46536L5420M418l2024r275j18302n294N1141J45108J3853J24318q7355j04510
2484F64034q967o4347o0226o5108J9581L1738P0398j7225o0821N9039N0344l421
2472F15019m581J1759N0616o7507m976P3830j596N2772m3000k6879L1569j23588
2460E63438l3199k6066J9812R977j2940l0610J5018J08247J0740L6668m584m6552
$$ plain form
2543 550337 524672 538968 518829 543128 523727 604387 664364 632651 637373 680005 597831 518676
2531 518676 628304 601734 642716 737151 714159 685019 628166 631443 543070 640546 667093 648880
2519 648880 710157 749564 683225 573842 611793 569251 571400 619464 666635 655968 650990 648898
2507 648898 685561 663788 731608 790416 768673 705412 628641 576457 510992 527067 646536
2496 646536 681956 686374 654350 645075 526773 521479 572620 717728 731581 855899 768544 664034
2484 664034 655067 590720 530494 465386 484967 516705 587103 569878 509057 568096 618440 615019
2472 615019 610438 622197 672813 605306 600330 674160 672564 725336 682336 655457 687026 563438
2460 563438 530239 504173 523985 533962 521022 490412 505430 613677 624417 661085 656501 609949
2448F09949L3776l6070p84N4733r486k3312k8665j8868J45192K8417Q3200L317
2436H41399j6424j53149k5146P6511k1351J2259m9127m0555M0746j8482J4037
2425F60718N0710j5639O4669L3226n4414o6989j517L8376k550N4458N6009J9235
2413H36292o8480k995j25620N6279J69706j4368K5707q3260j7102o5268J17386
2402H28277m9428L1987L9140O014j04985n6924O174L4629k506N7002j04871p2039
2390F12470L8821j1862q20J12868J08151k2826M8404o5129j5184m6843O6945J19297
2378I44292n695j5109l9838L3410O0782Q4426K1707L7397M8586J12605R0917L1277
2366A404757J08302J00826R5100l2986q8446R507M9371Q5417J00282N9740J5893
$$ plain form
2448 609949 643725 607655 606871 661604 652118 628806 600141 581273 726465 754882 838082 841399
2436 841399 824975 671826 646680 723191 701840 714099 664972 624417 665163 646681 660718
2425 660718 711428 695789 760458 793684 739270 672281 670764 709140 706590 761048 817057 836292
2413 836292 767812 764817 639197 695476 865182 850814 876521 793261 776159 710891 828277
2402 828277 778849 810836 849976 855990 751005 694081 700255 734884 732378 789380 684509 612470
2390 612470 651291 639429 638609 751477 859628 836802 885206 820077 804893 758050 824995 944292
2378 944292 938597 923488 883650 917060 977842 1062268 1083975 1121372 1169958 1282563 1373480 1404757
2366 1404757 1513059 1613885 1708985 1675999 1587553 1597060 1646431 1731848 1832130 1891870 1907763
2355A907763M8618p8797k9792J01026L4060o977n0618J23527j7760R0445O9783
2344B191278Q8943J06319J76734J31029R7021J440K02511L05742K97739L98676
2334C997432N24793N89185P08312P73624N74549O50167O18453N12380O01901O12185
2324A0162981J129104J470137K309691L493541N783611R565725J3753088J5958306
2316F3626184J4060158N860871K86029m591024r795454j0081540r716166q840709
2308D0808349p658635o308020n478405l978194k759947j620621j171480r27226
2300A0905821r53388r13975p39118p71891o82139n71762m92234m49576l90377
2291D941361l09388l14498j95141k60437j14453j05355j36062j98656j81432r2019
$$ plain form
2355 1907763 1956381 1877584 1847792 1948818 1982878 1975901 1925283 2048810 2031050 2121495 2191278
2344 2191278 2280221 2386540 2563274 2694303 2791324 2792764 2995275 3301017 3598756 3997432
2334 3997432 4522225 5111410 5819722 6593346 7167895 7818062 8436515 8948895 9550796 10162981
2324 10162981 11292085 12762222 15071913 18565454 24349065 33914790 47667878 63626184
2316 63626184 77686342 83547213 83833242 79242218 69446764 59365224 49649058 40808349
2308 40808349 33149714 26841694 21363289 17385095 14625148 13004527 11833047 10905821
2300 10905821 9952433 9038458 8299340 7527449 6845310 6273548 5781314 5331738 4941361
2291 4941361 4631973 4317475 4122334 3861897 3747444 3642089 3506027 3307371 3125939 3033920
2281C033920j50486j41024j16090o0086l0408q1633j53703k00755q1596q5018
2271A933121K1716l7278L638j45744j50709r9826j8579n1825N6966J0467J4313
2260A536260O5868n4088p0049J07064M165M4L1320m4679l4534j3136p0964p1373
2248A385898P3766m5524j7079L741q1417j4627j15363k8921O9183j02375l4563
2237A092719o2185n944Q2180m1642k8675J9534r5579l7168j8547J315m1179O1886
2225I26715m2020r078m3032M7662m509q8893m8077n7109K3K2715L9675L969K4391
2212G72432n4656o6084Q731J1962K7160J7987K8602j4482q041K0796o6519m8668
2200F29220k5054M7095O1858r3176l5475m5243O382k4296N1401J11137l278L6768
$$ plain form
2281 3033920 2883434 2742410 2626320 2566234 2535826 2454193 2300490 2099735 2018139 1933121
2271 1933121 1954837 1917559 1921197 1775453 1624744 1524918 1506339 1454514 1511480 1521947 1536260
2260 1536260 1602128 1548040 1477991 1585055 1589220 1589264 1620584 1575905 1541371 1528235 1457271 1385898
2248 1385898 1459664 1414140 1397061 1400802 1319385 1304758 1189395 1160474 1229657 1127282 1092719
2237 1092719 1030534 1024590 1106770 1065128 1036453 1055987 960408 923240 904693 906008 864829 926715
2225 926715 884695 875617 832585 880247 875738 786845 738768 681659 681682 704397 744072 748041 772432
2212 772432 717776 651692 660423 672385 699545 717532 746134 731652 723611 744407 677888 629220
2200 629220 604166 651261 713119 619943 584468 539225 545607 521311 572712 683849 680571 717339
2188G17339J9326j26533L5176l2743m287M8709k879Q88j04156q0209m5927Q5301
2176E10005Q6561J09515n656p6689q1173p2438K1919P4735K8345n9134J08752
2165F44742p8638n8991n2094o2452k1547N4879M3757j5355N108l5101p0032M7407
2153D01683N878Q4202M5293k2556j4310m6506l6808j8913q4386N3105n7574J8044
2141C27152P3384r5587O9382l9402o3744n2256M8579O5313O2774J8825r073k4743
2129C80604k5503j13162J04283L9637K2945L4830o8432r4120j35663L3305J50897
2118C29621Q6248Q5768j8560j09416r4953j20027N5992J44226R7702J02195m9338
2107E09458l0519j19915q2692O0843L3557J18273O923j22203j18339k6117l0535
$$ plain form
2188 717339 736665 610132 645308 612565 608278 656987 654108 654996 550840 470631 424704 510005
2176 510005 596566 706081 700425 623736 542563 470125 492044 566779 595124 535990 644742
2165 644742 566104 507113 455019 392567 371020 425899 469656 454301 459409 424308 354276 401683
2153 401683 407561 491763 537056 514500 500190 453684 416876 397963 313577 366682 309108 327152
2141 327152 400536 304949 374331 334929 271185 218929 267508 332821 395595 414420 405347 380604
2129 380604 355101 241939 346222 385859 408804 443634 375202 281082 145419 178724 329621
2118 329621 415869 501637 483077 373661 278708 158681 214673 358899 456601 558796 509458
2107 509458 478939 359024 276332 337175 370732 489005 495928 373725 255386 229269 198734
2096A98734R6037J85795K9365l4554n5076r8029j1486R5136P1701O5931k3342
2085E20212K5377j73010o160J4343n5838O1688K9459q429m2539j3955q2445k6233
2073B42470K3227M8121J9980L9872m4578M2650j0177M1033j8880K3139r744n9525
2061C37588L0476j1485p5647K4520J1279N316Q4012j5442P7281m0134M2169j0004
2049D59929j545J76974P9275K6451P1208q0697j3197o7135j19544q3992R485K8546
2037D85758M8858r747o2589j15469j1569r7495O5080J31145J6802q865k3046p0630
2025C48233n6848J7604J32240J0405j633m4276n7231m5611o5265J0117Q4753J51442
2013D83930l4835j8429l3814j18309r3344J44839K9277J48692l4323m6240j26806
$$ plain form
2096 198734 294771 480566 509931 475377 420301 322272 310786 405922 477623 543554 520212
2085 520212 545589 372579 366419 380762 324924 386612 416071 407642 365103 351148 268703 242470
2073 242470 265697 313818 333798 373670 329092 371742 361565 402598 383718 406857 397113 337588
2061 337588 368064 356579 280932 305452 316731 322047 406059 390617 467898 427764 469933 459929
2049 459929 458384 635358 714633 741084 812292 731595 718398 651263 531719 447727 457212 485758
2037 485758 534616 524869 462280 346811 335242 237747 302827 433972 450774 441909 418863 348233
2025 348233 291385 308989 441229 451634 450001 405725 348494 302883 237618 247735 332488 483930
2013 483930 449095 430666 396852 278543 185199 330038 359315 508007 473684 427444 300638
2002C00638r2047l4707M9857J47422Q0951m7814p9984j2415n0489k7187O9775
1991C04000M3150n4604L0257l5398J1661J336n33M1382l7865J2660l1757k8371
1979B55918j22547r512L6108M6474K7446O4011n4038K035R099m3521K735P3876
1967B88084J24249m8818n6756N4623j14196o1403N268J1123L958J10799J21126
1956D38057j4496j9429p7498k5049p0584N2988m9648P5980M2513k483p0713r2825
1944A86813n4780O4383M5604M7261R5924k3790j56341o9547J7875Q7367Q6980
1933C27749N4761j0091j22003k1158l4014q574J67390k1281K4925M274p5236r63
1921B85779m9004L8744J1174O5883p30p7566j06237r416l9609J42217M9635J6815
$$ plain form
2002 300638 208591 173884 223741 371163 452114 404300 324316 311901 261412 234225 304000
1991 304000 347150 292546 322803 287405 299066 300402 299869 341251 303386 316046 284289 255918
1979 255918 133371 123859 159967 206441 233887 297898 243860 245895 254994 211473 214208 288084
1967 288084 412333 363515 306759 361382 247186 185783 191051 202174 206132 316931 438057
1956 438057 423561 404132 326634 301585 231001 283989 234341 310321 352834 350351 279638 186813
1944 186813 132033 196416 242020 289281 385205 361415 205074 135527 153402 240769 327749
1933 327749 382510 372419 250416 229258 195244 186670 354060 332779 357704 361978 286742 285779
1921 285779 236775 275519 286693 352576 351846 274280 168043 158627 119018 261235 310870 327685
1909C27685l7325l0882N467p8907L8624k8295J04286K3111j0988p1804K4233o9137
1897A96068M6772L8528k7786n650K8757n8280j6320L8752m4614L8020L8592L1728
1885C04567n2046o191l6152K8813n3624j3137p4233L4922Q8137J1735l0442P851
1873B10200m796M6514k3698J6534J8235N5348L1849k8347K3074p6058l1380N2429
1861B89904N6144j9000J8116m9381n9838k4093J8091j6735P0165M033j8948m0908
1849B27550l6519L4798o926L4628N1330P3067j8831l460j56669q6769M4542K7299
1837A84040R5850P8269j19010k4381l2993j02150P8765J11598J3770J0033m290
1826B89501p9547j2250j7946o554J0518Q0803K8350k6592k5144m2961J3367K6018
$$ plain form
1909 327685 290360 259478 264945 186038 224662 196367 300653 323764 312776 240972 265205 196068
1897 196068 242840 281368 253582 247932 276689 218409 202089 240841 196227 234247 272839 304567
1885 304567 252521 246330 210178 238991 185367 172230 97997 132919 221056 232791 202349 210200
1873 210200 205404 251918 228220 244754 262989 318337 350186 321839 344913 268855 237475 289904
1861 289904 346048 327048 345164 295783 235945 211852 229943 213208 283373 287406 268458 227550
1849 227550 191031 225829 218903 253531 304861 377928 359097 355637 198968 112199 156741 184040
1837 184040 279890 358159 239149 214768 181775 79625 158390 269988 283758 293791 289501
1826 289501 209954 197704 179758 173204 183722 264525 292875 266283 241139 198178 211545 237563
1814B37563r6732O3869p2640n3647L4207O1752J1830J12375J5613l7447J0227
1803B86970n0377q3490l2310P3465M37K1877J2863K1411j74132J903O6909l0782
1791A14744K4754J15493R400l9831j7480l953k5894m499l7327M1523L8375o4048
1779A51257L528M6446Q3018L5335M0487l0348j45252L4478J1692j8864J36459
1768C48236k6856P2521L838o9862j54560L763N6427J9278O279k3544j5512p6623
1756A43385K7226N4974M9928N2623j24725l4577L4801j3240P4517K1632m028k7231
1744B55285p9465j0473J1878r20K5265J12563P2379k2282r2539n9610M4612l7791
1732B18902J7853L8008m4526m1261k5049p108L8920K1279N3159r181j8621n2025
$$ plain form
1814 237563 140831 204700 132060 78413 112620 174372 186202 298577 314190 276743 286970
1803 286970 236593 153103 120793 194258 194695 216572 229435 250846 76714 78617 145526 114744
1791 114744 139498 254991 264391 224560 207080 203127 177233 172734 135407 176930 215305 151257
1779 151257 154785 201231 284249 319584 360071 329723 184471 218949 230641 211777 348236
1768 348236 321380 393901 397739 327877 173317 177080 233507 252785 259064 235520 220008 143385
1756 143385 170611 225585 275513 328136 203411 168834 203635 190395 264912 286544 282516 255285
1744 255285 175820 165347 177225 176305 201570 314133 386512 364230 271691 212081 256693 218902
1732 218902 236755 274763 230237 188976 163927 156819 195739 217018 270177 260996 242375 190350
1720A90350j53842J2623K1202Q9039J07517n3309p8364q4573q244J26641R6670
1709B65710J20023k4176j53293j7428r4605K2415N5886M8224J4402m8091r8991
1698I0076p466O9293Q964Q5450M5381l7743o2601p1605N3979m4874Q651J01409
1686B38914N6821l9217K6751j17578k5304L6171L6656R9193j2161m3746r6140
1675A60360k5908J5195O8571P2359j2176o2203j0246P8409o3341M2871P9986m8817
1663B95060q2765p3149l0383L3284p0324N1153M2319K3451n2105N629k4105o3656
1651E4409M4134J59164J1007R085k8697p5408l268J1816L1749P772O1903n8686
1639B24980m8741K9482N6113p7208O5482o7258K4713l2336p8022l402M371J15072
$$ plain form
1720 190350 36508 49131 70333 159372 266889 213580 135216 50643 42399 169040 265710
1709 265710 385733 361557 208264 190836 96231 118646 174532 222756 237158 189067 90076
1698 90076 82610 151903 160867 246317 291698 253955 191354 119749 173728 128854 137505 238914
1686 238914 295735 256518 283269 165691 140387 176558 213214 312407 300246 256500 160360
1675 160360 134452 149647 218218 290577 278401 216198 205952 284361 221020 263891 343877 295060
1663 295060 212295 139146 108763 142047 71723 122876 165195 188646 136541 142170 118065 54409
1651 54409 98543 257707 268714 277799 249102 173694 170426 182242 213991 221763 283666 224980
1639 224980 176239 205721 261834 184626 250108 182850 207563 175227 97205 93803 98174 213246
1627B13246J18465r328l7450j05450l768O03K5409j3213j3970K0377n0412J8522
1615A63031N6680J5113K3951q3215P0166J5918l7298l1535l5316N0152l0905o4409
1603A12333M6451j4853M7976M8410M2530j17j13081K322R33n2654n8105j0413
1591E1732P7340j0125M6409k5627l6295L5698R6819J5210P046l4689l9119j03713
1579H0686N0001K5512M7622P5101p4729R350r0334K4344j5200J1736j9986K4648
1567A48751O3607K6070j10716M718o9645j13669J65661M6097q1100J1355l1893
1556E9236N8588k8181J02171j110q9154K5961j1479l8461L6964J17410n5393l1632
1544A44920L2728j17657J8370O6514j9803M2771p8739j3744j1442o7923M5814
$$ plain form
1627 213246 331711 322383 284933 179483 175715 176318 201727 188514 174544 194921 144509 163031
1615 163031 219711 234824 258775 175560 245726 261644 224346 192811 157495 207647 176742 112333
1603 112333 158784 143931 191907 240317 282847 282730 169649 171971 172904 120250 62145 51732
1591 51732 129072 118947 165356 139729 103434 139132 235951 251161 258207 223518 184399 80686
1579 80686 130687 156199 203821 278922 204193 213543 123209 147553 132353 144089 124103 148751
1567 148751 212358 238428 127712 132430 62785 -50884 114777 160874 79774 91129 59236
1556 59236 117824 89643 191814 190704 101550 127511 116032 77571 114535 231945 176552 144920
1544 144920 177648 59991 78361 144875 125072 167843 89104 75360 63918 -4005 41809
1533D1809N9847O1135l1398K3121l131K5087l929P2727J17727m0730p8169o8208
1521A75888k6485N7832J3693m3594R0869l3383l6142j63968j10187J94076P9695
1510A98294J05941j0841l5904O029r9708r9672J11702J40658o869r8561j34201
1499G6868l008M4045N4670o146O5587m106p589j29408K2267L7955N5863Q3930
1487B90928n2962j8142j12047m5909j8366P1180k054P1331Q0213j39236n4574
1476G0362j5886O7226M9231J14368p0481j40971J40836j17332l9752M9718k2945
1465H4374k7621R1676j6663m3530j3489J03111K5199K165M8463j08692r0984j8485
1453C5524Q7287N3488N4292j8091n235J0221M8759R304m7218r6626m4009l4858
$$ plain form
1533 41809 101656 162791 131393 154514 151383 176470 172541 245268 362995 322265 244096 175888
1521 175888 149403 207235 220928 177334 268203 234820 198678 34710 -75477 118599 198294
1510 198294 304235 293394 257490 263519 163811 64139 175841 316499 309630 211069 76868
1499 76868 73860 117905 172575 166429 232016 227910 220321 90913 113180 151135 206998 290928
1487 290928 237966 219824 107777 61868 43502 114682 112628 183959 264172 124936 70362
1476 70362 54476 121702 170933 285301 214820 73849 214685 97353 57601 107319 84374
1465 84374 56753 148429 131766 88236 74747 177858 203057 205222 253685 144993 54009 35524
1453 35524 122811 176299 230591 212500 207265 217486 266245 275549 228331 131705 87696 52838
1441E2838j9045J3301p4853K39960N5883k0383o2131r5136l9770l9807M2524J86944
1429B40325Q0574j02565j06617p0411L8637q2987J84506J00192k4119k3326q5543
1418A48666n4180N4355P1804m136R1335j6848r2043n5002j46829M5933J36610
1407A79665J37076J12700r3390j51115r8211k0809Q4994p480P0532k6478l4013
1396A53471o4318L4581k8366p6257O4945Q9237K3406l1703o3125N0472M2205N723
1384B00271M3330k3530r5204p7636Q307R114L5796J6835Q7942k5636O400m0971
1372A45018l7606K2292M0602l5245O3579N4775j52105N606L4895O5891r6811n682
1360A05209n8157L8663j2309j0714M2263M84L7594k9665L2809n0405Q271k8538
$$ plain form
1441 52838 33793 47094 -27759 212201 268084 247701 185570 90434 50664 10857 53381 240325
1429 240325 320899 218334 111717 41306 79943 -3044 181462 281654 257535 234209 148666
1418 148666 94486 148841 220645 216509 307844 290996 198953 143951 -2878 43055 179665
1407 179665 316741 429441 336051 184936 86725 65916 150910 143430 213962 187484 153471
1396 153471 89153 123734 95368 19111 84056 173293 196699 164996 101871 152343 194548 200271
1384 200271 243601 220071 124867 47231 55538 64652 100448 117283 205225 179589 185989 145018
1372 145018 107412 129704 170306 135061 198640 253415 101310 106916 141811 207702 110891 105209
1360 105209 47052 85715 73406 62692 104955 105439 143033 113368 146177 95772 104043 75505
1348G5505J53553j4399j6625o7640k6070j508J3077k5327N4969O8196J6392l0572
1336A99551k7750n2838p2386O6903M6023n6180j07938P3803M0754Q9445K1650
1325B21037J1995P1012j35351j44181L2490J490J2388M0056K6453j5172R437j0180
1313A21474q9588K4490J29133l1440L1769k7926o4949J513J2136j2768k5430L2405
1301A00819p1j16531k0940L8402J2033N6780J10022O4004j07292L3953m510j8588
1289A48081n636M3351K6659j863m2550r0865q160J16212L7807K6494p2071K5972
1277B03431m7909j34890N2065o5356R869K7761R2078O781n4950N4359k5292N247
1265A23194R353l2938n7959K9515O3912r5694P0169Q5655o7480M3159P398n3993
$$ plain form
1348 75505 229058 214659 198034 130394 104324 102816 115893 90566 145535 213731 230123 199551
1336 199551 171801 118963 46577 113480 159503 103323 -4615 69188 109942 199387 221037
1325 221037 233032 304044 168693 24512 57002 58492 70880 110936 137389 122217 131654 121474
1313 121474 31886 56376 185509 154069 185838 157912 92963 94476 106612 93844 68414 100819
1301 100819 100748 -15783 -36723 1679 13712 70492 180514 244518 137226 171179 166669 148081
1289 148081 142445 185796 212455 210592 168042 77177 69017 185229 223036 249530 177459 203431
1277 203431 155522 20632 72697 7341 17210 44971 137049 143830 88880 143239 117947 123194
1265 123194 132547 99609 41650 71165 135077 39383 109552 195207 127727 170886 178284 124291
1253A24291M4421J7600r0121L9733q6027L481R0091J7148n2241l3846P2389l4676
1241A12243n7644M6312j9488m4667R8961m4121k3612P437n6213p096J13820N7794
1229A83726Q3433M0697m5886r6691p2454q9673N2940K7159J37149L3893j77304
1218G6989O4670q0704n1406M3781j9106L9598R3853j8847m8622R562M2442j0785
1206A41425N7806R1974J2790j20619p0953l409L1609N6336L2935m8151n2378j15737
1194A3628q7953K5988J27039J37529O18l6967Q611l9837q9996N303R0761O896
1182A61620p1029M0369p2407p1790j2164J27629O6096R3932M914q0617p4763J06845
1170B18635l1561n4302P9080J2026K2629n9799j51159k1909P6437M0877M3979
$$ plain form
1253 124291 168712 186312 96191 135924 49897 53378 143469 160617 108376 74530 146919 112243
1241 112243 54599 100911 81423 36756 135717 91596 67984 75421 19208 12112 125932 183726
1229 183726 267159 307856 261970 165279 92825 3152 56092 83251 220400 254293 76989
1218 76989 141659 60955 9549 53330 34224 73822 167675 148828 100206 109768 152210 141425
1206 141425 199231 291205 303995 183376 112423 109014 140623 196959 229894 181743 129365 13628
1194 13628 -74325 -48337 78702 216231 216849 179882 188493 148656 58660 63963 154724 161620
1182 161620 90591 130960 58553 -13237 -25401 102228 168324 262256 267170 186553 111790 218635
1170 218635 187074 132772 211852 223878 246507 186708 35549 13640 90077 130954 174933
1159A74933K9111j6217r3040K998l2676K0253m7716Q2902N5779n1266o5467M5981
1147A05575k8895j5317l5076J78133m9274j16337R2480J1831q873j41414N0741
1136D3574M145O2677m9323k173O718n5836M8878L9181M9749K6224m0304j9634
1124A13876k2644j1092N7971q4854k0095R5213N0095p171o5815o2851j3051l7906
1112h324N2965K5850O7473N5619j03900l9175k8706M8348n426P3443Q1216K3365
1100B42748J4929j99874j62847N0623M6240J30510J16591P743l4960q7343p1518
1089E2842j1059O2045J69221j7176j00596k4665m4235j8269J03085r406K1949
1078A83736K0650n6265k7687J3197q4278P0937K6847M5321K1299j7864l1639o9668
$$ plain form
1159 174933 204044 187827 94787 97785 65109 85362 37646 120548 176327 125061 59594 105575
1147 105575 76680 61363 26287 204420 155146 38809 131289 143120 134247 -7167 43574
1136 43574 47719 110396 61073 58900 65618 9782 58660 97841 147590 173814 133510 113876
1124 113876 91232 80140 138111 53257 33162 128375 178470 171299 105484 42633 29582 -8324
1112 -8324 44641 70491 137964 193583 89683 50508 21802 70150 64724 138167 219383 242748
1100 242748 257677 57803 -105044 -54421 -8181 122329 238920 246663 211703 124360 52842
1089 52842 41783 103828 273049 255873 155277 130612 86377 68108 171193 161787 183736
1078 183736 204386 148121 120434 133631 49353 120290 147137 192458 213757 195893 164254 94586
1066I4586m256P7275L4000j378j7675j76449j8482J1462J08069J851k7772l9470
1054D1761j1284K4391k4119Q587P0721r061L0222J9049n2280l4458o1018M0217
1042D2728J11494L6959l5590j10397J06l8929O3548P0316m9964r8848K5654p4539
1030e7462j7511J43917Q3395o7000Q3590m2378n8652M4801k2022R3974M1301n4382
1018A71571j11100r4193J01930n549l6626J20542k2353L626J2697m3283m036J5412
1006A08638P1126l7180j29124j1862k430n74r802J26434J8011J8711o0799q5902
994E247M1106O110J675N2828K6446M5321o6592p7437N3211j893Q3687P0612j07511
981A32810o2620L710K1592P1427P184o4691j2246N456R306K0277n3872P6605P915
$$ plain form
1066 94586 90330 167605 201605 200227 182552 6103 -12379 -917 107152 109003 81231 41761
1054 41761 30477 54868 30749 39336 110057 100996 131218 150267 97987 63529 2511 42728
1042 42728 154222 191181 155591 45194 45300 6371 69919 140235 90271 -8577 17077 -57462
1030 -57462 -74973 68944 152339 85339 168929 126551 67899 112700 90678 184652 225953 171571
1018 171571 60471 -33722 68208 62659 26033 146575 124222 127848 140545 97262 93226 108638
1006 108638 179764 142584 13460 1598 -832 -1406 -11208 115226 133237 151948 91149 5247
994 5247 46353 52463 54138 106966 133412 178733 112141 34704 87915 86022 169709 240321 132810
981 132810 70190 73900 95492 166919 174103 109412 97166 102622 111928 132205 78333 154938 162853
968A62853n8512K05L0357n9841P268O3329j2420r4184n1600O3615m073P0514l3504
955H4007n2034k5936R0477m0180Q378J21558P2180J7937r983k24539K5179K6688
943I3732k9871J69221K0353k4913j19595m5974J7297k1379L5980k8046l2734O2268
931I6339j32934R273J75059P8735k1271p8205J7199j13837Q407O0148l4596P0469
919A34786l3152n5543r7886j4128O4149J18959P3364J596p7778m694k9906J0425
907I0192L0780K454l9492p6533J9905P743j9826M574P4470J32766m3542o4044
895A19447o6137j22695N7630P4548L0763M7991L1308j9277p3819M2472M1795j1662
883A52364Q6439L7365j29720j00796n34M3875j0863K1238m5321q8266K8292r577
$$ plain form
968 162853 104341 104546 134903 75062 82330 145659 133239 39055 -12545 51070 46997 117511 84007
955 84007 31973 6037 96514 56334 64712 186270 258450 276387 266404 41865 67044 93732
943 93732 63861 233082 253435 228522 108927 62953 80250 58871 94851 66805 34071 96339
931 96339 -36595 -27322 147737 226472 205201 126996 144195 30358 38765 98913 64317 134786
919 134786 101634 46091 -51795 -65923 -1774 117185 190549 192145 114367 109673 79767 90192
907 90192 120972 123426 83934 7401 27306 35049 15223 19797 94267 227033 183491 119447
895 119447 53310 -69385 -11755 62793 93556 141547 172855 153578 79759 122231 164026 152364
883 152364 238803 276168 146448 45652 45118 88993 78130 99368 54047 -34219 -5927 -15504
871a5504R1001L0278k8618l5579J2819p1358o510k1668P2162K0732L884L8186
859H9825l5263k1805J25418M5337o4601k2323r7283r3639P1609J48042L7560M7759
847B30636q3995n0891l8345p2379j673R4367J94725J0862m3875q1160j55337k5772
835b2837K1033j910O1742O7648M4630o898j6041k2082K6339R3841M7311l8928
823B53848j28842m2714m2170m881J21129M9112p991n0177j73046n7684m6373J71024
811D1235R4306l306m6756k4553j6391R148K4718N7488K2544L809p0621n4918n4075
798a7372k9860J5823Q1298N3398r784k5545j4526j6842R4617Q2490L525Q0939
786B98161l4239k7282k10917p4413k2303m8010J73179J94753j42839q9041o489
$$ plain form
871 -15504 75497 105775 77157 41578 54397 -16961 -23471 -45139 27023 47755 51639 89825
859 89825 54562 32757 158175 203512 138911 116588 19305 -74334 -2725 145317 182877 230636
847 230636 146641 95750 57405 -14974 -16647 77720 272445 283307 239432 158272 2935 -22837
835 -22837 -1804 -3714 58028 125676 170306 163408 147367 125285 151624 245465 292776 253848
823 253848 125006 82292 40122 35241 156370 205482 197491 147314 -25732 -83416 -129789 41235
811 41235 135541 132235 85479 60926 44535 53683 78401 135889 158433 162242 91621 36703 -17372
798 -17372 -47232 -31409 49889 103287 93503 67958 53432 36590 131207 213697 217222 298161
786 298161 263922 236640 25723 -48690 -70993 -119003 54176 248929 106090 17049 10560
775A0560J8832o3952l13K4482M8341J5031K0313o1757M6798j4093M5703J0451
763A00396K0941L2576k4775J6996q4534J1346Q398k5281K9010K9784m2339P5635
751A48153m7434J316L2078N1845P220J7380j8670j53588m3482O8221m5772O4341
739H1608l9549Q5678O504l9498L8534j09605n8196O3710J29045M3028P718m3456
727A65521o8819m8838p5364N9319Q3512J3632K3674O700j2587m9856q4350M5731
715E8275P5117l8907j01133M4282j2418j9212l4Q9261Q1822o845n3226j36177
703a9195r7267Q5778J85186k0734J1447m8727k1510n6904l4832O7328J16776k1143
691A46203k238K3845q6357K085L9315J7944N2631M7714l1266j73524j1364j3758
$$ plain form
775 10560 29392 -34560 -34873 -10391 37950 52981 73294 11537 58335 44242 89945 100396
763 100396 121337 153913 129138 146134 61600 72946 81344 56063 85073 114857 72518 148153
751 148153 100719 102035 134113 185958 193178 210558 191888 38300 -5182 63039 17267 81608
739 81608 42059 127737 134241 94743 133277 23672 -34524 29186 158231 201259 208977 165521
727 165521 96702 47864 -27500 31819 115331 128963 152637 159337 146750 96894 12544 58275
715 58275 133392 94485 -6648 37634 25216 6004 5970 95231 177053 170208 116982 -19195
703 -19195 -116462 -30684 154502 133768 145215 96488 74978 18074 -16758 50570 167346 146203
691 146203 143965 167810 81453 83538 122853 140797 193428 241142 209876 36352 24988 11230
679A1230j3976R9596K7943k4916o7428j25157Q343K4752N9591O4063Q3354O7281
667B14676j98272q920L231O4382n567L8189P85m1249l6621k8175r6376R3153N7985
654E7221m2154k0621q732R723j6747J37708j33994J5652l8359J5042o0451N6892
642b8820K5500P6536j4211J9152n9553l6927J9844n3445N9183m3524k287N9454
630B0902J8150O1342l8814M1623R4353m0340Q862p7052K0243k3926r131L4246
618A10458M0650o589o6699r1467k5004K3614J23056K9103m1987L1723l1380p6815
606A8663m3329N3333j1882L7056R9562k482O566j5021j29279l1573Q9516J2041
594H3171o559Q1929N04r9609l9292k7376l7784P9232J39020J659q4258m1110j4320
$$ plain form
679 11230 -2746 96850 124793 99877 32449 -92708 -84365 -59613 -22 64041 147395 214676
667 214676 16404 7484 10715 75097 69530 107719 108504 67255 30634 2459 -93917 -764 57221
654 57221 15067 -5554 -14286 -4563 -21310 116398 -17596 -1944 -40303 -25261 -85712 -28820
642 -28820 -3320 73216 59005 78157 18604 -18323 1521 -51924 7259 -36265 -38552 20902
630 20902 39052 100394 61580 103203 197556 157216 166078 89026 109269 85343 76212 110458
618 110458 151108 144519 77820 -13647 -38651 -15037 108019 137122 95135 126858 95478 18663
606 18663 -24666 28667 16785 53841 153403 150921 157487 142466 13187 -18386 71130 83171
594 83171 76612 158541 159045 59436 20144 -7232 -45016 34216 173236 174895 90637 49527 35207
581C5207k7928j0928J01426J23396o5050j03011j13060L4526M2310Q8870P3562
570A79320j7283N347m887n3793m410M0717l8409J8716q93m8323L8951o4329P673
557E8397k5671l9734M3090o2158J9456l4440k5808Q9403L9926o6608q3381J02158
545A4630K6807K4531K3400l5630N1363k0875l7382K9083k9840l9772j2870j6979
533b3534Q6016q3349L1257L0754n7882J05587k1869L1456j19898N2794k9953J04131
521A05510J1091m8210k9412j21142O4922M1748M7842J41m330J1795M0538r9484
509B1009N8326J4393p772K3036P8603L935r4967k3650p914M1622n424Q911r3145
496A6963L7268p5135o3952J206O1594J04272m0875L0769M5937n1455K903j5005
$$ plain form
581 35207 7279 -3649 97777 221173 156123 53112 -59948 -25422 16888 105758 179320
570 179320 162037 167384 162497 108704 104294 145011 106602 125318 124425 76102 115053 50724 58397
557 58397 32726 -7008 36082 -26076 -6620 -41060 -66868 22535 62461 -4147 -87528 14630
545 14630 41437 65968 89368 53738 105101 84226 46844 75927 46087 6315 -6555 -23534
533 -23534 62482 -20867 10390 41144 -16738 88849 66980 98436 -21462 31332 1379 105510
521 105510 116601 68391 38979 -82163 -17241 24507 72349 72490 68160 79955 120493 21009
509 21009 79335 93728 85956 108992 187595 191530 96563 72913 64999 106621 101197 110108 16963
496 16963 54231 -20904 -84856 -83650 -22056 82216 41341 72110 118047 66592 69495 54490
484E4490J1630M2654m2475P42m2746j0455m7712m3892L4826M3106P8935N5827
472A34930Q5950o6240r4366R0136j46925j1674P1819q301m4455N1116O1074r9279
460B3785m8451J31609p1478J8816o572o042j05371n8836J6479N007J62144K8961
448I0051j19019L9124n275L9446J00j5956J5709k4395N7186j8892J7200q0861
436e582m9772R1120N3125l9931m0021O5004N7974l1863j14113j3421J3683M7138
424C3341Q367N6416l769o0137r2424J4132M3785L2106N8716M6400j49652k8761
412d1480N2514N190Q8672j0609Q4389m0331l7379q2244p4173K5116M6061J9130
400C4856J14484n2357p1093r2317n5424J2173J26827J03304K898N0754o3392r3160
$$ plain form
484 54490 66120 108774 66299 67041 24295 13840 -33872 -77764 -42938 168 79103 134930
472 134930 220880 154640 60274 150410 3485 -8189 63630 55329 10874 61990 123064 23785
460 23785 -24666 106943 35465 54281 47709 41667 -63704 -122540 -106061 -101054 61090 90051
448 90051 -28968 10156 4881 44327 44427 28471 44180 19785 76971 58079 75279 -5582
436 -5582 -55354 35766 88891 48960 8939 73943 131917 100054 -14059 -27480 -13797 33341
424 33341 41708 98124 94355 34218 -58206 -44074 -289 31817 90533 136933 -12719 -41480
412 -41480 11034 16224 104896 94287 178676 138345 100966 18722 -55451 -30335 15726 34856
400 34856 149340 96983 25890 -66427 -121851 -109678 17149 120453 123351 174105 110713 17553
388A7553L392p6287K5671P1245O6267R807Q986K661j17764m9975O7380J6536Q0708
375A26180M4215n2440r2097o3539J2577O1052O6124K3975o0684l5076k6071j058
363C158k3247J9035o086O4780N7831q0623o5742o2241o9232Q7052J07821J14354
351A46860R195l7411j03332l9219K8374N1734k7093L4815J2954q2900m9770m8226
339a04019P5096R6490N0808l9070o1576p9659l8828M6137J33481p699J51436p3519
327A49078p4289j25983J199N0502N1480N1213J1870O168o9096j19604N4605m6906
315e9763j5566Q9405N9424j5688j22842M6934j7969N2147R0851O281p689K4079
303A29604j82564p5894O3940O8442m4921J9102n739r9218K6030P7136M4106Q8649
$$ plain form
388 17553 20945 -55342 -29671 41574 107841 117648 126634 129295 11531 -38444 28936 45472 126180
375 126180 170395 117955 25858 -37681 -25104 35948 102072 126047 65363 30287 4216 3158
363 3158 -20089 -1054 -7140 57640 115471 34848 -30894 -93135 -162367 -75315 32506 146860
351 146860 156055 118644 15312 -23907 4467 56201 29108 63923 76877 -6023 -55793 -104019
339 -104019 -28923 67567 118375 79305 17729 -61930 -100758 -54621 78860 71161 222597 149078
327 149078 74789 -51194 -49995 507 51987 103200 115070 121238 52142 -67462 -12857 -59763
315 -59763 -75329 14076 73500 57812 -65030 -18096 -36065 16082 106933 113214 105525 129604
303 129604 -52960 -128854 -64914 3528 -41393 -22291 -28030 -127248 -101218 -24082 20024 108673
291A08673N1454J0434j966r3601j8662m6053M2030Q0725M6105l3260n7208l9202
279D9469m4663Q013n0592P7258m6912n9517J15137J2338l3189j0358L8621o5410
267i805J3068l1686R731N8378j6470J1650k238P829n0143O4080K06J0540n5471
254I669l9368l8255L9184N874N5514M8896K2267o1652p0575K9481p5649O2535
242a2079Q9401L3754m3792k0122p6195o0395k4915k7851K3797J36975K8742j6043
230C1277j12461P9065L4200r273J30830p46o2315J0945m7946r9168K1127P131
218a7334l2035o712M0349o4803K8093M3010M182j6077Q2975J6470m3159k7543
206G416p1045j3142K2256p4405Q7477R0334q8539J5100o6412j2917J9399P7458
$$ plain form
291 108673 160127 170561 168595 74994 56332 10279 52309 133034 179139 145879 88671 49469
279 49469 4806 12819 -37773 39485 -7427 -66944 48193 60531 27342 16984 55605 -9805
267 -9805 3263 -28423 -18692 39686 23216 34866 32628 40457 -9686 54394 54600 65140 9669
254 9669 -29699 -67954 -28770 -22896 32618 81514 103781 42129 -28446 1035 -74614 -12079
242 -12079 77322 111076 67284 47162 -29033 -89428 -114343 -142194 -118397 18578 47320 31277
230 31277 -81184 -2119 32081 22808 153638 152892 90577 101522 53576 -45592 -24465 -17334
218 -17334 -49369 -56081 -15732 -80535 -52442 -9432 -5250 -21327 61648 78118 34959 7416
206 7416 -63629 -76771 -54515 -128920 -41443 48891 -39648 -24548 -90960 -103877 -84478 -7020
194g020k1979M5037p1993k4170j9052L085P4730K9275Q4088L829l7654r3391o136
181d1351K4883P1078K7705j18047l7943p234K2808o629k8138P9624Q4047L7132
169A07935j6510M417n7966n8374l270L9001j3150K6313M7489l8288o6659J7664
157a1398j1300n3560L2408O1252Q597k2419n3777o851J920L6845P6245P3837k588
144A29211j47769p3405k8230M9525m6498J2348L3828Q123j4492m0955k1770l9936
132a80020N4166j4066L1550N9527J678l4634j3719L7266Q7282l0417P2915k5659
120D5869l3344r8762m8012k3590L1287K5177L1115n0862k7095J8222k4605k3457
108a78057Q9952R7926o7515N1216l8188K0259k1206j9283k514k8513m6324p9439
$$ plain form
194 -7020 -28999 16038 -55955 -80125 -99177 -96092 -21362 7913 92001 95830 58176 -35215 -41351
181 -41351 -16468 54610 82315 -35732 -73675 -80909 -58101 -64730 -92868 -13244 70803 107935
169 107935 91425 95842 37876 -20498 -23768 15233 2083 28396 75885 37597 -29062 -11398
157 -11398 -22698 -76258 -43850 17402 25999 3580 -50197 -57048 -55128 -18283 57962 131799 129211
144 129211 -18558 -91963 -120193 -70668 -117166 -104818 -70990 -62867 -77359 -118314 -140084 -180020
132 -180020 -125854 -139920 -108370 -48843 -47165 -81799 -95518 -58252 29030 -1387 71528 45869
120 45869 12525 -86237 -134249 -157839 -126552 -101375 -70260 -121122 -148217 -129995 -154600 -178057
108 -178057 -88105 9821 -57694 -6478 -44666 -24407 -45613 -64896 -67410 -95923 -142247 -221686
96b21686l6067O9975j8141J23475L8218J8366m3027R215l1913j1683L215n5296
84a55349l2261J5470K0992J9957N7278k2496j2586o1394o201q948N2805O2678
72g0055k4540l0442K9690j9119O818K8692K4161l0482k3834J091L9176J6389n3155
59a05610Q802O895m0481l6515m6033L6534M6488L4933M4334m2219o4227k7966
47a85065n4726M5328K4220N1806O1331n1623r5683k425Q264K0058n471J9128k0036
34a84894K3647K6504m2914r0846O7507P7967O5089j2895q2260l5742k711m2764
22b34312L0326J9873j9067K8088n4544p9905q044M1231L2913O1311L7119O0227
10h4784r3811o5789k645K2068J8648P4077q27n4420o7815k331
$$ plain form
96 -221686 -257753 -187778 -205919 -82444 -44226 -25860 -68887 -59672 -91585 -103268 -100053 -155349
84 -155349 -187610 -172140 -151148 -131191 -73913 -96409 -108995 -170389 -176590 -185538 -132733 -70055
72 -70055 -94595 -125037 -95347 -114466 -107648 -78956 -54795 -85277 -109111 -108020 -68844 -52455 -105610
59 -105610 -96808 -89913 -130394 -166909 -212942 -176408 -129920 -94987 -50653 -92872 -157099 -185065
47 -185065 -239791 -194463 -170243 -118437 -57106 -108729 -204412 -206837 -198573 -178515 -183986 -164858 -184894
34 -184894 -161247 -134743 -177657 -268503 -200996 -123029 -57940 -70835 -153095 -188837 -191548 -234312
22 -234312 -203986 -184113 -203180 -175092 -229636 -309541 -317585 -276354 -243441 -182130 -145011 -84784
10 -84784 -178595 -244384 -247029 -224961 -206313 -132236 -133063 -187483 -255298 -257629
0b57629
$$ plain form
0 -257629
$$ Imaginary data points
##PAGE= N=2
##DATA TABLE= (X++(I..I)), XYDATA
16383a655205L2310r435N917q4100K6672J2521J09843L7251N40j3632m6345N3413
16371a530250P454L6858J09921j1383O3279J3037Q51j4702k0263M3226J6198M8084
16359a237690L8228K9005P3902n2849m4268N9069j0328J8669P5093N5395q207
16348a003981l7284q52L3801O4410j9134L8446O6635j1324q41M796o003R9169
16336g72162N8105L0066L5964k0580K54l4454p739P9573P7798N7508p685j1232
16324e14584k5019o8806K71N8894N3048R7011N2344M059l9162l4109l863O2400
16312c57516M7584L0648L442m25k3614J4989J4159J8736J2937Q1980N4719L3393
16300f8968K0791m475l2037L7323R588J5365j7868O382L7461m5492l0234j9259
$$ plain form
16383 -1655205 -1622895 -1632330 -1626413 -1710513 -1683841 -1671320 -1561477 -1524226 -1523686 -1537318 -1583663 -1530250
16371 -1530250 -1522796 -1485938 -1376017 -1387400 -1324121 -1311084 -1310233 -1324935 -1345198 -1301972 -1285774 -1237690
16359 -1237690 -1199462 -1170457 -1096555 -1149404 -1193672 -1134603 -1144931 -1126262 -1051169 -995774 -1003981
16348 -1003981 -1041265 -1042117 -1008316 -943906 -963040 -924594 -857959 -869283 -870124 -865328 -871331 -772162
16336 -772162 -714057 -683991 -648027 -668607 -668353 -702807 -710546 -630973 -553175 -495667 -503352 -514584
16324 -514584 -539603 -608409 -608138 -549244 -496196 -399185 -346841 -342782 -381944 -416053 -419916 -357516
16312 -357516 -309932 -279284 -275842 -276267 -299881 -284892 -270733 -251997 -239060 -157080 -102361 -68968
16300 -68968 -48177 -52652 -84689 -47366 -37778 -22413 -40281 -33899 3562 -41930 -72164 -91423
16288i1423N6072P9588J01280J9370l4580K58o5049j6148k0742O7714Q0136k5228
16276A51248O1294M694p3643k856O3183N7430O3590N443J9615n4499P712K5405
16264C28616j656J26885K9998p202M572l8318l1942J9361P4913K0744L3052n5518
16252E03505n4094J287j6626L4633J13055k1073O6590m7672m1722M2988j7268
16241E63603L5939J9525J2409J5671k3853K9508R5836J4667j1830o531J3658k9229
16229G29373k16K7045N0386O086m8267l4136m358k2902O0420q67R2740J00381
16217I55685r0528L3487K6495L562L3222j8692p4977J2930p309k2891M6377N2981
16205I50342J5122P150k8446l1088M2936l683m067L1564K36K7067L8566K3956
$$ plain form
16288 -91423 -35351 44237 145517 164887 130307 130565 65516 49368 28626 96340 176476 151248
16276 151248 212542 217236 143593 140737 203920 261350 324940 330383 349998 295499 303211 328616
16264 328616 326960 453845 483843 476641 481213 442895 410953 430314 505227 525971 559023 503505
16252 503505 449411 450698 434072 468705 581760 560687 627277 579605 537883 580871 563603
16241 563603 599542 619067 631476 647147 623294 652802 748638 763305 751475 744944 758602 729373
16229 729373 729157 756202 806588 812674 764407 730271 725913 703011 763431 762564 855304 955685
16217 955685 865157 898644 925139 928701 961923 943231 868254 881184 873875 850984 897361 950342
16205 950342 965464 972614 944168 913080 956016 952333 948266 979830 980066 1007133 1045699 1069655
16193A069655j05473R0611R0023k9330j1500J6863l3281k5899j0335M6885K888
16182A101107k1546k3644p0107M6205j2211L1730R8751l3657o4315K0724K1556
16171A094593O9722j8418j2058K5917j0921N2467l7862L0462k4428J6169p692
16160A177951j4148k9954j2518k2669O1110J81875K0644K360k6523l8392p1820
$$ plain form
16193 1069655 964182 1054793 1144816 1115486 1103986 1120849 1087568 1061669 1051334 1098219 1101107
16182 1101107 1079561 1055917 985810 1032015 1019804 1051534 1150285 1116628 1052313 1073037 1094593
16171 1094593 1164315 1145897 1133839 1159756 1148835 1201302 1163440 1193902 1169474 1185643 1177951
16160 1177951 1163803 1133849 1121331 1098662 1159772 1341647 1362291 1364651 1338128 1299736 1227916
$$ [...]
##END NTUPLES=NMR SPECTRUM
##END=
