##TITLE=1H_DE-80H_X3
 200.13MHz, d2o
 8 sc
 
 19ns.26.2.2025
##JCAMPDX= 6.0         $$ Bruker NMR JCAMP-DX V2.0
##DATA TYPE= NMR SPECTRUM
##DATA CLASS= NTUPLES
##ORIGIN= UXNMR, Bruker Analytische Messtechnik GmbH
##OWNER= pz
$$ XWIN-NMR		Version 3.5
$$ Mon Jun 15 12:25:59 2026 Russian Standard Time (UT+4h)  Yarkov@DPX200
##.OBSERVE FREQUENCY= 200.1313
##.OBSERVE NUCLEUS= ^1H
##.ACQUISITION MODE= SIMULTANEOUS
##.ACQUISITION SCHEME= undefined
##.AVERAGES= 8
##.DIGITISER RES= 18
##SPECTROMETER/DATA SYSTEM= spect
##.PULSE SEQUENCE= zg30
##.SOLVENT NAME= CDCl3
##.SHIFT REFERENCE= (INTERNAL, CDCl3, 0, 15.4329)
##AUDIT TRAIL= $$ (NUMBER, WHEN, WHO, WHERE, WHAT)
$$ ##TITLE= Audit trail, XWIN-NMR		Version 3.5
$$ ##JCAMPDX= 5.01
$$ ##ORIGIN= Bruker BioSpin GmbH
$$ ##OWNER= Yarkov
$$ C:/Bruker/XWIN-NMR/data/yarkov2/nmr/H-C/1/pdata/1/auditp.txt
$$ ##AUDIT TRAIL=  $$ (NUMBER, WHEN, WHO, WHERE, WHAT)
(   1,<2026-06-15 12:24:45.78 +0400>,<Yarkov>,<DPX200>,
      <created by zg, POWCHK disabled, PULCHK disabled
       configuration hash MD5:
       00 E9 B6 7A A2 85 ED C7 34 08 36 98 17 FE 4E 26
       data hash MD5: 16K
       7A 75 0E 4A D7 22 A5 AA 65 78 6B 2A 30 C0 BC 20>)
(   2,<2026-06-15 12:25:03.76 +0400>,<Yarkov>,<DPX200>,
      <Start of raw data processing
       efp BC_mod = 2 LB = 0.25 FT_mod = 6 PKNL = 1 PHC0 = -6900.219 PHC1 = 13.42196 SI = 16K 
       data hash MD5: 16K
       C9 AD 58 63 DA C4 66 18 A9 D9 82 23 E4 ED 9A F9>)
(   3,<2026-06-15 12:25:25.06 +0400>,<Yarkov>,<DPX200>,
      <abs ABSG = 5 
       data hash MD5: 16K
       3C 54 5B 43 80 91 90 F9 F8 31 6B 15 CA CD A8 D9>)
(   4,<2026-06-15 12:25:40.32 +0400>,<Yarkov>,<DPX200>,
      <pk PHC0 = 3.8 PHC1 = 0 
       data hash MD5: 16K
       3D B2 9B 76 41 C9 F5 06 BF 2B 5E 0C A2 3C EB CA>)
$$ ##END=
$$ 
$$ hash MD5
$$ 5A 2F 54 BA EA 41 71 7F 41 BF 96 86 33 90 FB B7
##$RELAX= 
##$RELAX= 
##$RELAX= 
##$RELAX= 
##$RELAX= 
##$RELAX= 
$$ Bruker specific parameters
$$ --------------------------
##$DU= <C:/Bruker/XWIN-NMR>
##$EXPNO= 1
##$NAME= <H-C>
##$PROCNO= 1
##$TYPE= <nmr>
##$USER= <yarkov2>
##$AMP= (0..31)
100 100 100 100 100 100 100 100 100 100 100 100 100 100 100 100 100 100 
100 100 100 100 100 100 100 100 100 100 100 100 100 100 
##$AQSEQ= 0
##$AQ_mod= 1
##$AUNM= <au_zg>
##$AUTOPOS= <>
##$BF1= 200.13
##$BF2= 200.13
##$BF3= 200.13
##$BF4= 200.13
##$BF5= 200.13
##$BF6= 200.13
##$BF7= 200.13
##$BF8= 200.13
##$BYTORDA= 1
##$CFDGTYP= 0
##$CFRGTYP= 5
##$CHEMSTR= <none>
##$CNST= (0..31)
1 1 145 1 1 1 1 1 1 1 1 1 1 1 1 1 1 1 1 1 1 1 1 1 1 1 1 1 1 1 1 1 
##$CPDPRG= <>
##$CPDPRG1= <>
##$CPDPRG2= <>
##$CPDPRG3= <>
##$CPDPRG4= <mlev>
##$CPDPRG5= <mlev>
##$CPDPRG6= <mlev>
##$CPDPRG7= <mlev>
##$CPDPRG8= <mlev>
##$CPDPRGB= <>
##$CPDPRGT= <>
##$D= (0..31)
0 0.7 0 0 0 0 0 0 0 0 0 0.03 0 0 0 0 0 0 0 0 0 0 0 0 0 0 0 0 0 0 0 0 
##$DATE= 1781511885
##$DBL= (0..7)
120 120 120 120 120 120 120 120 
##$DBP= (0..7)
150 150 150 150 150 150 150 150 
##$DBP07= 0
##$DBPNAM0= <>
##$DBPNAM1= <>
##$DBPNAM2= <>
$$ [...]
##$SUBNAM3= <"">
##$SUBNAM4= <"">
##$SUBNAM5= <"">
##$SUBNAM6= <"">
##$SUBNAM7= <"">
##$SUBNAM8= <"">
##$SUBNAM9= <"">
##$SW= 18.0517328524113
##$SWIBOX= (0..15)
0 0 2 0 0 0 0 0 0 0 0 0 0 0 0 0 
##$SW_h= 3612.71676300578
##$TD= 16384
##$TD0= 1
##$TE= 0
##$TE2= 300
##$TE3= 300
##$TEG= 300
##$TL= (0..7)
0 120 120 120 120 120 120 120 
##$TP= (0..7)
150 150 150 150 150 150 150 150 
##$TP07= 0
##$TPNAME0= <>
##$TPNAME1= <>
##$TPNAME2= <>
##$TPNAME3= <>
##$TPNAME4= <>
##$TPNAME5= <>
##$TPNAME6= <>
##$TPNAME7= <>
##$TPOAL= (0..7)
0.5 0.5 0.5 0.5 0.5 0.5 0.5 0.5 
##$TPOFFS= (0..7)
0 0 0 0 0 0 0 0 
##$TUNHIN= 0
##$TUNHOUT= 0
##$TUNXOUT= 0
##$USERA1= <user>
##$USERA2= <user>
##$USERA3= <user>
##$USERA4= <user>
##$USERA5= <user>
##$V9= 5
##$VALIST= <valist>
##$VCLIST= <CCCCCCCCCCCCCCC>
##$VD= 0
##$VDLIST= <DDDDDDDDDDDDDDD>
##$VPLIST= <PPPPPPPPPPPPPPP>
##$VTLIST= <TTTTTTTTTTTTTTT>
##$WBST= 1024
##$WBSW= 4
##$XGAIN= (0..3)
0 0 0 0 
##$XL= 0
##$YL= 0
##$YMAX_a= 183202
##$YMIN_a= -217849
##$ZGOPTNS= <>
##$ZL1= 120
##$ZL2= 120
##$ZL3= 120
##$ZL4= 120
##$ABSF1= 15.43288
##$ABSF2= -2.618969
##$ABSG= 5
##$ABSL= 3
##$ALPHA= 0
##$AQORDER= 0
##$ASSFAC= 0
##$ASSFACI= 0
##$ASSFACX= 0
##$ASSWID= 0
##$AUNMP= <proc_1d>
##$AZFE= 0.1
##$AZFW= 0.1
##$BCFW= 0
##$BC_mod= 2
##$BYTORDP= 0
##$COROFFS= 0
##$CY= -3
##$DATMOD= 1
##$DC= 0
##$DFILT= <>
##$DTYPP= 0
##$F1P= 0
##$F2P= 0
##$FCOR= 1
##$FTSIZE= 16384
##$FT_mod= 6
##$GAMMA= 0
##$GB= 0
##$INTBC= 1
##$INTSCL= 3.241238e-09
##$ISEN= 128
##$LB= 0.25
##$LEV0= 0
##$LPBIN= 0
##$MAXI= 10000
##$MC2= 0
##$MEAN= 0
##$ME_mod= 0
##$MI= 1.114404
##$NCOEF= 0
##$NC_proc= -8
##$NLEV= 6
##$NOISF1= 3.799351
##$NOISF2= 2.8
##$NSP= 0
##$NTH_PI= 0
##$NZP= 0
##$OFFSET= 15.43288
##$PC= 1
##$PHC0= -6896.419
##$PHC1= 13.42196
##$PH_mod= 1
##$PKNL= yes
##$PPARMOD= 0
##$PSCAL= 0
##$PSIGN= 0
##$REVERSE= no
##$SF= 200.130017777577
##$SI= 16384
##$SIGF1= 3
##$SIGF2= 2
##$SINO= 0.751879
##$SIOLD= 32768
##$SREGLST= <19F.Aceton>
##$SSB= 0
##$STSI= 16384
##$STSR= 0
##$SW_p= 3612.71676300578
##$SYMM= 0
##$S_DEV= 0
##$TDeff= 16384
##$TDoff= 0
##$TI= <>
##$TILT= no
##$TM1= 0
##$TM2= 0
##$TOPLEV= 0
##$USERP1= <user>
##$USERP2= <user>
##$USERP3= <user>
##$USERP4= <user>
##$USERP5= <user>
##$WDW= 1
##$XDIM= 16384
##$YMAX_p= 519861126
##$YMIN_p= -4985783
$$ End of Bruker specific parameters
$$ ---------------------------------
##NTUPLES= NMR SPECTRUM
##VAR_NAME=  FREQUENCY,     SPECTRUM/REAL,   SPECTRUM/IMAG
##SYMBOL=    X,             R,               I
##VAR_TYPE=  INDEPENDENT,   DEPENDENT,       DEPENDENT
##VAR_FORM=  AFFN,          ASDF,            ASDF
##VAR_DIM=   16384,         16384,           16384
##UNITS=     HZ,            ARBITRARY UNITS, ARBITRARY UNITS
##FACTOR=    0.220516191357247, 1,           1
##FIRST=     3088.58262913369, 0,            0
##LAST=      -524.134133872085, 0,           0
##MIN=       -524.134133872085, -4985783,    0
##MAX=       3088.58262913369, 519861126,    0
$$ Real data points
##PAGE= N=1
##DATA TABLE= (X++(R..R)), XYDATA
$$ [...]
7439e16076k1573R183K2221J02251j26238Q4557j14540J87720j5439j61194J82999
7428c66129k04005J38070k36162J89364j23702j32370K5915K7908K9627o8560
7418g20044l5497q9779J07459J10888P0343p5519l65665J50655O4691K66943p2271
7407e87796m883J80140j7099j60680j30492L9728J6276N6941k27762J17855L56121
7396c61651j89051J04633j75221J85199k22385k38186M10701k7034Q7383l56918
7386g82530j07711K27824j11896L1924N0322N6569k80698O6384J62364J6605l3519
7375g04362m4121L30994k78056N6537k68081O4218K08733j07346Q0585k9836L0448
7364f60287k0255k5087j10081k15924K8829k4662K81160j34559R3239m3890k3919
$$ y = [-516076, -537649, -528466, -506245, -403994, -530232, -445675, -560215, -372495, -387934, -549128, -366129, -570134, -432064, -668226, -478862, -602564, -734934, -709019, -681111, -651484, -720044, -755541, -845320, -737861, -626973, -556630, -632149, -997814, -847159, -782468, -515525, -587796, -592679, -412539, -429638, -590318, -720810, -681082, -664806, -607865, -835627, -717772, -361651, -550702, -446069, -621290, -436091, -658476, -896662, -485961, -512995, -425612, -782530, -890241, -662417, -774313, -742389, -692067, -635498, -916196, -849812, -687448, -670843, -704362, -748483, -417489, -695545, -639008, -907089, -842871, -634138, -741484, -660899, -690735, -660287, -680542, -705629, -815710, -1031634, -1002805, -1027467, -746307, -880866, -787627, -831517, -855436]
7353h55436J38135k34374J91765n2803Q422l4435j25104R7067j24272r2455J39034
7342i44456J29687j21147L15864j16251N205o3838L0555m0513j17841J15004k0412
7331h28143L00K6128j22842m129M1012j52867k65285O0072L48460L77922j15114
7320f34486k04182j31448O857K60779k68350P0255J89748p9444P2252N8814j14528
7309g73733r2037L9942l1953m9619j26740J10017J0650M2663q960k41270K85839
7298h35201q1471j59982l9408K732J07847K5157k4835L0210M0508l8787N1601
7287i21629R8896M0200J31104j42757J76934j07419j03538J04652j75654k35554
7277a134765O4484K26637q259j91146O780J53106J53760j23161j28j3898K43126
$$ y = [-855436, -717301, -951675, -759910, -812713, -804291, -838726, -963830, -866763, -991035, -1083490, -944456, -814769, -935916, -620052, -736303, -731098, -794936, -764381, -804894, -922735, -807731, -828143, -827843, -801715, -924557, -928686, -887674, -1040541, -1305826, -1245754, -897294, -519372, -634486, -838668, -970116, -963259, -702480, -970830, -900575, -710827, -790271, -718019, -659205, -773733, -865770, -825828, -857781, -907400, -1034140, -924123, -913473, -870810, -879770, -1121040, -835201, -916672, -1076654, -1116062, -1113330, -1005483, -980326, -1005161, -974951, -934443, -973230, -921629, -822733, -782533, -651429, -794186, -617252, -724671, -828209, -723557, -899211, -1134765, -1070281, -843644, -851903, -1043049, -1036269, -883163, -729403, -852564, -852692, -866590, -623464]
7266f23464j13819m2228J2584j48255J58690k21776L2033j2422J0353L36462p5153
7255f86995M2686o0323o5938j34786M293q2087j2758J65788o0450J21957l1810
7244h00423j20170l2861j22170J30935n3966J80242j91180k3045K49778K6354
7234g56506j22148M1234K23287j23491M8858n7256K43444j45682j64241J053m5592
7223h57040J26752l39937o2110M18873q0288J7387j55724K32240p6096P6098k16683
7212i16528m015J01661j56500j04237J06218J61252k54306k2312K44191k25366
7202a069942J95249O1545Q6031J0077k52106J32725K35329N1761j40762j00472
7192g90565J77583k01365q9711j3982O8566J5925p9479M2730R2969k9442j60296
$$ y = [-623464, -737283, -779511, -766927, -915182, -756492, -978268, -946235, -958657, -948304, -611842, -686995, -644309, -704632, -770570, -905356, -901063, -983150, -995908, -830120, -890570, -768613, -800423, -920593, -953454, -1075624, -944689, -998655, -818413, -1009593, -1032638, -782860, -756506, -878654, -837420, -614133, -737624, -688766, -746022, -502578, -648260, -812501, -811448, -857040, -730288, -1070225, -1132335, -713462, -793750, -776363, -932087, -699847, -775943, -699845, -916528, -920543, -818882, -975382, -1079619, -973401, -812149, -1066455, -1088767, -844576, -1069942, -874693, -813148, -727117, -717040, -969146, -836421, -601092, -549331, -690093, -790565, -612982, -814347, -904058, -918040, -849474, -833549, -913028, -870298, -777329, -806771, -967067]
7181i67067J15430J31069P7065k28532M7440J7568J00231J19204m5346j85455
7171h18393l9439j18921J88L20332J5830k05059K30051j0990K8545k63472P3787
7160g87541n9617m2662l8707J31395Q840J4577k51783L4353N5013l15349O4053
7149a187428M63188j39371o2078L22905P6803q0302k13748k29455Q9611K70050
7139f89825j4999k07390K46509K30746l67145o1800j37084K3023J35983n1719
7129h93701j3068K60305Q7157m08999o9113J66360L5214p6841m9640J54557M4159
7118g63610K42580k23027j38609L4361j46851J17714k7634P641N2632K74372P0407
7107e00024l23609L5684m1296j0019j53316O2871P9661J98714j02659k10095l7300
$$ y = [-967067, -851637, -720568, -643503, -872035, -824595, -807027, -706796, -587592, -632938, -818393, -857832, -976753, -976565, -656233, -640403, -845462, -615411, -626401, -597856, -861328, -787541, -847158, -889820, -928527, -797132, -788292, -773715, -1025498, -991145, -936132, -1251481, -1187428, -724240, -863611, -925689, -602784, -525981, -606283, -820031, -1049486, -959875, -689825, -704824, -912214, -665705, -434959, -802104, -863904, -1000988, -977965, -841982, -893701, -906769, -646464, -559307, -968306, -1037419, -871059, -835845, -912686, -962326, -807769, -763610, -521030, -744057, -882666, -848305, -995156, -877442, -905076, -897435, -844803, -570431, -500024, -823633, -787949, -829245, -839264, -992580, -929709, -850048, -651334, -753993, -964088, -1001388]
7096a001388q5891J36502l3698N0639J87169o2077K64454k92014K4215j41728
7086i53817M1516n5813O1438J66013j76988K32983J2415p7861k3373N8685O6969
7075f47833l6309J88258k20893J42868r4082r4563J95376r9461j94477q5069J76695
7064g69490J32917J9596k30625r7551P3186j12320m0701J17263J97073J08093
7054f02559m9187J55720k52700J23371J2730M9286j57741j73984n0781J96892
7044g48953P7572j15122j8688n5304J41231q1845j90362L26990j29514K44455
7034e49540j7306k20989r4219M5356m3213O439J68592r8564P5311K01492L4375
7023d92266k84839k9484Q9424N28J59479j07518N7986j65385o3895J75288j93245
$$ y = [-1001388, -1087279, -950777, -984475, -933836, -746667, -808744, -544290, -836304, -812089, -953817, -912301, -968114, -906676, -740663, -917651, -684668, -672253, -750114, -773487, -714802, -647833, -684142, -495884, -716777, -573909, -667991, -762554, -567178, -666639, -861116, -946185, -769490, -636573, -616977, -847602, -945153, -871967, -984287, -1024988, -907725, -710652, -602559, -651746, -496026, -748726, -625355, -612625, -563339, -721080, -895064, -945845, -748953, -671381, -786503, -805191, -860495, -719264, -801109, -991471, -664481, -793995, -549540, -566846, -787835, -882054, -836698, -879911, -873472, -704880, -803444, -728133, -526641, -492266, -777105, -806589, -717165, -716637, -557158, -664676, -606690, -772075, -835970, -660682, -853927]
7012h53927M6026j09499k27458L61165J70902j31652l3628O264J2538K21373k88921
7001h26817j12046O8707K02338L9280k23436O3519j03202J13000J82639k69961
6991h65979K1406J1764M1727J82538k79511P6879N6189K09771M9932r4481k54686
6980h44451J65265j30882O0613j04524j71535J41032n0071J68411J89203l63324
6970i40263M615L47159N7108k16925k66047M82L30545M0332o7569k68794q538
6959i87895R2349j00584J16742J28991p4778J25945O8276j47660k1924J8640o8661
6948h50559M6054n6157K25361o4870m1880j55634k7239L41223m57731k07566M12887
6937h36111J97843j34231l8317J99720J31385j01518k57347k23840K38042K02357
$$ y = [-853927, -807901, -917400, -1144858, -783693, -612791, -744443, -778071, -771807, -759269, -537896, -826817, -938863, -870156, -667818, -628538, -851974, -788455, -891657, -778657, -596018, -865979, -844573, -832809, -791082, -608544, -888055, -811176, -754987, -545216, -495284, -589765, -844451, -679186, -810068, -749455, -853979, -1025514, -884482, -934553, -766142, -576939, -940263, -935648, -588489, -531381, -748306, -1014353, -1013871, -683326, -642994, -710563, -979357, -987895, -895546, -996130, -879388, -750397, -825175, -699230, -630954, -778614, -800538, -781898, -850559, -804505, -860662, -635301, -700171, -742051, -897685, -924924, -583701, -1041432, -1248998, -836111, -638268, -772499, -810816, -611096, -479711, -581229, -838576, -1062416, -824374, -622017]
6927f22017k43089l20912K97402K19037J96484k09001l77408M1459J01149K77254
6917f39642K20389j10231j06714K0134l8256j33378j08886N8952M4721k00060
6907i92971L08584o0627r4882j74379J0978M04071L1058k18533M6514J01727J96717
6896d41743j44601k47829k0665K53208l7489n1884o8272J28523Q4921j53983Q2637
6885f17177j80662j07191K45404J75367P6688k28523r096N9992J58893j35654
6875e61959k60571k10218K00555L31591k5752J17866l68481N8916J16847r8068
6865f99274j28804k51493L64953K17799l3210j65646j53031N3854j35423o3935
6855i94210J31038K90911q1531J70269m756J48151L54l13786n299K10638n7182
$$ y = [-622017, -865106, -1186018, -888616, -669579, -473095, -682096, -1059504, -1018045, -916896, -639642, -419253, -529484, -636198, -616064, -654320, -787698, -896584, -837632, -792911, -992971, -684387, -745014, -839896, -1014275, -1003297, -599226, -568168, -786701, -740187, -638460, -441743, -586344, -834173, -854838, -601630, -639119, -691003, -759275, -630752, -545831, -699814, -617177, -797839, -905030, -659626, -484259, -407571, -636094, -645190, -585198, -426305, -561959, -822530, -1032748, -832193, -500602, -526354, -408488, -776969, -718053, -601206, -699274, -828078, -1079571, -714618, -496819, -530029, -695675, -848706, -794852, -930275, -994210, -863172, -572261, -653792, -483523, -488279, -340128, -339774, -653560, -658859, -448221, -505403]
6844e05403r3902j26445K49973k3122o1845k47294j08332O3006K51563N8786P246
6833e35769j13696P3274J52721n7401j53826j62618R7213Q5856j0721J21381j00553
6822f04139m2406O2489M4700l464j04419q5329J54615J74691K9264r9084p5410
6811e48492R2603P3352j52175j00808R563M4247J28744N1439O2611j50125j41031
6800f30072J6574m760R7148J48606j80833K2052J15396k1850o4964p6225m8605
6789f27533j6958J40668K15260k20823M09N5922j14756j52764N5749j22750K31256
6778e56320J1801N9262Q7643n073O776n8843k16573P9561Q081M3581o1128l570
6766f04802N8081m7104j00491K28524L1267o0979j30084p5928J71802P9199j5525
$$ y = [-505403, -599305, -725750, -475777, -498899, -560744, -808038, -916370, -853364, -601801, -543015, -535769, -649465, -576191, -423470, -480871, -634697, -797315, -700102, -614246, -624967, -503586, -604139, -646545, -584056, -539356, -542820, -647239, -732568, -577953, -403262, -373998, -473082, -548492, -455889, -382537, -534712, -635520, -625957, -581710, -452966, -401527, -338916, -489041, -630072, -613498, -618258, -521110, -372504, -553337, -531285, -415889, -437739, -502703, -578928, -627533, -644491, -503823, -288563, -509386, -508977, -453055, -567811, -720575, -664826, -787576, -556320, -544519, -485257, -397614, -402687, -395911, -454754, -671327, -591766, -583685, -540104, -601232, -604802, -546721, -593825, -694316, -465792, -434525, -495504, -625588, -701516, -529714, -450515, -466040]
6755d66040q8373j29404r747K02777m4653j96171r0516J4478K94432L3120l98756
6744h78853p9495K37196K64820k0910q6737n7853j1711p0025k3823J51672j31896
6733g07615J20015J78337m9538k11847q2182n4768m940J13367k03692J97445q8191
6722g93609m1093J21394R8209k3703j61669o0716K98973J1153o0012k81177O4291
6711h27959K63139J52854j61255j56394K20412M39662J08321l10699j92742J23310
6701c41351J91534l339k01024L4018J28352J47610O2584k14206j46743J43018
6691a99547m7550n9877L8276j53829N7089J0202o0724n558p6061Q3866J22970
6680b90743K45567q5588j23571p0874O8945M5145j86908k46513P1032K51790N9624
$$ y = [-466040, -554413, -683817, -693564, -490787, -535440, -731611, -822127, -807649, -513217, -480097, -878853, -958348, -721152, -456332, -477242, -563979, -621832, -633543, -703568, -727391, -575719, -707615, -587600, -409263, -458801, -670648, -752830, -807598, -812538, -699171, -902863, -705418, -793609, -834702, -713308, -615099, -638802, -800471, -861187, -562214, -551061, -611073, -892250, -827959, -564820, -411966, -573221, -729615, -509203, -69541, 38780, -271919, -464661, -341351, -149817, -153156, -354180, -320162, -191810, -44200, 18384, -195822, -342565, -199547, -247097, -306974, -268698, -422527, -365438, -355236, -415960, -421518, -497579, -413713, -290743, -45176, -130764, -254335, -325209, -256264, -211119, -398027, -644540, -573508, -321718, -262094]
6669b62094J16837r8104j44211N9037l9695n1986p4017o767K01803M2937J07731
6658a48529l35585m3546M2203M0725j3275n9515m3443K12239L02816j40470Q412
6647a77968k12424J54704J38586j66360j17874k47901J29547K35223p851r2170
6637c64488n2689j89977M7218r0660j09111K31213P2678O1959J2850k09360K5443
6626e64924J5800O2516o5474J48034J00222K07430P343M9922l12571k47368J22111
6615d76959K69602L01640k9351k30727O6214m8864J7934k09440j73052M9193l7846
6604e01656J72762P3149k6830k8609j61189j8040J91045k13139o3993K44690J36136
6593a95674J7417j00246r4371j4408p8194o7647m0451J67816J19623j0426j21058
$$ y = [-262094, -145257, -243361, -387572, -328535, -368230, -420216, -494233, -501000, -299197, -256260, -148529, -484114, -527660, -485457, -444732, -458007, -517522, -560965, -348726, -45910, -186380, -177968, -390392, -235688, -97102, -263462, -381336, -629237, -499690, -264467, -272318, -364488, -417177, -607154, -559936, -650596, -759707, -528494, -455816, -393857, -381007, -590367, -564924, -549124, -486608, -552082, -404048, -303826, -96396, -89053, -39131, -351702, -599070, -476959, -207357, 94283, 64932, -165795, -99581, -148445, -130511, -339951, -513003, -463810, -501656, -328894, -255745, -282575, -311184, -472373, -490413, -299368, -512507, -576500, -331810, -195674, -178257, -278503, -372874, -387282, -465476, -533123, -573574, -405758, -286135, -296561, -417619]
6582d17619J43941j16947J60472L066k27894j43982P8279J96951J89239k06829
6572c41323K5402N5753k0378j45285o3246K26952N8881l259J88897M1982r0863
6561f6487j3551k38563M7937K48462P0035R830q5310j96129o2702K25241j35597
6550a96834j10232Q2296K25338J37029J2785o3617j34252L48485M5126m52299
6540a06175K355j485J12987j87667l3686J29890J10905R2750o0554K55069J21708
6529D36097k3183j0580J39131k4003j65811J7482m396K8226k4036J46850O4420
6518E80197r3286Q3350J99722K73675m8011O7058L41806K70222j34379j21941
6508A418413M0006L15918K69094n0714o3936K07372j47247L8436l4285k8777j90902
$$ y = [-417619, -273678, -390625, -230153, -227087, -454981, -598963, -520684, -323733, -134494, -341323, -315921, -260168, -280546, -425831, -489077, -262125, -203244, -206503, -17606, 24376, -66487, -80038, -318601, -270664, -22202, 47833, 57663, -27647, -223776, -286478, -61237, -196834, -307066, -224770, 568, 137597, 150382, 86765, -47487, 300998, 346124, -106175, -103820, -105305, 7682, -179985, -213671, -83781, 27124, 119874, 59320, 314389, 436097, 412914, 402334, 541465, 517462, 351651, 369133, 364737, 392963, 368927, 515777, 580197, 486911, 570261, 769983, 1043658, 995647, 1062705, 1404511, 1674733, 1540354, 1418413, 1458419, 1774337, 2043431, 1992717, 1928781, 2136153, 1988906, 2027342, 1993057, 1964280, 1773378]
6497A773378N2132j45153j05441k09828j8004n6305O456k5926k89510k3979j52426
6486H05394k53337M9198j05957J3245m6936m1091R4330j22144j5405j37819K16355
6475D55833K69682k42458j68925K4855j04728j43651j52139N171l6746L3652K82167
6464B22713k8777j11515k1917m2851K16861P5026l03906r4059K25651J44679p2157
6453B09748k08213j8156o25n5917O7821K97028m1396j65917P1253J54675r2448
6442B17853q2299p7106N1625m5695q783j1042k1980j71345k9603K79639j6882
6431H4382k55445M9157J13769J72901j44537p9249K45689R0286j59327o8991J63501
6420B12136K32952J4008j48409J6738q8774j4354j46420N8370L52168k87678M3223
$$ y = [1773378, 1825510, 1680357, 1574916, 1365088, 1347084, 1290779, 1297235, 1271309, 981799, 957820, 805394, 552057, 601255, 495298, 508543, 461607, 420516, 514846, 392702, 377297, 239478, 455833, 725515, 483057, 314132, 338987, 234259, 90608, -61531, -56360, -93106, -59454, 222713, 193936, 82421, 60504, 17653, 234514, 309540, 5634, -88425, 137226, 281905, 209748, 1535, -16621, -17246, -73163, -5342, 291686, 250290, 84373, 155626, 310301, 217853, 135554, 58448, 110073, 64378, 55595, 44553, 22573, -148772, -178375, 101264, 84382, -171063, -121906, -8137, 164764, 20227, -59022, 186667, 276953, 117626, 48635, 212136, 445088, 459096, 310687, 327425, 238651, 224297, 77877, 136247, 488415, 200737, 243960]
6409B43960J87424R7568j10685k21563j3260J12812o5373k0429R009j8551K6465
6398B27377p5830j44154K692M2030J62664K04304j5102L0766J49331J07327l06806
6387C84599j34364j18928L37466N7705k44373J24569J86445P2029l09806j19706
6377B35636n1243N2448n857Q872K45006M3130j27039j67837m249J65056q5453
6366C08470k40581J00774J26227J94279N6059k68765k33082J75311l0624M6102
6356B34170j03790J19917J69088Q7377L2436k14259K5509M6988K1311R2408M8946
6345E60101Q1200J51589K2089P1052K55644k21086J18354K98835J01982J45611
6335A585371J17569K77740k04444k09903q4890j82263p5795k06331j16832J07230
$$ y = [243960, 431384, 528952, 418267, 196704, 183444, 296256, 230883, 210454, 219463, 200912, 227377, 151547, 7393, 10085, 52115, 214779, 419083, 403981, 434747, 584078, 691405, 384599, 250235, 131307, 468773, 526478, 282105, 406674, 593119, 665148, 355342, 235636, 184393, 236841, 230984, 239856, 484862, 527992, 400953, 233116, 228867, 393923, 308470, 67889, 168663, 294890, 489169, 545228, 276463, 43381, 218692, 188068, 234170, 130380, 250297, 419385, 506762, 539198, 324939, 350448, 397436, 418747, 511155, 560101, 641301, 792890, 814979, 886031, 1141675, 920589, 1038943, 1337778, 1439760, 1585371, 1702940, 1980680, 1776236, 1566333, 1481443, 1299180, 1223385, 1017054, 900222, 1007452]
6325A007452J69724k28335N6938M9720j91459K57735l1477n2121R3251K45424
6315A376852L02819K8939o748K26978K94772R9765J1506M393N06947M27409R7068
6304C370700K66467J57988M59157M573k52616j16919L25252l6609m50991k41724
6294C485278l642k31906l99455j76350j70097J88213k75021l87888J2727J63344
6284B205203M11601J9808r7924K08456M35763L86277J08385R0708P41616K55399
6274D765292l0832Q117j78232j4709j12879n47038m82562p8588k07324m42883
6264B678362l19146r158j27424l16670l06423l7757K97131k05150j54242K82650
6254A782173L77190o7118l01720j05485P2073J93408j61673k58514k41073L04601
$$ y = [1007452, 1177176, 948841, 1005779, 1055499, 864040, 1121775, 1090298, 1038177, 1131428, 1376852, 1679671, 1708610, 1701862, 1928840, 2223612, 2323377, 2334883, 2339276, 2846223, 3273632, 3370700, 3637167, 3795155, 4254312, 4258885, 4006269, 3889350, 4214602, 4177993, 3727002, 3485278, 3481636, 3249730, 2850275, 2673925, 2503828, 2692041, 2417020, 2029132, 2041859, 2205203, 2616804, 2636612, 2538688, 2747144, 3182907, 3569184, 3677569, 3768277, 4509893, 4765292, 4734460, 4742577, 4564345, 4549636, 4436757, 3889719, 3407157, 3328569, 3121245, 2678362, 2359216, 2350058, 2222634, 1905964, 1599541, 1561784, 1858915, 1653765, 1499523, 1782173, 2159363, 2092245, 1790525, 1685040, 1757113, 1950521, 1788848, 1530334, 1289261, 1593862]
6244A593862J10835k27963n1377J00677k6858j08370o3604J37539J09153o0349
6234A513545j59036K34283O4639J50773k41418L8354M37309N9121j95855j60006
6224A741709M88015M61183j71726k52189P6600M67409R5637k57701k16631J42744
6214B575050K78326L54342l59582l15401R0257R5809M8608l94318n2459l5420
6204B285212m8214J56064n5815O3341j16558j48015L10991K14374P7538j5306
6194B723612j94175K22795K05197j66422k45486k8792L40334J51747j62186p8261
6184B768363j13060p2315J32690k64035l00876o6073r5961n3541J33419j76446
6174A892165o3878k2023J59697K08752J73198O0181R926K52745K31889n28348
$$ y = [1593862, 1704697, 1476734, 1425357, 1526034, 1499176, 1390806, 1327202, 1464741, 1573894, 1513545, 1354509, 1588792, 1653431, 1804204, 1562786, 1601140, 2038449, 2097570, 1901715, 1741709, 2229724, 2690907, 2519181, 2266992, 2343592, 2811001, 2906638, 2648937, 2432306, 2575050, 2853376, 3207718, 2848136, 2532735, 2622992, 2718801, 2767409, 2373091, 2320632, 2285212, 2236998, 2393062, 2337247, 2400588, 2284030, 2136015, 2447006, 2661380, 2738918, 2723612, 2529437, 2752232, 2957429, 2791007, 2545521, 2516729, 2857063, 3008810, 2846624, 2768363, 2655303, 2582988, 2715678, 2451643, 2150767, 2084694, 1988733, 1935192, 2068611, 1892165, 1828287, 1806264, 1965961, 2174713, 2347911, 2408092, 2418018, 2670763, 2902652, 2374304]
6164B374304j96587K67752K84917L5327j03686j85162L64697K58228j96478j96428
6154B706884N03023N56340J05289K51239J74491M35964N47291K2266N82165R98209
6144F883161O19617N07561L96418J88625p2941l14861o52961m67368k04754l53
6134F882144n61194o94934m3471k15473J13985m30384l71973K69055J60700j55745
6124D952710j17071L41542N84590L01076M10380Q82871J114523J368898J291462
6115A1130981J059329Q53171L53019k69782p23457p03285p45224r97320q55687
6106I101745o50235k97434j6488q9347j83792J31564j19211j14957q8333k34735
6096G438777Q6974J47336j13415M03557O2303m257M48292L15149M68191M63264
$$ y = [2374304, 2177717, 2445469, 2730386, 2765713, 2662027, 2476865, 2841562, 3099790, 2903312, 2706884, 3209907, 3766247, 3871536, 4122775, 4297266, 4733230, 5280521, 5302787, 5884952, 6883161, 7502778, 8010339, 8406757, 8595382, 8522441, 8207580, 7554619, 7087251, 6882497, 6882144, 6320950, 5626016, 5582545, 5367072, 5481057, 5050673, 4678700, 4947755, 5108455, 4952710, 4835639, 5177181, 5761771, 6062847, 6473227, 7356098, 8470621, 9839519, 11130981, 12190310, 13043481, 13396500, 13126718, 12403261, 11699976, 10954752, 9957432, 9101745, 8451510, 8154076, 8137588, 8048241, 7864449, 7996013, 7876802, 7761845, 7673512, 7438777, 7525751, 7673087, 7559672, 7963229, 8025532, 8021275, 8469567, 8784716, 9252907, 9716171]
6086I716171N72924Q60977J041100J522433J627898J885454K709666L086939K445742
6077B5469304J793841O22574n1852j106880j738742j924152j826527j548021j483368
6068A8206177j414952q56896m94852m37567l79053j1377L01350L48904M33984
6059A5695718M08762P59419J297274J456670J824531K395861K659432L096337
6051B9594004K959617K531733K012112J067655R0969q78836j144387p62045l93498
6042C5077324k68391Q96477J809876K922230L753752L771066L632455K913298
6034E4508087K221662J600178R67036M52655k99814j318009k006750k251276k603891
6025E1269878k459273j876247p19340M58987R43805J293830J413525J350838P65862
$$ y = [9716171, 10289095, 11150072, 12191172, 13713605, 15341503, 17226957, 19936623, 23023562, 25469304, 27263145, 27885719, 27833867, 26726987, 24988245, 23064093, 21237566, 19689545, 18206177, 16791225, 15934329, 15439477, 15001910, 14622857, 14611480, 14912830, 15261734, 15695718, 16104480, 16863899, 18161173, 19617843, 21442374, 23838235, 26497667, 29594004, 32553621, 35085354, 37097466, 38165121, 38256090, 37377254, 36232867, 35470822, 35077324, 34808933, 35705410, 37515286, 40437516, 44191268, 47962334, 51594789, 54508087, 56729749, 58329927, 59296963, 59749618, 59449804, 58131795, 56125045, 53873769, 51269878, 48810605, 46934358, 46215018, 46674005, 47617810, 48911640, 50325165, 51676003, 52441865]
6016E2441865K74070L57766Q06238J741817L178969N371737P443883Q444122Q026529
6007H8086996O189880K817370q45336l952102o659944p215824o990112n842021
5999F5588907m507469k692811j113387l09764j84778j184814k502291l451468
5991D9642125m066703m322103m444424l895882l430246k869447l106450k310887
5983B1195983j468012j124375j107799j139127q95874m55951m59709n32538o68293
5974A3344305k03923l08970m79218m65018q0329J4314k17661l15498k55870J32251
5964A1164383M2549J73530O742J75038J24118K101J54891r620L0932M50329M12234
5953A2727227J54359L31331L34291K00943K10485J26865N78071P49852J059732
$$ y = [52441865, 52715935, 53073701, 53879939, 55621756, 58800725, 64172462, 71616345, 80060467, 88086996, 94276876, 97094246, 96248910, 92296808, 85636864, 78421040, 71430928, 65588907, 61081438, 58388627, 57275240, 56965476, 56780698, 55595884, 53093593, 49642125, 45575422, 41253319, 36808895, 32913013, 29482767, 26613320, 23506870, 21195983, 19727971, 18603596, 17495797, 16356670, 15460796, 15004845, 14545136, 14012598, 13344305, 13140382, 12831412, 12352194, 11887176, 11806847, 11821161, 11603500, 11288002, 11032132, 11164383, 11206932, 11380462, 11387204, 11562242, 11686360, 11688461, 11843352, 11833732, 11864664, 12314993, 12727227, 12881586, 13212917, 13547208, 13748151, 13958636, 14085501, 14663572, 15413424, 16473156]
5944A6473156J322309J551954J850926J371131J323223J316468R09392P82464
5936B6901023P36963J175203Q87165J204469J183017J280320J143473J76328o21762
5927C4066199j001960r42744j371127j166575n58452l00474r9598m65714J93326
5918B8352881K24693j22559l65089k17547q8801J9083K78324N48200O96676O89574
5908C0015435Q06127O12065K54157J95555K27278J94044k61285p20922k05228
5899C1117226m4571m43727l38717j94125K17776J87088j52036j36529J88082L59559
5889C0760026j31527k9684O69329L57409J19834L11989L06843l327n52879o77500
5879C1130513o96750q53360j296974j129734r49778p90008o88271l93056j87299
$$ y = [16473156, 17795465, 19347419, 21198345, 22569476, 23892699, 25209167, 26118559, 26901023, 27637986, 28813189, 29700354, 30904823, 32087840, 33368160, 34511633, 34687961, 34066199, 33064239, 32121495, 30750368, 29583793, 29025341, 28724867, 28625269, 28159555, 28352881, 28577574, 28455015, 28089926, 27872379, 27783578, 27802661, 28080985, 28629185, 29325861, 30015435, 30821562, 31433627, 31687784, 31883339, 32110617, 32304661, 32043376, 31322454, 31117226, 31072655, 30628928, 30290211, 30096086, 30313862, 30500950, 30348914, 30212385, 30400467, 30760026, 30628499, 30598815, 31268144, 31625553, 31745387, 32057376, 32364219, 32360892, 31808013, 31130513, 30433763, 29580403, 28283429, 27153695, 26203917, 25413909, 24725638, 24332582, 24145283]
5870B4145283k56680n9251J89624L07319J76940m06788j76455j20576m63081q02519
5860B2533816p66252n63448n21252m80482n15430o04153r95554r29271q14857
5851A6343117p54543r16323j336151p56471o32310n40186o32650j57326K37402
5842A0854559P1617l71246k54811R3618m4497r6684j58539k74819j30143k33761
5832I455294n30484o55799l86694m88535n15819k72338n61098m62493k29146j05798
5822E247090l39997q3980j58331k14558k76491q9458J76360p7553j7388l33328
5812C832366k28406J43758k86374k13225j53345J7326K8183L8368M2703r6943
5802C124411K77556j20909j58948K4838k8545n3908j20463J24920k64797J43340
$$ y = [24145283, 23888603, 23829352, 24018976, 24326295, 24503235, 24096447, 23919992, 23799416, 23336335, 22533816, 21767564, 21204116, 20682864, 20202382, 19686952, 19082799, 18087245, 17157974, 16343117, 15588574, 14672251, 13336100, 12579629, 11947319, 11407133, 10774483, 10617157, 10854559, 10926176, 10554930, 10300119, 10393737, 10349240, 10252556, 10094017, 9819198, 9689055, 9455294, 8924810, 8269011, 7882317, 7393782, 6877963, 6605625, 6044527, 5582034, 5352888, 5247090, 4907093, 4823113, 4664782, 4450224, 4173733, 4084275, 4260635, 4183082, 4165694, 3832366, 3603960, 3747718, 3461344, 3248119, 3094774, 3112100, 3140283, 3178651, 3221354, 3124411, 3401967, 3281058, 3122110, 3146948, 3118403, 3064495, 2944032, 3068952, 2804155, 2947495]
5792B947495o2240j05350q4736P463J32953M6021k5485k1899P0956R3250k50714
5781B747714k40301M0292P3921m0237K54655r0443l00260m3024K1554j95075j60779
5770B068017J37342p000J06117J78277j6657J38817Q6076K45149j32191k54644
5760B549303l4801j9625M0154j74886O9946k4815k83292j74081J28234J2383m0248
5749B048272Q9061l2198J02900J23065j14582k72702L3202K45454j60688j18148
5739A943636l12843O4847K53910J07873N599k33766q7354J69493J96504K12205
5729B320104j68442K3842p2187L6552o2851l2220j34750K62020R9169r119n7296
5718B204822k258k380J8064j0497k2525j99161M7855K64179K76354l55028l79736
$$ y = [2947495, 2885255, 2779905, 2695169, 2702632, 2835585, 2881606, 2856121, 2834222, 2905178, 2998428, 2747714, 2507413, 2547705, 2621626, 2581389, 2836044, 2745601, 2445341, 2402317, 2423871, 2228796, 2068017, 2205359, 2198359, 2304476, 2482753, 2466096, 2604913, 2690989, 2936138, 2803947, 2549303, 2514502, 2494877, 2535031, 2360145, 2430091, 2405276, 2121984, 1947903, 2076137, 2088520, 2048272, 2137333, 2105135, 2208035, 2331100, 2216518, 1943816, 1977018, 2222472, 2061784, 1943636, 1630793, 1695640, 1949550, 2057423, 2063022, 1829256, 1741902, 1911395, 2107899, 2320104, 2151662, 2175504, 2103317, 2139869, 2077018, 2044798, 1910048, 2172068, 2271237, 2262118, 2204822, 2202564, 2200184, 2218248, 2207751, 2185226, 1986065, 2033920, 2298099, 2574453, 2219425, 1839689]
5707A839689R3517K03686k595j51272q0526R810J10082M0006J54993k45782o0885
5696A910723J64220K15213M6426k53822L400L23822K54466j66299m72519j51302
5686A874328J45985Q8406j9615m6120o9110K22310K65248K1262l48960k51116
5676A882618J29160K02724r4850j09819k8806J45438L9169j75480j33248J08103
5666A965009p1833K4274N9691P2982m5610n1549Q0209k1137K01368j00297k43600
5655A869507J17925K02585l3008k31394Q6863J58347Q2794j23068j21468j55589
5645A853494J09474K74598O861j69179j13741n9305K63342k03184j15659J29453
5635A976154J37423L0341O5737J09233j56836m139M7800k3733R8257j27475n8691
$$ y = [1839689, 1933206, 2136892, 2134297, 1983025, 1902499, 1912309, 2022391, 2062397, 2217390, 1971608, 1910723, 2074943, 2290156, 2336582, 2082760, 2086160, 2409982, 2664448, 2498149, 2025630, 1874328, 2020313, 2108719, 2089104, 2042984, 1973874, 2196184, 2461432, 2482694, 2133734, 1882618, 2011778, 2214502, 2119652, 2009833, 1981027, 2126465, 2165634, 1990154, 1856906, 1965009, 1893176, 1917450, 1977141, 2050123, 2004513, 1952964, 2033173, 2012036, 2213404, 2113107, 1869507, 1987432, 2190017, 2157009, 1925615, 2012478, 2170825, 2253619, 2130551, 2009083, 1853494, 1962968, 2237566, 2244427, 2075248, 1961507, 1902202, 2165544, 1962360, 1846701, 1976154, 2113577, 2143918, 2209655, 2318888, 2162052, 2157913, 2205713, 2181980, 2280237, 2152762, 2094071]
5624B094071J84938J89077k39855q8577j818K7645j39097K0136J75434q6869J0028
5613B145113o1002M6933J42034r4314l11656J42985K06615j74710J84176j0598
5603B215576p2716J50143j90196j10771P3197J10004r4670l6410J18399n6547
5593B106009J4967J12312j08054q3880Q5475l989o4958O7838m2844J74251K14475
5582B471602O2293o15197K00820J67753l41406O5018J8218N9177J06447p410m123
5571B183192R9460P6060j10476m4385M4561J17668J12111K61504r3712j70210
5561B475773j19883k74825J80966K01945n7432q3520p0059P4550j27617k2446
5551B177452j7608Q5652L751J26476n471o1081M6024j59902j9904J19774j13707
$$ y = [2094071, 2279009, 2468086, 2228231, 2139654, 2137836, 2165481, 2026384, 2046520, 2221954, 2135085, 2145113, 2084111, 2131044, 2273078, 2178764, 1867108, 2010093, 2216708, 2041998, 2226174, 2215576, 2142860, 2293003, 2102807, 1992036, 2065233, 2175237, 2080567, 2044157, 2162556, 2106009, 2120976, 2233288, 2125234, 2041354, 2126829, 2122840, 2057882, 2125720, 2082876, 2257127, 2471602, 2533895, 1918698, 2119518, 2287271, 1945865, 2010883, 2029101, 2088278, 2194725, 2187315, 2183192, 2282652, 2358712, 2248236, 2203851, 2248412, 2366080, 2478191, 2739695, 2645983, 2475773, 2355890, 2081065, 2262031, 2463976, 2406544, 2323024, 2252965, 2327515, 2199898, 2177452, 2159844, 2245496, 2249247, 2375723, 2370252, 2309171, 2355195, 2195293, 2175389, 2295163, 2181456]
5540B181456j23546J15987P1721L7212J43568k50843M0042k426n5758m3389J05654
5529B219678J05084p1754K87685n5929j83393q1404N5719N8254k06851O0128J97987
5518B385204K78002J27531k76262N6625N3028J4850k7066J86501j6710j41219
5508B640484L118K2304N390K2931r7648k6291N3620K75077K93009N51374J36606
5497C879974N9417M0625J10101j77902j28028R5176K95973J87246n801j34470
5487D222311K31120J64861m85894p3973J78909j6259K41108N1756P6625n6445
5477D534119p4522n0413n8167j17344j59303J92471M18746M5481m44378R4418
5467D381108J37778l56756j75364r2989j65711M612k84109j02742J49875K79839
$$ y = [2181456, 2057910, 2173897, 2245618, 2282830, 2426398, 2175555, 2215597, 2213171, 2157413, 2114024, 2219678, 2324762, 2253008, 2540693, 2484764, 2301371, 2219967, 2275686, 2333940, 2127089, 2187217, 2385204, 2663206, 2790737, 2514475, 2571100, 2624128, 2638978, 2611912, 2798413, 2781703, 2640484, 2643602, 2665906, 2671296, 2694227, 2596579, 2570288, 2623908, 2898985, 3191994, 3743368, 3879974, 3939391, 3980016, 4090117, 3912215, 3784187, 3879363, 4175336, 4362582, 4356781, 4222311, 4453431, 4618292, 4132398, 4058425, 4237334, 4221075, 4462183, 4513939, 4590564, 4534119, 4459597, 4409184, 4351017, 4233673, 4074370, 4266841, 4685587, 4731068, 4286690, 4381108, 4518886, 4162130, 3986766, 3893777, 3728066, 3732678, 3448569, 3345827, 3495702, 3775541]
5457C775541l16569N5009L87106P6928J01680J60287K60893J39072O0092l99193
5447D300846Q619L32894k11820P0730K86224k0880M0683L70514r3501l70184n8451
5436D655674K13181L5629j49336Q5314P0305K45098J62333n95220J67005J95611
5426E085594n3922j30815J66626J51742k45436j51837k11359j52613q2232m50238
5416C925510j89582J36522r1772l78833K42355R8590p4391k71215n8155j65286
5406C173743J17031K50824k09711J37333N0508R6249J22360j1629p3353n0435
5396C602920J76907q9396k12595j22391m2068j9566p7238J37804M2015J12510
5386C508902j76321L6969L99754J9544m77135L9515L04516p8704l10416j59454
$$ y = [3775541, 3458972, 3513981, 3901087, 3978015, 4079695, 4239982, 4500875, 4639947, 4700039, 4300846, 4309465, 4642359, 4430539, 4501269, 4787493, 4766613, 4807296, 5177810, 5084309, 4714125, 4655674, 4868855, 4904484, 4755148, 4840462, 4910767, 5155865, 5318198, 4722978, 4889983, 5085594, 5031672, 4900857, 5067483, 5219225, 4973789, 4821952, 4610593, 4457980, 4375748, 3925510, 3735928, 3872450, 3780678, 3401845, 3644200, 3742790, 3668399, 3397184, 3339029, 3173743, 3290774, 3541598, 3331887, 3469220, 3519728, 3615977, 3738337, 3726708, 3653355, 3602920, 3779827, 3690431, 3477836, 3355445, 3313377, 3293811, 3216573, 3354377, 3396392, 3508902, 3332581, 3369550, 3769304, 3788848, 3311713, 3351228, 3655744, 3577040, 3266624, 3107170]
5376C107170J51546L92130p2036j41994m2586L00345j60633j65574l639Q3920
5366C448649N8318J28517K8563j07331M5668R6809Q0163R1791j5677L2231j24968
5355C762733J6945k34708L5912J39722k81016J384K40744K7125k96216j14282
5345C298343L86653K60567k1614m47401J2750J97235J674j94799j69510K31946
5335C555844k834K7655j56427J9269J78254R4792l6980N7172K04975k58667n837
5324C677216l5760p4980n9295m9374o8836J95150K50452l9704j398M1029P042
5313C841542o0625p8636j76069P8283K80599j71934m61619K30681M54894J9409
5303C956525l73925j70224k3243M48617j71310k81587R6495K38900J11316j63147
$$ y = [3107170, 3258716, 3650846, 3578810, 3436816, 3394230, 3694575, 3533942, 3368368, 3364729, 3448649, 3506967, 3635484, 3664047, 3556716, 3602384, 3699193, 3779356, 3871147, 3855470, 3887701, 3762733, 3779678, 3544970, 3580882, 3720604, 3439588, 3440972, 3681716, 3708841, 3412625, 3298343, 3684996, 3945563, 3923949, 3476548, 3489298, 3686533, 3688207, 3493408, 3323898, 3555844, 3553010, 3580665, 3424238, 3443507, 3621761, 3716553, 3679573, 3736745, 3941720, 3683053, 3677216, 3641456, 3566476, 3507181, 3457807, 3388971, 3584121, 3834573, 3794869, 3793471, 3834500, 3841542, 3780917, 3702281, 3526212, 3604495, 3885094, 3713160, 3251541, 3482222, 3937116, 3956525, 3582600, 3412376, 3389133, 3837750, 3666440, 3384853, 3481348, 3720248, 3831564, 3668417]
5293C668417k9779J35144J51699J87321m02700M7991P1484M8301k09015K9235
5283C698098m131O6426J4039p297N0888J95481m1111m16828K05762L75476r4658
5272D042145k88096k37999J82573K95432q2179n98561j39222M24388J54797J42380
5262C895658j91069Q4451K22771K68328j87562j14017J5321j69935N5823p2046
5252C807723j07251j08291J16257J84993j33834k652j33390K17605L48965j30904
5242D059221r7113k17100K19077R9945K4340L2307j86523K2529P0949J39018j86370
5231C980280r025p996L95221L2237k08125k6551J62438K65314J38894K55163J17558
5220E095408J03366K65244K46868J52617J92108p8155Q212M34647P8122k51102
$$ y = [3668417, 3638638, 3773782, 3925481, 4112802, 3710102, 3758093, 3829577, 3877878, 3668863, 3698098, 3693967, 3760393, 3774432, 3767135, 3818023, 4013504, 3972393, 3555565, 3761327, 4136803, 4042145, 3754049, 3516050, 3698623, 3994055, 3911876, 3313315, 3174093, 3598481, 3753278, 3895658, 3704589, 3789040, 4011811, 4280139, 4092577, 3978560, 3993881, 3823946, 3879769, 3807723, 3700472, 3592181, 3708438, 3893431, 3759597, 3756945, 3623555, 3841160, 4190125, 4059221, 3962108, 3745008, 3964085, 4064030, 4088370, 4120677, 3934154, 3956683, 4027632, 4166650, 3980280, 3971255, 3963259, 4358480, 4390717, 4182592, 4156041, 4318479, 4583793, 4722687, 4977850, 5095408, 5198774, 5464018, 5710886, 5863503, 6055611, 5977456, 5985668, 6420315, 6498437, 6247335]
5210F247335k30508p4204P019k10983m72010l11171P7794Q3087k04883j33024
5200D778452l3059J54335O7189J60842j62905J65284M29705K09305M51682K93964
5190F514794L33241P67699N40215K60816J79092M71222J54399j95542k27070k98623
5180H500243o01990m68896m38615n00354l58470l92330j94073L5406J5663j49350
5170E447234l03908N8747j7336j23750j44751j15174J12501J95109L94345P8221
5160E581238K59466K78818M94304M59270J84649k65153m1283J57163j99486m77830
5150F431156l44939k98356j48843m35414j92822m2622Q1411k29747o25J02589
5140D921788j86244o9859O3308J78315l04352p5608K65550K90555L4112n00571
$$ y = [6247335, 6016827, 5942623, 5949642, 5738659, 5266649, 4955478, 5033272, 5116359, 4911476, 4778452, 4745393, 4899728, 4966917, 5127759, 4964854, 5130138, 5559843, 5769148, 6220830, 6514794, 6848035, 7615734, 8155949, 8416765, 8595857, 9067079, 9221478, 9025936, 8798866, 8500243, 7898253, 7429357, 6990742, 6490388, 6131918, 5739588, 5545515, 5580921, 5596584, 5447234, 5143326, 5202073, 5184737, 5060987, 4916236, 4801062, 4913563, 5108672, 5503017, 5581238, 5840704, 6119522, 6613826, 7073096, 7257745, 6992592, 6951309, 7108472, 6908986, 6431156, 6086217, 5787861, 5639018, 5203604, 5010782, 4968160, 5049571, 4819824, 4819199, 4921788, 4735544, 4665685, 4728993, 4907308, 4602956, 4527348, 4792898, 5083453, 5117565, 4616994]
5130D616994J3997J83665K9707n4139p136N9396p8205j02801J23051K80266r1976
5119D972819j69478P7410J49068l5802j70350J00631N2928J6620j42028L5862
5109D887680K45800l67143n1520K80641J78187l68714j42459K94144K56919j78175
5099E035360m23138L03180J01918n9737l30911j0956L31936j31913L0109m1918
5089D803930J01230J58626k79766P1006L88213n5615k53068K20978M6457q1826
5079E120165J71096J13953p914l54394O1986j52174N7917k19946j54949K40494
5069D876234J62565j26026o7069K99804k1821j22431J6054M004K54689j15162
5059E160841O5372p2428M9016j55020j83015M17470j48464j52549J76710J13623
$$ y = [4616994, 4630991, 4814656, 4844363, 4790224, 4783088, 4842484, 4764279, 4661478, 4784529, 5064795, 4972819, 4803341, 4880751, 5029819, 4994017, 4823667, 4924298, 4977226, 4993846, 4851818, 4887680, 5133480, 4766337, 4714817, 4995458, 5173645, 4804931, 4662472, 4956616, 5213535, 5035360, 4612222, 4915402, 5017320, 4957583, 4626672, 4615716, 4947652, 4815739, 4845848, 4803930, 4905160, 5063786, 4784020, 4855026, 5243239, 5187624, 4934556, 5155534, 5201991, 5120165, 5291261, 5405214, 5397300, 5042906, 5104892, 4952718, 5010635, 4790689, 4635740, 4876234, 5038799, 4912773, 4845704, 5145508, 5123687, 5001256, 5017310, 5021314, 5276003, 5160841, 5226213, 5153785, 5202801, 5047781, 4864766, 5282236, 5133772, 4981223, 5157933, 5271556]
5049E271556J94879k04916J3255J84561q15l23518q9919J09056K8636k40521m7210
5038D895044L55750k70436j13830Q7296J61762J47477j38755J28738J92525J35838
5028E581409n7920J8550N7022j02311k22900L7807K77592k64521o6286J10998
5018E369440L48073k69613l54995o7869L67078K14682j51412R4602M89699O248
5008F045933K5623L6664J65267j56054m031J17581L35470J86104k23923K26184
4998F754818L40629K29675j51185j5313J00701l4007K08358j12915J01464j60201
4988G262024k01803m827N4441k68353k66129J96390J21752J21541j74102J4190
4978F855124L43407N2897R2026M774J14021P2082J5966P8531L75693k5481k13047
$$ y = [5271556, 5466435, 5261519, 5274774, 5459335, 5458520, 5135002, 5045083, 5154139, 5182775, 4942254, 4895044, 5250794, 4980358, 4866528, 4953824, 5115586, 5263063, 5124308, 5253046, 5445571, 5581409, 5523489, 5542039, 5599061, 5496750, 5273850, 5311657, 5589249, 5324728, 5258442, 5369440, 5717513, 5447900, 5092905, 5025036, 5392114, 5606796, 5455384, 5549986, 6039685, 6045933, 6071556, 6108220, 6273487, 6117433, 6113402, 6230983, 6566453, 6752557, 6528634, 6754818, 7095447, 7325122, 7173937, 7158624, 7259325, 7225318, 7433676, 7320761, 7422225, 7262024, 7060221, 7055394, 7109835, 6841482, 6575353, 6771743, 6893495, 7015036, 6840934, 6855124, 7198531, 7251428, 7343454, 7348228, 7462249, 7534331, 7550297, 7628828, 8004521, 7979040, 7765993]
4967G765993L24658K60568J72633k23183L01676M95334J03072P3227p8419M78149
4957I673708M16413J09079J0003J22009M34492k1905O1828N6140K18647j5956
4947A1064458Q1366J83972K00597L66101K37048J60453M49991Q6701j13860j66757
4937A2550070l08498l21290K80235o1850k11359j46410K97480J51166J17027M6305
4927A2392876K22651L71344K14870K06925L64257K93920K69858L05448K56837
4918A4898986Q5389K28963J82433K80072L14747K70943J46684o7163J94252K6101
4908A6561407k8334M8159k7135L34488J81961J17756K5296J69288K48862L09809
4898A7941557L95049j87137J59862L47413N37742J52054J64418M64145M15603
$$ y = [7765993, 8090651, 8351219, 8523852, 8300669, 8602345, 9097679, 9200751, 9273978, 9195559, 9673708, 10090121, 10199200, 10209203, 10331212, 10765704, 10743799, 10805627, 10861767, 11080414, 11064458, 11145824, 11329796, 11530393, 11896494, 12133542, 12293995, 12743986, 12830687, 12716827, 12550070, 12241572, 11920282, 12200517, 12138667, 11927308, 11780898, 12078378, 12229544, 12346571, 12392876, 12615527, 12986871, 13201741, 13408666, 13772923, 14066843, 14336701, 14642149, 14898986, 14984375, 15213338, 15395771, 15675843, 15990590, 16261533, 16408217, 16341054, 16535306, 16561407, 16533073, 16581232, 16554097, 16888585, 17070546, 17188302, 17213598, 17382886, 17631748, 17941557, 18336606, 18149469, 18309331, 18656744, 19194486, 19346540, 19510958, 19975103, 20390706]
4889B0390706N52738M64691N79490P90744P23865P74898R83688R51762O32242
4880B6844824J038277J515782J474822J239295J185753J697580K013970J779632
4872C8789935J702695J855621K360903J961274J721518J837206J838211J722513
4864E3789876J809688J657204J909320J745520J901204J905493J957182K348387
4856F9023874K253486K934001L234310L290797L744215L974374L796579L340457
4848I5592093L347029L200950L235034L026994L530790M417212M764098M703534
4840A25817734M581407M978728M795380L903715L141087K339324J703515M68907
4832A51729797j197913k510939l171395m089124m489812m310335m249343l596698
$$ y = [20390706, 20943444, 21408135, 21987625, 22778369, 23502234, 24277132, 25260820, 26212582, 26844824, 27883101, 29398883, 30873705, 32113000, 33298753, 34996333, 37010303, 38789935, 40492630, 42348251, 44709154, 46670428, 48391946, 50229152, 52067363, 53789876, 55599564, 57256768, 59166088, 60911608, 62812812, 64718305, 66675487, 69023874, 71277360, 74211361, 77445671, 80736468, 84480683, 88455057, 92251636, 95592093, 98939122, 102140072, 105375106, 108402100, 111932890, 116350102, 121114200, 125817734, 130399141, 135377869, 140173249, 144076964, 147218051, 149557375, 151260890, 151729797, 150531884, 148020945, 144849550, 140760426, 136270614, 131960279, 127710936, 124114238]
4824A24114238k889832j876007o65484K70689J386960K628254L944811M492179
4816A31405808N005835N672027N906595N887749N356374M686569L137218J587736
4808A68645911k31697k027198l934693n156090n975986o253059n835530n576223
4800A33655435m516889l294098k341979j627303j646045j664538j568245j712800
4792A15283538j984615j655504j409926j486161j214895r12395j105546j252794
4784A04261702j267293j365592j061019r43795j310234j578642k172437k496807
4776I2065883k935504l652271m250756l823944l086663l108791l365321l460492
4768F4382141k979877k750523k848825k730405k324745j411198j210060j242747
$$ y = [124114238, 121224406, 119348399, 118682915, 118953604, 120340564, 122968818, 126913629, 131405808, 136411643, 142083670, 147990265, 153878014, 159234388, 163920957, 167058175, 168645911, 168414214, 166387016, 162452323, 157296233, 151320247, 145067188, 139231658, 133655435, 129138546, 125844448, 123502469, 121875166, 120229121, 118564583, 116996338, 115283538, 113298923, 111643419, 110233493, 108747332, 107532437, 106620042, 105514496, 104261702, 102994409, 101628817, 100567798, 99624003, 98313769, 96735127, 94562690, 92065883, 89130379, 85478108, 81227352, 77403408, 74316745, 71207954, 67842633, 64382141, 61402264, 58651741, 55802916, 53072511, 50747766, 49336568, 48126508, 46883761]
4760D6883761q59775m96260k54660k32433M1620k5933m87818j100569j221636
4751D2246297j270122j722810j760384j902018j404382j108308r87727p00501
4743C1390045r05655q15737l43763j97574l67047l30910l9877L06666O6062k27932
4733B8534278m8262J94530K70936l899J24034L32092M60850L61084J95101P16341
4723C1137085P05696P74301J003396J642218K164538J916743J468216J266168
4715D2078361J214945L80660m64999p53972q54970p47145q12584o78568k12144
4706C9149584L43033O97985N70252R30092J082348M81979l14581q44498j266872
4697D0829322j725451j966845k244803j486525j351129j334335j400570r37517
$$ y = [46883761, 46023986, 45527726, 45273066, 45040633, 45082253, 45056320, 44568502, 43467933, 42246297, 40976175, 39253365, 37492981, 35590963, 34186581, 33078273, 32090546, 31390045, 30484390, 29668653, 29324890, 29127316, 28760269, 28429359, 28389482, 28696148, 28762210, 28534278, 28486016, 28680546, 28951482, 28947583, 29071617, 29403709, 29864559, 30225643, 30420744, 31137085, 31842781, 32617082, 33620478, 35262696, 37427234, 39343977, 40812193, 42078361, 43293306, 43673966, 43208967, 42454995, 41600025, 40852880, 40040296, 39361728, 39149584, 39492617, 40190602, 40760854, 41690946, 42773294, 43255273, 42940692, 42096194, 40829322, 39103871, 37137026, 34892223, 33405698, 32054569, 30720234, 29319664, 28382147]
4689B8382147m69411q02149p91212p28545j78009M1652j33584k97685k9755K80775
4679B5274224L22916N96688O43254J178127J871168K176172K236679K024574J774096
4670C8097898J197639O75021Q6661l87224n49355q94189o41658M82832J709473
4661C9777098K552379K413526K216476K393160K145680O04463q36933j384531
4653D9881318j398680j994784k245021j055867k13372K25713P85269J445373J995935
4644D7425884K270121J510696J351864J301437P49862M33542K40670P27535J029878
4635E7041489J155632J097258P60239M44420J54437k49034k53092o4641N062M29749
4625F0521519O8918j46531N4257k67706m45418n37305k36049j58271J9166L46213
$$ y = [28382147, 27912736, 27110587, 26319375, 25590830, 25412821, 25454473, 25320889, 25023204, 24993449, 25274224, 25597140, 26193828, 26837082, 28015209, 29886377, 32062549, 34299228, 36323802, 38097898, 39295537, 39970558, 40057219, 39669995, 39120640, 38226451, 37584793, 38067625, 39777098, 42329477, 44743003, 46959479, 49352639, 51498319, 52102782, 51265849, 49881318, 48482638, 46487854, 44242833, 43186966, 42973594, 43199307, 43984576, 45429949, 47425884, 49696005, 51206701, 52558565, 53860002, 54609864, 55043406, 55284076, 56011611, 57041489, 58197121, 59294379, 60054618, 60499038, 60653475, 60404441, 60151349, 60086708, 60091770, 60521519, 60590437, 60443906, 60498163, 60230457, 59785039, 59247734, 59011685, 58853414, 58872580, 59218793]
4615E9218793Q87726J070215J505932J736790K483268L256924L555436L855216
4607G7570300M176612M709916M718609M738976N277675N753370O258882O701956
4599A19906296O427297O707832O910859P826910R587053J2443599J7788185K5065496
4591B12663527L3700358M2629225M9767664N2489753M9938490M1305367K7118263
4584E09612647J0248479p028682k3123657l6158896m3177760m4567747m2838805
4577C22965579l9036202l4016049k8463428k3557179j9461673j5723356j2216145
4570A50491547r779737q002021o443711n130241m275536m329347m513534m157169
4562A03860251l973295l905675l521420k831860k406735k089739j566476j280000
$$ y = [59218793, 60106519, 61176734, 62682666, 64419456, 66902724, 70159648, 73715084, 77570300, 81746912, 86456828, 91175437, 95914413, 101192088, 106945458, 113204340, 119906296, 126333593, 133041425, 139952284, 147779194, 157366247, 169809846, 187598031, 212663527, 246363885, 288993110, 338760774, 391250527, 441189017, 482494384, 509612647, 519861126, 512832444, 489708787, 453549891, 410372131, 365804384, 322965579, 283929377, 249913328, 221449900, 197892721, 178431048, 162707692, 150491547, 140711810, 132709789, 126266078, 121135837, 116860301, 112530954, 108017420, 103860251, 99886956, 95981281, 92459861, 89628001, 87221266, 85131527, 83565051, 82285051]
4554H2285051j347171j759231j683337j823640j943585k254142j995164j115010
4546F8363771j352445j606805j770219j866061k088369k340174j908283j932285
4538E3499130j517715j253434r72888j73466L2959j43353k1853K48462k03310
4529D9494532r62567j441272j650613j553958j965560k090325j780586j323109
4521C6726542j494922j469704j181607p43260p62676o60985p02996n40201l29130
4512B8841061p10155q83310n49277k53320m53885n46665l98885k23044k17794
4503B4604726l90392n12117l69088n9396k89403l62907j4328J72339J20942q220
4493B2892156L4095P7339q2186J907k13064r0650r8865k66823L05271P315j76410
$$ y = [82285051, 80937880, 79178649, 77495312, 75671672, 73728087, 71473945, 69478781, 68363771, 67011326, 65404521, 63634302, 61768241, 59679872, 57339698, 55431415, 53499130, 51981415, 50727981, 49755093, 49581627, 49614586, 49471233, 49449380, 49697842, 49494532, 48531965, 47090693, 45440080, 43886122, 41920562, 39830237, 38049651, 36726542, 35231620, 33761916, 32580309, 31837049, 31074373, 30413388, 29710392, 29170191, 28841061, 28130906, 27247596, 26698319, 26444999, 25991114, 25444449, 25045564, 24822520, 24604726, 24214334, 23702217, 23333129, 23273733, 22984330, 22621423, 22607095, 22779434, 22900376, 22892156, 22926251, 23003590, 22921404, 22923311, 22710247, 22619597, 22520732, 22253909, 22559180, 22566495, 22390085]
4482B2390085j9704M875J95575j63678k03472m6887p3792L808j29662K04267L32025
4471B2493440j0061j56457K89448J53222q3744k19326l68617r555l43145o66970
4461B1078235k5560j65752k85244j22442j76248p032j37068q1713j7672L72322
4451B0431826R24479J163850J815012K073939K301981K156359K159663J422815
4443C4449924N20380m75215j242277j838520k340994k304765k605349k104263
4435B2058921j322799j427365q32481m43992l48423l3997L0859P8645O37863Q29705
4425A9226936J152069R48622N52509K24653j84543o96732p20480r56721o35593
4416A8910720r11476n06701j95780n36528j90187p1225J60610J71556l14022N2303
$$ y = [22390085, 22370381, 22375256, 22570831, 22407153, 22203681, 22156794, 22083002, 22086810, 21957148, 22161415, 22493440, 22483379, 22326922, 22616370, 22769592, 22685848, 22466522, 22097905, 22088350, 21745205, 21078235, 21052675, 20886923, 20601679, 20479237, 20302989, 20295957, 20158889, 20077176, 20059504, 20431826, 21356305, 22520155, 24335167, 26409106, 28711087, 30867446, 33027109, 34449924, 34970304, 34495089, 33252812, 31414292, 29073298, 26768533, 24163184, 22058921, 20736122, 19308757, 18476276, 18032284, 17683861, 17649864, 17680723, 17759368, 18397231, 19226936, 20379005, 21327627, 21880136, 22104789, 21920246, 21223514, 20503034, 19546313, 18910720, 17999244, 17492543, 17296763, 16760235, 16570048, 16498823, 16659433, 16830989, 16516967, 16569270]
4406A6569270K5616k71287j09028j84753p8437M9318l76095j79092K38867j3489
4396A5670890j9077j03444K49260Q1718j86350j57523m797k76040k32712k46724
4386A4775201k4202l20900n78492l24067j05503l75774m12436k99424l6489l59253
4376A1938661l98758o6987j74267k62032j35477n3306J81894n6789j65478j14643
4366A0692818J44814J02839j80323k68839J96397K01034J3240o4005k18347r7634
4356A0521994K538r1425K32558j07181J20788O7005J47968J51606L6825J99191
4346A1281867K55537L52992M11074m6664m2115L04019J04089j03530l5465q0861
4336A2400943J84903O3600M7810L5384L8886L28609L21732K91445M02849J73647
$$ y = [16569270, 16594886, 16323599, 16214571, 16029818, 15951381, 16000699, 15624604, 15445512, 15684379, 15670890, 15651813, 15548369, 15797629, 15879347, 15692997, 15535474, 15530677, 15254637, 15021925, 14775201, 14750999, 14430099, 13851607, 13527540, 13422037, 13046263, 12633827, 12334403, 12297914, 11938661, 11539903, 11472916, 11298649, 11036617, 10901140, 10847834, 11029728, 10972939, 10807461, 10692818, 10837632, 10940471, 10760148, 10491309, 10687706, 10888740, 10901980, 10837975, 10619628, 10521994, 10524532, 10433107, 10665665, 10558484, 10679272, 10746277, 10894245, 11045851, 11082676, 11281867, 11537404, 11890396, 12301470, 12254806, 12212691, 12516710, 12620799, 12517269, 12481804, 12400943, 12585846, 12649446, 12697256, 12732640, 12771526, 13100135, 13421867, 13713312, 14116161, 14289808]
4326A4289808J60830M53205L25322J76069l22898j93604k24963l30252n28455
4317A3805062n45924j81609J85901m4993j33519Q6792J52209J05438L00128M5082
4307A3774567r164K9764J75918N343j88117r6916j11368J46180J77470r3985n5625
4296A3754067j40553m4550j54130j98945j20456j15953m01557p6367O3861j9411
4286A2546006o2162k09963L22834K55637l75613q4595J43967L98739P3929j12323
4276A2896456R3343P5343K8648K69221q3162j4648j23570N1879L28706n1496j33574
4265A3337146o3411J07329R7736L22057J60004j68394J09339M09199J01118j49241
4255A4262882Q9483o1608J37505K4547m08592M0350K7627k94042p0634j05854
$$ y = [14289808, 14450638, 14903843, 15229165, 15405234, 15082336, 14888732, 14663769, 14333517, 13805062, 13259138, 13077529, 13263430, 13218437, 13084918, 13171710, 13323919, 13429357, 13729485, 13774567, 13765403, 13795167, 13971085, 13976428, 13788311, 13691395, 13580027, 13726207, 13903677, 13809692, 13754067, 13613514, 13568964, 13414834, 13215889, 13095433, 12979480, 12577923, 12501556, 12565417, 12546006, 12483844, 12273881, 12596715, 12852352, 12476739, 12392144, 12536111, 12934850, 13008779, 12896456, 12989799, 13065142, 13093790, 13363011, 13279849, 13265201, 13141631, 13193510, 13522216, 13470720, 13337146, 13273735, 13381064, 13478800, 13800857, 13960861, 13792467, 13901806, 14311005, 14412123, 14262882, 14352365, 14290757, 14428262, 14452809, 14044217, 14084567, 14112194, 13818152, 13747518, 13641664]
4245A3641664o1844j60551L8018K41709J83357J25194k0379R7061K05870N711
4235A4295810m57825j39746k43985q1563n0438j50467q6325M465J03274J09252
4225A3302452m7912j63308q3088L67432K80333m3718j53098L28246K19839k33848
4215A3773330j04896J74649m0786l77070p6888M40906J59075J13137j36565M72821
4205A4397713N35825m6695J0008J54515K79899M2895j71781j09072J51150j42172
4195A5102285l74646m8320M29526J16719o7378L06538L84894K72020K76814J64808
4185A6563260M31921L50991K13432L48767K33645L83329O21813N26054L05415
4176A9978627K79837N84509O75342N06903L67465O45597O08940N13254n8496L79827
$$ y = [13641664, 13579820, 13419269, 13457287, 13698996, 13882353, 14007547, 13987168, 14084229, 14290099, 14295810, 13837985, 13698239, 13454254, 13372691, 13322253, 13171786, 13085461, 13089926, 13193200, 13302452, 13254540, 13091232, 13008144, 13375576, 13655909, 13612191, 13459093, 13787339, 14007178, 13773330, 13668434, 13843083, 13802297, 13425227, 13348339, 13789245, 13948320, 14061457, 13924892, 14397713, 14933538, 14886843, 14896851, 15051366, 15331265, 15374160, 15202379, 15093307, 15244457, 15102285, 14727639, 14679319, 15108845, 15225564, 15158186, 15464724, 15849618, 16121638, 16398452, 16563260, 16995181, 17346172, 17559604, 17908371, 18142016, 18525345, 19147158, 19673212, 19978627, 20258464, 20842973, 21518315, 22025218, 22392683, 23038280, 23647220, 24160474, 24101978, 24481805]
4166B4481805N07379M26171M17173J72068N84825N59435L49881L31437P81016
4157B8611190P92205P25508Q06460Q86710J408493J271479J106007O97473J068098
4148C7373623J347846R32376Q22381O05843Q34736R58975M67952K11893M92068
4139D4047693Q65930O45142M59146P84974J012960J037792Q17704R05417J553014
4130E2129772J867159J437276J677191K222185J987352J567875J183390J090401
4122F5162601J159681Q43947M62591N97686N39372M74334L54470N30296Q54317
4113G0979295O56679P31514N38615L08846M68551L74398K23465L35774O80053
4104G5297190J211440J549884K043104K298912K988777L434673L005399K993703
$$ y = [24481805, 24989184, 25415355, 25832528, 26004596, 26589421, 27148856, 27498737, 27830174, 28611190, 29403395, 30128903, 30935363, 31822073, 33230566, 34502045, 35608052, 36305525, 37373623, 38721469, 39653845, 40476226, 41082069, 41916805, 42875780, 43343732, 43555625, 44047693, 44913623, 45558765, 46017911, 46802885, 47815845, 48853637, 49671341, 50576758, 52129772, 53996931, 55434207, 57111398, 59333583, 61320935, 62888810, 64072200, 65162601, 66322282, 67166229, 67628820, 68226506, 68765878, 69240212, 69594682, 70124978, 70979295, 71635974, 72367488, 72906103, 73214949, 73683500, 74057898, 74281363, 74617137, 75297190, 76508630, 78058514, 80101618, 82400530, 85389307, 88823980, 91829379, 94823082]
4096I4823082L468705L226311K893280K660442K601955K677524K389268J779884
4088A16520451J692786J691479J515500M03016R1696Q3368J49986K27292N14258
4079A22889832P04365J246077J295538R86461J034735P17630L08280m8341l10450
4070A28824127q1908K6955K19932K54754L84409P00403L00729N9558j32125k23354
4060A30333480m75528r86193j653791j727634j599231k134615k233899k388024
4052A17134565k194417k762604l107757l350991l345014k727266k975758k812219
4044I3858539j987798j782955j443176q37266r96870n45121j87212k26656m52226
4035H5399259o82564m68893r45550j305987j212663j473593o90188q68301j006447
$$ y = [94823082, 98291787, 101518098, 104411378, 107071820, 109673775, 112351299, 114740567, 116520451, 118213237, 119904716, 121420216, 121823232, 121914928, 121998296, 122148282, 122375574, 122889832, 123594197, 124840274, 126135812, 127122273, 128157008, 128874638, 129182918, 129134577, 128824127, 128742219, 128769174, 128989106, 129243860, 129628269, 130328672, 130629401, 130688959, 130556834, 130333480, 129857952, 128871759, 127217968, 125490334, 123891103, 121756488, 119522589, 117134565, 114940148, 112177544, 109069787, 105718796, 102373782, 99646516, 96670758, 93858539, 91870741, 90087786, 88644610, 87807344, 86810474, 86265353, 86078141, 85851485, 85399259, 84716695, 84247802, 83302252, 81996265, 80783602, 79310009, 78619821, 77751520, 76745073]
4026G6745073m57450m18830r29322j308048j467299j205376j297424j699050j811995
4017F6150279j470787j248912j400099j957289j334075j058641j357575j355259
4009E4967642j073271o40205l91855o30851k91292M5028R5653Q6525J96527J47858
3999E2511759M9575n11880q22480j093373j122382j207897j192245j443198j404299
3990D3763580r76291r37052r08065r06693q47619o03807m03777m41278m98272
3981C7240726l74326n83210n22700p09207p97412o33832n75506m05984l22952
3972C2315597L8965L18163K89443O38894Q72843R64177O90420L74837J63497L6032
3962C6702868k30787q57417q06163j055470q35554p55426o14691j29621j6302
$$ y = [76745073, 76287623, 75868793, 74939471, 73631423, 72164124, 70958748, 69661324, 67962274, 66150279, 64679492, 63430580, 62030481, 60073192, 58739117, 57680476, 56322901, 54967642, 53894371, 53254166, 52862311, 52231460, 51940168, 51985196, 52080849, 52167374, 52363901, 52511759, 52561334, 52049454, 51226974, 50133601, 49011219, 47803322, 46611077, 45167879, 43763580, 42787289, 41850237, 40942172, 40035479, 39187860, 38584053, 38180276, 37738998, 37240726, 36866400, 36283190, 35760490, 35051283, 34253871, 33620039, 33044533, 32638549, 32315597, 32354562, 32672725, 32962168, 33601062, 34473905, 35438082, 36128502, 36503339, 36666836, 36702868, 36472081, 35614664, 34808501, 33753031, 32917477, 32162051, 31547360, 31417739, 31401437]
3953C1401437m2172o6716J34280K09159P537j88334Q0073K17566J1065J56717
3943C1920612J67800L34344J97575J14872o7805K03955L69301L33785L00942O11682
3933C4487063L80503O86817O58375O23811M65745M18538P24773R97369Q58669
3924D0301663O36688O75044Q91701P78607Q04589M74928M71330O78125J010551
3915D6723226J183821J046470R41283J056950J334892J169349R79568J089857
3907E5525416J281283J831850J733928J631608J721438J928063K274263K198002
3899G0125851K156504K232285K387320K719666L162947L281360K991190K955143
3891I2012266K735884K459702J666617R86683M32785J69814K85092K38200J0154
$$ y = [31401437, 31359265, 31292549, 31426829, 31635988, 31643525, 31455191, 31535264, 31752830, 31763895, 31920612, 32088412, 32422756, 32620331, 32735203, 32667398, 32871353, 33240654, 33574439, 33875381, 34487063, 34867566, 35554383, 36212758, 36836569, 37302314, 37720852, 38445625, 39442994, 40301663, 40938351, 41613395, 42505096, 43283703, 44088292, 44563220, 45034550, 45712675, 46723226, 47907047, 48953517, 49894800, 50951750, 52286642, 53455991, 54435559, 55525416, 56806699, 58638549, 60372477, 62004085, 63725523, 65653586, 67927849, 70125851, 72282355, 74514640, 76901960, 79621626, 82784573, 86065933, 89057123, 92012266, 94748150, 97207852, 98874469, 99861152, 100293937, 100463751, 100748843, 100987043, 100997197]
3882A00997197k2281N50989Q18172P25238J64108j05192j37913m89414r60657
3873A01540247j440563j612349j366501j121986q43286j161382j162746j392704
3865I1438730j907290j866725k123644k482042k344039k014260j543562j517269
3857G5639899j121706p76951k71549j66367k70474o24243o94022q30599o60101
3848G0223887p83993j143566r63255o10321l15000m28991o58129p08978r06863
3839F3704791r75532j198551j494500j376148j360990j147759r68716j021659
3831E4160936j052717j027193r94414j039850j024480j102092q79388p70293o85075
3822D5585434m97667l69330k73922o5096K71867L30460J00695L00843M75299M75733
$$ y = [100997197, 100974916, 101525905, 102344077, 103069315, 103233423, 103128231, 102990318, 102500904, 101540247, 100099684, 98487335, 97120834, 95998848, 95155562, 93994180, 92831434, 91438730, 89531440, 87664715, 85541071, 83059029, 80714990, 78700730, 77157168, 75639899, 74518193, 73741242, 73469693, 73303326, 73032852, 72408609, 71714587, 70883988, 70223887, 69439894, 68296328, 67333073, 66722752, 66407752, 65978761, 65320632, 64611654, 63704791, 62729259, 61530708, 60036208, 58660060, 57299070, 56151311, 55182595, 54160936, 53108219, 52081026, 51086612, 50046762, 49022282, 47920190, 47040802, 46270509, 45585434, 45087767, 44718437, 44444515, 44379419, 44651286, 44981746, 45082441, 45383284, 45858583, 46334316]
3812D6334316N11239O98767P12005R32279J026353R83351Q64974O47308O57609
3803E3368201P35559P20445M97125P10356R42207Q70079J250763K111456K756652
3794F3962843L554129M610440M508911M820615M559673L716738K806937J864308
3786I4404594O81162n62025j668705k336933k276657k159501j786841j494968
3778H2800126r52479r20722o07157m91130o54469j82552J68008O85358J517240
3769H1362223J985886K794111L019763L193242L452946L490319L400428L171905
3761A05870823K836293K860995K538671K051360J560786J534686J929966J774099
3753A22957679J010045N78723m72792j325138k402370l847320m404320m940262
$$ y = [46334316, 46845555, 47544322, 48256327, 49188606, 50214959, 51198310, 52063284, 52710592, 53368201, 54103760, 54824205, 55321330, 56031686, 56973893, 57843972, 59094735, 61206191, 63962843, 67516972, 72127412, 76636323, 81456938, 86016611, 89733349, 92540286, 94404594, 95085756, 94523731, 92855026, 90518093, 88241436, 86081935, 84295094, 82800126, 81847647, 80926925, 80319768, 79828638, 79174169, 78991617, 79159625, 79844983, 81362223, 83348109, 86142220, 89161983, 92355225, 95808171, 99298490, 102698918, 105870823, 108707116, 111568111, 114106782, 116158142, 117718928, 119253614, 121183580, 122957679, 123967724, 124546447, 124073655, 122748517, 120346147, 116498827, 112094507, 107154245]
3745A07154245m645648m266085l730843k894380j869549j172024p27997n09633
3737H7338086o35850q96293j207302j062967j138015j329600j243698j194051
3729G8630310r87366q36099r37078j284642j063626j052773j389395j509073j832772
3720F7737486j820057k070247k025471k360979k267500j903163j970440j411531
3712E1908098j034730j133806j039823r73639p70434r94408j148233p76862p51640
3703D3284523q03851q24736r47940r38542q72459q92171q01187o49763m50570
3694C6103304r5936K07297M58923P3639J91785K52501R1515j11725l40453k60259
3684C6570591k54483n00487o60567j89394j74995l90312j38162K45624M15686
$$ y = [107154245, 102508597, 98242512, 94511669, 91617289, 89747740, 88575716, 87847719, 87338086, 86702236, 85805943, 84598641, 83535674, 82397659, 81068059, 79824361, 78630310, 77642944, 76806845, 75869767, 74585125, 73521499, 72468726, 71079331, 69570258, 67737486, 65917429, 63847182, 61821711, 59460732, 57193232, 55290069, 53319629, 51908098, 50873368, 49739562, 48699739, 47726100, 46955666, 45961258, 44813025, 44036163, 43284523, 42480672, 41655936, 40707996, 39769454, 38896995, 38004824, 37203637, 36553874, 36103304, 36007368, 36214665, 36673588, 36747227, 36939012, 37191513, 37283028, 37171303, 36830850, 36570591, 36316108, 35815621, 35155054, 34965660, 34790665, 34400353, 34262191, 34507815, 34923501]
3675C4923501L64840K68953J38075J40377K40666l60126o02397n07906l08244
3666C4297739l87189n05304o73585m13684j85066r91864j148518j190217p23997
3657B8078315j154846j402684r16999r28627o26187r15629j243169n18277j33958
3648B0237939m16504j66589q8226L8254l3586k97907j90121J19297K098m39754
3638A8764901m15238K09615j90198j61221J0585j54256l4318Q5508j72075r3511
3628A7849792J85905K78656J36689r7470r0524j27377L141m3130k98970n0021
3618A7746691K10110J05074N6732J40900L05319L12538L58595J62950K50011M49143
3608B0098063K69638J66540O65717N73269j27075j3653N8441J15429j2585l50308
$$ y = [34923501, 35288341, 35557294, 35695369, 35835746, 36076412, 35716286, 35113889, 34605983, 34297739, 33910550, 33405246, 32731661, 32317977, 32132911, 31141047, 29992529, 28802312, 28078315, 26923469, 25520785, 24603786, 23675159, 23048972, 22133343, 20890174, 20371897, 20237939, 19821435, 19654846, 19566620, 19604874, 19571288, 19273381, 19083260, 19202557, 19204655, 18764901, 18349663, 18559278, 18369080, 18207859, 18218444, 18064188, 18029870, 18115378, 17943303, 17849792, 18035697, 18314353, 18451042, 18353572, 18263048, 18135671, 18138812, 18095682, 17796712, 17746691, 17956801, 18061875, 18118607, 18259507, 18564826, 18877364, 19235959, 19398909, 19648920, 20098063, 20367701, 20534241, 21199958, 21773227, 21646152, 21632499, 21690940, 21806369, 21793784, 21443476]
3598B1443476l14875r6393n0740l73750k81367j28593j2939M4925N7271J1650
3588B0298665q0251J24963N930J42510K06460j26774M35544M43336M27613N42648
3578B2420644O41781P81213M65676J039850R96392N01275L83482N76699N93504
3569B8400516L09568j12789m72550l8804M8413j09181k54817P4298J51928K72259
3559B8268841N80736M20353N62649O39990L52671L68924M81753K3653J35468N33122
3549C2368160K59087L82444N37000K21292P9728K60500L51634K29862M65004Q17439
3539C5972150Q43586R39562J109425J450245K217607K677775K638483K911327
3531E0760160L360171L300561L149313L060039K800244K049573J175050N16436
$$ y = [21443476, 21128601, 21032208, 20981468, 20607718, 20326351, 20197758, 20184819, 20229744, 20287015, 20298665, 20218414, 20343377, 20349307, 20491817, 20698277, 20571503, 21007047, 21450383, 21877996, 22420644, 23062425, 23843638, 24309314, 25349164, 26345556, 26846831, 27230313, 27807012, 28400516, 28710084, 28597295, 28124745, 28085941, 28134354, 28025173, 27770356, 27844654, 27996582, 28268841, 28849577, 29269930, 29832579, 30472569, 30825240, 31194164, 31675917, 31699570, 31835038, 32368160, 32627247, 33009691, 33546691, 33767983, 33847711, 34108211, 34459845, 34689707, 35154711, 35972150, 36815736, 37755298, 38864723, 40314968, 42532575, 45210350, 47848833, 50760160, 54120331, 57420892, 60570205, 63630244, 66430488, 68480061, 69655111, 70171547]
3523G0171547K04491O8458r14173j325742p72526n02481p59102j308316j149688
3514F3712468j235994j483808k288564k636838k301479k009459k319310k139605
3506D7297411j676652j825756j418082j118823j282699j246806j044567j028457
3498C6655569j068296j039762r30436p12103p86698j022272p91033k97830o77960
3489B9329179q77167m63076l45158m95067o66675m80892l05062j58241k30229
3480B5307612m63185k26232J13336p5310n652J64954L50911L88586L43949K03862
3470B6102831L71997K90643L62532J88131L18012L41233J43311L11074O4576k06342
3460B8287998k11594l02492p98319o82331l56156n39530m37388n89320p20301
$$ y = [70171547, 70376038, 70444496, 69530323, 68204581, 67432055, 66929574, 66170472, 64862156, 63712468, 62476474, 60992666, 58704102, 56067264, 53765785, 51756326, 49437016, 47297411, 45620759, 43795003, 42376921, 41258098, 39975399, 38728593, 37684026, 36655569, 35587273, 34547511, 33617075, 32904972, 32118274, 31096002, 30304969, 30007139, 29329179, 28452012, 27988936, 27643778, 27148711, 26482036, 26001144, 25696082, 25537841, 25307612, 24844427, 24618195, 24731531, 24656221, 24650569, 24815523, 25166434, 25555020, 25898969, 26102831, 26474828, 26765471, 27128003, 27316134, 27634146, 27975379, 28118690, 28429764, 28494340, 28287998, 28076404, 27773912, 26975593, 26293262, 25937106, 25397576, 24960188, 24370868, 23650567]
3451B3650567k70597j95881l60298k78942K7146j52266R5612L05825K9879j10635
3441B2740410r6163J4386Q674K03988N8598J73892L26370K85673J35556J11670
3431B3963054K59020M06308N51573R72569J213264J654732K154508K973910L989712
3422C8138650M669151M982932M888449L819424K269743P09654j064156k745767
3414E5668080l691682l695557l837730m115106l428167k509353j831371j642714
3406C0916400j537602j075634p75467o52896p91012n28191k16352J21513J07248
3397B5568007K64628L85464L66766N42478J82135L25833L46403R1577O8548j68452
3387B7973387P9894l90118l71412k64176j41718L30999J63700m9820j993K81990
$$ y = [23650567, 23379970, 23184089, 22823791, 22544849, 22571995, 22419729, 22515341, 22821166, 22851045, 22740410, 22644247, 22658633, 22667307, 22871295, 22929893, 23103785, 23430155, 23715828, 23851384, 23963054, 24222074, 24628382, 25179955, 26152524, 27365788, 29020520, 31175028, 34148938, 38138650, 42807801, 47790733, 52679182, 56498606, 58768349, 59478003, 58413847, 55668080, 51976398, 48280841, 44443111, 40328005, 36899838, 34390485, 32559114, 30916400, 29378798, 28303164, 27527697, 26874801, 26083789, 25555598, 25339246, 25460759, 25568007, 25832635, 26218099, 26584865, 27127343, 27309478, 27635311, 27981714, 28073291, 28141839, 27973387, 28053281, 27663163, 27291751, 27027575, 26885857, 27216856, 27380556, 27330736, 27328743, 27610733]
3377B7610733O3874J4845j1550j01538N66076N09668N00437O63113R52149J053543
3367C1821350R56081R96756P48454R66370J024302P21563O77484P58234M45758
3358C9116352N05235M81584R2927J13862n6258l4340J2716n290o754k58965j62819
3347C9798250l5491j15759l39091q14544m77386J9416p7440l18765o2170J86610
3337C7763630L98982L09954L34832L64573M73652R06771P92345J283831J918907
3328D4547477K248489K864926L557885M141115M897188N548096O338252P248258
3320H1391686P657276P765213P213216N893232M261298J987428J42849j444326
3312A14867872k934009l609344m370192m749282m922955n045354n079963m968328
$$ y = [27610733, 27674607, 27689452, 27677902, 27576364, 28142440, 28652108, 29152545, 29815658, 30767807, 31821350, 32777431, 33774187, 34522641, 35489011, 36513313, 37234876, 37912360, 38670594, 39116352, 39621587, 40103171, 40196098, 40309960, 40253702, 40219362, 40232078, 40226788, 40220034, 39961069, 39798250, 39762759, 39647000, 39307909, 38493365, 38015979, 38035395, 37957955, 37639190, 37577020, 37763630, 38162612, 38472566, 38807398, 39171971, 39645623, 40552394, 41344739, 42628570, 44547477, 46795966, 49660892, 53218777, 57359892, 62257080, 67805176, 74143428, 81391686, 89048962, 96814175, 104027391, 109920623, 114181921, 116169349, 116312198, 114867872, 111933863, 108324519, 103954327, 99205045, 94282090, 89236736, 84156773, 79188445]
3304G9188445m728564m296066l590595k827131k265364k048843j192248n52048
3296E7687586l25953L34677K95585P44631J139287J120618J552323K175377L055059
3287F7779190L756055M600538N427847N831391O466621O616972N182762L661947
3279A09323323J703149m11240j551313k935714l751611l668326l670638l452290
3271I1585340l511879l219566k872842k787952k593939k704776k797212k421003
3263F8676171k202361k058497j713635j659748j428001j213385j297403j172888
3255E5930253p89318o49455n43041k50599M17494O72179P16492J049192J838821
3246E8392018K662153L394600M128214N734049P383440P887679P083956N341584
$$ y = [79188445, 74459881, 70163815, 66573220, 63746089, 61480725, 59431882, 58239634, 57687586, 57361633, 57696310, 57991895, 58736526, 59875813, 60996431, 62548754, 64724131, 67779190, 71535245, 76135783, 81563630, 87395021, 93861642, 100478614, 105661376, 109323323, 111026472, 110615232, 109063919, 106128205, 102376594, 98708268, 95037630, 91585340, 88073461, 84853895, 81981053, 79193101, 76599162, 73894386, 71097174, 68676171, 66473810, 64415313, 62701678, 61041930, 59613929, 58400544, 57103141, 55930253, 55140935, 54491480, 53948439, 53697840, 54115334, 54787513, 55504005, 56553197, 58392018, 61054171, 64448771, 68576985, 74311034, 81694474, 89582153, 96666109, 102007693]
3238A02007693L973149K634271K038601K053174K130141L092024N000315P757388
3230A30686756J1601563J6488043K1723846K6509475K9286985K8592417K5324960
3223B90214045K0093155J4874294J0275180Q655233P750867O218789L345624k270198
3215C59156989r417725j6706473k3202346k6436593k6991788k5617261k2870564
3208B07914239j9404775j4899056j0699889o979060l273380K62068K983048M491663
3200A60394858M812689M866315M206949L294674K867323J303790m92318l247725
3192A78006555o149358q059007r276023r654573r391739q076726o512746m448384
3184A16437999k369518M92565L786056O862774Q965957Q972387O480000J934813
$$ y = [102007693, 105980842, 108615113, 110653714, 112706888, 114837029, 117929053, 122929368, 130686756, 142288319, 158776362, 180500208, 207009683, 236296668, 264889085, 290214045, 310307200, 325181494, 335456674, 344111907, 351862774, 358081563, 361427187, 359156989, 349739264, 333032791, 309830445, 283393852, 256402064, 230784803, 207914239, 188509464, 173610408, 162910519, 155931459, 152658079, 152920147, 155903195, 160394858, 165207547, 170073862, 174280811, 177575485, 180442808, 181746598, 181254280, 178006555, 171857197, 163798190, 154522167, 144867594, 135475855, 127399129, 120886383, 116437999, 114068481, 114561046, 118347102, 125209876, 134175833, 143148220, 149628220, 151563033]
3176A51563033j802931l993213m715472m718188m489388l878266l864147m537139
3168A19564289n470796n313098n675982n794558n268065n094878m010475l299948
3160G9636489k767644j824932j545487j036017o03643j24227R8423N14957O35302
3151G2983221R91273J145670R28332P22150O07668N4967l47639n84426o30796
3142G5870420o82860o53210q47346j76587p132J95933J006475J801419L033689
3133G9540801M029926N333681O854332Q004780Q740962Q368754P333894N425433
3125A33632563L658149J927861O14801k41238p3878J263615L001161N501887Q861065
3116A58145986J4718866K2163874L1182460M0560777M8291759N1235695M6833168
$$ y = [151563033, 149760102, 145766889, 141051417, 136333229, 131843841, 127965575, 124101428, 119564289, 114093493, 108780395, 103104413, 97309855, 92041790, 86946912, 82936437, 79636489, 76868845, 75043913, 73498426, 72462409, 71858766, 71734539, 71832962, 72347919, 72983221, 73974494, 75120164, 76048496, 76770646, 77378314, 77433281, 77085642, 76501216, 75870420, 75187560, 74534350, 73687004, 73510417, 73503285, 73699218, 74705693, 76507112, 79540801, 83570727, 88904408, 95758740, 103763520, 112504482, 120873236, 128207130, 133632563, 137290712, 139218573, 139833374, 139592136, 139518258, 140781873, 143783034, 149284921, 158145986, 172864852, 195028726, 226211186, 266771963, 315063722, 366299417, 413132585]
3109D13132585L6360956K2035706N203764j1979780k5988985l4092188l6802632
3102C67869426l5055517l0209789k3056226j4782150n667265L035761J1228151
3095B73362391J7945986K1743965K2706471K1132180J7994755J3951141J0246517
3088C99083406P424534L907382j015180p929336j5156036k1977794k7265606l0597464
3080C06473906l1359410k9459429k6836529k3647133j9970819j6761919j4090716
3073A44347951j1940113j0189892q735621p627365o769524n855259m946384m242276
3065H4041517l959871l381372k868943k577674k164902j798907j557230j392827
3057F4339791j315122n42984o76574p33008n97642R3846Q53342J397055K136806
$$ y = [413132585, 449493541, 471529247, 476733011, 464753231, 438764246, 404672058, 367869426, 332813909, 302604120, 279547894, 264765744, 259098479, 262134240, 273362391, 291308377, 313052342, 335758813, 356890993, 374885748, 388836889, 399083406, 406507940, 410415322, 409400142, 401470806, 386314770, 364336976, 337071370, 306473906, 275114496, 245655067, 218818538, 195171405, 175200586, 158438667, 144347951, 132407838, 122217946, 113482325, 105854960, 99085436, 93230177, 88283793, 84041517, 80081646, 76700274, 73831331, 71253657, 69088755, 67289848, 65732618, 64339791, 63024669, 62481685, 61805111, 61072103, 60474461, 60568307, 61421649, 62818704, 64955510]
3048F4955510L578090M778694N351359N230823M466317L637089K492444J295376
3040I5785702k52646j558245k841978m178961n364572n553983o021824n841951
3032F4171542n119906m289656l623078k858135k225071j615264j205247o69918
3024D2565267P4235N13250J246827K689550M332966N556302N389776M803977K747717
3015F9919867J45830k446652m398635m960673m685852m639074l990474l582962
3007D1361375l026009k104564k135875j806067j268851j363002p54799o92637
2999B8209571p07606n65157k84644j80508k82270k06229K8868K4081O6399L86684
2989B6489189N58920J210503J520454K288470L775717M512962M823592L574996
$$ y = [64955510, 68533600, 73312294, 78663653, 83894476, 88360793, 91997882, 94490326, 95785702, 95533056, 93974811, 91132833, 86953872, 81589300, 76035317, 70013493, 64171542, 59051636, 54761980, 51138902, 48280767, 46055696, 44440432, 43235185, 42565267, 42639502, 43152752, 44399579, 47089129, 51422095, 56978397, 62368173, 67172150, 69919867, 70065697, 67619045, 63220410, 58259737, 53573885, 48934811, 44944337, 41361375, 38335366, 36230802, 34094927, 32288860, 31020009, 29657007, 28902208, 28209571, 27501965, 26936808, 26652164, 26471656, 26189386, 25983157, 26012025, 26036106, 26102505, 26489189, 27048109, 28258612, 29779066, 32067536, 35843253, 40356215, 45179807, 48754803]
2981D8754803J995495O8934k335498l265506l965489l895300l549301l136409
2973C0671729k909331k016295j335844j330247j058574r05155o53447o21799p40418
2964A9100619n80886m69345m37073m80923k32377m11375l62241p3027m8105l86348
2954A5618919l39877j89335j93770N9199l88955j50113J14661p9929n4493k99963
2944A4096344K7941K4463K0887j31576j82639j00486j10664l36631O2590l5203
2934A3335026k08967k67993R615R1494n6526n06317p7603l63511k19319p311k49457
2923A1479131l78000k97969m6986K34663q2428l12656l42257j3751L93659k1661
2913A0611745m16432k22959J04230K93526k31251k16831l4422j72149j88605l51287
$$ y = [48754803, 50750298, 50819232, 48483734, 45218228, 41252739, 37357439, 33808138, 30671729, 27762398, 25746103, 24410259, 23080012, 22021438, 21116283, 20462836, 19841037, 19100619, 18519733, 18050388, 17613315, 17132392, 16900015, 16488640, 16126399, 16053372, 16005267, 15618919, 15279042, 15089707, 14895937, 14955136, 14566181, 14416068, 14530729, 14450800, 14396307, 14096344, 14124285, 14148748, 14169635, 14038059, 13855420, 13754934, 13644270, 13307639, 13370229, 13335026, 13126059, 12858066, 12867681, 12959175, 12902649, 12396332, 12318729, 11955218, 11735899, 11728588, 11479131, 11101131, 10803162, 10756176, 10990839, 10908411, 10595755, 10253498, 10239747, 10633406, 10611745, 10195313, 9972354, 10076584, 10370110, 10138859, 9922028, 9887606, 9715457, 9526852, 9175565]
2903I175565j42525k0915j29280k336Q0984k76456q6712q7343M3169L0967J02818
2892H687936j39375m102j53918R6904m21733k98455p4634k1305q694J03217k53778
2881G512063j46668K26481J11252k06750m04266m4452Q8456J62914J40037l33068
2871G105999j48366j01582j2451N6655k88478j49121K43218P4655J16400j0778
2861F886151N783l5696M084j12215j822q470N822j96250P3017Q6960k41220p7774
2849F388370l3388J77432R1499j75644O6308K46712m2159p2104j96382m1172O7852
2838F477324j51129m689j5442J20982R5425R6279K13183j49048R6169L56517J54271
2827G289842L90971p3113k6504K62535J6241k94473l10701j45458k92444j61790
$$ y = [9175565, 9033040, 9012125, 8882845, 8880509, 8961493, 8685037, 8598325, 8510982, 8554151, 8585118, 8687936, 8548561, 8544459, 8390541, 8487445, 8065712, 7767257, 7692623, 7671318, 7662624, 7765841, 7512063, 7365395, 7591876, 7703128, 7496378, 7092112, 7047660, 7136116, 7299030, 7439067, 7105999, 6957633, 6856051, 6843600, 6900255, 6611777, 6462656, 6705874, 6780529, 6896929, 6886151, 6891934, 6856238, 6860322, 6748107, 6746285, 6737815, 6743637, 6547387, 6620404, 6707364, 6466144, 6388370, 6354982, 6532414, 6623913, 6448269, 6514577, 6761289, 6719130, 6647026, 6450644, 6409472, 6477324, 6326195, 6321506, 6306064, 6427046, 6522471, 6618750, 6831933, 6682885, 6779054, 7135571, 7289842, 7680813, 7607700, 7581196, 7843731, 7859972, 7565499, 7254798, 7109340, 6816896, 6655106]
2817F655106k08910j10884n3265j81012K7174J27583J77903j8468J21018L45907
2807F882152N3005J36916L6353J216j88921j4470l92355p3270o5040k32243j28807
2796F014536j41326j19727j88770j96954j10669l20602J79421J02342J2306r8700
2786E131857j87048j88518Q2593l9688n999j56814q5995J55213j00067r750l8063
2775D557721j08106J29803j97507q524O0088j4532j55059J51556J32690j5000
2765D533130m2603n6097O5950p3348k4076o3947k4319K42393P8469j56064r8537
2754D380951n6211j12083j16779j77087K080L03736J37856k52536k04618J241
2744C906550J20075P854j09555n0966J50441K04322l8242p8228k05028J38257
$$ y = [6655106, 6446196, 6335312, 6282047, 6101035, 6128209, 6255792, 6433695, 6415227, 6536245, 6882152, 6935157, 7072073, 7108426, 7109642, 6920721, 6906251, 6513896, 6440626, 6375586, 6143343, 6014536, 5873210, 5753483, 5564713, 5367759, 5257090, 4936488, 5115909, 5218251, 5230557, 5131857, 4944809, 4756291, 4838884, 4799196, 4793197, 4636383, 4550388, 4705601, 4605534, 4595784, 4557721, 4449615, 4579418, 4381911, 4373387, 4433475, 4418943, 4263884, 4415440, 4548130, 4533130, 4490527, 4434430, 4500380, 4427032, 4402956, 4339009, 4314690, 4557083, 4635552, 4479488, 4380951, 4324740, 4212657, 4095878, 3918791, 3920871, 4224607, 4362463, 4109927, 3905309, 3906550, 4026625, 4034479, 3924924, 3873958, 4024399, 4228721, 4190479, 4112251, 3907223, 4045480]
2734D045480M2358n4286j43295J16173l7493l9211r7890J00034J15816j50848
2724C896838r3234k21393R154K98038k78343j36807M6109m2681o8707j26654k8304
2713C254016K34798J80682p4869Q0361J41596r8712L6049k03070r9239J68636
2703C620248J75258k34731P2871j12401o3866J24685K77632k68359k18254J82308
2693C555391K33235J02067j56914k33464n294m4884J1315q4184k58265O4410J03685
2682C287098L2510N0496M4405m5719J50923K8437L7409j02153Q9749j2296j93990
2671C366869L9494J5502M7873j13940l14739P6376J91336k00298J37445J81416
2661C427334J8597J0503l96649K29806J91053o6394k17377p4303K14409O9062
$$ y = [4045480, 4087838, 4033552, 3890257, 4006430, 3968937, 3929726, 3831836, 3931870, 4047686, 3896838, 3803604, 3582211, 3591365, 3889403, 3611060, 3474253, 3520362, 3477681, 3408974, 3282320, 3254016, 3488814, 3669496, 3594627, 3674988, 3816584, 3717872, 3753921, 3550851, 3451612, 3620248, 3795506, 3560775, 3633646, 3521245, 3457379, 3582064, 3859696, 3591337, 3373083, 3555391, 3788626, 3890693, 3733779, 3500315, 3495021, 3450137, 3461452, 3377268, 3119003, 3183413, 3287098, 3319608, 3370104, 3414509, 3368790, 3519713, 3548150, 3585559, 3483406, 3573155, 3560859, 3366869, 3406363, 3421865, 3469738, 3355798, 3041059, 3117435, 3308771, 3108473, 3245918, 3427334, 3445931, 3456434, 3059785, 3289591, 3480644, 3414250, 3196873, 3122570, 3336979, 3406041]
2651C406041J02939r6069l27733Q2171K74971r4190j03516K22457q9350J17544
2641C495265N2484k26957j17105n6595K2392K0364K8978N6676j61316l0833j20671
2630B962682N4047J15780k57017j68454M64305j35374j65705J87652r6029P1825
2620C033712n1908p1335Q101N434K33843k23654O2085P5650r1305J0805j74171
2609B817257l8284J96537M1087l8189J72221k35841L3499J48686j45577N6072
2599C007468j46907K39502j5124l25387L03388K0102l12360k39312J83669K74683
2589B989722J09111r4633M4227Q4951O2116k01419j55977L73500j63377m50355
2579B597866R8195j30857J20332L567j66600J28990J11629o3096r2642O77J46086
$$ y = [3406041, 3508980, 3412911, 3085178, 3167349, 3442320, 3348130, 3244614, 3467071, 3377721, 3495265, 3547749, 3320792, 3203687, 3147092, 3169484, 3189848, 3218826, 3275502, 3114186, 3083353, 2962682, 3016729, 3132509, 2875492, 2707038, 3171343, 3035969, 2870264, 3057916, 2961887, 3033712, 2981804, 2910469, 2918570, 2924004, 3157847, 2934193, 2996278, 3071928, 2980623, 2991428, 2817257, 2778973, 2975510, 3016597, 2978408, 3150629, 2914788, 2948287, 3096973, 2951396, 3007468, 2860561, 3100063, 3084939, 2759552, 3062940, 3083042, 2770682, 2531370, 2715039, 2989722, 3098833, 3004200, 3048427, 3133378, 3195494, 2994075, 2838098, 3211598, 3048221, 2597866, 2696061, 2565204, 2685536, 2689103, 2522503, 2651493, 2763122, 2700026, 2607384, 2608061, 2754147]
2568B754147k5483L52998K26573j23800k61039q9062j14957L3233P7970q1453
2558B749127p9227m7348O4249j7806J35307P8231j64444m16J99703R442k5298
2547B901520k76132R4724J53479k14304l5565J09893j00738o0675K955J46950
2537B722107n6729p3799J84298j6900J656M8010l5209J85843K3360l41763N3924
2526B694798K3196m3850k26083j53971L02870j8197o1085J16598Q8801N4120J11404
2515B888601j1225k6448R6352k04706L5603m5551J35108j3053q0747k5887k73384
2504B474663K40110J90681k6438l01440K4653K73490K53100J8796l01024L2250
2494B878841o890j18101L7638m038M2080j48614j15476r9751J47984j43209j70736
$$ y = [2754147, 2728664, 3081662, 3308235, 3184435, 2923396, 2834334, 2719377, 2752610, 2830580, 2749127, 2669900, 2622552, 2686801, 2668995, 2804302, 2882533, 2718089, 2717673, 2917376, 2926818, 2901520, 2625388, 2720112, 2873591, 2659287, 2623722, 2733615, 2632877, 2572202, 2575157, 2722107, 2665378, 2591579, 2775877, 2758977, 2760633, 2808643, 2773434, 2959277, 2982637, 2640874, 2694798, 2717994, 2674144, 2448061, 2294090, 2596960, 2578763, 2517678, 2634276, 2723077, 2777197, 2888601, 2877376, 2850928, 2947280, 2742574, 2778177, 2732626, 2867734, 2854681, 2773934, 2748047, 2474663, 2714773, 2905454, 2879016, 2577576, 2602229, 2875719, 3128819, 3147615, 2846591, 2878841, 2871951, 2753850, 2791488, 2787450, 2829530, 2680916, 2565440, 2465689, 2613673, 2470464, 2299728]
2483B299728K16498J8344K25123O5369k7114J31240j6079K5197q9187P9611l15701
2472B613029r4327J14844J25977j33115j89356K50161j97189K61857q8123r6818
2462B566940J82877q834q6685j5329k9180p8091o9212k04636L85428m3214j00259
2451B499805K25819j32402N7421j17584L26292P3973l37385l5973J82292L35697
2441C077955m7818r2968J9707m681j67797L8304J14576j11543M3258j96504R0810
2430B763299L11913p0163k14763p5564K79770O4220J15573K13876Q7776j0314
2420C465623k12125j04419L4697J91031l19938P6039L1812q2457L34814l0766
2410C384311j6141J51085J89610J13986J22257O2952N3205k8265J37898J97888
$$ y = [2299728, 2516226, 2534570, 2759693, 2825062, 2797948, 2929188, 2913109, 2938306, 2849119, 2928730, 2613029, 2518702, 2633546, 2759523, 2626408, 2437052, 2687213, 2490024, 2751881, 2663758, 2566940, 2749817, 2740983, 2654298, 2638969, 2609789, 2531698, 2462486, 2257850, 2643278, 2600064, 2499805, 2725624, 2593222, 2650643, 2533059, 2859351, 2933324, 2595939, 2559966, 2742258, 3077955, 3030137, 2937169, 2956876, 2952195, 2784398, 2822702, 2937278, 2825735, 2868993, 2672489, 2763299, 3075212, 3005049, 2790286, 2714722, 2994492, 3058712, 3174285, 3388161, 3475937, 3465623, 3253498, 3149079, 3183776, 3374807, 3054869, 3130908, 3162720, 3080263, 3415077, 3384311, 3368170, 3519255, 3708865, 3822851, 3945108, 4008060, 4061265, 4033000, 4170898, 4368786]
2400D368786R7875J16275j29263K17864O20764P70306Q25597L45916N22934P12547
2390H469601L66908K66673M40895R16564J028973J403592K809540M195192P374254
2381B7272192J1178579J4383602J7244557J3321049K553465l845678p943853j0205282
2373F3958631j0621801r759988q344074p098014n244048m085416k774612j623437
2365A4407241r64571o71466n34288q46147r37017o91277n26908o96412n53282
2356G985873n46974k08845k37359n65114l31738M2605j43155l03434p0933Q5451
2346E706377l82635m39062P94J60692k52179k04943l0159L51776j07115k18242
2336D585304j30037J44985Q9169l48005o1078L8035k13419l042M8278J36769j56191
$$ y = [4368786, 4466661, 4582936, 4453673, 4671537, 5292301, 6062607, 6888204, 7234120, 7757054, 8469601, 8836509, 9103182, 9544077, 10460641, 11489614, 12893206, 15702746, 19897938, 27272192, 38450771, 52834373, 70078930, 83399979, 85953444, 82107766, 74163913, 63958631, 53336830, 43576842, 35232768, 28134754, 22890706, 18805290, 16030678, 14407241, 13442670, 12771204, 12236916, 11390769, 10453752, 9762475, 9235567, 8539155, 7985873, 7438899, 7230054, 6992695, 6427581, 6095843, 6138448, 5995293, 5691859, 5620926, 5706377, 5323742, 4884680, 4885474, 5046166, 4793987, 4589044, 4558885, 4910661, 4803546, 4585304, 4455267, 4600252, 4689421, 4341416, 4280338, 4318373, 4104954, 4101912, 4150190, 4286959, 4130768]
2325D130768k76146l66991Q5788O8894p4423k07697q9910K7700L0051J11020j38676
2314C300378j98597J71840J34110p7248k31246n1141K98326J84698k56422k18538
2304C056160J73086J18133j29171j85167J04073q4845J29769k00055o2240J14457
2294C034200q1362q6229J9393N0514n3289p9993J55088J76114J00338j79049N9414
2283C115139Q0728K09830J14103q8543l22061k16706K17701K59347j94275k86558
2273B888705j75818K26567o6334j77320r1023K00161j37497k02269o2193M7337
2263B450316J60824o1400j12103J275O9183q8445o9265K99444q9838j75887j67031
2252B217073J77928J75984m1721j45789k8510K55565K8752P529M4557j19742Q0800
$$ y = [4130768, 3854622, 3487631, 3573419, 3642313, 3567890, 3360193, 3270283, 3297983, 3328034, 3439054, 3300378, 3101781, 3273621, 3407731, 3330483, 3099237, 3048096, 3346422, 3531120, 3274698, 3056160, 3229246, 3347379, 3218208, 3033041, 3137114, 3052269, 3182038, 2981983, 2919743, 3034200, 2952838, 2866609, 2886002, 2936516, 2883227, 2803234, 2958322, 3134436, 3234774, 3055725, 3115139, 3195867, 3405697, 3519800, 3431257, 3109196, 2892490, 3110191, 3369538, 3175263, 2888705, 2712887, 2939454, 2873120, 2695800, 2604777, 2804938, 2667441, 2465172, 2402979, 2450316, 2611140, 2549740, 2437637, 2438912, 2508095, 2419650, 2350385, 2649829, 2559991, 2384104, 2217073, 2395001, 2570985, 2529264, 2383475, 2354965, 2610530, 2639282, 2646811, 2691368, 2571626, 2652426]
2241B652426J24133r638l35870j75233N515J63586j97489k45771M932k1876J93750
2230B158465k6821J42392J607j57340R0806K05467k6586j97600j77786J66946
2220B179550J84785m962l99090L3694J36344J96594l25927j0395J98391J76910
2210B365894p1848j59379P7691q7603p3914q1137j79127k8948N4128L33239J0962
2199B159958l68k65300m590Q8419l0752O8840j08262o4129K38491J99020K84203
2188B565530k31861r4206l78274L0335Q7261o7720j50143J80428Q7424j48617
2178A880157j73227m879M42826o0046k56833N878J13516N2417r3767k8565N2628
2167A930105J1616N995q1966K12587j7095o887j94556J06586k4527p7510o845
$$ y = [2652426, 2776559, 2766921, 2431051, 2255818, 2261333, 2424919, 2227430, 1981659, 1986591, 1964715, 2158465, 2131644, 2274036, 2275643, 2118303, 2209109, 2414576, 2387990, 2190390, 2012604, 2179550, 2364335, 2359373, 1960283, 1993977, 2130321, 2326915, 2000988, 1990593, 2188984, 2365894, 2294046, 2134667, 2212358, 2124755, 2050841, 1969704, 1790577, 1761629, 1815757, 2148996, 2159958, 2159590, 1894290, 1889700, 1978119, 1947367, 2016207, 1907945, 1843816, 2082307, 2281327, 2565530, 2333669, 2239463, 1861189, 1891524, 1978785, 1911065, 1760922, 1941350, 2028774, 1880157, 1706930, 1702051, 2144877, 2084831, 1827998, 1833876, 1947392, 1999809, 1906042, 1877477, 1930105, 1941721, 1947716, 1865750, 2078337, 2061242, 2054355, 1859799, 1966385, 1941858, 1864348, 1857503]
2156A857503R7331K62598j54659j44159L3516l6158L6459p3067m2022k76725Q7810
2145A648427L10130O5098k69538K0878Q9948K10676q1644l58819J85401M92960
2135B313517j87238k4482p3614K38819j93022k28299m4478L05387j1552k81649
2125A813389m2632K5697k0624K4028J87415j9071p1027R8473j3314M7140n2828
2114A976646J2431J93613k2588l14162J78663L13810q4900j68594L9452K79109
2104B403480j34974k74324l30825K70226L87752m03712j08435J84911J40783m568
2094B130314j77485Q6462m957k81194j14541K04607k8827P9063k57999J83985
2084A819428J32517k24426J70966l3309j2058l3625q5125K37427j47093L8517
$$ y = [1857503, 1954834, 2217432, 2062773, 1918614, 1952130, 1915972, 1952431, 1879364, 1837342, 1560617, 1648427, 1958557, 2023655, 1754117, 1774995, 1864943, 2075619, 1993975, 1635156, 1820557, 2313517, 2126279, 2101797, 2028183, 2267002, 2073980, 1845681, 1801203, 2106590, 2095038, 1813389, 1770757, 1796454, 1775830, 1799858, 1987273, 1968202, 1897175, 1995648, 1982334, 2029474, 1976646, 1989077, 2182690, 2160102, 1845940, 2024603, 2338413, 2253513, 2084919, 2124371, 2403480, 2268506, 1994182, 1663357, 1933583, 2321335, 1917623, 1809188, 1994099, 2134882, 2130314, 1952829, 2039291, 2034334, 1753140, 1638599, 1843206, 1814379, 1893442, 1635443, 1819428, 1951945, 1727519, 1898485, 1865176, 1853118, 1819493, 1734368, 1971795, 1824702, 1863219]
2074A863219j28461p9551J41962r0285k791J72053j43131j70328r966K71206J35052
2063A958979j98324j28763J71913P7660J59105r3716K1955j2835l05802M1665
2053A691837K18061p4775j49881R8947K23438J81729j92088k94960K30347J16396
2043B049051R2071k52270j00164j62629j16093O3186R12J1983J06637k44k8881
2032A663559j42478l659K83029L13514m25391j47251K01489J39306K9240k33023
2022A678335J25420r4382M6700l5947p6446Q0091L0670j59622R0739m0919p483
2011A637156M0683k45213J84293K14065j22179n9938k13941K37355j21559n2982
2001A497740J57316k00270K3985J45271K4753K60332k61617L4694M0234j15342
$$ y = [1863219, 1734758, 1655207, 1797169, 1706884, 1704093, 1876146, 1733015, 1562687, 1552721, 1823927, 1958979, 1760655, 1631892, 1803805, 1881465, 2040570, 1946854, 1968809, 1955974, 1650172, 1691837, 1909898, 1835123, 1685242, 1784189, 2007627, 2189356, 1997268, 1702308, 1932655, 2049051, 2141122, 1888852, 1788688, 1626059, 1509966, 1573152, 1574064, 1586047, 1692684, 1692440, 1663559, 1521081, 1517422, 1800451, 2113965, 1688574, 1541323, 1742812, 1882118, 1911358, 1678335, 1803755, 1709373, 1756073, 1720126, 1643680, 1723771, 1754441, 1594819, 1685558, 1644639, 1637156, 1677839, 1432626, 1616919, 1830984, 1708805, 1648867, 1434926, 1672281, 1550722, 1497740, 1655056, 1454786, 1478771, 1624042, 1648795, 1909127, 1647510, 1682204, 1722438, 1607096]
1991A607096J30260R1218k06806J43983k43738l598K7914L2322J19490j33950
1981A564191M8343J33929q6065J11791j72144k50662J5895J53490L025l0343k28369
1970A263081K18133K99740q6974m1989j57802J69575K33571J03110j10690q5435
1960A804320J59680J7505k49959k55408r370j0242m7503J599J37436J93298j68134
1949A573222K23594o0586k33272j10389J030J65978K33430j40765J2216j34630
1939A529828P9571R2178j0149o3288q4013J00933K93853j54470k11245j27102
1929A446096J30025M68652j66750n35327K9017K81459J56133j30459j66724j5738
1919A496384R0009m9164J66432R669j69779n9629L19828K74139l23297j85504
$$ y = [1607096, 1737356, 1828574, 1621768, 1765751, 1522013, 1518415, 1546329, 1578651, 1698141, 1564191, 1612534, 1746463, 1660398, 1772189, 1600045, 1349383, 1365278, 1518768, 1521793, 1491450, 1263081, 1481214, 1780954, 1693980, 1651991, 1494189, 1663764, 1897335, 2000445, 1889755, 1804320, 1964000, 1981505, 1731546, 1476138, 1466768, 1456526, 1409023, 1410622, 1548058, 1741356, 1573222, 1796816, 1736230, 1502958, 1392569, 1393599, 1559577, 1793007, 1652242, 1664458, 1529828, 1609399, 1701577, 1691428, 1628140, 1544127, 1645060, 1938913, 1784443, 1573198, 1446096, 1576121, 2044773, 1878023, 1342696, 1371713, 1653172, 1809305, 1678846, 1512122, 1496384, 1586393, 1537229, 1703661, 1713330, 1543551, 1483922, 1803750, 2077889, 1754592, 1569088]
1909A569088N4241K38711J38695l56842j60026K59723q7486j82083J41869j36983
1899A478907L1806J650L9720J91693j17240j3687j8458J45043j25702m93932J78337
$$ y = [1569088, 1623329, 1862040, 2000735, 1643893, 1483867, 1743590, 1656104, 1474021, 1615890, 1478907, 1510713, 1512363, 1552083, 1743776, 1626536, 1612849, 1594391, 1739434, 1613732, 1119800, 1298137]
$$ [...]
##END NTUPLES=NMR SPECTRUM
##END=
