##TITLE=1H_DE-80H_X3
 200.13MHz, d2o
 8 sc
 
 19ns.26.2.2025
##JCAMPDX= 6.0         $$ Bruker NMR JCAMP-DX V2.0
##DATA TYPE= NMR SPECTRUM
##DATA CLASS= NTUPLES
##ORIGIN= UXNMR, Bruker Analytische Messtechnik GmbH
##OWNER= pz
$$ XWIN-NMR		Version 3.5
$$ Tue Jun 16 11:57:36 2026 Russian Standard Time (UT+4h)  Yarkov@DPX200
##.OBSERVE FREQUENCY= 200.1313
##.OBSERVE NUCLEUS= ^1H
##.ACQUISITION MODE= SIMULTANEOUS
##.ACQUISITION SCHEME= undefined
##.AVERAGES= 8
##.DIGITISER RES= 18
##SPECTROMETER/DATA SYSTEM= spect
##.PULSE SEQUENCE= zg30
##.SOLVENT NAME= DMSO
##.SHIFT REFERENCE= (INTERNAL, DMSO, 0, 15.4957)
##AUDIT TRAIL= $$ (NUMBER, WHEN, WHO, WHERE, WHAT)
$$ ##TITLE= Audit trail, XWIN-NMR		Version 3.5
$$ ##JCAMPDX= 5.01
$$ ##ORIGIN= Bruker BioSpin GmbH
$$ ##OWNER= Yarkov
$$ C:/Bruker/XWIN-NMR/data/yarkov2/nmr/H-C/1/pdata/1/auditp.txt
$$ ##AUDIT TRAIL=  $$ (NUMBER, WHEN, WHO, WHERE, WHAT)
(   1,<2026-06-16 11:56:31.87 +0400>,<Yarkov>,<DPX200>,
      <created by zg, POWCHK disabled, PULCHK disabled
       configuration hash MD5:
       00 E9 B6 7A A2 85 ED C7 34 08 36 98 17 FE 4E 26
       data hash MD5: 16K
       0F 88 6C D2 B7 C0 E1 5F 44 89 BD DE 9C 03 99 9B>)
(   2,<2026-06-16 11:56:39.68 +0400>,<Yarkov>,<DPX200>,
      <Start of raw data processing
       efp BC_mod = 2 LB = 0.25 FT_mod = 6 PKNL = 1 PHC0 = -6898.619 PHC1 = 13.42196 SI = 16K 
       data hash MD5: 16K
       5F 45 48 07 12 84 CF 71 3B 2A 32 31 BD 2B 0F B1>)
(   3,<2026-06-16 11:56:57.43 +0400>,<Yarkov>,<DPX200>,
      <pk PHC0 = -1.8 PHC1 = 0 
       data hash MD5: 16K
       70 72 58 6E 64 D5 02 1C 2B D2 FD A5 52 3D 4A 80>)
$$ ##END=
$$ 
$$ hash MD5
$$ 62 14 7F CE CF 67 75 B9 7A DA 29 F2 6B D9 A4 54
##$RELAX= 
##$RELAX= 
##$RELAX= 
##$RELAX= 
##$RELAX= 
##$RELAX= 
$$ Bruker specific parameters
$$ --------------------------
##$DU= <C:/Bruker/XWIN-NMR>
##$EXPNO= 1
##$NAME= <H-C>
##$PROCNO= 1
##$TYPE= <nmr>
##$USER= <yarkov2>
##$AMP= (0..31)
100 100 100 100 100 100 100 100 100 100 100 100 100 100 100 100 100 100 
100 100 100 100 100 100 100 100 100 100 100 100 100 100 
##$AQSEQ= 0
##$AQ_mod= 1
##$AUNM= <au_zg>
##$AUTOPOS= <>
##$BF1= 200.13
##$BF2= 200.13
##$BF3= 200.13
##$BF4= 200.13
##$BF5= 200.13
##$BF6= 200.13
##$BF7= 200.13
##$BF8= 200.13
##$BYTORDA= 1
##$CFDGTYP= 0
##$CFRGTYP= 5
##$CHEMSTR= <none>
##$CNST= (0..31)
1 1 145 1 1 1 1 1 1 1 1 1 1 1 1 1 1 1 1 1 1 1 1 1 1 1 1 1 1 1 1 1 
##$CPDPRG= <>
##$CPDPRG1= <>
##$CPDPRG2= <>
##$CPDPRG3= <>
##$CPDPRG4= <mlev>
##$CPDPRG5= <mlev>
##$CPDPRG6= <mlev>
##$CPDPRG7= <mlev>
##$CPDPRG8= <mlev>
##$CPDPRGB= <>
##$CPDPRGT= <>
##$D= (0..31)
0 0.7 0 0 0 0 0 0 0 0 0 0.03 0 0 0 0 0 0 0 0 0 0 0 0 0 0 0 0 0 0 0 0 
##$DATE= 1781596591
##$DBL= (0..7)
120 120 120 120 120 120 120 120 
##$DBP= (0..7)
150 150 150 150 150 150 150 150 
##$DBP07= 0
##$DBPNAM0= <>
##$DBPNAM1= <>
##$DBPNAM2= <>
##$DBPNAM3= <>
##$DBPNAM4= <>
##$DBPNAM5= <>
##$DBPNAM6= <>
##$DBPNAM7= <>
##$DBPOAL= (0..7)
0.5 0.5 0.5 0.5 0.5 0.5 0.5 0.5 
##$DBPOFFS= (0..7)
0 0 0 0 0 0 0 0 
$$ [...]
##$SUBNAM2= <"">
##$SUBNAM3= <"">
##$SUBNAM4= <"">
##$SUBNAM5= <"">
##$SUBNAM6= <"">
##$SUBNAM7= <"">
##$SUBNAM8= <"">
##$SUBNAM9= <"">
##$SW= 18.0517328524113
##$SWIBOX= (0..15)
0 0 2 0 0 0 0 0 0 0 0 0 0 0 0 0 
##$SW_h= 3612.71676300578
##$TD= 16384
##$TD0= 1
##$TE= 0
##$TE2= 300
##$TE3= 300
##$TEG= 300
##$TL= (0..7)
0 120 120 120 120 120 120 120 
##$TP= (0..7)
150 150 150 150 150 150 150 150 
##$TP07= 0
##$TPNAME0= <>
##$TPNAME1= <>
##$TPNAME2= <>
##$TPNAME3= <>
##$TPNAME4= <>
##$TPNAME5= <>
##$TPNAME6= <>
##$TPNAME7= <>
##$TPOAL= (0..7)
0.5 0.5 0.5 0.5 0.5 0.5 0.5 0.5 
##$TPOFFS= (0..7)
0 0 0 0 0 0 0 0 
##$TUNHIN= 0
##$TUNHOUT= 0
##$TUNXOUT= 0
##$USERA1= <user>
##$USERA2= <user>
##$USERA3= <user>
##$USERA4= <user>
##$USERA5= <user>
##$V9= 5
##$VALIST= <valist>
##$VCLIST= <CCCCCCCCCCCCCCC>
##$VD= 0
##$VDLIST= <DDDDDDDDDDDDDDD>
##$VPLIST= <PPPPPPPPPPPPPPP>
##$VTLIST= <TTTTTTTTTTTTTTT>
##$WBST= 1024
##$WBSW= 4
##$XGAIN= (0..3)
0 0 0 0 
##$XL= 0
##$YL= 0
##$YMAX_a= 24625
##$YMIN_a= -41659
##$ZGOPTNS= <>
##$ZL1= 120
##$ZL2= 120
##$ZL3= 120
##$ZL4= 120
##$ABSF1= 0
##$ABSF2= 0
##$ABSG= 0
##$ABSL= 0
##$ALPHA= 0
##$AQORDER= 0
##$ASSFAC= 0
##$ASSFACI= 0
##$ASSFACX= 0
##$ASSWID= 0
##$AUNMP= <proc_1d>
##$AZFE= 0.1
##$AZFW= 0.1
##$BCFW= 0
##$BC_mod= 2
##$BYTORDP= 0
##$COROFFS= 0
##$CY= -3
##$DATMOD= 1
##$DC= 0
##$DFILT= <>
##$DTYPP= 0
##$F1P= 0
##$F2P= 0
##$FCOR= 1
##$FTSIZE= 16384
##$FT_mod= 6
##$GAMMA= 0
##$GB= 0
##$INTBC= 1
##$INTSCL= 3.241238e-09
##$ISEN= 128
##$LB= 0.25
##$LEV0= 0
##$LPBIN= 0
##$MAXI= 10000
##$MC2= 0
##$MEAN= 0
##$ME_mod= 0
##$MI= 1.114404
##$NCOEF= 0
##$NC_proc= -9
##$NLEV= 6
##$NOISF1= 3.799351
##$NOISF2= 2.8
##$NSP= 0
##$NTH_PI= 0
##$NZP= 0
##$OFFSET= 15.49568
##$PC= 1
##$PHC0= -6900.419
##$PHC1= 13.42196
##$PH_mod= 1
##$PKNL= yes
##$PPARMOD= 0
##$PSCAL= 0
##$PSIGN= 0
##$REVERSE= no
##$SF= 200.130005207588
##$SI= 16384
##$SIGF1= 3
##$SIGF2= 2
##$SINO= 0.751879
##$SIOLD= 32768
##$SREGLST= <19F.Aceton>
##$SSB= 0
##$STSI= 16384
##$STSR= 0
##$SW_p= 3612.71676300578
##$SYMM= 0
##$S_DEV= 0
##$TDeff= 16384
##$TDoff= 0
##$TI= <>
##$TILT= no
##$TM1= 0
##$TM2= 0
##$TOPLEV= 0
##$USERP1= <user>
##$USERP2= <user>
##$USERP3= <user>
##$USERP4= <user>
##$USERP5= <user>
##$WDW= 1
##$XDIM= 16384
##$YMAX_p= 371599900
##$YMIN_p= -1392140
$$ End of Bruker specific parameters
$$ ---------------------------------
##NTUPLES= NMR SPECTRUM
##VAR_NAME=  FREQUENCY,     SPECTRUM/REAL,   SPECTRUM/IMAG
##SYMBOL=    X,             R,               I
##VAR_TYPE=  INDEPENDENT,   DEPENDENT,       DEPENDENT
##VAR_FORM=  AFFN,          ASDF,            ASDF
##VAR_DIM=   16384,         16384,           16384
##UNITS=     HZ,            ARBITRARY UNITS, ARBITRARY UNITS
##FACTOR=    0.220516191357247, 1,           1
##FIRST=     3101.15049014565, 0,            0
##LAST=      -511.566272860133, 0,           0
##MIN=       -511.566272860133, -1392140,    0
##MAX=       3101.15049014565, 371599900,    0
$$ Real data points
##PAGE= N=1
##DATA TABLE= (X++(R..R)), XYDATA
$$ [...]
5187I864719J86304j15554n57915K5817J34994l5543K58452r3218k02668l50110
$$ 9864719 10051023 9935469 9377554 9403371 9538365 9502822 9761274 9668056 9465388 9115278
5177I115278R5682k72993M2776j21622J41491O390L39067m8563K97055K6514m07976
$$ 9115278 9210960 8937967 8980743 8859121 9000612 9007002 9346069 9297506 9594561 9621075 9213099
5166I213099R1390J16861l41442K69520M57594j04020R8970L6496j16858q9270
$$ 9213099 9304489 9421350 9079908 9349428 9807022 9703002 9801972 9838468 9721610 9632340
5156I632340R8453k66149J88231K65238j63829j81659K69781N3960n106J29472
$$ 9632340 9730793 9464644 9652875 9918113 9754284 9572625 9842406 9896366 9891260 10020732
5146A0020732o0416j07301O05695J93824n2372j9686k0704j57342J56837m99L2257
$$ 10020732 9960316 9853015 10458710 10652534 10600162 10580476 10559772 10402430 10559267 10558768 10591025
5135A0591025P7779q3174J97296L03906m33269j58395K36794k82231K96018L0088
$$ 10591025 10668804 10585630 10782926 11086832 10653563 10495168 10731962 10449731 10745749 10775837
5125A0775837q5603J39491L58706P2731n38945j68526M4326K39983M12162k8201
$$ 10775837 10690234 10829725 11188431 11261162 10722217 10553691 10598017 10838000 11250162 11221961
5115A1221961J78148K7573R3672J49439J91835k08981J80097J73111K68662M52540
$$ 11221961 11400109 11427682 11521354 11670793 11862628 11653647 11833744 12006855 12275517 12728057
5105A2728057n9978k14170P2157M6590K80808j41924M33278j9329L7344K82174
$$ 12728057 12668079 12453909 12526066 12572656 12853464 12711540 13144818 13125489 13162833 13445007
5095A3445007r3726j58694k74683L41512k45549m52409Q9419j87417j4928K22486
$$ 13445007 13351281 13192587 12917904 13259416 13013867 12561458 12650877 12463460 12448532 12671018
5085A2671018O7372P1528j06976q3284m38316l9467J63677j54753j9516J53549
$$ 12671018 12738390 12809918 12702942 12619658 12181342 12141875 12305552 12150799 12131283 12284832
5075A2284832J46738P1974j89877j87529k2175k15749l1392L6105L57471l01097
$$ 12284832 12431570 12503544 12313667 12126138 12103963 11888214 11856822 11892927 12250398 11949301
5065A1949301j01715j11206n19728J95356j34964m28645L11357r8351k06816J42758
$$ 11949301 11847586 11736380 11216652 11412008 11277044 10848399 11159756 11061405 10854589 10997347
5055A0997347M386q82158m3030L35225p14094J90591m7376j38008l69823J95616
$$ 10997347 11001733 10119575 10076545 10411770 9697676 9888267 9840891 9702883 9333060 9528676
5045I528676k84743M4842o187l37242r975r2598n6316j97943L742k07953J31439
$$ 9528676 9243933 9288775 9282588 8945346 8935371 8842773 8786457 8588514 8592256 8384303 8515742
5034H515742K90114l56751L1816j15503o09756j41723L99476m68775k12387L04855
$$ 8515742 8805856 8449105 8480921 8365418 7755662 7613939 8013415 7544640 7332253 7637108
5024G637108j40669k70349O32137q8936m42718K143L1268q5768J38073l94618
$$ 7637108 7496439 7226090 7858227 7769291 7326573 7328716 7359984 7274216 7412289 7017671
5014G017671K79994L34662J96422L6193m8844L1870O3263j63348q36986O51967
$$ 7017671 7297665 7632327 7828749 7864942 7816098 7847968 7911231 7747883 6910897 7562864
5004G562864N46363O251J37470j17284l81230J9088N36878J48517k37785M70608
$$ 7562864 8109227 8115478 8252948 8135664 7754434 7773522 8310400 8458917 8221132 8691740
4994H691740N43446J50455M95051K93818k61782J49913L62278j44308M5025n7388
$$ 8691740 9235186 9385641 9880692 10174510 9912728 10062641 10424919 10280611 10325636 10268248
4984A0268248l91964o6361l58532K75775j04851q1151J44167K18269k8173R5520
$$ 10268248 9876284 9809923 9451391 9727166 9622315 9541164 9685331 9903600 9875427 9970947
4974I970947n5891m3783P8704L33302k25373k47740K15314k2618J8921P3710n6918
$$ 9970947 9915056 9871273 9949977 10283279 10057906 9810166 10025480 10002862 10021783 10095493 10038575
4963A0038575k23073r2706M93544J36553K5903k12636Q8199j85583l51248L50777
$$ 10038575 9815502 9722796 10216340 10352893 10378796 10166160 10254359 10068776 9717528 10068305
4953A0068305m2837P7228O2276J85995j44897m6611K37762l61090K72080M47532
$$ 10068305 10025468 10102696 10164972 10350967 10206070 10159459 10397221 10036131 10308211 10755743
4943A0755743l27453K67485M77910l9178k01112L44587L23864m36475J74171j52812
$$ 10755743 10428290 10695775 11173685 11134507 10933395 11277982 11601846 11165371 11339542 11186730
4933A1186730k26749Q133J04987R3054m74376k26431m7804J36870J8432k0379
$$ 11186730 10959981 10968114 11073101 11166155 10691779 10465348 10417544 10554414 10572846 10552467
4923A0552467l8823j69713Q1777k03434m59263J0163l9820K70258J8390j27214
$$ 10552467 10513644 10343931 10425708 10222274 9763011 9773174 9733354 10003612 10022002 9894788
4913I894788l85225L55204J61921J04236j54847k47931r4501J82091m7224J17909
$$ 9894788 9509563 9864767 10026688 10130924 9976077 9728146 9633645 9815736 9768512 9886421
4903I886421o7604N3780M39140L36196j96149j52395J13906J05134J41917J72412
$$ 9886421 9818817 9872597 10311737 10647933 10451784 10299389 10413295 10518429 10660346 10832758
4893A0832758M9815n2712L07468J65414J39079n2838M22036Q5861K86131J35858
$$ 10832758 10882573 10829861 11137329 11302743 11441822 11388984 11811020 11896881 12183012 12318870
4883A2318870k70673p691M8868J93105L08100j45631J57731J3879L6631l56701
$$ 12318870 12048197 12040506 12089374 12282479 12590579 12444948 12602679 12616558 12653189 12296488
4873A2296488j94574q87225j1767R37277j21963J96665K78050m0827K04352M44437
$$ 12296488 12101914 11214689 11202922 12140199 12018236 12214901 12492951 12452124 12656476 13100913
4863A3100913j10127j50620P66826O67681L17732L68749l63596M98550J029913
$$ 13100913 12990786 12840166 13606992 14274673 14592405 14961154 14597558 15096108 16126021
4854A6126021N87564P98662P34913K52460N78412J40535k64806k93338l3094m32449
$$ 16126021 16713585 17512247 18247160 18499620 19078032 19218567 18953761 18660423 18627329 18194880
4844A8194880m67911K34842k84622J20049J02424J62907P4893P56785P47471J27887
$$ 18194880 17726969 17961811 17677189 17797238 17899662 18062569 18137462 18894247 19641718 19769605
4834A9769605J304706Q67416R24306K293390K398327L674785N793058R302168
$$ 19769605 21074311 21941727 22866033 25159423 27557750 31232535 37025593 46327761
4826D6327761J1528580R901495K502683k901478m298367q023172p052549n363342
$$ 46327761 57856341 67757836 70260519 67359041 63060674 55037502 47984953 42621611
4818D2621611n390448m757817m178104l250219k243564r40046j124470r28953
$$ 42621611 37231163 32473346 28295242 25045023 22801459 21861413 20736943 19807990
4810A9807990j15327p24491o38528n76620l37112m77298q6479j51370n25523o7333
$$ 19807990 19692663 18968172 18329644 17753024 17415912 16938614 16852135 16700765 16175242 16107909
4800A6107909o7372n48220l06087m72094m05031L9449n24116Q685k57644k75462
$$ 16107909 16040537 15492317 15186230 14714136 14309105 14348554 13824438 13833123 13575479 13300017
4790A3300017k05231J64803j26594p90454j41116m42436j97993L46667m52910
$$ 13300017 13094786 13259589 13132995 12342541 12201425 11758989 11560996 11907663 11454753
4781A1454753J49737K39539J31027k08512R205O71086l68881N6431k61021l45848
$$ 11454753 11604490 11844029 11975056 11766544 11775749 12446835 12077954 12134385 11873364 11527516
4771A1527516J54601k08641j17422J6036J20284j99200M220R8022m07063j21465
$$ 11527516 11682117 11473476 11356054 11372090 11492374 11293174 11297394 11395416 10988353 10866888
4761A0866888k57391j82252J00735l773j30953j15057L21752l70573p6651L72107
$$ 10866888 10609497 10427245 10527980 10524207 10393254 10278197 10599949 10229376 10152725 10524832
4751A0524832k13810J07658l7234l38060q5747K73884P34024q577K93884K38942
$$ 10524832 10311022 10418680 10381446 10043386 9957639 10231523 10965547 10956970 11250854 11489796
4741A1489796J46441O95547M78048N39991J28949R9762M47261O19380O88442K93597
$$ 11489796 11636237 12331784 12809832 13349823 13478772 13578534 14025795 14645175 15333617 15627214
4731A5627214N042M79157L72021N33408j34050K51435K41297k09345K26857k57882
$$ 15627214 15632256 16111413 16483434 17016842 16882792 17134227 17375524 17166179 17393036 17135154
4721A7135154J78861J18075R8489N74566P1819M52609K47447N5503M41421K81329
$$ 17135154 17314015 17432090 17530579 18105145 18176964 18629573 18877020 18932523 19373944 19655273
4711A9655273J41046L24212R38554O64917Q18972Q66342L79853Q1233o6221M08390
$$ 19655273 19796319 20120531 21059085 21724002 22542974 23409316 23789169 23870402 23804181 24212571
4701B4212571J20620l29039m7221J40783p0764o03112L98004k31809r49849j70167
$$ 24212571 24333191 24004152 23956931 24097714 24026950 23423838 23821842 23590033 22640184 22470017
4691B2470017l56555k88713K15611j08078o90631k5601k54024m53135j95343O7709
$$ 22470017 22113462 21824749 22040360 21932282 21241651 21216050 20962026 20508891 20313548 20381257
4681B0381257k79615J30875J55300k92231r84282j122826p62767p58407k36721
$$ 20381257 20101642 20232517 20387817 20095586 19111304 17988478 17225711 16467304 16230583
4672A6230583m14555l91073N790o15743k052j051690q93451m09882n33314m25297
$$ 16230583 15816028 15424955 15430745 14815002 14812950 13761260 12867809 12457927 11924613 11499316
4662A1499316l36545K04889m92528q6588K97181r76526K6854J52862k18608M09712
$$ 11499316 11162771 11367660 10875132 10788544 11085725 10109199 10136053 10288915 10070307 10480019
4652A0480019j4212l8700l19545R6033m42601J85211k57208k09707N01557M03237
$$ 10480019 10465807 10427107 10107562 10203595 9760994 9946205 9688997 9479290 9980847 10384084
4642A0384084R4409o2232o62313l78544R8730J40171q8301L33311N57692L58094
$$ 10384084 10478493 10416261 9753948 9375404 9474134 9614305 9526004 9859315 10417007 10775101
4632A0775101L96949O61783K08649Q21868J779131K997815L019781K720957J175182
$$ 10775101 11172050 11833833 12042482 12864350 14643481 17641296 20661077 23382034 24557216
4623B4557216l20638j32426j906715k322831j543458j278294n1387k11558l63633
$$ 24557216 24236578 24104152 22197437 19874606 18331148 17052854 17001467 16789909 16426276
4614A6426276J82635L45373Q82163J241679K202856J703434K441071K290555J417620
$$ 16426276 16608911 16954284 17836447 19078126 21280982 22984416 25425487 27716042 29133662
4605B9133662J385421O09074J353815J519684K165802K145589K069013K060305
$$ 29133662 30519083 31128157 32481972 34001656 36167458 38313047 40382060 42442365
4597D2442365N46641P30093N71467P98163K333389K396928K754875J701988K63436
$$ 42442365 42989006 43719099 44290566 45088729 47422118 49819046 52573921 54275909 54539345
4588E4539345k06065r54314j328247j424220r88101p45778j130979k134194k572201
$$ 54539345 54333280 53378966 52050719 50626499 49638398 48892620 47761641 45627447 43055246
4579D3055246k713288k628502k734779k340733j875999j748160j745469j867606
$$ 43055246 40341958 37713456 34978677 32637944 30761945 29013785 27268316 25400710
4571B5400710j733683k061893j839135j297894j401583j648467j506311q04497
$$ 25400710 23667027 21605134 19765999 18468105 17066522 15418055 13911744 13107247
4563A3107247p47830k56243o32822k27227J31998m85185J63007l10691k33641
$$ 13107247 12359417 12103174 11470352 11243125 11375123 10889938 11052945 10742254 10508613
4554A0508613j84425j11286K02567j30266J09087m26454J02862q2618j03273m9629
$$ 10508613 10324188 10212902 10415469 10285203 10394290 9967836 10070698 9988080 9884807 9835178
4544I835178L25342M7705k24401l92270M7590l21951Q9100L28503r5844K06046
$$ 9835178 10160520 10208225 9983824 9591554 9639144 9317193 9406293 9734796 9638952 9844998
4534I844998Q0593L54815K2483J23140j2861J7328K44462j09671L35382K79935
$$ 9844998 9925591 10280406 10302889 10426029 10413168 10430496 10674958 10565287 10900669 11180604
4524A1180604L82367L35235j5261Q4868L67599N56009M97928K50724n8410K83056
$$ 11180604 11562971 11898206 11882945 11967813 12335412 12891421 13389349 13640073 13581663 13864719
4514A3864719P86367Q11692Q6810P27952O14966J073236J301115J547285J699133
$$ 13864719 14651086 15462778 15549588 16277540 16892506 17965742 19266857 20814142 22513275
4505B2513275J042452K039258K088365K209109K934482L335230M857309N913302
$$ 22513275 23555727 25594985 27683350 29892459 32826941 36162171 41019480 46932782
4497D6932782O592201O534089O538235O415910M951388L184548j85366j970402
$$ 46932782 53524983 60059072 66597307 73013217 77964605 81149153 80963787 78993385
4489G8993385l804444n501036n776257o620497o603167o209074m598744m384998
$$ 78993385 75188941 69687905 63911648 57291151 50687984 44478910 39880166 35495168
4481C5495168m103586k687970k449010j810099j439732j414265j499618o21064
$$ 35495168 31391582 28703612 26254602 24444503 23004771 21590506 20090888 19469824
4473A9469824N23712l6237J05373L66345K76483j38364m60489o69098j167235
$$ 19469824 19993536 19957299 20062672 20429017 20705500 20567136 20106647 19437549 18270314
4464A8270314q36561n68535j105109j207499j537527r79978m20672p88760j166597
$$ 18270314 17433753 16865218 15760109 14552610 13015083 12035105 11614433 10825673 9659076
4455I659076p65097m52255M51272k95501n69010n90712J30577j21242j14488J3271
$$ 9659076 8893979 8441724 8892996 8597495 8028485 7437773 7568350 7447108 7332620 7345891
4445G345891r14872M2910J45590j38446k93227n09044k11339l86359L76743k05614
$$ 7345891 6431019 6473929 6619519 6481073 6187846 5678802 5467463 5081104 5457847 5252233
4435E252233k44214K54317n2483P18398o34702m72294o1406P9400M35490L20519
$$ 5252233 5008019 5262336 5209853 5928251 5293549 4821255 4759849 4839249 5274739 5595258
4425E595258Q9258j69505q5175O86774k04083k98621j69193J31590K37574K65169
$$ 5595258 5684516 5515011 5429836 6116610 5912527 5613906 5444713 5576303 5813877 6079046
4415F079046r8652l64518N01378J49403k77018m35859j77058L0367L43174l67733
$$ 6079046 5980394 5615876 6117254 6266657 5989639 5553780 5376722 5407089 5750263 5382530
4405E382530m25126m50692K01190L16393m0358j01734m17355M91934K6995m5450
$$ 5382530 4957404 4506712 4707902 5024295 4983937 4882203 4464848 4956782 4983777 4938327
4395D938327m50457o91487M35237m8698k01918q7242K26911L78267r2392L63253
$$ 4938327 4487870 3796383 4231620 4182922 3981004 3893762 4120673 4498940 4406548 4769801
4385D769801m33564r3002R6785J88369J5457n80803O65730M70933Q0250p6315
$$ 4769801 4336237 4243235 4340020 4528389 4543846 3963043 4628773 5099706 5179956 5103641
4375E103641m64264L9002j24093R58474K48595L4341M4171r1732P25534K50721
$$ 5103641 4639377 4678379 4554286 5512760 5761355 5795696 5839867 5748135 6473669 6724390
4365F724390J20433J06851q2378K53021p8909n07033P4108l66862l74125l92885
$$ 6724390 6844823 6951674 6869296 7122317 7043408 6536375 6610483 6243621 5869496 5476611
4355E476611l96685j41720l68335M78453J23858m85002q2220k62483o3345m54274
$$ 5476611 5079926 4938206 4569871 5048324 5172182 4687180 4604960 4342477 4279132 3824858
4345C824858K82408j19120K04182L54418j34889J51367j72850J32967L2889J00164
$$ 3824858 4107266 3988146 4192328 4546746 4411857 4563224 4390374 4523341 4556230 4656394
4335D656394Q3202J39011M25257R6817k14051k66555j78553L40179K230n3519
$$ 4656394 4739596 4878607 5303864 5400681 5186630 4920075 4741522 5081701 5083931 5030412
4325E030412j21640L30186J16363N3457L47411p23669n7961K10569J41464J70503
$$ 5030412 4908772 5238958 5355321 5408778 5756189 5032520 4974559 5185128 5326592 5497095
4315E497095P1222L36731p4822J85538m82291k90860L85422l3067k81007r2082
$$ 5497095 5568317 5905048 5830226 6015764 5533473 5242613 5628035 5594968 5313961 5221879
4305E221879n2382L58069J93849p6606p1790l69294k0783j2719N66336n52296
$$ 5221879 5169497 5527566 5721415 5644809 5573019 5203725 5182942 5170223 5736559 5184263
4295E184263j19740M91729J01990J86209P7549N174j26638K78653R79730l49631
$$ 5184263 5064523 5556252 5658242 5844451 5922000 5927174 5800536 6079189 7058919 6709288
4285F709288N6508k59072K2254N11540k86080N7621J36520J49948J98850J32285
$$ 6709288 6765796 6506724 6528978 7040518 6754438 6812059 6948579 7098527 7297377 7429662
4275G429662K026r6932L55210R8369k21381M53813k66496L22063K82281J80132
$$ 7429662 7431688 7334756 7689966 7788335 7566954 8020767 7754271 8076334 8358615 8538747
4265H538747m34180L11476L14527l55956J25010J264j44198r5408M1727k25732
$$ 8538747 8104567 8416043 8730570 8374614 8499624 8500888 8356690 8261282 8303009 8077277
4255H077277k40602N28665K38986K81370J19393k95159J21935K16010j54220j24712
$$ 8077277 7836675 8365340 8604326 8885696 9005089 8709930 8831865 9047875 8893655 8768943
4245H768943k63789j52063Q56014M17262j03207K71456N79198P8084M48140M33177
$$ 8768943 8505154 8353091 9209105 9626367 9523160 9794616 10373814 10451898 10900038 11333215
4235A1333215K48667J318833J091473J432560J616537K841918M853379O946580
$$ 11333215 11581882 12900715 13992188 15424748 17041285 19883203 24736582 31683162
4227C1683162R286288O401201J276768j886152l805219n472142n287107m449258
$$ 31683162 40969450 47370651 48647419 46761267 42956048 37483906 32196799 27747541
4219B7747541l700785k866267k308902k032556r80998j099996R6677J9598q12514
$$ 27747541 24046756 21180489 18871587 16839031 15858033 14758037 14854714 14874312 14061798
4210A4061798J2057n65867n19740k92350M31880k22377k14945J36386m22795J82767
$$ 14061798 14073855 13507988 12988248 12695898 13127778 12905401 12690456 12826842 12404047 12586814
4200A2586814K44672n10627o12953k01642k77430n54935k41617k24585k35235
$$ 12586814 12831486 12320859 11707906 11506264 11228834 10673899 10432282 10207697 9972462
4191I972462l8662N7883j15118j30647m93272J57106j23620k51432j38572j5785
$$ 9972462 9933800 9991683 9876565 9745918 9252646 9409752 9286132 9034700 8896128 8880343
4181H880343K87062r6861M23606k99535l49960L17759K9472J0329j08021j89883
$$ 8880343 9167405 9070544 9494150 9194615 8844655 9162414 9191886 9202215 9094194 8904311
4171H904311O4696L08819M05802o25941j78439l90307L23449L80558n15499J26550
$$ 8904311 8969007 9277826 9683628 9057687 8879248 8488941 8812390 9192948 8677449 8803999
4161H803999l41695j88375m90749j31880J31273J94584M80746q1454l75238l79333
$$ 8803999 8462304 8273929 7783180 7651300 7782573 7977157 8457903 8376449 8001211 7621878
4151G621878k17977J40835J40324L65998k21700R5145L66154m8051K13092j42060
$$ 7621878 7403901 7544736 7685060 8051058 7829358 7924503 8290657 8242606 8455698 8313638
4141H313638m1824K00444J89635L06000j58471q6036L54373r0497j06384m0177
$$ 8313638 8271814 8472258 8661893 8967893 8809422 8723386 9077759 8987262 8880878 8840701
4131H840701J73623Q4636k4668K74010j93998J88745j03719l88762q6208k70292
$$ 8840701 9014324 9098960 9074292 9348302 9154304 9343049 9239330 8850568 8764360 8494068
4121H494068L93712K90145K36507K72689j75085l0531j2295M59199k1077j29802
$$ 8494068 8887780 9177925 9414432 9687121 9512036 9481505 9469210 9928409 9907332 9777530
4111I777530J29503N1363M34638L75654j5600j54746N37459l8543p8759M93441
$$ 9777530 9907033 9958396 10393034 10768688 10753088 10598342 11135801 11097258 11018499 11511940
4101A1511940J03061o9138L01709K18970j97920M6860J26617M62295O73043J79920
$$ 11511940 11615001 11545863 11847572 12066542 11868622 11915482 12042099 12504394 13177437 13357357
4091A3357357j50530J33790L4266R5325j04193l5879O48321N50920J91679N9442
$$ 13357357 13206827 13340617 13374883 13470208 13366015 13330136 13978457 14529377 14721056 14780498
4081A4780498N76221M32277J62166M47265J5509M7040P54951K91027K01150k02370
$$ 14780498 15356719 15788996 15951162 16398427 16413936 16460976 17215927 17506954 17708104 17505734
4071A7505734K94372R2330O0772K92450k85084J19686Q44528L3881J12336m63785
$$ 17505734 17800106 17892436 17953208 18245658 17960574 18080260 18924788 18958669 19071005 18607220
4061A8607220k35421M64449O85773O79916N77418Q99768R13252K424851K494700
$$ 18607220 18371799 18836248 19522021 20201937 20779355 21679123 22592375 25017226 27511926
4052B7511926J656562J218692J08373j52030o13425q45308q29159m98635N7396
$$ 27511926 29168488 30387180 30495553 30343523 29730098 28884790 28055631 27556996 27614392
4043B7614392r32491k99144r3893m16324K24149M85306l58359k34671J47943K27315
$$ 27614392 26681901 26382757 26288864 25872540 26096689 26581995 26223636 25988965 26136908 26364223
4033B6364223j22458q5498p3722L36409O01070J38771p9601J05937p6228J71667
$$ 26364223 26241765 26156267 26082545 26418954 27020024 27158795 27079194 27185131 27108903 27280570
4023B7280570L39460K74265J38404K30235p7998R6100L59756k27854K34773P2291
$$ 27280570 27620030 27894295 28032699 28262934 28184936 28281036 28640792 28412938 28647711 28720002
4013B8720002m30818k72898K65712J80815j94845M65463K30549j60508M17867
$$ 28720002 28289184 28016286 28281998 28462813 28267968 28733431 28963980 28803472 29221339
4004B9221339J76102M47382k45666j3032J26321L43410O3352l23566L64237j98126
$$ 29221339 29397441 29844823 29599157 29586125 29712446 30055856 30119208 29795642 30159879 29961753
3994B9961753k52371k03822p99599m85890m09304o97915m82411k14426m81990
$$ 29961753 29709382 29505560 28705961 28220071 27810767 27112852 26630441 26416015 25934025
3985B5934025k43706J52239n70666p16613J7018j59902m70882j69054m41513l1169
$$ 25934025 25690319 25842558 25271892 24555279 24572297 24412395 23941513 23772459 23330946 23299777
3975B3299777l20973L8232j95128l97582K78317J59090J85754L08326J65494K96779
$$ 23299777 22978804 23017036 22821908 22424326 22702643 22861733 23047487 23355813 23521307 23818086
3965B3818086n28210K21807J56849j57915K59548K98045J13970r1425N29176n16783
$$ 23818086 23289876 23511683 23668532 23510617 23770165 24068210 24182180 24090755 24619931 24103148
3955B4103148j95278K96217J89625N47441J094775K052284J472198J232888L11482
$$ 24103148 23907870 24204087 24393712 24941153 26035928 28088212 29560410 30793298 31104780
3946C1104780l59703o93020j001301p03123r82187j75514n49081p74957q95118
$$ 31104780 30745077 30052057 29050756 28347633 27365446 27189932 26640851 25865894 24970776
3937B4970776o88626l27503m41385l6826j87911l61127J63158K65943j08097k0618
$$ 24970776 24282150 23954647 23513262 23476436 23288525 22927398 23090556 23356499 23248402 23227784
3927B3227784J56601M35415M75793O57728L36469L34010P51315R40532R09088
$$ 23227784 23384385 23819800 24295593 24953321 25289790 25623800 26375115 27315647 28224735
3918B8224735J311835P06321J32223n71664j071575j705552j580795j083683j178662
$$ 28224735 29536570 30242891 30375114 29803450 28731875 27026323 25445528 24361845 23183183
3909B3183183j275203j395404p41577j65398O5644r4440j90927l27470k01953
$$ 23183183 21907980 20512576 19770999 19605601 19671245 19576805 19385878 19058408 18856455
3900A8856455k96488Q2912J61633L2061l62316J58086K19315R6904k27707m86000
$$ 18856455 18559967 18642879 18804512 18836573 18474257 18632343 18851658 18948562 18720855 18234855
3890A8234855p14021p3421j62116O3208n1675O1463L75q3072l19267j87832j91770
$$ 18234855 17520834 17447413 17285297 17348505 17296830 17358293 17358668 17275596 16956329 16768497 16576727
3879A6576727m1804r4892Q3141m828J2820l6835k42163m45663m18511K03199o3730
$$ 16576727 16534923 16440031 16523172 16518344 16531164 16494329 16252166 15806503 15387992 15591191 15527461
3868A5527461J77506N09876K95964J28899j05897n1152J89857P5785L33262k6897
$$ 15527461 15704967 16214843 16510807 16639706 16533809 16482657 16672514 16748299 17081561 17054664
3858A7054664O93808J78165K98590M18207j30515l11995j80985Q9122k02073K53
$$ 17054664 17748472 17926637 18225227 18643434 18512919 18200924 18019939 18109061 17906988 17907241
3848A7907241P3488p39059n80783k73676k72400k41313n11958l56246q4774L60010
$$ 17907241 17980729 17241670 16660887 16387211 16114811 15873498 15361540 15005294 14920520 15280530
3838A5280530J08249m90601J04883L96167K16804j65239N0162K9081K5643J46427
$$ 15280530 15388779 14898178 15003061 15399228 15616032 15450793 15500955 15530036 15555679 15702106
3828A5702106j69840l19739l61735k1043p7757j77911K26153K04149j26432K89488
$$ 15702106 15532266 15212527 14850792 14829749 14751992 14574081 14800234 15004383 14877951 15167439
3818A5167439j03988k67895J85566j17248k3497K04392J67062j63801p2798J50535
$$ 15167439 15063451 14795556 14981122 14863874 14840377 15044769 15211831 15048030 14975232 15125767
3808A5125767j86414n00878n82018j39213j95011j29010L46845J00901p1779k11577
$$ 15125767 14939353 14438475 13856457 13717244 13522233 13393223 13740068 13840969 13769190 13557613
3798A3557613M78055n25744j74670o9483k75289L37143O1357O5741j50626R4911
$$ 13557613 14035668 13509924 13335254 13265771 12990482 13327625 13388982 13454723 13304097 13399008
3788A3399008q3213o98554m54423m33338k48941k16332M95747K30278n36937o1463
$$ 13399008 13315795 12617241 12162818 11729480 11480539 11264207 11759954 11990232 11453295 11391832
3778A1391832l80502o78871l03934N96648K5876m4688R6264L02791j79840l97314
$$ 11391832 11011330 10332459 10028525 10625173 10651049 10606361 10702625 11005416 10825576 10428262
3768A0428262m44862l67783j05561L96641P99028J86792k49077j12414m85853
$$ 10428262 9983400 9615617 9510056 9906697 10705725 10892517 10643440 10531026 10045173
3759A0045173K71550J59445K9707L09649k1415L58820J63141L2099M1239l20844
$$ 10045173 10316723 10476168 10505875 10815524 10794109 11152929 11316070 11348169 11389408 11068564
3749A1068564n53478l1607N2550k67899M32900k35904n86968K01197o78150l51784
$$ 11068564 10515086 10483479 10536029 10268130 10701030 10465126 9878158 10079355 9401205 9049421
3739I049421j07385K60920q9326M24954M19258p4369l44020l97049m60724l40427
$$ 9049421 8942036 9202956 9113630 9538584 9957842 9883473 9539453 9142404 8681680 8341253
3729H341253o3221K90031Q28565K8736o328R8289k53572r3421j46291j83569j89347
$$ 8341253 8278032 8568063 9396628 9425364 9419036 9517325 9263753 9170332 9024041 8840472 8651125
3718H651125P56560M23537j02268L63876l16597o65051o42643M48647K44418j6451
$$ 8651125 9407685 9831222 9728954 10092830 9776233 9111182 8468539 8917186 9161604 9145153
3708I145153O29272l59678m73595m43866m67817L32632J65862J69370j00819j7512
$$ 9145153 9774425 9414747 8941152 8497286 8029469 8362101 8527963 8697333 8596514 8579002
3698H579002j54423N239j73462m54638k66073n56018N82873K89228J98705k86498
$$ 8579002 8424579 8429818 8256356 7801718 7535645 6979627 7562500 7851728 8050433 7763935
3688G763935O7615N34985m72768m70142l82960K37257K52785Q3928R6487m04070
$$ 7763935 7831550 8366535 7893767 7423625 7040665 7277922 7530707 7614635 7711122 7307052
3678G307052k01427R5280m61398l53946O905K50947K36029k02829l35957l01675
$$ 7307052 7105625 7200905 6739507 6385561 6392466 6643413 6879442 6676613 6340656 6038981
3668F038981m08218J25636j83674o5378k02575K64710K92114q6704M2870l80987
$$ 6038981 5630763 5756399 5572725 5507347 5304772 5569482 5861596 5774892 5817762 5436775
3658E436775o74028M26318O0764K39382M7369O43860j84759R2410q3214p05403
$$ 5436775 4762747 5189065 5249829 5489211 5536580 6180440 5995681 6088091 6004877 5299474
3648E299474K34091L14741q7130m31725J66866o3847Q664L4771k37129J2739l9375
$$ 5299474 5533565 5848306 5761176 5329451 5496317 5432470 5441134 5475905 5238776 5251515 5212140
3637E212140J04299n1301n22961m97004k5425K90887k55347k67013r1572O983
$$ 5212140 5316439 5265138 4742177 4245173 4219748 4510635 4255288 3988275 3896703 3903686
3627C903686L12824L80204n71377p7833L32506L32948m06387J25382k17318K83159
$$ 3903686 4216510 4596714 4025337 3947504 4280010 4612958 4206571 4331953 4114635 4397794
3617D397794P05923l6614n58657n82983l06792L66021N04697J03231J32942l95772
$$ 4397794 5103717 5067103 4508446 3925463 3618671 3984692 4489389 4592620 4725562 4329790
3607D329790k7126K2075r5425j83759j60543M00755J16750R2778K01383m14478
$$ 4329790 4302664 4324739 4229314 4045555 3885012 4285767 4402517 4495295 4696678 4282200
3597D282200N9239k6235l11446l89162M00777M13059j06875M70404k44930m59615
$$ 4282200 4341439 4315204 4003758 3614596 4015373 4428432 4321557 4791961 4547031 4087416
3587D087416k68113K98238j25031j26968J88570j35478J31458J16919m27968Q1184
$$ 4087416 3819303 4117541 3992510 3865542 4054112 3918634 4050092 4167011 3739043 3820227
3577C820227j90550O50720J38095k18548j46791K29010k38292l49886N94963m9025
$$ 3820227 3629677 4280397 4418492 4199944 4053153 4282163 4043871 3693985 4288948 4239923
3567D239923k14161L85192K03667n1343M93309O9072j50120K09299n8868k10265
$$ 4239923 4025762 4410954 4614621 4563278 5056587 5125659 4975539 5184838 5125970 4915705
3557D915705O36059N19769Q3849J27499m9386o8209m83817m67488L69921J28596
$$ 4915705 5551764 6071533 6155382 6282881 6233495 6165286 5681469 5213981 5583902 5712498
3547E712498K89036j29671k1171j23785k9279K45232j04530J29293J81114l12838
$$ 5712498 6001534 5871863 5850692 5726907 5697628 5942860 5838330 5967623 6148737 5835899
3537E835899J46418J62029M91934m00946J3891L0247R8805O28197k02778L03150
$$ 5835899 5982317 6144346 6636280 6235334 6249225 6279472 6378277 7006474 6803696 7106846
3527G106846M6114K46476j34921k99500J284k54549K91795N19556J93416j33568
$$ 7106846 7152960 7399436 7264515 6965015 6966299 6711750 7003545 7523101 7716517 7582949
3517G582949l26443j1598J0761j69681j50701J13234j01639r3729j6350j57571
$$ 7582949 7256506 7244908 7255669 7085988 6935287 7048521 6946882 6853153 6836803 6679232
3507F679232n02760L07806o7997j45730k26312j42625L02252J11325J39113j02267
$$ 6679232 6176472 6484278 6416281 6270551 6044239 5901614 6203866 6315191 6454304 6352037
3497F352037l87529K6302M7817M73323l442j91388L48149j62936K73585m56195
$$ 6352037 5964508 5990810 6038627 6511950 6508508 6317120 6665269 6502333 6775918 6319723
3487F319723l36604k03748N69004N40749l9366K60351n71302k98720M22653k24377
$$ 6319723 5983119 5779371 6348375 6889124 6849758 7110109 6538807 6240087 6662740 6438363
3477F438363N1782j62102L20573l17137P5873L90015N0382k40321J44859J85911
$$ 6438363 6490145 6328043 6648616 6331479 6407352 6797367 6847749 6607428 6752287 6938198
3467F938198j28583K68813K84916j37849J08698J74509l0427J7072M6505Q02044
$$ 6938198 6809615 7078428 7363344 7225495 7334193 7508702 7478275 7495347 7541852 8343896
3457H343896N81330L39715J51310K35176N9072j60744J90500P64508J51382P71449
$$ 8343896 8925226 9264941 9416251 9651427 9710499 9549755 9740255 10504763 10656145 11427594
3447A1427594N7200M11771K53968m21071J42m43416n175n54347j0618J65703m87311
$$ 11427594 11484794 11896565 12150533 11729462 11729604 11286188 11281013 10726666 10716048 10881751 10394440
3436A0394440m01373m33967k37999l29109r8031j7382l95507L63430k07430j76076
$$ 10394440 9993067 9559100 9321101 8991992 8893961 8876579 8481072 8844502 8637072 8460996
3426H460996k44443k97442m9195L84492M86473K24885O17K51593J15869K34946
$$ 8460996 8216553 7919111 7869916 8254408 8740881 8965766 8966383 9217976 9333845 9568791
3416I568791p0396M9776M59449O21227P47254J99890k42490R7726N76443j70309
$$ 9568791 9498395 9548171 10007620 10628847 11376101 11575991 11333501 11431227 12007670 11837361
3406A1837361l6548O6120K35042M75095K53164l28852l68780l81411J43388R0499
$$ 11837361 11800813 11866933 12101975 12577070 12830234 12501382 12132602 11751191 11894579 11985078
3396A1985078j77464k24308j10446L34219J1288n47351j18923q45454N91108L76074
$$ 11985078 11807614 11583306 11472860 11807079 11818367 11271016 11152093 10306639 10897747 11273821
3386A1273821O8759n2708L16537O87960M3579K27680P3958J25655P95978O75343
$$ 11273821 11342580 11289872 11606409 12294369 12337948 12565628 12639586 12765241 13561219 14236562
3376A4236562O96657M30628M19777R55907P72277P96985j44781J018735J023762
$$ 14236562 14933219 15363847 15783624 16739531 17511808 18308793 18164012 19182747 20206509
3367B0206509R60867O64343j99626J71557k3526r3667j16163m23309j32140M6818
$$ 20206509 21167376 21831719 21632093 21803650 21780124 21686457 21570294 21146985 21014845 21061663
3357B1061663J94397n05101r83192j98725J64797P621k36204m26795k99117M2867
$$ 21061663 21256060 20750959 19767767 19569042 19733839 19741460 19505256 19078461 18779344 18822211
3347A8822211O76452K58157k55021k7509K781K69389r0272J76792J0962M45066
$$ 18822211 19498663 19756820 19501799 19474290 19477071 19746460 19656188 19832980 19843942 20289008
3337B0289008N49513J09857L22851Q68182O53598J222899N63353N23343J41740
$$ 20289008 20838521 20948378 21271229 22139411 22793009 24015908 24579261 25102604 25244344
3328B5244344L61827j35937l79635l24050o99613P7248p3141l12832j103881n95026
$$ 25244344 25606171 25470234 25090599 24766549 24066936 24144184 24071043 23758211 22654330 22059304
3318B2059304L31413J14944J82671j87386j48006J1993J6925J144476j8127M55399
$$ 22059304 22390717 22505661 22688332 22500946 22352940 22364933 22381858 23526334 23508207 23963606
3308B3963606L8959J191704J185102Q99122J486888J438208J833548K765562K339494
$$ 23963606 24002565 25194269 26379371 27278493 28765381 30203589 32037137 34802699 37142193
3299C7142193L347569L592586L707225L105802K079794J848917J321889K313379
$$ 37142193 40489762 44082348 47789573 50895375 52975169 54824086 56145975 58459354
3291E8459354K649993K249953O34501k087175l319388l945492n179088l490136
$$ 58459354 61109347 63359300 63993801 61906626 58587238 54641746 49462658 45972522
3283D5972522k633185j599875j625126n81861K10005J068005K578577K332124
$$ 45972522 43339337 41739462 40114336 39532475 39742480 40810485 43389062 45721186
3275D5721186L169211K955323K524944J952313M91480m53454j767076j511948
$$ 45721186 48890397 51845720 54370664 56322977 56814457 56361003 54593927 53081979
3267E3081979j913534j677524j96482P20946K388709K381428l30975k473008l847971
$$ 53081979 51168445 49490921 49294439 50015385 52404094 54785522 54454547 51981539 48133568
3258D8133568m278314m571727l612328l343381l077042j911014k459446j350342
$$ 48133568 43855254 39283527 35671199 32327818 29250776 27339762 24880316 23529974
3250B3529974j272261o66278p49779k36797r7746o56231n16896m24662m43087
$$ 23529974 22257713 21591435 20841656 20604859 20507113 19850882 19333986 18909324 18466237
3241A8466237k16556j94239p591j67762m33120N54170J11668M56937K15140m06993
$$ 18466237 18249681 18055442 18047851 17880089 17446969 18001139 18112807 18569744 18784884 18377891
3231A8377891J96698L441J89691K85395P06945Q15702L60394Q89489J25596P63186
$$ 18377891 18574589 18578030 18767721 19053116 19760061 20575763 20936157 21825646 21951242 22714428
3221B2714428M70610J186555J308812Q71939J833265J086561J561799K390013
$$ 22714428 23185038 24371593 25680405 26552344 28385609 29472170 31033969 33423982
3213C3423982K541652L443968L031757L611467L609097L669559L060844J693963
$$ 33423982 35965634 39409602 42441359 46052826 49661923 53331482 56392326 58086289
3205E8086289J007702m42755j75239k90306j44116L92278O93183Q00332J137259
$$ 58086289 59093991 58651236 58475997 58185691 58041575 58433853 59127036 59927368 61064627
3196F1064627N0800j083535k149723j691551k915189k987471l646261l833863
$$ 61064627 61115427 60031892 57882169 56190618 53275429 50287958 46641697 42807834
3188D2807834k938525k704948k346024j991478j520298r67626r54035J02112R9969
$$ 42807834 39869309 37164361 34818337 32826859 31306561 30338935 29384900 29487012 29586981
3179B9586981p04257k08259l70331j98988j028995r22814p60695l94736j64537
$$ 29586981 28882724 28674465 28304134 28105146 27076151 26153337 25392642 24997906 24833369
3170B4833369k58240n89843r77722n26292K05502q45813l89139p91374p70167
$$ 24833369 24575129 23985286 23007564 22481272 22686774 21840961 21451822 20660448 19890281
3161A9890281p93490q77103p87332j117866m69923m91403l78076k22435q05730
$$ 19890281 19096791 18219688 17432356 16314490 15844567 15353164 14975088 14752653 13946923
3152A3946923K56428n08065k988J82341m72462J65591J8576O94212J09143K15900
$$ 13946923 14203351 13695286 13692298 13874639 13402177 13567768 13586344 14280556 14389699 14605599
3142A4605599K76397j66434K20354N48743L20274O86225N75411L87380k61247
$$ 14605599 14881996 14715562 14935916 15484659 15804933 16491158 17066569 17453949 17192702
3133A7192702r8000o61338m67072P8177J04528l9373k39881j19668j69129j28411
$$ 17192702 17094702 16433364 15966292 16044469 16148997 16109624 15869743 15750075 15580946 15452535
3123A5452535m23492J77476J32832K64176j48101K97638O5991P29217L13511k62881
$$ 15452535 15029043 15206519 15339351 15603527 15455426 15753064 15819055 16548272 16861783 16598902
3113A6598902J46114L7596R85660N85048N67192O22146K01899J200114J01535
$$ 16598902 16745016 16782612 17768272 18353320 18920512 19542658 19744557 20944671 21046206
3104B1046206M18804P27163J069233J479566J706417K018942R27078J657456K229469
$$ 21046206 21465010 22192173 23261406 24740972 26447389 28466331 29393409 31050865 33280334
3095C3280334K431429K653796K798285L627419L584799L749821L081931J661269
$$ 33280334 35711763 38365559 41163844 44791263 48376062 52125883 55207814 56869083
3087E6869083J163466k8177L95836q96325q38460m04883L0042J211041J802651
$$ 56869083 58032549 58004372 58400208 57503883 56665423 56260540 56290582 57501623 59304274
3078E9304274J864649J877225J454712J050812n03877j550873k503051l476007
$$ 59304274 61168923 63046148 64500860 65551672 65047795 63496922 60993871 57517864
3070E7517864l483000m017979m255555m351636l614541k704222l312824k386090
$$ 57517864 54034864 50016885 45761330 41409694 37795153 35090931 31778107 29392017
3062B9392017k233425k002355j024738j049773q19354j121112k03149m77687q20700
$$ 29392017 27158592 25156237 24131499 23081726 22262372 21141260 20938111 20460424 19639724
3053A9639724j34438q64373n54601o72169o16323j84372j108954m2678n58597
$$ 19639724 19505286 18640913 18086312 17414143 16797820 16613448 15504494 15461816 14903219
3044A4903219l69193q68728n2108j46364o95925m46388n27099n98410n96874j62289
$$ 14903219 14534026 13665298 13613190 13466826 12770901 12324513 11797414 11199004 10602130 10439841
3034A0439841k83248m80506P2673k7441J00328K57650j69448m1555j82633R16706
$$ 10439841 10156593 9676087 9748760 9721319 9821647 10079297 9909849 9868294 9685661 10602367
3024A0602367M16718k89430J60139K92316j19649k78498o38317j04821l75686
$$ 10602367 11019085 10729655 10889794 11182110 11062461 10783963 10145646 10040825 9665139
3015I665139J99353l38560n71690l10449m93437n56874n27261l95277j57470m76739
$$ 9665139 9864492 9525932 8954242 8643793 8150356 7593482 7066221 6670944 6513474 6036735
3005F036735K61251j25959j09505o9106k44596m79959r94594K53299l32282K42541
$$ 6036735 6297986 6172027 6062522 5993416 5748820 5268861 4274267 4527566 4195284 4437825
2995D437825L55026l28733k54084m15127L68347J83358l01130K85490o8273N85898
$$ 4437825 4792851 4464118 4210034 3794907 4163254 4346612 4045482 4330972 4262699 4848597
2985D848597L16619K20378m573L97395P21656K36264N73584L15643P9272N66893
$$ 4848597 5165216 5385594 5381021 5778416 6500072 6736336 7309920 7625563 7704835 8271728
2975H271728K56770m402q11921m61426J53701Q449l3588n59657p5012n83347m43146
$$ 8271728 8528498 8524096 7712175 7250749 7404450 7412899 7379311 6819654 6744642 6161295 5718149
2964E718149o83079q07255n01122K69984J02953l70390k90378l2384n79290m1294
$$ 5718149 5035070 4227815 3726693 3996677 4099630 3729240 3438862 3406478 2827188 2785894
2954B785894m08989q22214l5574K49317O49600j21581j66533L024j77042K61596
$$ 2785894 2376905 1554691 1519117 1768434 2418034 2296453 2129920 2132944 1955902 2217498
2944B217498m27262k94003J88389L36137Q45232o50035J53474k64677j86176P9227
$$ 2217498 1790236 1496233 1684622 2020759 2865991 2215956 2369430 2104753 1918577 1997804
2934A997804J08775j4348J02647R74094L35836m99935j75991l94954P7358r6646
$$ 1997804 2106579 2092231 2194878 3168972 3504808 3004873 2828882 2433928 2511286 2414640
2924B414640k34969j96332K18400P64694k53690k83964l68618m22684l7869K99621
$$ 2414640 2179671 1983339 2201739 2966433 2712743 2428779 2060161 1637477 1599608 1899229
2914A899229N0959n11733J43954L31788j12932l65225p20037L9044K16080J61854
$$ 1899229 1950188 1438455 1582409 1914197 1801265 1436040 716003 755047 971127 1132981
2904A132981K93104j17848m66963M37377O9439n7130j00950J2952j21789K80725
$$ 1132981 1426085 1308237 841274 1278651 1348090 1290960 1190010 1202962 1081173 1361898
2894A361898L88203m20321K0419K81794K40109l87781l64937J61740K6071J11046
$$ 1361898 1750101 1329780 1350199 1631993 1872102 1484321 1119384 1281124 1307195 1418241
2884A418241M2249o08187K26671j21409J07818k84441J32073k07258j84686K88352
$$ 1418241 1460490 852303 1078974 957565 1065383 780942 913015 705757 521071 809423
2874H09423k16347K90139m03006K68373L49560l85995k76463P7660N43220k26857
$$ 809423 593076 883215 480209 748582 1098142 712147 435684 513344 1056564 829707
2864H29707J26607q7524l25489N17005k08082k19748K54462K85302k10026K57993
$$ 829707 956314 868790 543301 1060306 852224 632476 886938 1172240 962214 1220207
2854A220207l49612j15414J77197L01133j78990j89143k54022K19239L37510P2466
$$ 1220207 870595 755181 932378 1233511 1054521 865378 611356 830595 1168105 1240571
2844A240571k69949m18109O1713p194j50238J79972m08042L44912N07560o6018
$$ 1240571 970622 552513 614226 607032 456794 636766 228724 573636 1081196 1015178
2834A015178r9442j37802M6845o2346N66380o3919j49608r9115l00308m3563O9484
$$ 1015178 915736 777934 824779 762433 1328813 1264894 1115286 1016171 715863 672300 741784
2823G41784j86852J67313J12610M81756k09396j18453m66680J72838M92811n20849
$$ 741784 554932 722245 834855 1316611 1107215 988762 522082 694920 1187731 666882
2813F66882r5787l15071j58117O32510J15192n2764k0598K51878J0157j91095
$$ 666882 571095 256024 97907 730417 845609 792845 772247 1024125 1034282 843187
2803H43187l00471k10587K30535J24742K8995k89097M01322K69693J94112K5182
$$ 843187 542716 332129 562664 687406 716401 427304 828626 1098319 1292431 1317613
2793A317613j0055n8564J44087J0388j00077r5625J38533P6339l45577l70412
$$ 1317613 1307558 1248994 1393081 1403469 1303392 1207767 1346300 1422639 1077062 706650
2783G06650k11146J99811Q0155k39817K07090m46309l12887K7840J35616N9993
$$ 706650 495504 695315 775470 535653 742743 296434 -16453 11387 147003 206996
2773B06996j42608k544L9321N45839k99069m3980J75733K13394R6689l08273j11352
$$ 206996 64388 61844 101165 647004 347935 303955 479688 693082 789771 481498 370146
2762C70146L21861m661M17012k41189j93635J07224N29733K01386l68177k00318
$$ 370146 692007 687346 1104358 863169 669534 776758 1306491 1507877 1139700 939382
2752I39382L0067K16802J83482j63278n4954J04422o8267K31578j92504l03738
$$ 939382 969449 1186251 1369733 1206455 1151501 1255923 1187656 1419234 1226730 922992
2742I22992k73194P0654j29682j30320n22340j00221J84027J90751j62848k54724
$$ 922992 649798 720452 590770 460450 -61890 -162111 21916 212667 49819 -204905
2732b04905j6875P83170j30104l54766l93474J19019K84879K55758k03659q3329
$$ -204905 -221780 561390 431286 76520 -316954 -197935 86944 342702 139043 55714
2722E5714N81340p2303J10389J31796m01517N4185M38115Q3690K24760m88846
$$ 55714 637054 564751 675140 806936 405419 459604 897719 981409 1206169 717323
2712G17323J38416L27926P2376L18506l28262k16015K72057K7098l088k24622
$$ 717323 855739 1183665 1256041 1574547 1246285 1030270 1302327 1329425 1326337 1101715
2702A101715J18309l96631J25129k78822k65364K07752R4673L32815q9334p13845
$$ 1101715 1220024 823393 948522 669700 404336 612088 706761 1039576 950242 236397
2692B36397q0795n2335q1940P5257K55760k94883Q2908r3654n24886M23123M3658
$$ 236397 155602 103267 21327 96584 352344 57461 140369 46715 -478171 -55048 -11390
2681a1390J44709O061J74217K4816m9422k56142J24780j90720j46440J09628L32480
$$ -11390 133319 139380 313597 338413 288991 32849 157629 -33091 -179531 -69903 262577
2670B62577k9746J20333j59472L02800o7204n9151J29584j55209K55253K58789
$$ 262577 232831 353164 193692 496492 429288 370137 499721 344512 599765 858554
2660H58554N5203J85325O8705l84984m7113j92900K0821j92557M65994L13620
$$ 858554 913757 1099082 1167787 782803 735690 542790 563611 371054 837048 1150668
2650A150668j06691p3489k55523p9145j58881l16024N1320l82323K40673K67379
$$ 1150668 1043977 970488 714965 635820 476939 160915 212235 -170088 70585 337964
2640C37964L18671m58831J24290m11017r6071L84556j27251J67774J23009o1162
$$ 337964 656635 197804 322094 -88923 -184994 199562 72311 240085 363094 301932
2630C01932k39132l2694j36246r1196K1800L76699L67350K2679n6291L17692k66174
$$ 301932 62800 30106 -106140 -197336 -175536 201163 568513 591192 534901 852593 586419
2619E86419K66901m44M3111m7362K75484K71298p1839j80853l8037j95899J05469
$$ 586419 853320 852876 895987 848625 1124109 1395407 1323568 1142715 1104678 908779 1014248
2608A014248k10094j33436J62769k65212K60712l8961k17838R6641l51783L18477
$$ 1014248 804154 670718 833487 568275 828987 790026 572188 668829 317046 635523
2598F35523L06551l04137K09476k99228p7128m8108M09802l68707K66652L13877
$$ 635523 942074 637937 847413 548185 471057 422949 832751 464044 730696 1044573
2588A044573J46043Q53956K9549P543j21192K2290K29095o12959l22718k45938
$$ 1044573 1190616 2044572 2074121 2081664 1960472 1982762 2211857 1598898 1276180 1030242
2578A030242L11026Q9447j18425K02069m12601j88860K32321J06270j82232k97302
$$ 1030242 1341268 1430715 1312290 1514359 1101758 912898 1145219 1251489 1069257 771955
2568G71955j52361K72001K09893K09321m67641N2136J89413j93817N7578M9895
$$ 771955 619594 891595 1101488 1310809 843168 895304 1084717 890900 948478 998373
2558I98373n46490K51807N9480N1028j45792J0581k23264J24627n6463r5835J39132
$$ 998373 451883 703690 763170 814198 668406 678987 455723 580350 523887 428052 567184
2547E67184K73738o38392o3853K44165j09277K64708K7724o5259K9170L56456
$$ 567184 840922 202530 138677 382842 273565 538273 565997 500738 529908 886364
2537H86364P9708M57677j92499k01940j85124k643P7286K6441j6563K89082J91152
$$ 886364 966072 1423749 1231250 1029310 844186 841543 918829 945270 928707 1217789 1408941
2526A408941k92510m46346J2041k85007L16937k43947Q6524j17189J81470K92615
$$ 1408941 1116431 670085 682126 397119 714056 470109 556633 439444 620914 913529
2516I13529m39185j72913k12856P4943O77746j29916l89808l4865K67471j05043
$$ 913529 474344 301431 88575 163518 841264 711348 321540 286675 554146 449103
2506D49103l2037K04285n95580O71764N26310n9654j94802K44757m45606J58635
$$ 449103 417066 621351 25771 697535 1223845 1164191 969389 1214146 768540 927175
2496I27175J44361l78840J11235R3641L55799L82971j6436l27379j43983m4072
$$ 927175 1071536 692696 803931 897572 1253371 1636342 1619906 1292527 1148544 1104472
2486A104472j71297L48314L8570l43435o8062L96343O7982j26381l41620l79823
$$ 1104472 933175 1281489 1320059 976624 908562 1304905 1372887 1246506 904886 525063
2476E25063M02998o7141M31396k99185M08369K5562l79606j99565m70348M5782
$$ 525063 928061 860920 1292316 993131 1401500 1427062 1047456 847891 377543 423325
2466D23325N05254M95821J74586k37026j20901m63566R7969j8061j02041L06260
$$ 423325 928579 1424400 1598986 1361960 1241059 777493 875462 857401 755360 1061620
2456A061620k32828K46975j00754k04260n4438M10602j81661J35143J40149j88428
$$ 1061620 828792 1075767 975013 770753 716315 1126917 945256 1080399 1220548 1032120
2446A032120p3956K14844m82203N41943J96350P5472P6463j9129Q8489L59788
$$ 1032120 958164 1173008 690805 1232748 1429098 1504570 1581033 1561904 1650393 2010181
2436B010181l4165o1862J1585k71859j41226m8758K27704j4523P4625l20109J48607
$$ 2010181 1976016 1914154 1925739 1653880 1512654 1463896 1691600 1677077 1751702 1431593 1580200
2425A580200j33048o72336J78576k70620J14254N19491j41189q7988j95961K16957
$$ 1580200 1447152 774816 953392 682772 797026 1316517 1175328 1087340 891379 1108336
2415A108336k16403k37217j7726M01070L69652M93180o9675j12628m0935J70291
$$ 1108336 891933 654716 636990 1038060 1407712 1900892 1831217 1718589 1677654 1847945
2405A847945k98595N71975L82462M4695M70061L72978k03149j24704O8324m73923
$$ 1847945 1549350 2121325 2503787 2548482 3018543 3391521 3188372 3063668 3131992 2658069
2395B658069L27173J05732k87049j19288j02261L53318J13201q8608l19592J84316
$$ 2658069 2985242 3090974 2803925 2684637 2582376 2935694 3048895 2960287 2640695 2825011
2385B825011J55554n4645J20283p3389L73206K02074k5811Q8595j70628l36055
$$ 2825011 2980565 2925920 3046203 2972814 3346020 3548094 3522283 3610878 3440250 3104195
2375C104195P55744N93116K02103j10686l71128K24955J37525L64941j5073L83379
$$ 3104195 3859939 4453055 4655158 4544472 4173344 4398299 4535824 4900765 4885692 5269071
2365E269071J48958J43963O7475j55244O7976L82779N53190P27681r6670O21024
$$ 5269071 5418029 5561992 5629467 5474223 5542199 5924978 6478168 7205849 7109179 7730203
2355G730203O08816M00340L96116L40912K31190M44139N10102N04977O27224L65188
$$ 7730203 8339019 8739359 9135475 9476387 9707577 10151716 10661818 11166795 11794019 12159207
2345A2159207k9443J74425M52138N93059Q34605J014652J449533J565104J373286
$$ 12159207 12129764 12304189 12756327 13349386 14183991 15198643 16648176 18213280 19586566
2336A9586566K778923L352776L069458K383629K148355K705159L195990M331739
$$ 19586566 22365489 25718265 28787723 31171352 33319707 36024866 39220856 43552595
2328D3552595N468859P566206R675489J3437228K0305377L2846854N2344320P3680113
$$ 43552595 49021454 56587660 66263149 79700377 100005754 132852608 185196928 258877041
2320B58877041P3038762L9684097m783533k1811141m2561385n1540285m4263669
$$ 258877041 331915803 371599900 366816367 345005226 302443841 250903556 206639887
2313B06639887l5885292l1347978l0346920k4072516j7759096j0262466o127187
$$ 206639887 170754595 139406617 109059697 84987181 67228085 56965619 50838432
2306E0838432l432093k577435k458042k948903k915946l912158l396775l121067
$$ 50838432 47406339 44828904 42370862 39421959 36506013 32593855 29197080 26076013
2298B6076013k149878k118445j251456j887868q79127r35215j464359j351802
$$ 26076013 23926135 21807690 20556234 18668366 17789239 16854024 15389665 14037863
2290A4037863j073304j254528q08465n66117o37210m09380k72297p65880j34609
$$ 14037863 12964559 11710031 10901566 10335449 9698239 9288859 9016562 8250682 8116073
2281H116073m70104p6570N10586N5953j10852k8369j81893o22252l58413n34122
$$ 8116073 7645969 7569399 8079985 8135938 8025086 7996717 7814824 7192572 6834159 6300037
2271F300037J30339L9466J92436L16238k20258n15528q21280m11628P7526R086
$$ 6300037 6430376 6469842 6662278 6978516 6758258 6242730 5421450 5009822 5087348 5096434
2261E096434M6978R3882K4202l73441K03901k15193m19328O3209j59590q1867
$$ 5096434 5143412 5237294 5261496 4888055 5091956 4876763 4457435 4520644 4361054 4279187
2251D279187K10921K49265R1643L26089o69694J8575k29884n34751p8053p6764
$$ 4279187 4490108 4739373 4831016 5157105 4487411 4505986 4276102 3741351 3663298 3586534
2241C586534l20266O8228l75789o09424l63469L39571l77715K74193J07295M2883
$$ 3586534 3266268 3334496 2958707 2349283 1985814 2325385 1947670 2221863 2329158 2372041
2231B372041N69722k4465m89173j20624k16562j22248J5479J08893J49942M25715
$$ 2372041 2941763 2917298 2428125 2307501 2090939 1968691 1984170 2093063 2243005 2668720
2221B668720O1523J30668j5016o25604J71476k3153J54003J19977J41042m36312
$$ 2668720 2730243 2860911 2845895 2220291 2391767 2368614 2522617 2642594 2783636 2347324
2211B347324k3254j17421q320m42973N1219N7561l12101K10034J04504n91694
$$ 2347324 2324070 2206649 2198329 1755356 1806575 1864136 1552035 1762069 1866573 1274879
2201A274879n53803M73189K19545l14602k957j03794J92999L54672j90763j86915
$$ 1274879 721076 1194265 1413810 1099208 1096251 992457 1185456 1540128 1349365 1162450
2191A162450j93465O8701K98835m7290P063L98203L26728k68261K28793n54370
$$ 1162450 968985 1037686 1336521 1289231 1296294 1694497 2021225 1752964 1981757 1427387
2181A427387n29124N25588K43185J18785j86416j32545l78627K07426j68535l80425
$$ 1427387 898263 1423851 1667036 1785821 1599405 1466860 1088233 1295659 1127124 746699
2171G46699Q1821J30026J9637l18680k57965J1062k40195j7249L74974j85693
$$ 746699 828520 958546 978183 659503 401538 412600 172405 155156 530130 344437
2161C44437k990Q9855M79313p3112Q1828j51055j37237K97382k94811k72464J39069
$$ 344437 341447 431302 910615 837503 919331 768276 631039 928421 633610 361146 500215
2150E00215M3792L19368k65266K67808M81983m21253J38580K52069n45189k86943
$$ 500215 544007 863375 598109 865917 1347900 926647 1065227 1317296 772107 485164
2140D85164J06041O26930p8615j91901R2487j00503j99924m78867J40422m85167
$$ 485164 591205 1218135 1139520 947619 1040106 939603 739679 260812 401234 -83933
2130h3933L60505M10117k40917l22730j36910J83685R5617k9052J17229N733J89202
$$ -83933 276572 686689 445772 123042 -13868 169817 265434 236382 353611 359344 548546
2119E48546L76770O9327o03789o6067M10657l46732J46026K5533k20178K67698
$$ 548546 925316 994643 390854 324787 735444 388712 534738 560271 340093 607791
2109F07791N85501n6415m22304O4026q2024j24728J67123j92890m9166J53105
$$ 607791 1193292 1136877 714573 778599 696575 571847 738970 546080 496914 650019
2099F50019J81919j08702l57124k92862p520j71471J80516K34236j20478k8522
$$ 650019 831938 723236 366112 73250 65730 -105741 74775 309011 188533 160011
2089A60011L83819j12031m42136l0392j19514M2835l4265L86825J16684l51234
$$ 160011 543830 431799 -10337 -40729 -160243 -117408 -151673 235152 351836 602
2079F02M20713m40359l02437L97555L38710K96729o986J19231K370L53766o0661
$$ 602 421315 -19044 -321481 76074 414784 711513 704527 823758 826128 1179894 1119233
2068A119233n04069k15653r1395M22361J86734p7210k00060P073P3254j81759
$$ 1119233 615164 399511 308116 730477 917211 840001 639941 647014 720268 538509
2058E38509N8670o50765m0225M99436M70487L20187K83148J00934K39070K29244
$$ 538509 597179 -53586 -93811 405625 876112 1196299 1479447 1580381 1819451 2048695
2048B048695m70385l10849L5848K16462l80952l54227l60575l34946L8876j03535
$$ 2048695 1578310 1267461 1303309 1519771 1138819 784592 424017 89071 127947 24412
2038B4412K34255M0500J48324J28154L59872J3690l77308J90018k66151o4247
$$ 24412 258667 299167 447491 575645 935517 949207 571899 761917 495766 431519
2028D31519J20797j22472R9651M78973J70375m74008j23503l94999k82845M86571
$$ 431519 552316 429844 529495 1008468 1178843 704835 581332 186333 -96512 390059
2018C90059q3333l62156K07942K04922K75462k15857l8334p1271K82348l32917
$$ 390059 306726 -55430 152512 357434 632896 417039 378705 307434 589782 256865
2008B56865J56276K0004o45540j70696M66678K8276Q1151O318j81290J15196L69988
$$ 256865 413141 433145 -212395 -383091 83587 111863 193014 199332 18042 133238 503226
1997E03226k87138l64900M03507K56753l30903l13280M0187J40327M42029L42486
$$ 503226 216088 -148812 254695 511448 180545 -132735 -92548 47779 489808 832294
1987H32294j14582k74976p1526J07001p9742k20904q0842J13546J8637M21288
$$ 832294 717712 442736 371210 478211 398469 177565 96723 210269 228906 650194
1977F50194L27310p07112m2824L05940N7367j40460J70216p20060L57434L93119
$$ 650194 977504 270392 227568 533508 590875 450415 620631 -99429 258005 651124
1967F51124l02823J3408j8207N6829J98831j20307l46402J01801J23053k80534
$$ 651124 348301 361709 343502 400331 599162 478855 132453 234254 357307 76773
1957G6773M29621l61048k63644O22125l2004O885J85771k3844j34185j91200O7468
$$ 76773 506394 145346 -118298 503827 471823 478708 664479 640635 506450 315250 382718
1946C82718n01311r2843K54131k61701L97920J72635o2937j99751K71780r405
$$ 382718 -118593 -211436 42695 -219006 178914 351549 288612 88861 360641 351236
1936C51236k36200J64948j91672l1811K50399k70460m1471j37657l8841O26159
$$ 351236 115036 279984 88312 56501 306900 36440 -5031 -142688 -181529 444630
1926D44630Q1939j49316l34965K59752k10544N8344K66429m37668L3681J69458
$$ 444630 526569 377253 42288 302040 91496 149840 416269 -21399 12282 181740
1916A81740r5579m3712J22759P9209o5439L69158j70145j83744m13501k47418
$$ 181740 86161 42449 165208 244417 178978 548136 377991 194247 -219254 -466672
1906d66672l4788J95717p2598J34518L60828L4047j46068J2993J6039K27532L28023
$$ -466672 -501460 -305743 -378341 -243823 117005 151052 4984 17977 34016 261548 589571
1895E89571l44129K20883l1646K14058r8713J31281o67679l60959Q81575K35830
$$ 589571 245442 466325 434679 648737 550024 681305 13626 -347333 534242 770072
1885G70072o1079J71110m05279l33174O38867K8008o52414q9115J38207K53510
$$ 770072 708993 880103 474824 141650 780517 808525 156111 66996 205203 458713
1875D58713Q1403j8282k56873j77090m7450R5713o380o8357n8890K86605R5490
$$ 458713 540116 521834 264961 87871 40421 136134 129754 61397 2507 289112 384602
1864C84602k2385J04183n88224j06981K90739o3641k91855P1257M58233K27786
$$ 384602 362217 466400 -121824 -228805 61934 -1707 -293562 -222305 235928 463714
1854D63714k22168J50954k31449k2406N43984K0299m9746j04200M9428n1034K2788
$$ 463714 241546 392500 161051 138645 682629 702928 653182 548982 598410 547376 570164
1843E70164k83680j89790K41475M9815L13257j12656k10924J72711j58923k8706
$$ 570164 286484 96694 338169 387984 701241 588585 377661 550372 391449 362743
1833C62743k02486m8438l71021L30036L32519j4113K28638l5497l38167l90778
$$ 362743 160257 111819 -259202 70834 403353 389240 617878 582381 244214 -146564
1823a46564K32882j56066k74227N14842K76271j69442k0057j39795k74979K30162
$$ -146564 86318 -69748 -343975 170867 447138 277696 257639 117844 -157135 73027
1813G3027l47282k92855N32982L440r7151J50773J8341m28669O19679k91010p4052
$$ 73027 -274255 -567110 -34128 -30688 -127839 22934 41275 -387394 232285 -58725 -132777
1802a32777O31348r4541R5486Q9990m9543k13671r1803n6019k2059M83124J67325
$$ -132777 498571 404030 499516 589506 539963 326292 234489 178470 156411 639535 806860
1791H06860K79604L31100k43449k75340n17371l15480k45003q4488K30438K61467
$$ 806860 1086464 1417564 1174115 898775 381404 65924 -179079 -263567 -33129 228338
1781B28338J78240K27515j45396k45980k46645k89912k04100J91163L39791L41511
$$ 228338 406578 634093 488697 242717 -3928 -293840 -497940 -306777 33014 374525
1771C74525m57773k62931J97518N8535K29835M41481m66827j56443L77439K33187
$$ 374525 -83248 -346179 -148661 -90126 139709 581190 114363 -42080 335359 568546
1761E68546k0743N9632m5535j17104K83173m0687o6973J73896o3007K22977k78795
$$ 568546 547803 607435 561900 444796 727969 687282 620309 794205 731198 954175 675380
1750F75380o60253k43962L4732K95646j7651J94989k75019J00997M7191k09126
$$ 675380 15127 -228835 -194103 101543 83892 278881 3862 104859 152050 -57076
1740e7076m2750l25892q3715M57562L71506q4881o00744M27929j67858J30263
$$ -57076 -99826 -425718 -509433 -51871 319635 234754 -365990 61939 -105919 24344
1730B4344J77245l65450O1981L83200J29443o7179q7762j55261J8997M55439J841
$$ 24344 201589 -163861 -101880 281320 410763 343584 255822 100561 119558 574997 576838
1719E76838k95744J93589J15089J90439M8691n29827k16273J55496J57773k92560
$$ 576838 281094 474683 589772 780211 828902 299075 82802 238298 396071 103511
1709A03511J54922m71139l6313O55503k63817k17607J56100K20173p5857L7253
$$ 103511 258433 -212706 -249019 406484 142667 -74940 81160 301333 225476 262729
1699B62729k63475j97594L04223K42718P2426j99075m17848K04635J03666M8914
$$ 262729 -746 -198340 105883 348601 421027 221952 -195896 8739 112405 161319
1689A61319J63198m6123m14208j64132N37615j63570j5810K41595k40749L45437
$$ 161319 324517 278394 -135814 -299946 237669 74099 58289 299884 59135 404572
1679D04572J76390j53655k02924Q8831K52438n28532J11750K13283k96766N04864
$$ 404572 580962 427307 224383 313214 565652 37120 148870 362153 65387 570251
1669E70251R0023J12038l21863J49462j30077k28061J8535l17008K88287J82601
$$ 570251 660274 772312 450449 599911 469834 241773 260308 -56700 231587 414188
1659D14188Q6888r3599o66177K39162k49079j36689j48695J11889Q4917J69077
$$ 414188 501076 407477 -258700 -19538 -268617 -405306 -554001 -442112 -357195 -188118
1649a88118M82593K14044n35491K47039K00145o0534J840L10919J06695m02981
$$ -188118 294475 508519 -26972 220067 420212 359678 361518 672437 779132 376151
1639C76151N60974j0111n02482q8013q62j13103L00325J98326L2382J0850m9349
$$ 376151 937125 927014 424532 336519 335657 222554 522879 721205 753587 764437 715088
1628G15088j75264j50975l38711j91457M7951L06767Q7539j07905l65678j15665
$$ 715088 539824 388849 50138 -141319 -93368 213399 300938 193033 -172645 -288310
1618b88310O5850P7425l60048L20356R0646J70352K57331L65332o50210j83134
$$ -288310 -222460 -145035 -505083 -184727 -94081 76271 333602 698934 48724 -134410
1608a34410L81812k17948K16240M79628k14702k34416K81033k05808l54593Q7524
$$ -134410 247402 29454 245694 725322 510620 276204 557237 351429 -3164 84360
1598H4360L73515Q7179M37751r9160k76635M7985k75092j30491j66908n47427
$$ 84360 457875 545054 982805 883645 607010 654995 379903 249412 82504 -464923
1588d64923N71554L39405k85997J36248L05642n07003m40216L04211m84867K63271
$$ -464923 106631 446036 160039 296287 601929 94926 -345290 -41079 -525946 -262675
1578b62675N68942p4045j63399j55059j86174k18318M59427J83968m72044P13608
$$ -262675 306267 232222 68823 -86236 -272410 -490728 -31301 152667 -319377 394231
1568C94231K86457n0381k88426l02974j30936L13946J64660o8273K26353j21096
$$ 394231 680688 630307 341881 38907 -92029 221917 386577 318304 544657 423561
1558D23561J01588O21692k46855o78697j1850k12744j7605O76919l95068k56438
$$ 423561 525149 1146841 899986 221289 209439 -3305 -20910 656009 260941 4503
1548D503O14092k63298l21446Q6276k07342k32637L83303J73355J55579l61648
$$ 4503 618595 355297 33851 120127 -87215 -319852 63451 236806 392385 30737
1538C0737j60706l95417K51355L8048M48054M3801J42178N1737n3412j80710l77182
$$ 30737 -129969 -525386 -274031 -235983 212071 255872 398050 449787 396375 215665 -161517
1527a61517K14373K58169o8923M13385N2083r24133M18410J90215l59083j04351
$$ -161517 52856 311025 242102 655487 707570 -216563 201847 392062 32979 -71372
1517g1372J31929j60423J05416O39502q1249n1595K01750l15020J13179M45879
$$ -71372 60557 -99866 5550 645052 563803 512208 713958 398938 512117 957996
1507I57996j05520l31200n1498L19713m06180l08901R4261j13393L41374L15231
$$ 957996 852476 521276 469778 789491 383311 74410 168671 55278 396652 711883
1497G11883J69628m60454k13970K51579j08382j93547p43190m08699J96959N97300
$$ 711883 881511 421057 207087 458666 350284 156737 -586453 -995152 -798193 -200893
1487b00893K42208J1649k10633L59634L71989n83637j23009K13461k02953K80710
$$ -200893 41315 52964 -157669 201965 573954 -9683 -132692 80769 -122184 158526
1477A58526M73494p05455j59857M21164J51571P407L12999j33984m4083K43909
$$ 158526 632020 -73435 -233292 187872 339443 346850 659849 525865 481782 725691
1467G25691j18036j31019n5417K0805L51605J73530l64736J33931L23368k21179
$$ 725691 607655 476636 421219 442024 793629 967159 602423 736354 1059722 838543
1457H38543l22343o3810m49723k60505Q70688l99249P2817K02296J2001n07350
$$ 838543 516200 452390 2667 -257838 612850 213601 286418 488714 500715 -6635
1447f635J45044m11363l16691P40591q9123n60460j40499m8349K62708N17987
$$ -6635 138409 -272954 -589645 150946 61823 -498637 -639136 -687485 -424777 93210
1437I3210k45197k06369O3268M64300L1770M3339q18916k97906P56425R1402m1866
$$ 93210 -151987 -358356 -295088 169212 200982 244321 -574595 -872501 -116076 -24674 -66540
1426f6540K24622J628J98441N45152k0189q62632j53359M142L55622P07061j83941
$$ -66540 158082 159710 358151 903303 883114 20482 -132877 -128735 226887 933948 750007
1415G50007n67650L97713L08081l95019l05131r9993l14153P30093L41649o79989
$$ 750007 182357 580070 888151 493132 188001 88008 -226145 503948 845597 165608
1405A65608K0820l50877j44847J36037K73051k0472Q2188J89273q922K74114n46562
$$ 165608 186428 -164449 -309296 -173259 99792 79320 161508 350781 341859 615973 69411
1394F9411l56854N9790N8524o2312L95799J05106R3142M96899k85763n49932L0754
$$ 69411 -287443 -227653 -169129 -231441 164358 269464 362606 859505 573742 23810 54564
1383E4564J68774j18420Q1054L49781L75026k37216q5206M4053m22930j24510
$$ 54564 223338 104918 185972 535753 910779 673563 588357 632410 209480 84970
1373H4970l2060L87659o7722j16293K29407j02030j4981k69539k22909K07252
$$ 84970 52910 440569 372847 256554 485961 383931 368950 99411 -123498 83754
1363H3754J1002K16676K30480R0582J3601n72570k30383l94443L16088K91682
$$ 83754 94756 311432 541912 632494 646095 73525 -156858 -551301 -235213 56469
1353E6469M87810O4535n50584M7532K29957r6950k53839K07563P6329J15300L56057
$$ 56469 544279 608814 58230 105762 335719 238769 -15070 192493 268822 384122 740179
1342G40179q5588o20003N89964q1278n36557j9599J89K28354K10920N2708m71810
$$ 740179 654591 34588 624552 543274 6717 -12882 -12693 215661 426581 479289 7479
1331G479k98756k79463n630M13351k60772J9602P58181Q5027J1995k08523o55286
$$ 7479 -291277 -570740 -576370 -163019 -423791 -404189 353992 439019 451014 242491 -412795
1320d12795j42755O28540K2948j65951M05184J66386K67654J35541m48847n52365
$$ -412795 -555550 72990 95938 -70013 335171 501557 769211 904752 455905 -96460
1310i6460K89871N20515J62265K69188n75815k54627K63764r5088k89483k92817
$$ -96460 193411 713926 876191 1145379 569564 314937 578701 483613 194130 -98687
1300i8687K38974L80274K3348j99474k78708k70203j70907j5313L07237k41868
$$ -98687 140287 520561 543909 344435 65727 -204476 -375383 -390696 -83459 -325327
1290c25327J419Q97464j61695m88808K19062j50630k41833M32220R565l90972
$$ -325327 -323908 573556 411861 -76947 142115 -8515 -250348 181872 191437 -199535
1280a99535M20195M12076J14679J50255o96542J63739M03070J13679K91574r4582
$$ -199535 220660 632736 747415 897670 201128 364867 767937 881616 1173190 1078608
1270A078608l93907j8095Q5927n22777l75362K51324j03087M05203L71333l71527
$$ 1078608 684701 666606 752533 229756 -145606 105718 2631 407834 779167 407640
1260D07640k31481j93230j95745K5485J04916J81570J18374K52289Q6123j48628
$$ 407640 176159 -17071 -212816 -187331 -82415 99155 217529 469818 555941 407313
1250D07313j99835k95722L44698J0981l32922L7719K99808q5534K99199M4923
$$ 407313 207478 -88244 256454 267435 -65487 -27768 272040 186506 485705 530628
1240E30628n07686k17725O16690k32475K12224K00650R7183k84612J82714m41564
$$ 530628 22942 -194783 421907 189432 401656 602306 699489 414877 597591 156027
1230A56027n31133L73208L1359M52910l8499l80110r7401j14819m19172j05239
$$ 156027 -375106 -1898 29461 482371 443872 63762 -33639 -148458 -567630 -672869
1220f72869K14810J46737M98926L23347j51277o5380l45530n02043R7817L79565
$$ -672869 -458059 -311322 187604 510951 359674 294294 -51236 -553279 -455462 -75897
1210g5897l74018L20202N77178k39219P8399J80001n63678j55925L60513L41741
$$ -75897 -449915 -129713 447465 208246 286645 466646 -97032 -252957 107556 449297
1200D49297L25542K37803k38785l49846K18688L2029o30832L29944K22763M46553
$$ 449297 774839 1012642 773857 424011 642699 674728 43896 373840 596603 1043156
1190A043156J48129m55789J51751o9530l47942j33462Q6486o90466J62609P43334
$$ 1043156 1191285 735496 887247 817717 469775 336313 422799 -267667 -105058 638276
1180F38276l58937l52992K0q46300l2672O88837k01194l24614N9752L26679n6756
$$ 638276 279339 -73653 -73633 -919933 -952605 -263768 -464962 -789576 -729824 -403145 -459901
1169d59901o5586k41877J32748M06611J96584M95373J27949K7573l46816L6143
$$ -459901 -525487 -767364 -634616 -228005 -31421 463952 591901 619474 272658 308801
1159C08801P8142j1395R1049p0299L78676N67290l38847k55772K58058j67174
$$ 308801 386943 375548 466597 396298 774974 1342264 1003417 747645 1005703 838529
1149H38529l41994M9540J92515k76150J49806k40465k59539k34340r708o9589
$$ 838529 496535 546075 738590 462440 612246 371781 112242 -122098 -131806 -201395
1139b01395O1825J94221L03831k59464l02974k40322j02514k22299J81175M36400
$$ -201395 -139570 54651 358482 99018 -203956 -444278 -546792 -769091 -587916 -151516
1129a51516m7917K33264J95946k27121j70924J45920m46837j35748P38981K84197
$$ -151516 -199433 33831 229777 2656 -168268 -22348 -469185 -604933 134048 418245
1119D18245N557N3927k64769J9779J30054M00238l07909n30524K89143L93929
$$ 418245 423802 477729 212960 232739 362793 763031 455122 -75402 213741 607670
1109F07670j61002K18138l07151m57106M37762O16817n0820l45923P042l61594
$$ 607670 446668 664806 357655 -99451 338311 955128 904308 558385 565427 203833
1099B03833j94788K0888l42181j34530K71842K08910J79293K4618n03162k8214
$$ 203833 9045 29933 -312248 -446778 -174936 33974 213267 237885 -265277 -293491
1089b93491N6363l10253O9428L42720k8639R6951P83458n28005k78012J83993
$$ -293491 -237128 -547381 -477953 -135233 -163872 -66921 716537 188532 -89480 94513
1079I4513n3646P4694L54607n32439o631M43160j4155k32901p7547j78422k5233
$$ 94513 40867 115561 470168 -62271 -68902 374258 360103 127202 49655 -128767 -154000
1068a54000Q58564L40926n277k15387k50721k79617j96706l98198L85915M18373
$$ -154000 704564 1045490 1040213 824826 574105 294488 97782 -300416 85499 503872
1058E03872j87358J74881O7328n94345r6727L19545m70660K59881N06884j12553
$$ 503872 316514 491395 558723 -35622 -132349 187196 -283464 -23583 483301 370748
1048C70748k4421J03790l36173k08452N33611m99654P0683L73556J45639J34622
$$ 370748 346327 450117 113944 -94508 439103 -60551 10132 383688 529327 663949
1038F63949M2440k71709l74364j24374k40455L78094K80621K21127K09338Q7334
$$ 663949 706389 434680 60316 -64058 -304513 73581 354202 575329 784667 872001
1028H72001o24533k71793J31285o35686J60741M75909J45677l0289J36839k21106
$$ 872001 247468 -24325 106960 -528726 -367985 107924 253601 223312 360151 139045
1018A39045l11739j28176j43397l79121O42824N69112k27873j78037M1211J01849
$$ 139045 -172694 -300870 -444267 -823388 -180564 388548 160675 -17362 23849 125698
1008A25698k42951l11911J00824J78285P47331M43361m7917o47023l59269M02206
$$ 125698 -117253 -429164 -328340 -150055 597276 1040637 992720 345697 -13572 388634
998C88634k73346L41364L88037k63868N00895K89116q79215m88020o6288k64335
$$ 388634 115288 456652 844689 580821 1081716 1370832 491617 3597 -62691 -327026
988c27026k195J51351l1704K20194J69110k53219m82501l60364j37107O22183
$$ -327026 -329221 -177870 -209574 10620 179730 -73489 -555990 -916354 -1053461 -431278
978d31278M19256m99826L26739j6923n45554K99403l6747k15756N67606P18186
$$ -431278 -12022 -511848 -185109 -202032 -747586 -448183 -484930 -700686 -133080 585106
968E85106J61161k6977k38695n06502J37086N81885j79293M4500N36371L38468
$$ 585106 746267 719290 480595 -25907 111179 693064 513771 558271 1094642 1433110
958A433110l0274k22983n43944j47970J09533L04847l3395m61371N5224N48573
$$ 1433110 1402836 1179853 635909 487939 597472 902319 868924 407553 462777 1011350
948A011350j44503m97362n65342J44560j36072K78120M05954m32043J434k53044
$$ 1011350 866847 369485 -195857 -51297 -187369 90751 496705 64662 66096 -186948
938a86948n24749k05785o4400N7173L31982Q32612L03699l05592k23179l58164
$$ -186948 -711697 -917482 -981882 -924709 -592727 239885 543584 237992 14813 -343351
928c43351K7378l23887K6396O75344L92703M23676N3781l47024l23423J84508
$$ -343351 -315973 -639860 -613464 61880 454583 878259 932040 585016 261593 446101
918D46101J92822l06281L44702K23833K50120K02508k62214m96132q57974L22144
$$ 446101 638923 332642 677344 901177 1151297 1353805 1091591 595459 -262515 59629
908E9629J04210k9327M59029J48722j91542l01813o66959m52273n21816Q62415
$$ 59629 163839 134512 593541 742263 550721 248908 -418051 -870324 -1392140 -529725
898e29725O21117J91510O4055l35879m3414n53727K06378J28418p7060M78552
$$ -529725 91392 282902 346957 11078 -32336 -586063 -379685 -251267 -328327 150225
888A50225O69783j1268j46182j48676k30802m70719K03733J12618M7054L79893
$$ 150225 820008 808740 662558 513882 283080 -187639 16094 128712 175766 555659
878E55659L96333k07035k11999k51512n9035j57768L39292K98599j68758Q4622
$$ 555659 951992 744957 532958 281446 222411 64643 403935 702534 533776 618398
868F18398j69870m06505m15994k44233k82709L07618O77932J15505Q4032j29051
$$ 618398 448528 42023 -373971 -618204 -900913 -593295 84637 200142 284174 155123
858A55123p6653j98823j68710N46322q6692r5171J31378N48798J35971l74881
$$ 155123 78470 -120353 -289063 257259 170567 75396 206774 755572 891543 516662
848E16662r083l15227j30938K09365K98187j3789m7092o2624n94426K3153J66072
$$ 516662 507579 192352 61414 270779 568966 555177 508085 445461 -148965 -125812 40260
837D0260P9222M7584J69979N7977J8488q9395m48003N7368R1301m26362K08654
$$ 40260 119482 167066 337045 395022 413510 324115 -123888 -66520 24781 -401581 -192927
826a92927K10450o2731O76318k45979m44846K7038J17013J4780J97704K3168l80066
$$ -192927 17523 -45208 631110 385131 -59715 -32677 84336 99116 296820 319988 -60078
815f0078L40456M81877k83877J96146m42671P8247K38623L35567L13822l27532
$$ -60078 280378 762255 478378 674524 231853 310100 548723 884290 1198112 870580
805H70580j37439k99972M4782J99564l12131K79785J70904k72887q0149m6779
$$ 870580 733141 433169 477951 677515 365384 645169 816073 543186 463037 416258
795D16258l03801l12468J80960m18106L25743K17641k41085m5890n5261k29108
$$ 416258 112457 -200011 -19051 -437157 -111414 106227 -134858 -180748 -236009 -465117
785d65117J28741J43291l9291N25330Q3450l54673l21068J55060J88715J27996
$$ -465117 -336376 -193085 -232376 292954 376404 21731 -299337 -144277 44438 172434
775A72434M70584J023J30783L19680q0818O5418j16662m77490P6416n3519J24600
$$ 172434 643018 644041 774824 1094504 1013686 1079104 962442 484952 561368 507849 632449
764F32449P93296K2549o87854o0178j56209k12768J0342k53324l25833J40154
$$ 632449 1425745 1448294 760440 700262 544053 331285 341627 88303 -237530 -97376
754i7376L84889l3369l24182m25067J002k3862K28427L47039k28527J91458J17966
$$ -97376 287513 254144 -70038 -495105 -494103 -517965 -289538 57501 -171026 20432 138398
743A38398m1719l83608l24770R2381M33664J99701K58804M23086k26986R519J34053
$$ 138398 96679 -286929 -611699 -519318 -85654 114047 372851 795937 568951 578470 712523
732G12523k04852R1188l3377q6007N89754L21606n77567k80360n4975L1989m9104
$$ 712523 507671 598859 565482 479475 1069229 1390835 813268 532908 477933 509922 460818
721D60818L4388k86218k77864Q3857M49982l28570m33380j56047N4545m185L29768
$$ 460818 495206 208988 -68876 14981 464963 136393 -296987 -453034 -398489 -402674 -72906
710g2906L72237N7765k31495j74538K66290j15630j63548k13699L5101N26614
$$ -72906 299331 357096 125601 -48937 217353 101723 -61825 -275524 -240423 286191
700B86191J91377k45045j50089K6593K41267j61161O0863l73440J03761L95951
$$ 286191 477568 232523 82434 109027 350294 189133 249996 -123444 -19683 376268
690C76268J01423M8057l08452j80011Q0022J10242L41716k1636K5824k41774P9979
$$ 376268 477691 525748 217296 37285 117307 227549 569265 547629 573453 331679 411658
679D11658n79621p1584K88948J67111P7517K87763R4055k14362O2193k07181k37142
$$ 411658 -167963 -239547 49401 216512 294029 581792 675847 461485 523678 316497 79355
668G9355j4003K99637M6367K47487j87500k11509K00726q0517o6948j99835m53063
$$ 79355 65352 364989 411356 658843 471343 259834 460560 380043 313095 113260 -339803
657c39803J40649K9923j04277k0416n047R1155J04713K66921J23604Q2348M47875
$$ -339803 -199154 -169231 -273508 -293924 -298971 -207816 -103103 163818 287422 369770 817645
646H17645j90150m61339j54409j0082R8349N01250J81575k75413m6230J23779
$$ 817645 627495 166156 11747 1665 100014 601264 782839 507426 461196 584975
636E84975o6569J39630R1915n65346n8025L37557q1345R6155j81392p4393Q0532
$$ 584975 518406 658036 749951 184605 126580 464137 382792 478947 297555 223162 303694
625C03694N7488l31784j43348k29110j71625M40801k10121l11721K13611j29766
$$ 303694 361182 29398 -113950 -343060 -514685 -73884 -284005 -595726 -382115 -511881
615e11881j51300K86575R2456L85245J96499M2259k53113k31417l40936K35641
$$ -511881 -663181 -376606 -284150 101095 297594 339853 86740 -144677 -485613 -249972
605b49972N50181L0070O2687L8665N2916K6344j72793o3654N6999j02307K26464
$$ -249972 300209 330279 392966 431631 484547 510891 338098 274444 331443 229136 455600
594D55600p787K85563J66473k8009J18893m0862p50884Q2M67265j52578J19237
$$ 455600 447813 733376 899849 871840 990733 949871 198987 199069 666334 513756 632993
583F32993j97839l80087K8879o9324k42613j7086N1787K08125K6783l66451k26036
$$ 632993 435154 55067 83946 14622 -227991 -245077 -193290 14835 41618 -324833 -550869
572e50869q4594l90690L35643K56654k49368l34269N32038j6357k1263K23206
$$ -550869 -635463 -1026153 -690510 -433856 -683224 -1017493 -485455 -501812 -523075 -299869
562b99869j41522R6990K70613J95416K89420j2953L31949J25431n7192l5327J43557
$$ -299869 -441391 -344401 -73788 121628 411048 398095 730044 855475 798283 762956 906513
551I06513j23727l7851K90793m4629J29078j60996j53400J07125J3414j62514
$$ 906513 782786 744935 1035728 991099 1120177 959181 805781 912906 926320 763806
541G63806p6401j14542N8172Q009o78379R4781K07357o71662j72190J3743j63477
$$ 763806 687405 572863 631035 639044 -39335 55446 262803 -408859 -581049 -567306 -730783
530g30783l810K01674q3860L76854k88440l89382n2199J85167J73016M38308K34209
$$ -730783 -734593 -532919 -616779 -239925 -528365 -917747 -969946 -784779 -611763 -173455 60754
519F0754Q6180K6760Q5197L10459Q5067k97612k6154L29253r2854q4022L65918
$$ 60754 146934 173694 258891 569350 654417 356805 330651 659904 567050 483028 848946
508H48946K26733k38776r6212J83730j78647n2360L64023l3830k58291O7395m30618
$$ 848946 1075679 836903 740691 924421 745774 693414 1057437 1023607 765316 832711 402093
497D02093m57324q6531R1347L29276M77678k72716j98200J08577k11563k3758
$$ 402093 -55231 -141762 -50415 278861 756539 483823 285623 394200 182637 158879
487A58879k26912m28969L67249J39575J10957J84509J30774r0805J62548R4318
$$ 158879 -68033 -497002 -129753 9822 120779 305288 436062 345257 507805 602123
477F02123m81422K2016k4168r304K9232J06014K1174r2674j97872J44936k16445
$$ 602123 120701 142717 118549 109245 138477 244491 265665 172991 -24881 120055 -96390
466i6390p6723J85457J66045j39496j35476j29109l02244m5560P28299J3667k84952
$$ -96390 -173113 12344 178389 38893 -96583 -225692 -527936 -573496 154803 168470 -116482
455a16482L29809J84334J9077M7829K26746k74075l01832N84532j26359j71435
$$ -116482 213327 397661 416738 464567 691313 417238 115406 699938 573579 402144
445D02144K27553m4451K5175O624o9073l24373R5656K16257m1079n2164l94536
$$ 402144 629697 585246 610421 617045 547972 223599 319255 535512 494433 442269 47733
434D7733p7913j4271j71900N03953k7737l22792J37549j49640p2934l7022j10807
$$ 47733 -30180 -44451 -216351 287602 259865 -62927 74622 -75018 -147952 -184974 -295781
423b95781j88483K29669M82871k38001j07475J62147K78675n4925o0995K06931
$$ -295781 -484264 -254595 228276 -9725 -117200 44947 323622 268697 207702 414633
413D14633o7351o2747L56722l41982k75790J12712K02356J13488j14808K87647
$$ 414633 347282 284535 641257 299275 23485 136197 338553 452041 337233 624880
403F24880L73382m7108l81655k42457l03377L1868M61908j64319P5704N9841k36156
$$ 624880 998262 951154 569499 327042 23665 55533 517441 353122 428826 488667 252511
392B52511j12484J69780m19061j63573J2461J58731R3579j27699j7045l8606J81191
$$ 252511 140027 309807 -109254 -272827 -260366 -101635 -8056 -135755 -152800 -191406 -10215
381a0215O6587N7852m11283J82578L90265K14549p0445o3249k09454j93187q5119
$$ -10215 56372 114224 -297059 -114481 275784 490333 419888 356639 147185 -46002 -131121
370a31121j01346K14119K83866L21583O51289m22128k85958l22849j00468L87867
$$ -131121 -232467 -18348 265518 587101 1238390 816262 530304 207455 106987 494854
360D94854Q9650k82770j22898M7542J14697k14937k26574k42252k05411J61129
$$ 494854 584504 301734 178836 226378 341075 126138 -100436 -342688 -548099 -386970
350c86970L94187J73108m30880L0038L65057j47511O9277m46272p8860M93201
$$ -386970 7217 180325 -250555 -220517 144540 -2971 66306 -379966 -458826 34375
340C4375L08481r8397o28689j01387J92647L54977N4686J44940K00153k49717
$$ 34375 342856 244459 -384230 -485617 -292970 62007 116693 261633 461786 212069
330B12069L74598R8503n12557P5430K55765j07615P7699M18368j30755Q4666M64248
$$ 212069 586667 685170 172613 248043 503808 396193 473892 892260 761505 846171 1310419
319A310419k48290o11637J33197j77239j54411k03749M8887O5280J53759k18164
$$ 1310419 1062129 450492 583689 406450 252039 48290 97177 162457 316216 98052
309I8052l50447l07304l08169L83188M10319L1077K05727m86787k4978K00837
$$ 98052 -252395 -559699 -867868 -484680 -74361 -43284 162443 -324344 -349322 -148485
299a48485L17906l14902m09147N82211K8949M13481M85449j87984m24206k2847
$$ -148485 169421 -145481 -554628 27583 56532 470013 955462 767478 343272 320425
289C20425j59526L03020M08508k6689J80097J88797k72091l25772n0724l41133
$$ 320425 160899 463919 872427 845738 1025835 1214632 942541 616769 566045 224912
279B24912M69680j06641l97619L574j01421l2667j5292J272n93719K18487O61187
$$ 224912 694592 587951 190332 193906 92485 59818 44526 45798 -547921 -329434 331753
268C31753m38943j14635l3834j32210J43538R7485K4079l45633K43090K60029
$$ 331753 -107190 -221825 -255659 -387869 -244331 -146846 -122767 -468400 -225310 34719
258C4719J15016J30101k68754L12761k597l50482N8244j64639K42684L41113L25439
$$ 34719 149735 279836 11082 323843 321246 -29236 29008 -135631 107053 448166 773605
247G73605k45753m18677N6869k60132M1637O75977j53227o50959M07747q2023
$$ 773605 527852 109175 166044 -94088 -52451 623526 470299 -180660 227087 145064
237A45064l86020N81179j57549j99656M42657j73021k03537K66556j9273K74942
$$ 145064 -240956 340223 182674 -16982 425675 252654 49117 315673 296400 571342
227E71342j08318j81984k66571K41320K01741q7245L83431l90819o460L23026
$$ 571342 463024 281040 14469 255789 457530 370285 753716 362897 356437 679463
217F79463n36907k64596L54940L3494j19509L20701l68878l72504R0097K05860
$$ 679463 142556 -122040 232900 266394 146885 467586 98708 -273796 -183699 22161
207B2161L02072j43644J02508l04919l07001J89958j66071J47470M4979Q6840
$$ 22161 324233 180589 283097 -21822 -328823 -138865 -304936 -157466 -112487 -25647
197b5647K88516l59901J78909M81330M10266m81493r7108J28506l08236L56713
$$ -25647 262869 -97032 81877 563207 973473 491980 394872 523378 215142 571855
187E71855J31448k11450O3462p7115p9304J51465O438l36674j44422L54986j51602
$$ 571855 703303 491853 555315 478200 398896 550361 556799 220125 75703 430689 279087
176B79087r9231k4891n08567K77461M36685O2072l63664P3874k46186k37198M27877
$$ 279087 179856 154965 -353602 -76141 360544 422616 58952 132826 -113360 -350558 77319
165G7319m08025K22280J21402j63047j77751K11850K45023J37152N49941j28519
$$ 77319 -330706 -108426 12976 -150071 -327822 -115972 129051 266203 816144 687625
155F87625n30901K38483l16530J35173J75294m41047r6479K46880J03090j40966
$$ 687625 156724 395207 78677 213850 389144 -51903 -148382 98498 201588 60622
145F0622K97781j7862j37779J19598k62121m38757P14179k9847j78525N9003k59717
$$ 60622 358403 340541 202762 322360 60239 -378518 335661 305814 127289 186292 -73425
134g3425l2537J56294q3715j45664J78402k69346k17527N14630k08306n5384M24768
$$ -73425 -105962 50332 -33383 -179047 -645 -269991 -487518 27112 -181194 -236578 188190
123A88190K21129k69687Q8316k08655l85076L79941j3772j34078J51548N3528
$$ 188190 409319 139632 227948 19293 -365783 14158 386 -133692 17856 71384
113G1384Q7339J36513j73712k52715L90514L97503k84000K11913n50598n198K01326
$$ 71384 158723 295236 121524 -131191 259323 656826 372826 584739 34141 28943 230269
102B30269L53365m6086n5935j57416M0463M26888j26094n51783K66867J83079
$$ 230269 583634 537548 481613 324197 364660 791548 665454 113671 380538 563617
92E63617o07003J55729p1560l21744L31554N8846l02232J0005L6040k77693K1500
$$ 563617 -43386 112343 40783 -280961 50593 109439 -192793 -182788 -146748 -424441 -402941
81d02941Q6519n71833L86746L15157k36170j1337j4890J1588J56639K63226k58844
$$ -402941 -316422 -888255 -501509 -186352 -422522 -433859 -448749 -437161 -280522 -17296 -276140
70b76140L1477Q3139j06479K77731O0748j94977R4117L36536o0875N6323K63596
$$ -276140 -244663 -161524 -268003 9728 70476 -124501 -30384 306152 245277 301600 565196
59E65196k89969L05405J50192m76865l9384J8189L11889m9982k79349l13940k05756
$$ 565196 275227 580632 730824 253959 214575 232764 544653 494671 215322 -98618 -304374
48c04374L29608k7060n9449k89048l49804J59122K28444k693l42605K02679k0719
$$ -304374 25234 -1826 -61275 -350323 -700127 -541005 -312561 -315254 -657859 -455180 -475899
37d75899P0044J06324k88689j79943M55140P4486J44506q8148j47439L0648L73904
$$ -475899 -405855 -299531 -588220 -768163 -313023 -238537 -94031 -182179 -329618 -298970 74934
26G4934J59500k91789j76527N0445K02304L49505j61168j82777l3853j58364N6234
$$ 74934 234434 -57355 -233882 -183437 18867 368372 207204 24427 -9426 -167790 -111556
15a11556j27002j67401J38603Q3549J95235K26616O906m73723p5891J18355J36037
$$ -111556 -238558 -405959 -267356 -183807 11428 238044 244950 -228773 -304664 -186309 -50272
4e0272k9180k02436J68690k21367
$$ -50272 -79452 -281888 -113198 -334565
0c34565
$$ -334565
$$ Imaginary data points
##PAGE= N=2
##DATA TABLE= (X++(I..I)), XYDATA
16383a040138j14132L6262L73438j51395k81897O5951j1703M0091M5353j59144
$$ -1040138 -1154270 -1118008 -744570 -895965 -1177862 -1111911 -1123614 -1083523 -1038170 -1197314
16373a197314K54481J99994J93134M21381l77215l68923j19412l4011r866K22287
$$ -1197314 -942833 -742839 -549705 -128324 -505539 -874462 -993874 -1027885 -1037751 -815464
16363h15464n6101O1126K67071j07162n5604n7210N6913o1367k69585q9331M08469
$$ -815464 -871565 -810439 -543368 -650530 -706134 -763344 -706431 -767798 -1037383 -1126714 -718245
16352g18245P4814K75529J32553n06752J5583J96110l0530n2576J28357J60944
$$ -718245 -643431 -367902 -235349 -742101 -726518 -530408 -560938 -613514 -485157 -324213
16342c24213J64645J78119l2096l30580l21693L89065L94722k46270J72521J2623
$$ -324213 -159568 18551 -13545 -344125 -665818 -276753 117969 -128301 44220 56843
16332E6843k87862k3558q7377k36465N8552M15707n4433J22647J18788r6200J57005
$$ 56843 -231019 -254577 -341954 -578419 -519867 -104160 -158593 -35946 82842 -13358 143647
16321A43647k09153j95450k81862k17830K74812M44443J88197k80297n6974l33027
$$ 143647 -65506 -260956 -542818 -760648 -485836 -41393 146804 -133493 -190467 -523494
16311e23494R5102J06518j105J40437k8759J91570L0078L36644m8670j44637k23402
$$ -523494 -428392 -321874 -322979 -182542 -211301 -19731 10347 346991 298321 153684 -69718
16300f9718N4461K64967L31090N80991j84571k56131l59013j82701M30840j3627
$$ -69718 -15257 249710 580800 1161791 977220 721089 362076 179375 610215 596588
16290E96588P8964q7337K61440L25967K6329l86446o27973J31996o6804k9218
$$ 596588 675552 588215 849655 1175622 1201951 815505 187532 319528 252724 223506
16280B23506J38447Q1420N1287J78805J6020m17163m9390K07712L51125k15727
$$ 223506 361953 443373 494660 673465 689485 272322 222932 430644 781769 566042
16270E66042k24637k8805K95175K86977j30568l6144m27249K56017M14403L71492
$$ 566042 341405 312600 607775 894752 764184 728040 300791 556808 971211 1342703
16260A342703J9080k24124J90022o6257j66838m27276j58786L69599J84803K33636
$$ 1342703 1361783 1137659 1327681 1261424 1094586 667310 508524 878123 1062926 1296562
16250A296562j53007j42568j43820M0244R9027l69230o3656O6999L98128J3644
$$ 1296562 1143555 1000987 857167 897411 996438 627208 563552 630551 1028679 1042323
16240A042323j41948Q8772N9504p8694j933O6624M2875J98514L19768j26005J05850
$$ 1042323 900375 989147 1048651 969957 968024 1034648 1077523 1276037 1595805 1469800 1575650
16229A575650K78459K99348l10431k00721K1308p1014L62324M4696l14397n27359
$$ 1575650 1854109 2153457 1843026 1642305 1663613 1592599 1954923 1999619 1685222 1157863
16219A157863k59351L00723K83772j59064j62583j80438j07916N61558Q2298m87309
$$ 1157863 898512 1199235 1483007 1323943 1161360 980922 873006 1434564 1516862 1029553
16209A029553n1108j60113j42692J15324J97740J17162L65479j3815m33716l5999
$$ 1029553 978445 818332 675640 790964 988704 1105866 1471345 1457530 1023814 987815
16199I87815k2078N20752P6302k07798j00379J15275O42437K53504l22602m15237
$$ 987815 965737 1486489 1562791 1354993 1254614 1369889 2012326 2265830 1943228 1527991
16189A527991K78262M30298q0135j19022k74352k03866o85J89167q821k18528
$$ 1527991 1806253 2236551 2156416 2037394 1763042 1559176 1558491 1747658 1738837 1520309
16179A520309Q3694M06190k4101j43109K79418q0159n00381j67833j41864j75571
$$ 1520309 1604003 2010193 1986092 1842983 2122401 2042242 1541861 1374028 1232164 1056593
16169A056593K75132J19740J41120m29392J448L14626N3895n779J38457j21963
$$ 1056593 1331725 1451465 1592585 1163193 1164641 1479267 1533162 1527383 1665840 1543877
16159A543877k27402N0803N5111K24694R2855j70426J21825j22140J00337m2160
$$ 1543877 1316475 1367278 1422389 1647083 1739938 1569512 1691337 1569197 1669534 1627374
16149A627374Q4767q303q8930k82480J49828J04300L15109K14615P1035J94240
$$ 1627374 1712141 1703838 1614908 1332428 1482256 1586556 1901665 2116280 2187315 2381555
16139B381555l06439J24495Q0141j80023j41800k23886K28332m3923M04175K16997
$$ 2381555 2075116 2199611 2279752 2099729 1957929 1734043 1962375 1918452 2322627 2539624
16129B539624o39161J08473J40937o8330n4696n9020k43530K3626L753P3990J9711
$$ 2539624 1900463 2008936 2149873 2081543 2026847 1967827 1724297 1747923 1751676 1825666 1845377
16118A845377k05291P2735k4956M88437J01610j87270k9129l46622l64413l39407
$$ 1845377 1640086 1712821 1687865 2176302 2277912 2090642 2061513 1714891 1350478 1011071
16108A011071K94221L88477L29507k59910q4015K56411j14093N4153J26758l41123
$$ 1011071 1305292 1693769 2023276 1763366 1679351 1935762 1821669 1875822 2002580 1661457
16098A661457j13459K57413M91243J29890J53537k75271m03717K18189K78574
$$ 1661457 1547998 1805411 2296654 2426544 2580081 2304810 1901093 2119282 2397856
16089B397856j40508j34162o3716j46897J62665N0138m52671Q242L579J49465
$$ 2397856 2257348 2123186 2059470 1912573 2075238 2125376 1672705 1680947 1684526 1833991
16079A833991K00138k406j37594R5538j29731n03138J550k19025K49724N32022
$$ 1833991 2034129 2031723 1894129 1989667 1859936 1356798 1358348 1139323 1389047 1921069
16069A921069j20083J4183M9102K25096k7174k27826k09833k88501o9621N71137
$$ 1921069 1800986 1815169 1864271 2089367 2062193 1834367 1624534 1336033 1266412 1837549
16059A837549k4589k20708M18990j68272m21242j47757Q7664L88674K08039J55635
$$ 1837549 1812960 1592252 2011242 1842970 1421728 1273971 1361635 1750309 1958348 2113983
16049B113983o39415N552J3006k2543L53234J92461L55335K62536r6183r6970
$$ 2113983 1474568 1480120 1493126 1470583 1823817 2016278 2371613 2634149 2537966 2440996
16039B440996L45327l61884m03983l58465M7339L19652M74406l72831N5019J58348
$$ 2440996 2786323 2424439 2020456 1661991 1709330 2028982 2503388 2130557 2185576 2343924
16029B343924J44970k14240J02356k15885k60918P3287L49177k91959k24387K5023
$$ 2343924 2488894 2274654 2377010 2161125 1900207 1973494 2322671 2030712 1806325 1831348
16019A831348k70160J55665R6827r8770N4682N9533l0484k91440m0486r6617K73031
$$ 1831348 1561188 1716853 1813680 1714910 1769592 1829125 1798641 1507201 1466715 1370098 1643129
16008A643129M7941J38073L91768k38766N12848R8128k60467m31145p6711n3298
$$ 1643129 1691070 1829143 2220911 1982145 2494993 2593121 2332654 1901509 1824798 1771500
15998A771500j54974N83933M04250K3233l33429j19934J54952m85452J7365P6073
$$ 1771500 1616526 2200459 2604709 2627942 2294513 2174579 2329531 1844079 1861444 1937517
15988A937517j12797l8203L12980j27002n02717L14662k07576k02295L16133J95776
$$ 1937517 1824720 1786517 2099497 1972495 1469778 1784440 1576864 1374569 1690702 1886478
15978A886478l4385r4585P0672l89171K29403j02555R6301P6420Q021L65408L62685
$$ 1886478 1852093 1757508 1828180 1439009 1668412 1565857 1662158 1738578 1746599 2112007 2474692
15967B474692j86687k51556P7582k33979n4580P3536l4520J28366J45108q7174
$$ 2474692 2288005 2036449 2114031 1880052 1825472 1899008 1864488 1992854 2137962 2050788
15957B050788j92815k33163j77298M10313N42817q7156l49221j07847J70188n4018
$$ 2050788 1857973 1624810 1447512 1857825 2400642 2313486 1964265 1856418 2026606 1972588
15947A972588R2941J66945j69586K50975k07530J25668J34807j51131j53161j22844
$$ 1972588 2065529 2232474 2062888 2313863 2106333 2232001 2366808 2215677 2062516 1939672
15937A939672r5665k17536O68613Q8636k52205M47813k35582j88663m012m71204
$$ 1939672 1844007 1626471 2295084 2383720 2131515 2579328 2343746 2155083 2151071 1679867
15927A679867m80588M03375K02305j7752L91265m51828k97698K07049J37924p780
$$ 1679867 1199279 1602654 1804959 1787207 2178472 1726644 1428946 1635995 1773919 1766139
15917A766139J55392r8709J27016K13361l72794k09905L83778j47566K64921R4823
$$ 1766139 1921531 1822822 1949838 2163199 1790405 1580500 1964278 1816712 2081633 2176456
15907B176456k78840j7823P40339j43779o20897M1657j29032M87354M20470P9644
$$ 2176456 1897616 1879793 2620132 2476353 1855456 1897113 1768081 2255435 2675905 2755549
15897B755549l51681M03466J40024p91558j77969j95594o0634J07795J56815p4911
$$ 2755549 2403868 2807334 2947358 2155800 1977831 1782237 1721603 1829398 1986213 1911302
15887A911302l48597J11184j18254J97006k52665j16177M23475J95375M64882
$$ 1911302 1562705 1673889 1555635 1752641 1499976 1383799 1807274 2002649 2467531
15878B467531k73580k60214l91853N86097J20674l18240K15614N3704N16360L6692
$$ 2467531 2193951 1933737 1541884 2127981 2248655 1930415 2146029 2199733 2716093 2752785
15868B752785O0153l92663l47415K1575l51433J92571N31895M92699k96433m39015
$$ 2752785 2812938 2420275 2072860 2094435 1743002 1935573 2467468 2960167 2663734 2224719
15858B224719n20337O3768K49322K72990r676m05332j80696q2803L60116N5778
$$ 2224719 1704382 1768150 2017472 2290462 2280786 1875454 1694758 1611955 1972071 2027849
15848B027849j75780Q9430N910k1576J98396j55160r216q9924R7459l94542j2265
$$ 2027849 1852069 1941499 1947409 1925833 2124229 1969069 1959853 1869929 1967388 1572846 1560581
15837A560581K37221R1592J92413q8323Q4692M343J34680n18239m64048J20602
$$ 1560581 1797802 1889394 2081807 1993484 2078176 2082519 2217199 1698960 1234912 1355514
15827A355514J16153N11021J46822J57191m57712J70565J60416j76390Q4790k04698
$$ 1355514 1471667 1982688 2129510 2286701 1828989 1999554 2159970 1983580 2068370 1863672
15817A863672K02865k57953j17815r6825J75108J92728K01184q1710m38004l69017
$$ 1863672 2066537 1808584 1690769 1593944 1769052 1961780 2162964 2081254 1643250 1274233
15807A274233R45770N1274j75345k26308p22691L22328O69213K73409m72634j166
$$ 1274233 2220003 2271277 2095932 1869624 1146933 1469261 2138474 2411883 1939249 1938083
15797A938083M3235J98879J78348l26727l79549J37198L53783j1678r8723o5579
$$ 1938083 1981318 2180197 2358545 2031818 1652269 1789467 2143250 2131572 2032849 1967270
15787A967270J65187K51263J49438o14980l23242K58959l8418K53063m54439k89755
$$ 1967270 2132457 2383720 2533158 1918178 1594936 1853895 1815477 2068540 1614101 1324346
15777A324346L22988K47719j20103J45671n0642j62101P98590r9873p13340J60938
$$ 1324346 1647334 1895053 1774950 1920621 1869979 1707878 2506468 2406595 1693255 1854193
15767A854193j83797K05300J6110M34454J75867O4619J44244l13566L63779j06770
$$ 1854193 1670396 1875696 1891806 2326260 2502127 2566746 2710990 2397424 2761203 2654433
15757B654433l37025L00020k87789j72392K4402L55317k61875J60926q9295o39584
$$ 2654433 2317408 2617428 2329639 2157247 2181649 2536966 2275091 2436017 2346722 1707138
15747A707138K92533J13171j54073K25201l46008o06695J06562K44654J71324
$$ 1707138 1999671 2112842 1958769 2183970 1837962 1231267 1337829 1582483 1753807
$$ [...]
##END NTUPLES=NMR SPECTRUM
##END=
