##TITLE=1H_DE-80H_X3
 200.13MHz, d2o
 8 sc
 
 19ns.26.2.2025
##JCAMPDX= 6.0         $$ Bruker NMR JCAMP-DX V2.0
##DATA TYPE= NMR SPECTRUM
##DATA CLASS= NTUPLES
##ORIGIN= UXNMR, Bruker Analytische Messtechnik GmbH
##OWNER= pz
$$ XWIN-NMR		Version 3.5
$$ Tue Jun  2 16:05:38 2026 Russian Standard Time (UT+4h)  Yarkov@DPX200
##.OBSERVE FREQUENCY= 200.1313
##.OBSERVE NUCLEUS= ^1H
##.ACQUISITION MODE= SIMULTANEOUS
##.ACQUISITION SCHEME= undefined
##.AVERAGES= 8
##.DIGITISER RES= 18
##SPECTROMETER/DATA SYSTEM= spect
##.PULSE SEQUENCE= zg30
##.SOLVENT NAME= CDCl3
##.SHIFT REFERENCE= (INTERNAL, CDCl3, 0, 15.4549)
##AUDIT TRAIL= $$ (NUMBER, WHEN, WHO, WHERE, WHAT)
$$ ##TITLE= Audit trail, XWIN-NMR		Version 3.5
$$ ##JCAMPDX= 5.01
$$ ##ORIGIN= Bruker BioSpin GmbH
$$ ##OWNER= Yarkov
$$ C:/Bruker/XWIN-NMR/data/yarkov2/nmr/H-C/1/pdata/1/auditp.txt
$$ ##AUDIT TRAIL=  $$ (NUMBER, WHEN, WHO, WHERE, WHAT)
(   1,<2026-06-02 16:04:47.26 +0400>,<Yarkov>,<DPX200>,
      <created by zg, POWCHK disabled, PULCHK disabled
       configuration hash MD5:
       00 E9 B6 7A A2 85 ED C7 34 08 36 98 17 FE 4E 26
       data hash MD5: 16K
       63 D2 12 A4 C9 F3 36 69 9B 85 B6 67 5B ED E6 C8>)
(   2,<2026-06-02 16:04:57.65 +0400>,<Yarkov>,<DPX200>,
      <Start of raw data processing
       efp BC_mod = 2 LB = 0.25 FT_mod = 6 PKNL = 1 PHC0 = -6385.696 PHC1 = 21.22195 SI = 16K 
       data hash MD5: 16K
       21 8D 2F 24 86 11 9D 36 81 98 A5 85 54 2C 94 8A>)
(   3,<2026-06-02 16:05:05.82 +0400>,<Yarkov>,<DPX200>,
      <abs ABSG = 5 
       data hash MD5: 16K
       9D 0C 0C 59 8F 5D 3A 10 16 15 CE 42 4B F9 E8 FB>)
$$ ##END=
$$ 
$$ hash MD5
$$ FB E1 21 77 47 DF 88 FD 9D 02 34 1E 79 03 07 89
##$RELAX= 
##$RELAX= 
##$RELAX= 
##$RELAX= 
##$RELAX= 
##$RELAX= 
$$ Bruker specific parameters
$$ --------------------------
##$DU= <C:/Bruker/XWIN-NMR>
##$EXPNO= 1
##$NAME= <H-C>
##$PROCNO= 1
##$TYPE= <nmr>
##$USER= <yarkov2>
##$AMP= (0..31)
100 100 100 100 100 100 100 100 100 100 100 100 100 100 100 100 100 100 
100 100 100 100 100 100 100 100 100 100 100 100 100 100 
##$AQSEQ= 0
##$AQ_mod= 1
##$AUNM= <au_zg>
##$AUTOPOS= <>
##$BF1= 200.13
##$BF2= 200.13
##$BF3= 200.13
##$BF4= 200.13
##$BF5= 200.13
##$BF6= 200.13
##$BF7= 200.13
##$BF8= 200.13
##$BYTORDA= 1
##$CFDGTYP= 0
##$CFRGTYP= 5
##$CHEMSTR= <none>
##$CNST= (0..31)
1 1 145 1 1 1 1 1 1 1 1 1 1 1 1 1 1 1 1 1 1 1 1 1 1 1 1 1 1 1 1 1 
##$CPDPRG= <>
##$CPDPRG1= <>
##$CPDPRG2= <>
##$CPDPRG3= <>
##$CPDPRG4= <mlev>
##$CPDPRG5= <mlev>
##$CPDPRG6= <mlev>
##$CPDPRG7= <mlev>
##$CPDPRG8= <mlev>
##$CPDPRGB= <>
##$CPDPRGT= <>
##$D= (0..31)
0 0.7 0 0 0 0 0 0 0 0 0 0.03 0 0 0 0 0 0 0 0 0 0 0 0 0 0 0 0 0 0 0 0 
##$DATE= 1780401886
##$DBL= (0..7)
120 120 120 120 120 120 120 120 
##$DBP= (0..7)
150 150 150 150 150 150 150 150 
##$DBP07= 0
##$DBPNAM0= <>
##$DBPNAM1= <>
##$DBPNAM2= <>
##$DBPNAM3= <>
##$DBPNAM4= <>
##$DBPNAM5= <>
##$DBPNAM6= <>
##$DBPNAM7= <>
##$DBPOAL= (0..7)
0.5 0.5 0.5 0.5 0.5 0.5 0.5 0.5 
##$DBPOFFS= (0..7)
0 0 0 0 0 0 0 0 
##$DE= 6
$$ [...]
##$SUBNAM3= <"">
##$SUBNAM4= <"">
##$SUBNAM5= <"">
##$SUBNAM6= <"">
##$SUBNAM7= <"">
##$SUBNAM8= <"">
##$SUBNAM9= <"">
##$SW= 18.0517328524113
##$SWIBOX= (0..15)
0 0 2 0 0 0 0 0 0 0 0 0 0 0 0 0 
##$SW_h= 3612.71676300578
##$TD= 16384
##$TD0= 1
##$TE= 0
##$TE2= 300
##$TE3= 300
##$TEG= 300
##$TL= (0..7)
0 120 120 120 120 120 120 120 
##$TP= (0..7)
150 150 150 150 150 150 150 150 
##$TP07= 0
##$TPNAME0= <>
##$TPNAME1= <>
##$TPNAME2= <>
##$TPNAME3= <>
##$TPNAME4= <>
##$TPNAME5= <>
##$TPNAME6= <>
##$TPNAME7= <>
##$TPOAL= (0..7)
0.5 0.5 0.5 0.5 0.5 0.5 0.5 0.5 
##$TPOFFS= (0..7)
0 0 0 0 0 0 0 0 
##$TUNHIN= 0
##$TUNHOUT= 0
##$TUNXOUT= 0
##$USERA1= <user>
##$USERA2= <user>
##$USERA3= <user>
##$USERA4= <user>
##$USERA5= <user>
##$V9= 5
##$VALIST= <valist>
##$VCLIST= <CCCCCCCCCCCCCCC>
##$VD= 0
##$VDLIST= <DDDDDDDDDDDDDDD>
##$VPLIST= <PPPPPPPPPPPPPPP>
##$VTLIST= <TTTTTTTTTTTTTTT>
##$WBST= 1024
##$WBSW= 4
##$XGAIN= (0..3)
0 0 0 0 
##$XL= 0
##$YL= 0
##$YMAX_a= 338041
##$YMIN_a= -312362
##$ZGOPTNS= <>
##$ZL1= 120
##$ZL2= 120
##$ZL3= 120
##$ZL4= 120
##$ABSF1= 15.50119
##$ABSF2= -2.550659
##$ABSG= 5
##$ABSL= 3
##$ALPHA= 0
##$AQORDER= 0
##$ASSFAC= 0
##$ASSFACI= 0
##$ASSFACX= 0
##$ASSWID= 0
##$AUNMP= <proc_1d>
##$AZFE= 0.1
##$AZFW= 0.1
##$BCFW= 0
##$BC_mod= 2
##$BYTORDP= 0
##$COROFFS= 0
##$CY= -3
##$DATMOD= 1
##$DC= 0
##$DFILT= <>
##$DTYPP= 0
##$F1P= 0
##$F2P= 0
##$FCOR= 1
##$FTSIZE= 16384
##$FT_mod= 6
##$GAMMA= 0
##$GB= 0
##$INTBC= 1
##$INTSCL= 3.241238e-09
##$ISEN= 128
##$LB= 0.25
##$LEV0= 0
##$LPBIN= 0
##$MAXI= 10000
##$MC2= 0
##$MEAN= 0
##$ME_mod= 0
##$MI= 1.114404
##$NCOEF= 0
##$NC_proc= -7
##$NLEV= 6
##$NOISF1= 3.799351
##$NOISF2= 2.8
##$NSP= 0
##$NTH_PI= 0
##$NZP= 0
##$OFFSET= 15.45491
##$PC= 1
##$PHC0= -6385.696
##$PHC1= 21.22195
##$PH_mod= 1
##$PKNL= yes
##$PPARMOD= 0
##$PSCAL= 0
##$PSIGN= 0
##$REVERSE= no
##$SF= 200.130013367184
##$SI= 16384
##$SIGF1= 3
##$SIGF2= 2
##$SINO= 0.751879
##$SIOLD= 32768
##$SREGLST= <19F.Aceton>
##$SSB= 0
##$STSI= 16384
##$STSR= 0
##$SW_p= 3612.71676300578
##$SYMM= 0
##$S_DEV= 0
##$TDeff= 16384
##$TDoff= 0
##$TI= <>
##$TILT= no
##$TM1= 0
##$TM2= 0
##$TOPLEV= 0
##$USERP1= <user>
##$USERP2= <user>
##$USERP3= <user>
##$USERP4= <user>
##$USERP5= <user>
##$WDW= 1
##$XDIM= 16384
##$YMAX_p= 504663390
##$YMIN_p= -4088491
$$ End of Bruker specific parameters
$$ ---------------------------------
##NTUPLES= NMR SPECTRUM
##VAR_NAME=  FREQUENCY,     SPECTRUM/REAL,   SPECTRUM/IMAG
##SYMBOL=    X,             R,               I
##VAR_TYPE=  INDEPENDENT,   DEPENDENT,       DEPENDENT
##VAR_FORM=  AFFN,          ASDF,            ASDF
##VAR_DIM=   16384,         16384,           16384
##UNITS=     HZ,            ARBITRARY UNITS, ARBITRARY UNITS
##FACTOR=    0.220516191357247, 1,           1
##FIRST=     3092.99140058887, 0,            0
##LAST=      -519.725362416907, 0,           0
##MIN=       -519.725362416907, -4088491,    0
##MAX=       3092.99140058887, 504663390,    0
$$ Real data points
##PAGE= N=1
##DATA TABLE= (X++(R..R)), XYDATA
$$ [...]
7357f8842k46426K51938J88240l55592k40401m3937n1419N16732N49448l37584
$$ -68842 -315268 -63330 124910 -230682 -471083 -515020 -566439 -49707 499741 162157
7347A62157j13496J20193j03829J80706j5964k0157J82410R0529k40503K6649
$$ 162157 48661 168854 65025 245731 229767 209610 392020 482549 242046 268695
7337B68695r4881Q4957O14822L1457k39449j32846m20345n8048k10812O1163J59521
$$ 268695 173814 258771 873593 905050 665601 532755 112410 54362 -156450 -95287 64234
7326F4234k48879K6596N201k54296L43767N41504l46426j70858j46599j56817
$$ 64234 -184645 -158049 -152848 -407144 -63377 478127 131701 -39157 -185756 -342573
7316c42573L61007J30004m95577J56809K8351l71701j2168l50957L63559R31684
$$ -342573 18434 148438 -347139 -190330 -161979 -533680 -545848 -896805 -533246 398438
7306C98438j07318k75947J88271k16483m50520M53214L95934j17353K60482K32849
$$ 398438 291120 15173 203444 -13039 -463559 -10345 385589 268236 528718 761567
7296G61567l53032k92146j83685J07211N39758K38146J82268m96566q18857j17375
$$ 761567 408535 116389 -67296 39915 579673 817819 1000087 503521 -315336 -432711
7286d32711N76755K14793o4281j02562m5241j98220L6829K72681J11903j2900
$$ -432711 144044 358837 294556 191994 146753 -51467 -14638 258043 369946 357046
7276C57046k82420m03284l26189K60419N06799N5928k6397j19964J39435j74974
$$ 357046 74626 -328658 -654847 -394428 112371 168299 141902 21938 161373 -13601
7266a3601j21264L95009k9984l7018N4366l49999j85200N9365k0292L05782Q2685
$$ -13601 -134865 260144 230160 193142 247508 -102491 -287691 -228326 -248618 57164 139849
7255A39849k18445J35042M162K84480L03770L69105k77375m56890o2910Q7309
$$ 139849 -78596 56446 60608 345088 648858 1017963 740588 283698 220788 308097
7245C08097K89388L1331j12195k26595k45806k71895K10679K53618L38955K32351
$$ 308097 597485 628816 516621 290026 44220 -227675 -16996 236622 575577 807928
7235H07928J2229J14535K28862J04636L19684J74338n8528n7318k90960k15633
$$ 807928 820157 934692 1163554 1268190 1587874 1762212 1703684 1646366 1355406 1139773
7225A139773K53131M8608P8612j07343L8218J6711J64280j31412J32237J50681
$$ 1139773 1392904 1441512 1520124 1412781 1450999 1467710 1631990 1500578 1632815 1783496
7215A783496m70863K54184j05025j54115M01967k15424n73910J63155J03631L4392
$$ 1783496 1312633 1566817 1461792 1307677 1709644 1494220 920310 1083465 1187096 1221488
7205A221488M09047n6477K22859J59263o50025k04232M01366p3216n4355K64444
$$ 1221488 1630535 1574058 1796917 1956180 1306155 1101923 1503289 1430073 1375718 1640162
7195A640162m69044n79834j32233q9537L91013j99578K59375J14026m59091k97440
$$ 1640162 1171118 591284 459051 369514 760527 560949 820324 934350 475259 177819
7185A77819L35303K3721P65O537r2950j75603o58380K1113M18609j42545j4976
$$ 177819 513122 536843 537608 544145 451195 275592 -382788 -361675 56934 -85611 -100587
7174a00587L14902l64566j73024K78280p3483k40132M7524M35986R2448n80047
$$ -100587 214315 -150251 -323275 -44995 -118478 -358610 -311086 124900 217348 -362699
7164c62699l12052O12730n4217k01090M19446L03377N8525Q2380j82945j49721
$$ -362699 -674751 -62021 -116238 -317328 102118 405495 464020 546400 363455 213734
7154B13734J9835J22815o9605m1555J09223j43991m2719n6421J00133L24077J74474
$$ 213734 233569 356384 286779 245224 354447 210456 167737 111316 211449 535526 710000
7143G10000L9686J85337M1510j26317j97793j6405n1978j38707O2700n12225O8915
$$ 710000 749686 935023 976533 850216 652423 636018 584040 445333 508033 -4192 64723
7132F4723N17777l50258k18959K49254L327j43832K5845j06094J37720r400m102
$$ 64723 582500 232242 13283 262537 265864 122032 147877 41783 179503 170103 166001
7121A66001j43436P5880N2333J59079k11732k95825L81187J68896k40409J11019
$$ 166001 22565 98445 150778 309857 98125 -197700 183487 352383 111974 222993
7111B22993K95879L24042j47570j46111L8088k47812k8572K73627m34079j82377
$$ 222993 518872 842914 695344 549233 587321 339509 310937 584564 150485 -31892
7101c1892J4296K37882p7405K5636j67099J71879J49193J57156j4687K95315k33834
$$ -31892 -17596 220286 142881 168517 1418 173297 322490 479646 464959 760274 526440
7090E26440j4324L68114m64187l79790J73121j85405j71164l54788J01567K02265
$$ 526440 512116 880230 416043 36253 209374 23969 -147195 -501983 -400416 -198151
7080a98151q5685j88929J63818K31741k37638J93546N75021L209P1142j86644
$$ -198151 -283836 -472765 -308947 -77206 -314844 -121298 453723 456932 528074 341430
7070C41430k53171j81915m02893K33042O65368m8777L57986r2884o93743K14906
$$ 341430 88259 -93656 -496549 -263507 401861 353084 711070 618186 -75557 139349
7060A39349K16219K1681l3181j11476j95067j57133k07967q8823J50164K00912
$$ 139349 355568 377249 344068 232592 37525 -119608 -327575 -416398 -266234 -65322
7050f5322R0905N05994J98467j26967R550L020l03595j17341l55386K45631m33830
$$ -65322 25583 531577 730044 603077 612627 615647 312052 194711 -160675 84956 -348874
7039c48874J8399j05168k29579L3025L07094P0447O05735k40025k4904Q4423O1994
$$ -348874 -330475 -435643 -665222 -632197 -325103 -254656 351079 111054 86150 170573 232567
7028B32567M7455R3720o3519Q4854l20610o2632K02319J18119K1842J50647k19215
$$ 232567 280022 373742 310223 395077 74467 11835 214154 332273 354115 504762 285547
7017B85547l63702J68692P9914r5421J02846M4854j71094l29987k9306L4868K64144
$$ 285547 -78155 90537 170451 75030 177876 222730 51636 -278351 -307657 -272789 -8645
7006h645J02871J68004j547P3544k33342r4905K03921J46776K23689k46002k42709
$$ -8645 94226 262230 260683 334227 100885 5980 209901 356677 580366 334364 91655
6995I1655K73834K74425k71730k12740K84343k51357l73900L38546l24106k3725
$$ 91655 365489 639914 368184 155444 439787 188430 -185470 153076 -171030 -194755
6985a94755J78490k01032j23143K41601J29438J09818J28940M3472j13763p287
$$ -194755 -16265 -217297 -340440 -98839 30599 140417 269357 312829 199066 191779
6975A91779k65013L93200K15845k02045P020L84175j33709k5104n37989j76064
$$ 191779 -73234 319966 535811 333766 340786 724961 591252 566148 28159 -147905
6965a47905J16376N9604N3846m2154J6683R3063j45743O5204o4143L65588K18066
$$ -147905 -31529 28075 81921 39767 56450 149513 3770 68974 4831 370419 588485
6954E88485j16480j0926m4027k59642r2917p8835J10218l4407q8205N9818p8314
$$ 588485 472005 461079 417052 157410 64493 -14342 95876 61469 -26736 33082 -45232
6943d5232O6518L3998l9691J1947L0404j15974p2271P0966J9441K68008m6314
$$ -45232 21286 55284 15593 27540 57944 -58030 -130301 -59335 -39894 228114 181800
6932A81800m8044J54650L03343j21583N8777J92694r5073j577k78487j92694J37628
$$ 181800 133756 288406 591749 470166 528943 721637 626564 624987 346500 153806 291434
6921B91434J5028k1692J70141k12816j37844O039M2985K76696N24418j66891m75283
$$ 291434 306462 284770 454911 242095 104251 110290 153275 429971 954389 787498 312215
6910C12215j33626J22605j84107j49279j68621J50217J16030j81453k9429k00109
$$ 312215 178589 301194 117087 -32192 -200813 -50596 65434 -116019 -145448 -345557
6900c45557j18611M5053l7014L55875K27015j59884N55715l71956l59814O1088
$$ -345557 -464168 -419115 -456129 -100254 126761 -33123 522592 150636 -209178 -148090
6890a48090n71611k1398P50746j56949l16900L50534P3242P5727K36632l86894
$$ -148090 -719701 -741099 9647 -147302 -464202 -113668 -40426 35301 271933 -114961
6880a14961j71770N04149j83546r2165K14674j81611j47989J684K9736L75896
$$ -114961 -286731 217418 33872 -58293 156381 -25230 -173219 -171535 -141799 234097
6870B34097K09100P8665L22845M7838l16419k24606k84431l76747J20935P25561
$$ 234097 443197 521862 844707 892545 576126 351520 67089 -309658 -188723 536838
6860E36838K44633m72914k10241j11476N2974J28198O1557K50172M8850N5619
$$ 536838 781471 308557 98316 -13160 39814 168012 229569 479741 528591 584210
6850E84210j12358J68270q7804k53260m196o4333J21076O26391p2612m30657K79054
$$ 584210 471852 640122 552318 299058 294862 230529 351605 977996 905384 474727 753781
6839G53781n6026m88690O5473M53322j5584M104N8632k78188J10242J26036k46499
$$ 753781 697755 209065 274538 727860 712276 716380 775012 496824 607066 733102 486603
6828D86603P8125K02853j13990K60182m5456m00437L89153J67057o59711J14821
$$ 486603 564728 767581 653591 913773 868317 467880 857033 1024090 364379 479200
6818D79200R8975l31860m6842l478l64376N09206J2154m00713K11202K27399k42165
$$ 479200 578175 246315 199473 195995 -168381 340825 352979 -47734 163468 390867 148702
6807A48702q3070K61823j0612k71085K7652p2923K91566j04448j12649K26868
$$ 148702 65632 327455 316843 45758 73410 487 292053 187605 74956 301824
6797C01824K85076k09796l3885J32365n2732j69693L95803J09600l08637J63515
$$ 301824 586900 377104 343219 475584 422852 253159 648962 758562 449925 613440
6787F13440j4873k40220j31176K52873K84066k51130j45502L95049m2408k39845
$$ 613440 598567 358347 227171 480044 764110 512980 367478 762527 720119 480274
6777D80274K26835J81724J45664k20425j56900N4351k53882J28037k7305m84302
$$ 480274 707109 888833 1034497 814072 657172 711523 457641 585678 558373 74071
6767G4071j09757O7755J16591K59302j3050L23381N4286q9308k69990n3072q7
$$ 74071 -35686 32069 148660 407962 394912 718293 772579 683271 413281 360209 360122
6756C60122Q7667J57582J758j18244n4834O4212L82358n8546q7810p3709j14724
$$ 360122 447789 605371 607129 488885 434051 498263 880621 822075 734265 660556 545832
6745E45832k32527r0425q7208O38420J61070k54060k03568k27361K6847M39750
$$ 545832 313305 222880 135672 774092 935162 681102 477534 250173 277020 716770
6735G16770K28384O2569l7073j73258k41743j5072l11597J6952L89705n8226k38283
$$ 716770 945154 1007723 970650 797392 555649 540577 228980 245932 635637 577411 339128
6724C39128J32198k16197K88606J10438j78990o9520J40107j72683J7360k70898
$$ 339128 471326 255129 543735 654173 475183 405663 545770 373087 390447 119549
6714A19549M9958O1641M723L29084l99120K90004P52220j97206K20722k05290
$$ 119549 169507 231148 235871 564955 165835 455839 1208059 1010853 1231575 1026285
6704A026285r50522R9452J91219j50457K97607K62797J38907J04135k65542l16770
$$ 1026285 75763 175215 366434 215977 513584 776381 915288 1019423 753881 437111
6694D37111J01420K60040L1066j45489m82325O9879M76319p8138j0028J90329
$$ 437111 538531 798571 829637 684148 201823 271702 748021 669883 659855 850184
6684H50184q1649p0923k56J14740M85065K4482N1150k46797q39145k6657l1834
$$ 850184 768535 697612 697356 812096 1297161 1321643 1372793 1125996 286851 260194 228360
6673B28360J72587K97214L79087J5361n80542r3310P2948l73809L53804N38657
$$ 228360 400947 698161 1077248 1092609 512067 418757 491705 117896 471700 1010357
6663A010357n4592k07513j96232l85400M47326L76923k16782N3153K3603k79273
$$ 1010357 955765 748252 552020 166620 613946 990869 774087 827240 850843 571570
6653E71570J74466j52915j58071L27458m31308m19113P52153l71665j3252Q51395
$$ 571570 746036 593121 435050 762508 331200 -87913 664240 292575 279323 1130718
6643A130718j30197l67464M30536j02914K45740m5598k92255J37930j46671n40979
$$ 1130718 1000521 633057 1063593 960679 1206419 1160821 868566 1006496 859825 318846
6633C18846M52346L19681n06276J88759L94642l69875j87343J46113P524k08089
$$ 318846 771192 1090873 584597 773356 1167998 798123 610780 756893 764417 556328
6623E56328J05605m34180q765K29034O5789J49375K14924k88243L08816K33892
$$ 556328 661933 227753 218988 448022 513811 663186 878110 589867 898683 1132575
6613A132575n04076j01944N39709K9006j21724J10896j54631j49246K06566j5209
$$ 1132575 628499 526555 1066264 1095270 973546 1084442 929811 780565 987131 971922
6603I71922R3619K08301n92869j3317n0250p0167K02595L6744J69722L3035j40181
$$ 971922 1065541 1273842 680973 667656 617406 547239 749834 786578 956300 989335 849154
6592H49154N11553k25877l54703K19841k9422J55375J79150k34697R1758n1534
$$ 849154 1360707 1134830 780127 999968 970546 1125921 1305071 1070374 1162132 1110598
6582A110598n6894K62507N4067l70319j828J44927m63912m09795N25794K07240
$$ 1110598 1053704 1316211 1370278 999959 998131 1143058 679146 269351 795145 1002385
6572A002385r627o1428L13093m5209k22224L33283K01341j37189j17599O3680
$$ 1002385 992758 931330 1244423 1199214 976990 1310273 1511614 1374425 1256826 1320506
6562A320506N2380K74029j73366O1592K210k81662N9578P3032n7173j01680J42374
$$ 1320506 1372886 1646915 1473549 1535141 1537351 1255689 1315267 1388299 1331126 1229446 1371820
6551A371820k18810l75864O22343K69480j00039M32946k63198L9417M3507l08975
$$ 1371820 1153010 777146 1399489 1668969 1568930 2001876 1738678 1778095 1821602 1512627
6541A512627J91892L01914k18050p9510m41112j88497K58682N80142l23366j60891
$$ 1512627 1704519 2006433 1788383 1708873 1267761 1079264 1337946 1918088 1594722 1433831
6531A433831J06794l36217o4294L5591j17653N41104Q1828k43008J27483k41552
$$ 1433831 1540625 1204408 1140114 1175705 1058052 1599156 1680984 1437976 1565459 1323907
6521A323907o7160O62441J65043l72373m34689k99687J612J93447p9959N05421
$$ 1323907 1256747 1919188 2084231 1711858 1277169 977482 979094 1172541 1092582 1598003
6511A598003M02178l31592n07209q2743r8591R2282M83740q7155L3822m05438
$$ 1598003 2000181 1668589 1161380 1078637 980046 1072328 1556068 1468913 1502735 1097297
6501A097297j99428K16566j94935Q0721J21296K5021Q0612K43835l43382j77839
$$ 1097297 897869 1114435 919500 1000221 1121517 1146538 1227150 1470985 1127603 949764
6491I49764J16978o0977q5830j37890L2836N17325J56462N8670P6969k72499m21226
$$ 949764 1066742 1005765 919935 782045 814881 1332206 1488668 1547338 1624307 1351808 930582
6480I30582K07954q9421n33L40186L75708k27119m13424l12484L17451L81553
$$ 930582 1138536 1049115 1048582 1388768 1764476 1537357 1123933 811449 1128900 1510453
6470A510453J5001M0408R9756J26109L570k78079j41464j0559p7437J95272J24209
$$ 1510453 1525454 1565862 1665618 1791727 1795297 1517218 1375754 1365195 1287758 1483030 1607239
6459A607239j30996N8990P0693n9729j55586l01619L72127J31045j42672l9356
$$ 1607239 1476243 1535233 1605926 1546197 1390611 1088992 1461119 1592164 1449492 1410136
6449A410136K50259k61803l79019m3462r6666J74854N62130K16860J54979k38534
$$ 1410136 1660395 1398592 1019573 976111 879445 1054299 1616429 1833289 1988268 1749734
6439A749734O1416K66152K18476n02194K85867m35211j83073j49747j64475k51633
$$ 1749734 1811150 2077302 2295778 1793584 2079451 1644240 1461167 1311420 1146945 895312
6429H95312O8782J29812J85237K07185N92016l43941J0306J53098k10424j99619
$$ 895312 964094 1093906 1279143 1486328 2078344 1734403 1744709 1897807 1687383 1487764
6419A487764K5570m13402L20677k56314l65096L98429K77693m31540L05785K78018
$$ 1487764 1513334 1099932 1420609 1164295 799199 1197628 1475321 1043781 1349566 1627584
6409A627584J22952J37106J00675m423J38586l83933J1449N32921J56111K65121
$$ 1627584 1750536 1887642 1988317 1983894 2122480 1738547 1749996 2282917 2439028 2704149
6399B704149n4615p47530k83297r0205m644K25272j51193L0231k02500p9351J20648
$$ 2704149 2649534 1902004 1618707 1528502 1523858 1749130 1597937 1628168 1425668 1346317 1466965
6388A466965R4290j28458L55936j65438j99923K35287P3598L04257O3367l98441
$$ 1466965 1561255 1432797 1788733 1623295 1423372 1658659 1732257 2036514 2099881 1701440
6378A701440k73576j67335k65832J70936L32822q6522L99405j14701k04408j15804
$$ 1701440 1427864 1260529 994697 1165633 1498455 1411933 1811338 1696637 1492229 1376425
6368A376425Q8645N42293Q94226n71772n16066k07734m04255j03694J51466O1039
$$ 1376425 1465070 2007363 2901589 2329817 1813751 1606017 1201762 1098068 1249534 1310573
6358A310573K73397k0211K22663J48568j23070M3725N41500j41084J25284k58575
$$ 1310573 1583970 1563759 1786422 1934990 1811920 1855645 2397145 2256061 2381345 2122770
6348B122770J34764K32612m2636j84749R2094k11873p283O8871k90975J81994
$$ 2122770 2257534 2490146 2447510 2262761 2354855 2142982 2135699 2204570 1913595 2095589
6338B095589M14351k11924l4549J39569l33087l5707L21718j46790L28678j17968
$$ 2095589 2509940 2298016 2263467 2403036 2069949 2034242 2355960 2209170 2537848 2419880
6328B419880K90299M25816j57101l28825M0742P0063K70322R9587m84602l33156
$$ 2419880 2710179 3135995 2978894 2650069 2690811 2760874 3031196 3130783 2646181 2313025
6318B313025J19273J95464k38288k99929K65920j39140j76030l8524L33296L15460
$$ 2313025 2432298 2627762 2389474 2089545 2355465 2216325 2040295 2001771 2335067 2650527
6308B650527K56653j46318l32758N5297K23451J21244K8426m3288k14979J17583
$$ 2650527 2907180 2760862 2428104 2483401 2706852 2828096 2856522 2813234 2598255 2715838
6298B715838k17216K161M70446L0028Q5702p3370K42370O9220j14529J44693K71369
$$ 2715838 2498622 2500783 2971229 3001257 3086959 3013589 3255959 3325179 3210650 3355343 3626712
6287C626712j01171l21654j06894J41392O4699P6271M09897R6198j01677J62263
$$ 3626712 3525541 3203887 3096993 3238385 3303084 3379355 3789252 3885450 3783773 3946036
6277C946036J77502J79017Q09709Q47519Q64014N74999J036136J353826J658753
$$ 3946036 4123538 4302555 5112264 5959783 6823797 7398796 8434932 9788758 11447511
6268A1447511J284920R76999P12632m808k27717q32659j034149n05827q37744
$$ 11447511 12732431 13709430 14422062 14417254 14189537 13356878 12322729 11816902 10979158
6259A0979158n78641p17486j24530L59873Q48300R36326J441420J181677R32990
$$ 10979158 10400517 9683031 9558501 9918374 10766674 11703000 13144420 14326097 15259087
6250A5259087M99012q4486m11811p61135j440853j222344j336113j501290j221095
$$ 15259087 15758099 15673613 15261802 14500667 13059814 11837470 10501357 9000067 7778972
6241G778972n52557n95978m52048k80169n21756k85739K4240l01823L87878J92137
$$ 7778972 7226415 6630437 6178389 5898220 5376464 5090725 5114965 4813142 5201020 5393157
6231E393157l04759j15891K82105j05137m0424O5271L62213j35615k43112n7552
$$ 5393157 5088398 4972507 5254612 5149475 5109051 5174322 5536535 5400920 5157808 5100256
6221E100256M29017K8186l28539N7017J14681j90369J3137K79301K99576K98900
$$ 5100256 5529273 5557459 5228920 5285937 5400618 5210249 5223386 5502687 5802263 6101163
6211F101163M86218R8697O21710O01849P27974N61262R65180R40166J120976J778238
$$ 6101163 6587381 6686078 7307788 7909637 8637611 9198873 10164053 11104219 12225195 14003433
6201A4003433K171968K979660M001965L648565L503771K966227J520301K88350
$$ 14003433 16175401 19155061 23157026 26805591 30309362 33275589 34795890 35084240
6193C5084240r26794j692807k199240k708367l019482k273176j250425m53784
$$ 35084240 34157446 32464639 30265399 27557032 24537550 22264374 21013949 20560165
6185B0560165L97306J768652K476088L321227L247068K021103J260488P96254
$$ 20560165 20957471 22726123 25202211 28523438 31770506 33791609 35052097 35848351
6177C5848351j259332k076054k817875l732978l516475l405120k912936j844803
$$ 35848351 34589019 32512965 29695090 25962112 22445637 19040517 16127581 14282778
6169A4282778j777784j848319j237547m58299j220326o81193K07871P0408p86082
$$ 14282778 12504994 10656675 9419128 8960829 7740503 7059310 7267181 7337589 6551507
6160F551507k63052j54220O975o8119J91139k89294m52431k41549m991J39126
$$ 6551507 6288455 6134235 6141210 6073091 6264230 5974936 5522505 5280956 5275965 5415091
6150E415091J53888n6261J22739m06479l54167L74359K58518k21543L82388R7194
$$ 5415091 5568979 5512718 5635457 5228978 4874811 5249170 5507688 5286145 5668533 5765727
6140E765727k682l90786r1840j70607O53465O79814K78496L68790L4547k17285
$$ 5765727 5763045 5372259 5280419 5109812 5763277 6443091 6721587 7090377 7124924 6907639
6130F907639O40614M28969K55876P20354N80772J208364K109866K341295L202977
$$ 6907639 7548253 7977222 8233098 8953452 9534224 10742588 12852454 15193749 18396726
6121A8396726L807808L805210L287834J977725Q61463p2112k40127r30234k343619
$$ 18396726 22204534 26009744 29297578 31275303 32136766 32064654 31824527 30894293 28550674
6112B8550674k793178l030251l131261k574235j543513p11888j88438L48227R12663
$$ 28550674 25757496 22727245 19595984 17021749 15478236 14766348 14577910 14926137 15838800
6103A5838800J181002K108192K955787L620521L469966K195908K186024K77779
$$ 15838800 17019802 19127994 22083781 25704302 29174268 31370176 33556200 33833979
6095C3833979j461386j249657j522962k844884l168183l565713l367900k866691
$$ 33833979 32372593 31122936 29599974 26755090 23586907 20021194 16653294 13786603
6087A3786603k490460j377026q40976r10893o96985J44616m88283l69883L82685
$$ 13786603 11296143 9919117 9078141 8167248 7470263 7614879 7126596 6756713 7139398
6078G139398m17269k74987k08961k30339l46664m39635j54181M06705k89792l00551
$$ 7139398 6722129 6447142 6238181 6007842 5661178 5221543 5067362 5474067 5184275 4883724
6068D883724O9692J09201j78842j84426J61102Q0430J10219M68j64914J333J36720
$$ 4883724 4953416 5062617 4883775 4699349 4860451 4940881 5051100 5051568 4886654 4887987 5024707
6057E024707N07592M97147J45817N33061R28800N14069Q52324J281813J074882
$$ 5024707 5532299 6029446 6175263 6708324 7637124 8151193 9003517 10285330 11360212
6048A1360212Q35450J032706N75589Q4671o32132o05384n58274o31638j125409
$$ 11360212 12195662 13228368 13803957 13888628 13256496 12651112 12092838 11461200 10335791
6039A0335791r43293o02503o18312o58266J6893M03850N79554O44075J265514
$$ 10335791 9392498 8789995 8171683 7513417 7530310 7934160 8513714 9157789 10423303
6030A0423303J065748J028897J329985Q86316Q65479M0366r69556m96376q58658
$$ 10423303 11489051 12517948 13847933 14734249 15599728 15640094 14670538 14174162 13315504
6021A3315504j326269j217604r83271j152065n06671j097103j032835p4980k73845
$$ 13315504 11989235 10771631 9788360 8636295 8129624 7032521 5999686 5924706 5650861
6012E650861k65576J02747k33239n29502O3666n56464j24878K03125l77714j0115
$$ 5650861 5385285 5488032 5254793 4725291 4788957 4232493 4107615 4310740 3933026 3922911
6002C922911K31140k20325q421L8799o47379N9309N2980l27359m4320j73464K80496
$$ 3922911 4154051 3933726 3925305 3964104 3316725 3376034 3429014 3101655 3057335 2883871 3164367
5991C164367L43380j79553m29856L54926l56955N3088M35891K99035L24804k88661
$$ 3164367 3507747 3328194 2898338 3253264 2896309 2949397 3385288 3684323 4009127 3720466
5981C720466k87771l01846j49327L23736o2619k95687L2870L00949p5052J25231
$$ 3720466 3432695 3130849 2981522 3305258 3242639 2946952 2979822 3280771 3205719 3330950
5971C330950M883k42447k11429J44370j06839K54706K77494j84542M28881l0449
$$ 3330950 3335833 3093386 2881957 3026327 2919488 3174194 3451688 3267146 3696027 3665578
5961C665578k96591J41052n0144r062M16831J27686l08259p5887k84536k99774
$$ 3665578 3368987 3510039 3459895 3450833 3867664 3995350 3687091 3611204 3326668 3026894
5951C026894K13893j39683o9160O56213J7409k83469J13754k56614L63444K84869
$$ 3026894 3240787 3101104 3031944 3688157 3705566 3422097 3535851 3279237 3642681 3927550
5941C927550j84865j05192o6368l17610J35571K20258O2860J16047m03294j03971
$$ 3927550 3742685 3637493 3571125 3253515 3389086 3609344 3672204 3788251 3384957 3280986
5931C280986j16873J96003M52566K41641Q2503k79827l00018j07701J5362N1999
$$ 3280986 3164113 3360116 3812682 4054323 4136826 3856999 3556981 3449280 3464642 3516641
5921C516641k04162k89188j24914j63788j83119l52703J63513M45654K23950K35767
$$ 3516641 3312479 3023291 2898377 2734589 2551470 2198767 2362280 2807934 3031884 3267651
5911C267651k24650k63126p1810k31925M8154K59387K07812k7964l44705m9680
$$ 3267651 3043001 2779875 2708065 2476140 2524294 2783681 2991493 2963529 2618824 2569144
5901B569144J02220L79263K60235k75060k24992l29026l65294J47604J14778r6222
$$ 2569144 2671364 3050627 3310862 3035802 2810810 2481784 2116490 2264094 2378872 2282650
5891B282650n7903o8122R3055L90484L67589L8755L33334M40932n46697j90344
$$ 2282650 2224747 2156625 2249680 2640164 3007753 3046508 3379842 3820774 3274077 3083733
5881C083733n11226k87499N58800J3889l05619N05150k30192j35836K28442J00082
$$ 3083733 2572507 2285008 2843808 2857697 2552078 3057228 2827036 2691200 2919642 3019724
5871C019724L06507L64622k97036o51761M4615j57534j12906O52435k51450k01434
$$ 3019724 3326231 3690853 3393817 2742056 2786671 2629137 2516231 3168666 2917216 2715782
5861B715782L47506m3565M99R7646j12710J21458o5144J71490L09351m9465k40888
$$ 2715782 3063288 3019723 3020222 3117868 3005158 3126616 3061472 3232962 3542313 3492848 3251960
5850C251960p9969J34505j59980J45146M97016l21975K12984J64982q5490J77700
$$ 3251960 3171991 3306496 3146516 3291662 3788678 3466703 3679687 3844669 3759179 3936879
5840C936879J02029j07839K08603l53364L3O65284L23096N9285p961L14014l38600
$$ 3936879 4038908 3931069 4139672 3786308 3786341 4451625 4774721 4834006 4826045 5140059 4801459
5829D801459P2884m2014K95661L56893j05180j48878N3706m61835j80533j66605
$$ 4801459 4874343 4832329 5127990 5484883 5379703 5230825 5284531 4822696 4642163 4475558
5819D475558m7013R3629R3825J48825j932p16081O4845J0996j50000N45108L69128
$$ 4475558 4428545 4522174 4615999 4764824 4762892 4046811 4111656 4122652 3972652 4517760 4886888
5808D886888n66696l28245K67217q990M3487Q0401l64632O6059K208j04564M57634
$$ 4886888 4320192 3991947 4259164 4250174 4293661 4374062 4009430 4075489 4077697 3973133 4430767
5797D430767J901p0784N25092o76482J15284M83639K82755j03813Q4089l0271
$$ 4430767 4432668 4361884 4886976 4210494 4325778 4809417 5092172 4988359 5072448 5042177
5787E042177L6604k85511k76707N33580O67717j96266J25651k73230q32032K61298
$$ 5042177 5078781 4793270 4516563 5050143 5717860 5521594 5647245 5374015 4541983 4803281
5777D803281J21594k9546O80474K0223q01043l80642J10905K37029N02896L79875
$$ 4803281 4924875 4895329 5575803 5596026 4794983 4414341 4525246 4762275 5265171 5645046
5767E645046j46195k86316l87986l01841K50290M57716J33814J2535o18712j07517
$$ 5645046 5498851 5212535 4824549 4522708 4772998 5230714 5364528 5377063 4758351 4650834
5757D650834K40650j72018L15647L49766j11300k26508j59309k8303r7755j56876
$$ 4650834 4891484 4719466 5035113 5384879 5273579 5047071 4887762 4859459 4761704 4604828
5747D604828N6849K17647l49599l4614M9531k89666o0053N94753K34593k35288
$$ 4604828 4661677 4879324 4529725 4495111 4544642 4254976 4194923 4789676 5024269 4788981
5737D788981J21812K97593l03375l03781k58889K8355m80210k07904p8425K45936
$$ 4788981 4910793 5208386 4905011 4601230 4342341 4370696 3890486 3682582 3604157 3850093
5727C850093k09316M40095M20130L8542P5884J72858K90558j941r9331J39795
$$ 3850093 3640777 4080872 4501002 4539544 4615428 4788286 5078844 5076903 4977572 5117367
5717E117367q8926p33507l35133j1061j95636K01870K67723J20860L18028K07898
$$ 5117367 5028441 4294934 3959801 3948740 3753104 3954974 4222697 4343557 4661585 4869483
5707D869483J88404N1833m9902k56764M01074O2554m69826p2982N0149l6689K20648
$$ 4869483 5057887 5109720 5059818 4803054 5204128 5266682 4796856 4723874 4774023 4737334 4957982
5696D957982K29448l52597l62508R6492P05239J40219l81774J23911K00419q95597
$$ 4957982 5187430 4834833 4472325 4568817 5274056 5414275 5032501 5156412 5356831 4461234
5686D461234m33964N79993L88179j7491o0573j20264m27059k54488L04860N67971
$$ 4461234 4027270 4607263 4995442 4977951 4917378 4797114 4370055 4115567 4420427 4988398
5676D988398j39745j42549K16478k23754L2497K53798L00509p844J3344L93390
$$ 4988398 4848653 4706104 4922582 4698828 4731325 4985123 5285632 5277788 5291132 5684522
5666E684522l79768l45340J31352L5422k6641m01887j81571J27141k70876k0893
$$ 5684522 5304754 4959414 5090766 5126188 5099547 4697660 4516089 4643230 4372354 4351461
5656D351461N97509N75334k8102m11302J97644J24900N2581j47621J50433k03156
$$ 4351461 4948970 5524304 5496202 5084900 5282544 5407444 5460025 5312404 5462837 5259681
5646E259681o02655n1718N05836K7936J16747K80185n40943q3178j1894N11752
$$ 5259681 4657026 4605308 5111144 5139080 5255827 5536012 4995069 4911891 4899997 5411749
5636E411749J24016m07443K05543k09368m96110m072O83300L11004l49337r6424
$$ 5411749 5535765 5128322 5333865 5124497 4628387 4624315 5307615 5618619 5269282 5172858
5626E172858q6559o05852L3909K68756J40706k20140n0081K54304k00794k67891
$$ 5172858 5086299 4480447 4514356 4783112 4923818 4703678 4653597 4907901 4707107 4439216
5616D439216P20892L30267k79940l3493K33859L26634l32014K27108J23361K05957
$$ 4439216 5160108 5490375 5210435 5176942 5410801 5737435 5405421 5632529 5755890 5961847
5606E961847r7349l69498m0217O67439O26311R33717J54623M55374J190589R29218
$$ 5961847 5864498 5495000 5454783 6122222 6748533 7682250 7836873 8292247 9482836 10412054
5596A0412054N55353O45203p0002k04083m86441r22305p30051j85965n19664p50651
$$ 10412054 10967407 11612610 11542608 11338525 10852084 9929779 9199728 9013763 8494099 7743448
5586G743448O093n59714o00738j64970k48565L15090J41217q1186K45774L73711
$$ 7743448 7749541 7189827 6589089 6424119 6175554 6490644 6631861 6550675 6796449 7170160
5576G170160M36909P75329Q37387J319475J225161Q64254k82855o70637j09546
$$ 7170160 7607069 8382398 9219785 10539260 11764421 12628675 12345820 11675183 11565637
5567A1565637j9540p27261o24090m13737q23397j152093o94835n27065l47023
$$ 11565637 11546097 10818836 10194746 9781009 8957612 7805519 7110684 6583619 6236596
5558F236596Q5938J4653n3473n20188j47380M30698n8695l12659N21868P9556
$$ 6236596 6322534 6337187 6283714 5763526 5616146 6046844 5988149 5675490 6197358 6276914
5548F276914m50368n38672k06444J64003q4321J22739L69499j32633j76797l20997
$$ 6276914 5826546 5287874 5081430 5245433 5161112 5283851 5653350 5520717 5343920 5022923
5538E022923M09249J62225K23213M48273k3275l67977J42263m10870n4091J97034
$$ 5022923 5432172 5594397 5817610 6265883 6242608 5874631 6016894 5606024 5551933 5748967
5528E748967K59232k6924n96797J42984K43844L79540j45898k21198m5391l78096
$$ 5748967 6008199 5981275 5384478 5527462 5771306 6150846 6004948 5783750 5738359 5360263
5518E360263p8762J85697O4601l22478P0154j34079l53338J077M77168R4560K21180
$$ 5360263 5281501 5467198 5531799 5209321 5279475 5145396 4792058 4793135 5270303 5364863 5586043
5507E586043L88393l68755J0428K21613l82031P0965J92861l29584k8471l67501
$$ 5586043 5974436 5605681 5616109 5837722 5455691 5526656 5719517 5389933 5361462 4993961
5497D993961j46633J49504K83575j50716J9441K06577k20726Q8510L26054k34700
$$ 4993961 4847328 4996832 5280407 5129691 5149132 5355709 5134983 5223493 5549547 5314847
5487E314847J81463M9454j3148L2183R9127K10328o1279P247J3680n7285j22906
$$ 5314847 5496310 5545764 5532616 5564799 5663926 5874254 5812975 5820222 5833902 5776617 5653711
5476E653711M7598J5234J20068l44182k28690J03368N8079K74886M76896K8460
$$ 5653711 5701309 5716543 5836611 5492429 5263739 5367107 5425186 5700072 6176968 6205428
5466F205428k49626m1719l90749Q850P13645m10985j88060M01467p9352l04404
$$ 6205428 5955802 5914083 5523334 5532184 6245829 5834844 5646784 6048251 5968899 5664495
5456E664495M93496J98495K5864M77701L1816R4732J89607j78802K64657j42m98917
$$ 5664495 6157991 6356486 6382350 6860051 6891867 6986599 7176206 6997404 7262061 7261919 6763002
5445F763002L03706R6614k25846J22923J51160n72530K74174L88834m53406k31579
$$ 6763002 7066708 7163322 6937476 7060399 7211559 6639029 6913203 7302037 6848631 6617052
5435F617052K3133p8186J3484R3514m09473M4930K55509J75600J99300J55257
$$ 6617052 6640185 6561999 6575483 6668997 6259524 6304454 6559963 6735563 6934863 7090120
5425G090120K91204O37102k24193l11690K13263k14823J78177J0511k84427J81774
$$ 7090120 7381324 8018426 7794233 7482543 7695806 7480983 7659160 7669671 7385244 7567018
5415G567018q7124L085J91866l18573L55388M48607Q1263J7177J20590j58968
$$ 7567018 7479894 7482979 7674845 7356272 7711660 8160267 8241530 8258707 8379297 8220329
5405H220329K52494R66585P94837J034080J376188J042576J366289R34162m08087
$$ 8220329 8472823 9439408 10234245 11268325 12644513 13687089 15053378 15987540 15579453
5396A5579453K69245k06269o66650m22185r99906r48065m27633j165127p70031
$$ 15579453 15848698 15642429 14975779 14553594 13553688 12605623 12177990 11012863 10242832
5387A0242832p0959k5957K51586P03120k27153j75657O98385J13788L12836Q91138
$$ 10242832 10171873 10145916 10397502 11100622 10873469 10697812 11396197 11509985 11822821 12713959
5377A2713959P43207N20710M62570J47297K61756j72966n95787K31685j35793
$$ 12713959 13457166 13977876 14440446 14587743 14849499 14676533 14080746 14312431 14176638
5368A4176638p97997l51157l63633m65027n81246k71015j91726m25021K07311
$$ 14176638 13378641 13027484 12663851 12198824 11617578 11346563 11154837 10729816 10937127
5359A0937127m7577l9134J82179M91418L69267r2458j55090L28307J51357L17206
$$ 10937127 10889550 10850416 11032595 11524013 11893280 11800822 11645732 11974039 12125396 12442602
5349A2442602O07882N33925M86437o7728K63903P17336J573039K073808K263553
$$ 12442602 13050484 13584409 14070846 14003118 14267021 14984357 16557396 18631204 20894757
5340B0894757K881685K713000R38838J691612J966293J847326O6603j436344j140903
$$ 20894757 23776442 26489442 27428280 29119892 31086185 32933511 33000114 31563770 30422867
5331C0422867p90302l71191p88278j599109j525191j006230l62448N8173j4673
$$ 30422867 29632565 29261374 28473096 26873987 25348796 24342566 23980118 24038291 24023618
5322B4023618O75329R11841J181551K214611L511683M510013M929149P155138
$$ 24023618 24698947 25610788 26792339 29006950 32518633 37028646 41957795 49112933
5314D9112933P121794L720127K757333M692725M676156K169543k059844k694230
$$ 49112933 56234727 59954854 62712187 67404912 72081068 74250611 72190767 69496537
5306F9496537j251030r08822o55051j146415m512469n240512k082976P62882R71270
$$ 69496537 68245507 67336685 66681634 65535219 61022750 55782238 53699262 54462144 55433414
5297E5433414J507676J623102K007711L229322K707383M110813P579928J0520779
$$ 55433414 56941090 58564192 60571903 63801225 66508608 70619421 78199349 88720128
5289H8720128J0085426N905917L750164P364897J0001844M861392J527911M518785
$$ 88720128 98805554 104711471 108461635 115826532 125828376 130689768 132217679 136736464
5281A36736464N335675L496993L777094j348649m826756l935395n472117n278718
$$ 136736464 142072139 145569132 149346226 147997577 143170821 139235426 133763309 128484591
5273A28484591n470539p729868j0765911j1514044r314359o986461o173449m156864
$$ 128484591 123014052 115284184 104518273 93004229 83689870 76703409 70529960 66373096
5265F6373096k156551J60500J049586K388155J233261O75954J1580n9173Q56664
$$ 66373096 64216545 64377045 65426631 67814786 69048047 69724001 69735581 69676408 70533072
5256G0533072O03291m96445m21611k569248l535661k074071j250514k86712J90566
$$ 70533072 71136363 70639918 70218307 67649059 64113398 62039327 60788813 60502101 60692667
5247F0692667j578958k636902k353408j320060j74236p5231m23049m7592N65217
$$ 60692667 59113709 56476807 54123399 52803339 52629103 52553872 52130823 52083231 52648448
5238E2648448J227187J290616m55813j983311j685717j457576j877527k840251
$$ 52648448 53875635 55166251 54710438 52727127 51041410 49583834 47706307 44866056
5230D4866056l035183l296188k524845j655987p63418k22423L39091M44715o35235
$$ 44866056 41830873 38534685 36009840 34353853 33590435 33368012 33707103 34151818 33516583
5221C3516583q02621k99810n56221q81620j051002j976747k205015j967738j083149
$$ 33516583 32713962 32414152 31857931 30976311 29925309 27948562 25743547 23775809 22692660
5212B2692660r26449p06320q59271r46763R1072Q4090K25585M07051n70210l58256
$$ 22692660 21766211 21059891 20200620 19253857 19344929 19429019 19654604 20061655 19491445 19133189
5202A9133189j71510r81322j044320l73038n84473q46667r94345p49333l36547
$$ 19133189 18961679 17980357 16936037 16562999 15978526 15131859 14137514 13388181 13051634
5193A3051634M12726j43964j64159L90640k53084n00047r6689l93926J84795j97679
$$ 13051634 13464360 13320396 13156237 13546877 13293793 12793746 12697057 12303131 12487926 12290247
5183A2290247o28275K26015L09082l94535J53146J06754M24822N96840K04995
$$ 12290247 11661972 11887987 12197069 11802534 11955680 12062434 12487256 13084096 13289091
5174A3289091n47938J30012P91970k3870K35408R30497P62048M60315J85518P78889
$$ 13289091 12741153 12871165 13663135 13639265 13874673 14805170 15567218 16027533 16213051 16991940
5164A6991940J856595K439863L172360L608227M590631M270481M770614O412488
$$ 16991940 18848535 21288398 24460758 28068985 32659616 36930097 41700711 48113199
5156D8113199P146242M849798K040421o40633k154413k670430m563419n422318
$$ 48113199 55259441 60109239 62149660 61509027 59354614 56684184 52120765 46698447
5148D6698447o003156n671778m762068l845986k925421k300079j785516q78614
$$ 46698447 40695291 35023513 30261445 26415459 23490038 21189959 19404443 18525829
5140A8525829n29071M0479l69125k92480K14453K44834J253897J316262J344557
$$ 18525829 17996758 18037237 17668112 17375632 17590085 17834919 19088816 20405078 21749635
5131B1749635K157189J968491J364373Q93584O09786R08544J415452J674772J365296
$$ 21749635 23906824 25875315 27239688 28133272 28743058 29651602 31067054 32741826 34107122
5122C4107122J591846K577715K564358L641385N828911P709880J0174998Q706629
$$ 34107122 35698968 38276683 40841041 44482426 50311337 58021217 68196215 76902844
5114G6902844K677136j278618j458395n75907k504360o367542p523597n965836
$$ 76902844 79579980 78301362 76842967 76267060 73762700 67395158 59871561 53905725
5106E3905725m125830j841637J272645L471908N665151P666617N686359J041471
$$ 53905725 49779895 47938258 49210903 52682811 58347962 66014579 71700938 72742409
5098G2742409o57857p08510r89875l257229n594984o443288o095539n327812l888301
$$ 72742409 72084552 71376042 70386167 67128938 61533954 55090666 48995127 43667315 39779014
5089C9779014k740771k577834j999468j301908j035090j388806j143961j321484
$$ 39779014 37038243 34460409 32460941 31159033 30123943 28735137 27591176 26269692
5081B6269692j327484j090566n74217n65694p9440m1613L14761K72072k10543
$$ 26269692 24942208 23851642 23277425 22711731 22632291 22590678 22905439 23177511 22966968
5072B2966968N52840J188103J057173J609114L202762M154629M948382O440698
$$ 22966968 23519808 24707911 25765084 27374198 30576960 34731589 39679971 46120669
5064D6120669P697835N587930M295802N696640O947127O013485J311672j562236
$$ 46120669 53818504 59406434 63702236 69398876 76346003 82359488 83671160 82108924
5056H2108924m019780m891182l530967k682066l083758k874107j469509K24220
$$ 82108924 78089144 73197962 69666995 66984929 63901171 61027064 59557555 59781775
5048E9781775O75034K307045L856844N473620O685345Q222935O866398r02643
$$ 59781775 60456809 62763854 66620698 72094318 78779663 87002598 93868996 92966353
5040I2966353l480646j91886K515249M69266m309281o938916n134002l677061
$$ 92966353 89485707 89293821 91809070 92278336 87969055 81030139 75896137 72219076
5032G2219076l650764k767108k012527j108550j662541j945474r64079J521757
$$ 72219076 68568312 65801204 63788677 62680127 61017586 59072112 58108033 59629790
5024E9629790J340276j07816N23674J647114j80912m059876l822961k169469j916865
$$ 59629790 60970066 60862250 61385924 63033038 62852126 58792250 54969289 52799820 50882955
5015E0882955l200385l175493l900050l327078j180528Q04581J850759L591002
$$ 50882955 47682570 44507077 40607027 37279949 36099421 36904002 38754761 42345763
5007D2345763L474004L831666K248358K91771o09640j382626o57235J276978P02430
$$ 42345763 45819767 49651433 51899791 52191562 51581922 50199296 49542061 50819039 51521469
4998E1521469j054829k976095m315923n532784m433334l258585k970083j860352
$$ 51521469 50466640 47490545 43174622 37641838 33208504 29949919 26979836 25119484
4990B5119484j191229j570717q09408j45470o28704o42557o39625q01400p16776
$$ 25119484 23928255 22357538 21548130 21402660 20773956 20131399 19491774 18690374 17973598
4981A7973598n89327J30540P66560j84575l96669J29796M73419P4870N88959M72071
$$ 17973598 17384271 17514811 18281371 18096796 17700127 17829923 18303342 18378212 18967171 19439242
4971A9439242J89125L29340K36206j53422N2356O04309L48424k27621k69385L4047
$$ 19439242 19628367 19957707 20193913 20040491 20092847 20697156 21045580 20817959 20548574 20582621
4961B0582621K95315j28585J10166N81345K62694N22172J980854K614170L063294
$$ 20582621 20877936 20749351 20859517 21440862 21703556 22225728 24206582 26820752 29884046
4952B9884046L269937M560553L886641K920309J303573P69360K01536r10842j276496
$$ 29884046 33153983 37714536 41601177 44521486 45825059 46594419 46795955 45885113 44608617
4943D4608617k32365M54044L18285m86831j293086j646201k531927k999796k825550
$$ 44608617 44376252 44830296 45148581 44661750 43368664 41722463 39190536 36190740 33365190
4934C3365190k821133k018251j834142j432409j337500j091689q73051p81886
$$ 33365190 30544057 28525806 26691664 25259255 23921755 22830066 21957015 21175129
4926B1175129l35834n5358k73860m52846P7904o7n7120Q0842N07912K75475K16331
$$ 21175129 20839295 20783937 20510077 20057231 20135135 20135068 20077948 20158790 20666702 20942177 21158508
4915B1158508J32475j03483O14088O95276j30740R5462K69808J73422J01220j09609
$$ 21158508 21290983 21187500 21801588 22496864 22366124 22461586 22731394 22904816 23006036 22896427
4905B2896427l70224J70538L88340k10224J54191M22201Q31243K90297K31937
$$ 22896427 22526203 22696741 23085081 22874857 23029048 23451249 24282492 24572789 24804726
4896B4804726J080057R33931L11748P73992J379868P29621Q3037j27979P5685
$$ 24804726 25884783 26818714 27130462 27904454 29284322 30013943 30096980 29969001 30044686
4887C0044686M0033l51877L52459J75602m81353p3352J52182j6950M1022P88860
$$ 30044686 30084719 29732842 30085301 30260903 29779550 29706198 29858380 29841430 29882452 30671312
4877C0671312M92598j00420j01163O68259K75312J75768N54396N85486L7323j30700
$$ 30671312 31163910 31063490 30962327 31630586 31905898 32081666 32636062 33221548 33258871 33128171
4867C3128171L82371M85965J66913O25996O02407J12790K73484O90385J358954
$$ 33128171 33510542 33996507 34163420 34789416 35391823 35504613 35778097 36468482 37827436
4858C7827436J452870J964641K724885K998746L080052K898043J738189N30116
$$ 37827436 39280306 41244947 43969832 46968578 50048630 52946673 54684862 55214978
4850E5214978P11402N42171J684r64921j484983r54419j046986r54242M6194R43680
$$ 55214978 55926380 56468551 56470235 55505314 54020331 53065912 52018926 51064684 51110878 52054558
4840E2054558J471742K032433K952849M740688N522199N455591N577236N518467
$$ 52054558 53526300 55558733 58511582 63252270 68774469 74230060 79807296 85325763
4832H5325763N489357N053850L749024J238060M48426K52036k23729p61341q50306
$$ 85325763 90815120 95868970 99617994 100856054 101304480 101556516 101332787 100571446 99721140
4823I9721140l55024K43700N86162J002085K172264K960112M178097O066752P103194
$$ 99721140 99366116 99609816 100195978 101198063 103370327 106330439 110508536 116575288 123678482
4814A23678482P898242Q119769P338967O682612P564447O934375N959048M744483
$$ 123678482 131576724 139696493 147035460 153718072 161282519 168216894 174175942 178920425
4806A78920425L200662K025579J998463K487601K623927L084497L023293L781865
$$ 178920425 182121087 184146666 186145129 188632730 191256657 194341154 197364447 201146312
4798B01146312M410079M269436M251832M441090L242588K349782J334322l958
$$ 201146312 205556391 209825827 214077659 218518749 221761337 224111119 225445441 225441483
4790B25441483J08671L54158O86108K135087K981290M064766N800622P008750
$$ 225441483 225550154 225904312 226590420 228725507 231706797 235771563 241572185 248580935
4782B48580935P863653Q491068O562302L935647Q59614k081489m212152o633791
$$ 248580935 256444588 264935656 271497958 275433605 276293219 274211730 269999578 263365787
4774B63365787q944635j0324108r217918q257847o721682m801683l495567l145560
$$ 263365787 254421152 244097044 234879126 226621279 219899597 215097914 211602347 208456787
4766B08456787l063957l497287l807624m293668n115048n323971n672452m908587
$$ 208456787 205392830 201895543 198087919 193794251 188679203 183355232 177682780 172774193
4758A72774193m500983m326740l862989l594423k794802k796606l412819l733867
$$ 172774193 168273210 163946470 160083481 156489058 153694256 150897650 147484831 143750964
4750A43750964m827428o583919p046188o995947p788638p445249p192610o793645
$$ 143750964 138923536 132339617 125293429 118297482 110508844 103063595 95870985 89077340
4742H9077340n990642m884534l601571k423138j038425Q58844K793704M130694
$$ 89077340 83086698 78202164 74600593 72177455 71139030 71997874 74791578 78922272
4734G8922272O790662Q425966O078696L553144O63285n31820m60882j92269L74033
$$ 78922272 85712934 94138900 100217596 103770740 104434025 103902205 103441323 103249054 103623087
4725A03623087k90742K57984K541472K973566k326022m925066k861483j313139
$$ 103623087 103332345 103590329 106131801 109105367 106779345 101854279 98992796 97679657
4717I7679657k791191n154097o232708n308454k701682J352025L525311K951420
$$ 97679657 94888466 89734369 83501661 78193207 75491525 76843550 80368861 83320281
4709H3320281J636134Q16329J457438Q13065j25668o91558L92506Q56614R9286
$$ 83320281 84956415 85772744 87230182 88043247 87917579 87226021 87618527 88475141 88574427
4700H8574427l64388k957714m289249m226406m005120m504508o677162p752856
$$ 88574427 88210039 85252325 80963076 76736670 72731550 68227042 61549880 53797024
4692E3797024o440930n219778m254273l158444k801923j749600j227527q73083
$$ 53797024 47356094 42136316 37882043 34723599 31921676 30172076 28944549 28071466
4684B8071466j147617q60518j161438m16203l79085n24838j49346J29799o15499
$$ 28071466 26923849 26063331 24901893 24485690 24106605 23581767 23432421 23562220 22946721
4675B2946721k29319L17679j21544m45654k46314n64956p4923K04345K02150m7677
$$ 22946721 22717402 23035081 22913537 22467883 22221569 21656613 21581690 21786035 21988185 21940508
4665B1940508r4233J65945J65795K74210k74846K98818L95666M8800j69046m082
$$ 21940508 21846275 22012220 22178015 22452225 22177379 22476197 22871863 22920663 22751617 22747535
4655B2747535R1292n3389o1367L70857Q3653K64690O83602N77340N82846O72563
$$ 22747535 22838827 22785438 22724071 23094928 23178581 23443271 24126873 24704213 25287059 25959622
4645B5959622N25314N22132N15147K77581M12416L12679J65970K87692N4745k62728
$$ 25959622 26484936 27007068 27522215 27799796 28212212 28524891 28690861 28978553 29033298 28770570
4635B8770570l23711J65791q6036J02472R2370k098j99671K5872J8159N09924
$$ 28770570 28446859 28612650 28526614 28629086 28721456 28719358 28519687 28545559 28563718 29073642
4625B9073642P36557P61325L34626p0970m38395R5126N8951J70570J15802N1252
$$ 29073642 29810199 30571524 30906150 30835180 30396785 30491911 30550862 30721432 30837234 30888486
4615C0888486R4857L02710M03640J62361P41975Q10151M74005N25491P52211O69385
$$ 30888486 30983343 31286053 31689693 31852054 32594029 33404180 33878185 34403676 35155887 35825272
4605C5825272K93263M63715J133983J061326K89923J69896M33399P31243Q10199
$$ 35825272 36118535 36582250 37716233 38777559 39067482 39237378 39670777 40402020 41212219
4596D1212219J006138J398860R48593O35985J050168J782221K232658K673241
$$ 41212219 42218357 43617217 44565810 45201795 46251963 48034184 50266842 52940083
4588E2940083L047939L163674L546931M017542N020893O129321P874354J0606657
$$ 52940083 55988022 59151696 62698627 66716169 71737062 77866383 85740737 96347394
4580I6347394J3605438J7480907K2860903K7609572K9494075L0560998L0367612
$$ 96347394 109952832 127433739 150294642 177904214 207398289 237959287 268326899
4573B68326899K7960512K2562955J5981044J1062825P890691P296457J1710777
$$ 268326899 296287411 318850366 334831410 345894235 353784926 361081383 372792160
4566C72792160J8775732K2553743K3631927K4684356K3337578J5126368L761526
$$ 372792160 391567892 414121635 437753562 462437918 485775496 500901864 504663390
4559E04663390q081244k1180954l2470371m0312066m3460659m5111327m4225308
$$ 504663390 496582146 475401192 442930821 402618755 359158096 314046769 269821461
4552B69821461m0664537l4448340k8466611k1849530j6532143j2360893r172968
$$ 269821461 229156924 194708584 166241973 144392443 127860300 115499407 106326439
4545A06326439o619345m598623m205758m013464l174676l238390l326981l857199
$$ 106326439 99707094 95108471 90902713 86889249 83714573 80476183 77149202 73292003
4537G3292003l699409l426612l525940l139466k550100k056677j361260j337423
$$ 73292003 69592594 66165982 62640042 59500576 56950476 54893799 53532539 52195116
4529E2195116j255602l54943m84005r20992n99981j61533m00582p20870n81410
$$ 52195116 50939514 50584571 50100566 49179574 48579593 48418060 48017478 47296608 46715198
4520D6715198k04830j53717m262L39060O27089R06967Q90991P95088J002852J047032
$$ 46715198 46510368 46356651 46352389 46691449 47318538 48225505 49116496 49911584 50914436 51961468
4510E1961468R43118P64610J153695R87431K050924K640765L166590M329637M539127
$$ 51961468 52904586 53669196 54822891 55810322 57861246 60502011 63668601 67998238 72537365
4501G2537365L987243M310735L844785K684886J501168Q80526j18653j393620
$$ 72537365 76524608 80835343 84680128 87365014 88866182 89746708 89628055 88234435
4493H8234435k452006l952193m712438n395684o066723n845278n097434m124296
$$ 88234435 85782429 81830236 77117798 71722114 65655391 59810113 54712679 50588383
4485E0588383l899324k620509j860156j369529j325908q89610q95761q29345p12172
$$ 50588383 46689059 44068550 42208394 40838865 39512957 38623347 37727586 36898241 36186069
4476C6186069j142080j066217r91348j108924q20329p54994j73832J11759O6945
$$ 36186069 35043989 33977772 32986424 31877500 31057171 30302177 30128345 30240104 30307049
4467C0307049l86539R11769J368626J133315J521644J477883R43058M84382R01316
$$ 30307049 29920510 30832279 32200905 33334220 34855864 36333747 37276805 37761187 38662503
4458C8662503R36105J219701J156568Q88397P95694O76983J090064J511836J382687
$$ 38662503 39598608 40818309 41974877 42863274 43658968 44335951 45426015 46937851 48320538
4449D8320538J557635J605568J071621R76171J426848J386123M25471j89569J74363
$$ 48320538 49878173 51483741 52555362 53531533 54958381 56344504 56769975 56580406 56754769
4440E6754769j194517j951232j797480j845277k027284j489028j793850j754212
$$ 56754769 55560252 53609020 51811540 49966263 47938979 46449951 44656101 42901889
4432D2901889j323867j294587j127748l00118J6106n7168K0317m91999k94852
$$ 42901889 41578022 40283435 39155687 38855569 38871675 38814507 38834824 38342825 38047973
4423C8047973K01893m92954l58466q21930j885842j804523j580992j974557j547957
$$ 38047973 38249866 37756912 37398446 36576516 34690674 32886151 31305159 29330602 27782645
4414B7782645r73491j373061j328964o74125o46753o28595L63752o5690m33381
$$ 27782645 26809154 25436093 24107129 23433004 22786251 22157656 22521408 22455718 22022337
4405B2022337j4197k75328O1842K95063m31059n68933J008j00584m61798j60820
$$ 22022337 22008140 21732812 21794654 22089717 21658658 21089725 21090733 20990149 20528351 20367531
4395B0367531Q3454k48498K94584M32666k57963M47628K42938j37022k26103o61525
$$ 20367531 20450985 20202487 20497071 20929737 20671774 21119402 21362340 21225318 20999215 20337690
4385B0337690o29924l29239l26097o11757l0050j28765l08806l91267m32470m94544
$$ 20337690 19707766 19378527 19052430 18440673 18410623 18281858 17973052 17581785 17149315 16654771
4375A6654771K7606J52404p3862j34667l68119l32505P4106M968K79938L40656
$$ 16654771 16682377 16834781 16760919 16626252 16258133 15925628 15999734 16004702 16284640 16625296
4365A6625296P2175R3677P9675K17754N2179J12091R9132j50708j39609L97715
$$ 16625296 16697471 16791148 16870823 17088577 17140756 17252847 17351979 17201271 17061662 17459377
4355A7459377l9157K66855l1688k73713N3822M02711M25911j64402J9060j22700
$$ 17459377 17420220 17687075 17655387 17381674 17435496 17838207 18264118 18099716 18118776 17996076
4345A7996076M13609j19533K49758L85796J15225l9838j1417j03543l2221L31162
$$ 17996076 18409685 18290152 18539910 18925706 19040931 19001093 18989676 18886133 18853912 19185074
4335A9185074M52523N64812P54212R76158J137666P11127M50210R5499R6961k26932
$$ 19185074 19637597 20202409 20956621 21932779 23070445 23781572 24231782 24327281 24424242 24197310
4325B4197310m15313p87430q42983q51414k53793P9481j80758j40031j82119O8215
$$ 24197310 23781997 22994567 22151584 21300170 21046377 21125858 20945100 20805069 20622950 20691165
4315B0691165p527J8630j16171k53919J43924K777n55963l56064J08734J26164
$$ 20691165 20683638 20702268 20586097 20332178 20476102 20478879 19922916 19566852 19675586 19801750
4305A9801750k3162M7437k22595p1536k6875k94926l20694M98519N13529K57295
$$ 19801750 19778588 19826025 19603430 19531894 19505019 19210093 18889399 19387918 19901447 20158742
4295B0158742L16691K95123l40373j69120m1201K33973K95999J50249j10856J39872
$$ 20158742 20475433 20770556 20430183 20261063 20219862 20453835 20749834 20900083 20789227 20929099
4285B0929099l44030n82509L55460l202m22052M82082q7708R8462K34111M29792
$$ 20929099 20585069 20002560 20358020 20354818 19932766 20414848 20327140 20425602 20659713 21089505
4275B1089505j19395N1649k40990q3072k01725k71800j66338q9856m31149r39681
$$ 21089505 20970110 21021759 20780769 20697697 20495972 20224172 20057834 19967978 19536829 18597148
4265A8597148l05733m97739k94097L32279K21021J00621k95041n55518m31430
$$ 18597148 18291415 17793676 17499579 17831858 18052879 18153500 17858459 17302941 16871511
4256A6871511m66498J6761N85935m35087M2605J6410o84622k57566J07240Q3704
$$ 16871511 16405013 16421774 17007709 16572622 16615227 16631637 15947015 15689449 15796689 15880393
4246A5880393j5324j68371m54188k32505K46229j58946K62997j21547n42055J9467
$$ 15880393 15865069 15696698 15242510 15010005 15256234 15097288 15360285 15238738 14696683 14716150
4236A4716150J56959m8427M17317L05120J45078J5326l88069O4301j79373j22951
$$ 14716150 14873109 14824682 15241999 15547119 15692197 15707523 15319454 15383755 15204382 15081431
4226A5081431j42850L7328n3023J23806K27653k47580m20650O446J01130j03007
$$ 15081431 14938581 14975909 14922886 15046692 15274345 15026765 14606115 14612561 14713691 14610684
4216A4610684k8079p54n7910l31337l60250M70811j89057J59794R9571L17073
$$ 14610684 14582605 14581851 14523941 14192604 13832354 14303165 14114108 14273902 14373473 14690546
4206A4690546M03960j36701l00645j246j04018L56536K41549m30042m8255N14929
$$ 14690546 15094506 14957805 14657160 14655914 14551896 14908432 15149981 14719939 14671684 15186613
4196A5186613m23567o82198L61535L84519l25195K35619J40428M55768K08920
$$ 15186613 14763046 14080848 14442383 14826902 14501707 14737326 14877754 15333522 15542442
4187A5542442k2632L16477L57057l28814L93976N10340J67279o1714L51108L27913
$$ 15542442 15519810 15836287 16193344 15864530 16258506 16768846 16936125 16874411 17225519 17553432
4177A7553432Q5207L34680J77734j56253K10768M68427M56592j38683K04725P33211
$$ 17553432 17638639 17973319 18151053 17994800 18205568 18673995 19130587 18991904 19196629 19929840
4167A9929840N16355J85350N22542R98013Q94392M18347M08480N94327o7967p5944
$$ 19929840 20446195 20631545 21154087 22152100 23046492 23464839 23873319 24467646 24399679 24323735
4157B4323735J006388M32514Q7385N54230O66339j13701J07537M18207P9945L12607
$$ 24323735 25330123 25762637 25850022 26404252 27070591 26956890 27064427 27482634 27562579 27875186
4147B7875186K61978L39310L57632m9311J84062Q09216J38830M57132J550784
$$ 27875186 28137164 28476474 28834106 28784795 28968857 29778073 29916903 30374035 31924819
4138C1924819O88623l190O26329J131796Q55594M85160L49503O65781R53440P34912
$$ 31924819 32613442 32610252 33236581 34368377 35223971 35709131 36058634 36724415 37677855 38412767
4128C8412767R91742J450611J397791Q05020J741018J076703J399095J542766
$$ 38412767 39404509 40855120 42252911 43057931 44798949 45875652 47274747 48817513
4120D8817513J550688J665577J854666J668976J583716J137464J086631J345055
$$ 48817513 50368201 52033778 53888444 55557420 57141136 58278600 59365231 60710286
4112F0710286R67525J01228M56991O79874O32620K7046R78224J793512J177772
$$ 60710286 61677811 61779039 62236030 62915904 63548524 63575570 64553794 66347306 67525078
4103F7525078Q62645J494474Q76834O22119P62684M05927N26435N99230J07233
$$ 67525078 68387723 69882197 70759031 71381150 72143834 72549761 73076196 73675426 73782659
4094G3782659Q9741P20609J223754K309936K707182K653587M227457M176741L224426
$$ 73782659 73872400 74593009 75816763 78126699 80833881 83487468 87714925 91891666 95116092
4085I5116092L276610L787457L493825K719677K084756K126127J702444J629624
$$ 95116092 98392702 102180159 105673984 108393661 110478417 112604544 114306988 115936612
4077A15936612K374035L305992K933671J964306J977347K412801K541414L118675
$$ 115936612 118310647 121616639 124550310 126514616 128491963 130904764 133446178 136564853
4069A36564853L615205M292825N027938O261051O637603N817366N243800M780914
$$ 136564853 140180058 144472883 149500821 155761872 162399475 168216841 173460641 178241555
4061A78241555L397196K520706J908947J47191O19229L10125J117499K681629
$$ 178241555 181638751 184159457 186068404 186215595 186834824 187144949 188262448 190944077
4053A90944077K607652J573402J726373K045132K614027L414794J674244l94212
$$ 190944077 193551729 195125131 196851504 198896636 201510663 204925457 206599701 206205489
4045B06205489j501426k330285k563637k892619k998360k898389k487014k092320
$$ 206205489 204704063 202373778 199810141 196917522 193919162 191020773 188533759 186441439
4037A86441439j222292j054404k249621l734963m666002m866258n860085o766442
$$ 186441439 185219147 184164743 181915122 178180159 173514157 168647899 162787814 156021372
4029A56021372o608695o308568n213526m287979l728846l149984k717102k736988
$$ 156021372 149412677 143104109 137890583 133602604 129873758 126723774 124006672 121269684
4021A21269684k165410k271621k622106k488476k951967l257743k464520k387430
$$ 121269684 119104274 116832653 114210547 111722071 108770104 105512361 103047841 100660411
4013A00660411k498242k700909l038575k531981k033669k366328k454721j936523
$$ 100660411 98162169 95461260 92422685 89890704 87857035 85490707 83035986 81099463
4005H1099463k146620k444776k293991k168343k011265k382436k298171j728309
$$ 81099463 78952843 76508067 74214076 72045733 70034468 67652032 65353861 63625552
3997F3625552j827538j953520j586071j819526j561398p65851j148623j211209
$$ 63625552 61798014 59844494 58258423 56438897 54877499 54111648 52963025 51751816
3989E1751816o28920o32334q19659m37961o00580o43305l59374j043112q77176
$$ 51751816 51122896 50490562 49670903 49232942 48632362 47989057 47629683 46586571 45709395
3980D5709395n47060j036682r75755j140530j452038j004496o72791j024563j001147
$$ 45709395 45162335 44125653 43149898 42009368 40557330 39552834 38880043 37855480 36854333
3971C6854333q63120n72685j067782j129988p34507j017689r55414o80696o73461
$$ 36854333 35991213 35418528 34350746 33220758 32486251 31468562 30513148 29832452 29158991
3962B9158991q61313p4103o23230o62494k20473l75739n73203o97249o47310l5019
$$ 29158991 28297678 28223575 27600345 26937851 26717378 26341639 25768436 25071187 24423877 24388858
3952B4388858n03928n53032j16905j24775n70975j40415j5092k38218K22896M92560
$$ 24388858 23884930 23331898 23214993 23090218 22519243 22378828 22363736 22125518 22348414 22840974
3942B2840974j90001l24634l41046J78792Q096k74897K37040K27606m59324j74277
$$ 22840974 22650973 22326339 21985293 22164085 22172181 21897284 22134324 22361930 21902606 21728329
3932B1728329J49098k37858j39552J66478P7023j96105r2594l72000l16811J40768
$$ 21728329 21877427 21639569 21500017 21666495 21743518 21547413 21454819 21082819 20766008 20906776
3922B0906776j21454K00116j54885k90077Q0614m65549j59220K03121k53159m08739
$$ 20906776 20785322 20985438 20830553 20540476 20621090 20155541 19996321 20199442 19946283 19537544
3912A9537544k69949l90288n5037k3076j23382j42207l9487K7944J09047j58452
$$ 19537544 19267595 18877307 18822270 18799194 18675812 18533605 18494118 18522062 18631109 18472657
3902A8472657k44539K33726k53196m89745L09964m03718n08662M07975L0167k13356
$$ 18472657 18228118 18461844 18208648 17718903 18028867 17625149 17116487 17524462 17554629 17341273
3892A7341273K29230r8539k8540N9697k73571J22319L94018j87380M65417J21771
$$ 17341273 17570503 17471964 17443424 17503121 17229550 17351869 17745887 17558507 18023924 18145695
3882A8145695n80943j53771N16469p6123L68465J28224J42482J38884K695j10630
$$ 18145695 17564752 17410981 17927450 17851327 18219792 18348016 18490498 18629382 18632077 18521447
3872A8521447J30215j75587J29480J03688k75960j31233j4707q083k0919l32790
$$ 18521447 18651662 18476075 18605555 18709243 18433283 18302050 18287343 18279260 18258341 17925551
3862A7925551m6519j44299j74808k39537L41190j85432M988R0183k97141j86029
$$ 17925551 17879032 17734733 17559925 17320388 17661578 17476146 17481134 17571317 17274176 17088147
3852A7088147J5540P2219K3720j28960j98774j06432m07886j36117J75106p8718
$$ 17088147 17103687 17175906 17199626 17070666 16871892 16765460 16357574 16221457 16396563 16317845
3842A6317845j43283J65894q2686l30460l34122R6350J39480j53602J78958k38881
$$ 16317845 16174562 16340456 16257770 15927310 15593188 15689538 15829018 15675416 15854374 15615493
3832A5615493m30364Q591j76535K10592K4522l0923j34449J23562j74172k31571
$$ 15615493 15185129 15193720 15017185 15227777 15252299 15221376 15086927 15210489 15036317 14804746
3822A4804746J67642m44076l86910J65477j82733j00415o2306R9538K9858j66243
$$ 14804746 14972388 14528312 14141402 14306879 14124146 14023731 13961425 14060963 14090821 13924578
3812A3924578j11742L7034j34241k0102r0155K08819m153n17519k0340j17104
$$ 13924578 13812836 13849870 13715629 13695527 13605372 13814191 13810038 13292519 13272179 13155075
3802A3155075L5494K16455J88672j99582J00271L08289o97272k96227L37343R8934
$$ 13155075 13190569 13407024 13595696 13396114 13496385 13804674 13107402 12811175 13148518 13247452
3792A3247452J22105N8078j92729M32432n8932p61237K01989k38977l91030L32185
$$ 13247452 13369557 13427635 13234906 13667338 13608406 12847169 13049158 12810181 12419151 12751336
3782A2751336p0950j95303k34650K23421j84077q7916N886N3834j04752j59758
$$ 12751336 12680386 12485083 12250433 12473854 12289777 12201861 12207747 12261581 12156829 11997071
3772A1997071p0480N17296l52664l11290p2786m44325l59230q2383M34622J15073
$$ 11997071 11926591 12443887 12091223 11779933 11707147 11262822 10903592 10821209 11255831 11370904
3762A1370904l06232J22482j32513j21261o3842n15148j67019J42314j19137k05196
$$ 11370904 11064672 11187154 11054641 10933380 10869538 10354390 10187371 10329685 10210548 10005352
3752A0005352k81888K0151n3333j57010k52183K15264N19323l18735m00245N9597
$$ 10005352 9723464 9743615 9690282 9533272 9281089 9496353 10015676 9696941 9296696 9356293
3742I356293j8329m1015j02590j39501L8683r947j36916Q2364M77927j04572l70739
$$ 9356293 9337964 9296949 9194359 9054858 9093541 9083594 8946678 9029042 9506969 9402397 9031658
3731I031658Q4718j60209l49197q9839K21814Q6805M09287o7949l54390j7436
$$ 9031658 9116376 8956167 8606970 8517131 8738945 8825750 9235037 9167088 8812698 8795262
3721H795262K33261O3365J41981l860j59860N45021n9008p68561P7504k3102l54602
$$ 8795262 9028523 9091888 9233869 9230009 9070149 9615170 9556162 8787601 8865105 8842003 8487401
3710H487401K75676N1582J04718M18222j5460j34100J09746J57060j2458j21190
$$ 8487401 8763077 8814659 8919377 9337599 9322139 9188039 9297785 9454845 9442387 9321197
3700I321197J26575j35094N6158j2300p4839o5402m78365K34644K91351k65770
$$ 9321197 9447772 9312678 9368836 9356536 9281697 9216295 8737930 8972574 9263925 8998155
3690H998155P0280j7682L8992L77840j17888l05965O3582r5499R9403L50813M7849
$$ 8998155 9068435 9050753 9089745 9467585 9349697 9043732 9107314 9011815 9111218 9462031 9509880
3679I509880j59028K06487O1901j15613P1757o2593P434M76912j60563m25392
$$ 9509880 9350852 9557339 9619240 9503627 9575384 9512791 9520225 9997137 9836574 9411182
3669I411182J46793M49574J73029q5701k15508j01892o1021K26359o379N6912
$$ 9411182 9557975 10007549 10180578 10094877 9879369 9777477 9716456 9942815 9936436 9993348
3659I993348K33633L22954k26794l87681J54096O68380l09958K6760K30805j08241
$$ 9993348 10226981 10549935 10323141 9935460 10089556 10757936 10447978 10474738 10705543 10597302
3649A0597302k52089M2366j56775k54348Q9759K68010k22570K51397N15296K56659
$$ 10597302 10345213 10387579 10230804 9976456 10066215 10334225 10111655 10363052 10878348 11135007
3639A1135007k873j27974n6637M8362o20486P0965K55423l89296l03395J12113
$$ 11135007 11132134 11004160 10947523 10995885 10375399 10446364 10701787 10312491 10009096 10121209
3629A0121209k62179l76751K1766N4303p9986J60851K00496o5214k30673l55672
$$ 10121209 9859030 9482279 9504045 9558348 9478362 9639213 9839709 9774495 9543822 9188150
3619I188150l37534K38724p5157R0744L65667J84797k63476m21883l8476J84400
$$ 9188150 8850616 9089340 9014183 9104927 9470594 9655391 9391915 8970032 8931556 9115956
3609I115956M47936K7408k65389J55677k05937p45583N62172P88223o7360r7897
$$ 9115956 9563892 9591300 9325911 9481588 9275651 8530068 9092240 9880463 9813103 9715206
3599I715206k1607l93972L33509K24527j8288K96358J77966n99805j05158j06830
$$ 9715206 9693599 9299627 9633136 9857663 9839375 10135733 10313699 9713894 9608736 9501906
3589I501906K09692M40761J98165J43173P5198k28186m5800L53688j27935l47060
$$ 9501906 9711598 10152359 10350524 10493697 10568895 10340709 10294909 10648597 10520662 10173602
3579A0173602j69129l18752l76521j9701J88373J67950k11621l28420M93917k90889
$$ 10173602 10004473 9685721 9309200 9289499 9477872 9645822 9434201 9105781 9599698 9308809
3569I308809l98115J06294N14969k54212k07115j48953k42971m20029J35302N4727
$$ 9308809 8910694 9016988 9531957 9277745 9070630 8921677 8678706 8258677 8393979 8448706
3559H448706j49972p910J42500m20450m12849q6883L3544j51180k00067l50636
$$ 8448706 8298734 8290824 8433324 8012874 7600025 7513142 7546686 7395506 7195439 6844803
3549F844803K99521n3134J0568J61527L55623j94715j63934M94810j33667L2728
$$ 6844803 7144324 7091190 7101758 7263285 7618908 7424193 7260259 7755069 7621402 7654130
3539G654130M66754Q8730K83282M58316J56337k44970l00838L75486L79838O983
$$ 7654130 8120884 8209614 8492896 8951212 9107549 8862579 8561741 8937227 9317065 9324048
3529I324048o3069L78012l3033m70223K64339L28734J38242K09669n6706j2808
$$ 9324048 9260979 9638991 9605958 9135735 9400074 9728808 9867050 10076719 10020013 10007205
3519A0007205K94480L00451J57828O0799K5221j81947j0629J068N16325N70985
$$ 10007205 10301685 10602136 10759964 10820763 10845984 10664037 10653408 10654476 11170801 11741786
3509A1741786N7793L46366K22542l65381J4829Q80184q975K62187N37931J67194
$$ 11741786 11799579 12145945 12368487 12003106 12017935 12898119 12889144 13151331 13689262 13856456
3499A3856456P86924P15674K81099N81531l7992l67612L8791r8838n98624m96654
$$ 13856456 14643380 15359054 15640153 16221684 16183692 15816080 15854871 15756033 15157409 14660755
3489A4660755j149618j007266q06269q74429n49730l07393k93402k22456q9484
$$ 14660755 13511137 12503871 11697602 10823173 10273443 9966050 9672648 9450192 9360708
3480I360708l59531j65151L5102j25367M7396k15817P8915O76383N7880m56046
$$ 9360708 9001177 8836026 8871128 8745761 8793157 8577340 8656255 9332638 9390518 8934472
3470H934472j28432J19359N46612M00897J236671J320739Q86589M18132J06609
$$ 8934472 8806040 8925399 9472011 9872908 11109579 12430318 13316907 13735039 13841648
3461A3841648m92601K7177L63592j58379p97749o58356r21325o04712k89903m3274
$$ 13841648 13349047 13376224 13739816 13581437 12783688 12125332 11204007 10599295 10309392 10266118
3451A0266118R6774l00855k32427L07475l38550m14684L83206L59825k18068K54211
$$ 10266118 10362892 10062037 9829610 10137085 9798535 9383851 9767057 10126882 9908814 10163025
3441A0163025L96520j22166K20775N93019M15747q4933K42040O86666M33016J84469
$$ 10163025 10559545 10437379 10658154 11251173 11666920 11581987 11824027 12510693 12943709 13128178
3431A3128178q36713k15504m52831m11862l10700m30967n72350m46512k05565
$$ 13128178 12291465 12075961 11623130 11211268 10900568 10469601 9897251 9450739 9245174
3422I245174j95645l15906j79596J5405k81276R8391j88125m48322k45102m18183
$$ 9245174 9049529 8733623 8554027 8569432 8288156 8386547 8198422 7750100 7504998 7086815
3412G086815k76729l81471k91282j32969l92076l7230m25332r6705n3553K26814
$$ 7086815 6810086 6428615 6137333 6004364 5612288 5575058 5149726 5053021 4999468 5226282
3402E226282J1340j54128L73587L64597j19268K09498K0482l88962K45050m59184
$$ 5226282 5237622 5083494 5457081 5821678 5702410 5911908 5932390 5543428 5788478 5329294
3392E329294n76661Q0195K48980M45264k46675j51584L97849K73530r6774o892
$$ 5329294 4752633 4832828 5081808 5527072 5280397 5128813 5526662 5800192 5703418 5696526
3382E696526J3424q0472k84061K65726k73205j69361K21954P9422k62K22628O0060
$$ 5696526 5709950 5629478 5345417 5611143 5337938 5168577 5390531 5469953 5469691 5692319 5752379
3371E752379K36085n2168J21681q9883p06458n30146Q1862m80910j44858j16969
$$ 5752379 5988464 5936296 6057977 5968094 5261636 4731490 4813352 4332442 4187584 4070615
3361D070615J80887J33368J39070k16045j86423K99832j09363j10058k78707K4359
$$ 4070615 4251502 4384870 4523940 4307895 4121472 4421304 4311941 4201883 3923176 3947535
3351C947535j01965k82246K07337L46481k18700l78092K28388k92719k43394m9700
$$ 3947535 3845570 3563324 3770661 4117142 3898442 3520350 3748738 3456019 3212625 3162925
3341C162925K36340N5012k70155j10767n3250O4660K38257K02067j17383J18109
$$ 3162925 3399265 3454277 3184122 3073355 3020105 3084765 3323022 3525089 3407706 3525815
3331C525815M64754l70980o27421k02830K84394q3755P7961N13500l08538J63296
$$ 3525815 3990569 3619589 2992168 2789338 3073732 2989977 3067938 3581438 3272900 3436196
3321C436196J42790p6678j417p9514k21395J44977j76687k08976N7048k4817m8994
$$ 3436196 3578986 3502308 3500891 3421377 3199982 3344959 3168272 2959296 3016344 2991527 2942533
3310B942533Q2967l91234m60404N92622L59487K2206j54603k32599k37225R0485
$$ 2942533 3025500 2634266 2173862 2766484 3125971 3148177 2993574 2760975 2523750 2614235
3300B614235K8787n3160k57565o1108J35881l67075N7813L29116j32393r7057
$$ 2614235 2643022 2589862 2332297 2271189 2407070 2039995 2097808 2426924 2294531 2197474
3290B197474j56578O6818J66732j6002J29540J86361l27784n55986K38573L3882
$$ 2197474 2040896 2107714 2274446 2258444 2387984 2574345 2246561 1690575 1929148 1963030
3280A963030q9688J9758k02462j67422K98699o75089k6568N62589m0006l91932
$$ 1963030 1873342 1893100 1690638 1523216 1821915 1146826 1120258 1682847 1642841 1250909
3270A250909j06788l45799L02528M90244K55742L15188M508k14850L2251k24904
$$ 1250909 1144121 798322 1100850 1591094 1846836 2162024 2166532 1951682 1983933 1759029
3260A759029m08416K78464N3767l46774l61083m3601J06442K80555K0844K8499
$$ 1759029 1350613 1629077 1682844 1336070 974987 931386 1037828 1318383 1339227 1367726
3250A367726M04115k05382k8870J40056j95259O6793K12329k55425j77050o3904
$$ 1367726 1771841 1566459 1537589 1677645 1482386 1549179 1761508 1506083 1329033 1265129
3240A265129j5127P9767M56715K54330k44466l25505j35870k45418j62229l07464
$$ 1265129 1250002 1329769 1786484 2040814 1796348 1470843 1334973 1089555 927326 619862
3230F19862N59373M73544m07134K81584J45963n46088J27396l66J24887k37911
$$ 619862 1179235 1652779 1245645 1527229 1673192 1127104 1254500 1254134 1379021 1141110
3220A141110k74647J46859K04109J59794k7485J38617O3139j57045J53114j96011
$$ 1141110 866463 1013322 1217431 1377225 1349740 1488357 1551496 1394451 1547565 1351554
3210A351554j46533M66202j19595l73173j90117j54271J97898q2887L68001M0249
$$ 1351554 1205021 1671223 1551628 1178455 988338 834067 1031965 949078 1317079 1357328
3200A357328O4855L73068P2052l8922J68769m29545j39261J17095k60692J81882
$$ 1357328 1422183 1795251 1867303 1828381 1997150 1567605 1428344 1545439 1284747 1466629
3190A466629J84436K45632j45402j06797k53221l23443L0463K95393K29560K63676
$$ 1466629 1651065 1896697 1751295 1644498 1391277 1067834 1098297 1393690 1623250 1886926
3180A886926m8788L70115m04083m29131L54828K51422p085J68938l18926J8314
$$ 1886926 1838138 2208253 1804170 1375039 1729867 1981289 1974204 2143142 1824216 1842530
3170A842530j71897n23971K61723J65901M8308N9508n5396L16277o2991K17712
$$ 1842530 1670633 1146662 1408385 1574286 1622594 1682102 1626706 1942983 1879992 2097704
3160B097704J06763p4687j8447J39398J15421K58937m08622J66462O6329k75273
$$ 2097704 2204467 2129780 2111333 2250731 2366152 2625089 2216467 2382929 2449258 2173985
3150B173985k7140k15871l08351n8712k53741J87625q9685K6619R5908J48242
$$ 2173985 2146845 1930974 1622623 1563911 1310170 1497795 1408110 1434729 1530637 1678879
3140A678879J932j59261K58803j06036j68149O11544J34118j34491J80137J3708
$$ 1678879 1680811 1521550 1780353 1674317 1506168 2117712 2251830 2117339 2297476 2311184
3130B311184k08173P5891k82060n1126J44606j9285j57757R6106j17263j7771
$$ 2311184 2103011 2178902 1896842 1845716 1990322 1971037 1813280 1909386 1792123 1774352
3120A774352o9973o3920j691K41091j06843k28476R8496k5787K40558m14023l05012
$$ 1774352 1704379 1640459 1638768 1879859 1773016 1544540 1643036 1617249 1857807 1443784 1138772
3109A138772J84573J66308O4168J13493m7733L88524l12241m94520j07273J56852
$$ 1138772 1323345 1489653 1553821 1667314 1619581 2008105 1695864 1201344 1094071 1250923
3099A250923k17257k76345J16058K75394j39771l51627k78471K40088M6683N0690
$$ 1250923 1033666 757321 873379 1148773 1009002 657375 378904 618992 665675 716365
3089G16365N5915K21318k54309J2581n51166k52833M49479K18754J80053J73396
$$ 716365 772280 993598 739289 751870 200704 -52129 397350 616104 796157 969553
3079I69553o4780k72708k65437j89916R3202J61172Q8455J1297M2961k0615l69248
$$ 969553 904773 632065 366628 176712 269914 431086 519541 530838 573799 553184 183936
3068A83936K09204K4676O1200J69777k8566k97713K28354n6991j42903K20288
$$ 183936 393140 417816 479016 648793 620227 322514 550868 493877 350974 571262
3058E71262K37212k83423M0338k02162k99866L44064j26343r3576M76335P2051
$$ 571262 808474 525051 565389 363227 63361 407425 281082 187506 663841 735892
3048G35892n17392L9484j05291l9486K12018j55369p0336K03722q2220j23461
$$ 735892 218500 257984 152693 113207 325225 169856 99520 303242 221022 97561
3038I7561M14285R7447j01400J69031l01408k11416K48284K0303J98184L26832
$$ 97561 511846 609293 507893 676924 375516 164100 412384 432687 630871 957703
3028I57703k58255o30226l24157L5869L60304J69337j63667J81068M8969l17543
$$ 957703 699448 69222 -254935 -219066 141238 310575 146908 327976 376945 59402
3018E9402l04139J28541L24934J94597j14979l23064M2446M69669p4328N0892
$$ 59402 -244737 -116196 208738 403335 288356 -34708 7738 477407 403079 453971
3008D53971O5327m79452n9844r4822k52644L89394k2238l79352j87119J64016
$$ 453971 519298 39846 -19998 -114820 -367464 21930 -308 -379660 -566779 -402763
2998d02763Q6958Q3991K71707K30938K03999l98549n27129J66170J78134j0727
$$ -402763 -315805 -231814 39893 270831 474830 76281 -450848 -284678 -106544 -117271
2988a17271K28007M60363R1992q2987j36091l09451J40856K57720l65686l58144
$$ -117271 110736 571099 663091 580104 444013 134562 275418 533138 167452 -190692
2978a90692J72528K5030k95119l2447l30416M04394K60663m7671J05641K35050
$$ -190692 -18164 6866 -288253 -320700 -651116 -246722 13941 -33730 71911 306961
2968C06961k32366m0633k07454J76190J91508j04791j79791r9333K87048R0412
$$ 306961 74595 33962 -173492 2698 194206 89415 -90376 -189709 97339 187751
2958A87751k64163K67269j18219k08946O4920k68116l6743O5634j19589j63382
$$ 187751 -76412 190857 72638 -136308 -71388 -339504 -376247 -310613 -430202 -593584
2948e93584K18119P2357K7302K20600K38482j58515L318k35279J85494N59222
$$ -593584 -375465 -303108 -275806 -55206 183276 24761 28079 -207200 -21706 537516
2938E37516m8810j04692K31012m01551l95115j57914K5853K89216M9690n5271
$$ 537516 488706 384014 615026 213475 -181640 -339554 -313701 -24485 25205 -30066
2928c0066J7241L6223k56052n9228J42705q4927j25259N1100j9126K70329M62879
$$ -30066 -12825 23398 -232654 -291882 -149177 -234104 -359363 -308263 -327389 -57060 405819
2917D05819k15448k64554Q1659J90265j64739l04114K55135N20987n16947n44427
$$ 405819 190371 -74183 7476 197741 33002 -271112 -15977 505010 -11937 -556364
2907e56364j99651L76029n146R9075K94425r2312j00272L480Q0479p8537J22694
$$ -556364 -756015 -379986 -385132 -286057 8368 -83944 -184216 -180736 -100257 -178794 -56100
2896e6100N7120k43463k78913J93212N42296J28264o45987J91125L4746l17760
$$ -56100 1020 -242443 -521356 -328144 214152 342416 -303571 -112446 -77700 -395460
2886c95460j9063K01428J13495l72307l14700L86016J66287J9355J39099K74961
$$ -395460 -414523 -213095 -99600 -471907 -786607 -400591 -234304 -214949 -75850 199111
2876A99111L20352j37128l61128k5947n8147j40691j78392l25814L74274M038
$$ 199111 519463 382335 21207 -4740 -62887 -203578 -381970 -707784 -333510 -329472
2866c29472j15758j12492k7629L91077K70430j1757J24402J36224l07299j52502
$$ -329472 -445230 -557722 -585351 -194274 76156 64399 188801 325025 17726 -134776
2856a34776K09934J79697j59008Q7838N7931l00187m49698k7865L71706M8016
$$ -134776 75158 254855 95847 183685 241616 -58571 -508269 -536134 -164428 -116412
2846a16412k64009n618L99797J5592o9133o3025L01278o1715K33967r6279m30610
$$ -116412 -380421 -386039 13758 29350 -39783 -102808 198470 136755 370722 274443 -156167
2835a56167r3543l07509M7459K37525j42062K71807j06613j54009K79879N31378
$$ -156167 -249710 -557219 -509760 -272235 -414297 -142490 -249103 -403112 -123233 408145
2825D08145K29712j14954k18953n0705m97397k30358Q6141K05159L1351n37197
$$ 408145 637857 522903 303950 253245 -244152 -474510 -388369 -183210 -151859 -689056
2815f89056P2302M13102K15384k4278J68503K05610K39826j04390o61460m35777
$$ -689056 -616754 -203652 11732 -12546 155957 361567 601393 497003 -164457 -600234
2805f00234K67795J99613l14636K46519J11991j49539K26073k90452K43657M54809
$$ -600234 -332439 -132826 -447462 -200943 -88952 -238491 -12418 -302870 -59213 395596
2795C95596K17423k28961p65973n189J60045k6109J22740Q761j11760m13245P9878
$$ 395596 613019 384058 -381915 -387104 -227059 -253168 -130428 -121667 -233427 -646672 -566794
2784e66794K22730k265L6456j53387p7069J16217K0600K5923J92805K39856k82835
$$ -566794 -344064 -346329 -309873 -463260 -540329 -424112 -403512 -377589 -184784 55072 -227763
2773b27763m81629l11333P27527O19588P4858k18905J76400k83778o03350K4048
$$ -227763 -709392 -1020725 -293198 326390 401248 182343 358743 74965 -528385 -504337
2763e04337M01564P3994j25013j98820k61339k46558l2117J13636L76050K93933
$$ -504337 -102773 -28779 -153792 -352612 -613951 -860509 -892626 -778990 -402940 -109007
2753a09007J0411r5355J49376j15299j6378k9507K04973L25801j12517l97393
$$ -109007 -98596 -193951 -44575 -159874 -176252 -205759 -786 325015 212498 -184895
2743a84895K8280j51464K94114K27767k67057j26040r1626R3737k69372j8413
$$ -184895 -156615 -308079 -13965 213802 -53255 -179295 -270921 -177184 -446556 -464969
2733d64969M43239k69811l25844J36732r2876L62052L23364J16043j55092L39732
$$ -464969 -21730 -291541 -617385 -480653 -573529 -211477 111887 227930 72838 412570
2723D12570j38248l25163l58914R7278N40847O289l00636O1000k21182m67295
$$ 412570 274322 -50841 -409755 -312477 228370 234659 -65977 -4977 -226159 -693454
2713f93454K8876M11755K60958J8856m6568J48290k18588J30182K63884M2955
$$ -693454 -664578 -252823 8135 26991 -19577 128713 -89875 40307 304191 347146
2703C47146p8299K9080k05642j64999M08617L96815k55821o16611J33327M1793
$$ 347146 268847 297927 92285 -72714 335903 732718 476897 -139714 -6387 35406
2693C5406n1663J93344N85803K68042m40828k69065l39384k15908K2930M29116
$$ 35406 -16257 177087 762890 1030932 590104 321039 -18345 -234253 -211323 217793
2683B17793o6019j10913j84498j40567k99064J24113M07470M29428m0239j05849
$$ 217793 151774 40861 -143637 -284204 -583268 -459155 -51685 377743 337504 231655
2673B31655J89461j65087j65824M47338L74433l30855m98665j65771M02554K3937
$$ 231655 421116 256029 90205 537543 911976 581121 82456 -83315 319239 343176
2663C43176j28183M6683K52968m55959p19749K81357O61694L65356k61393o29940
$$ 343176 214993 261676 514644 58685 -661064 -379707 281987 647343 385950 -243990
2653b43990j23285l5520j14355M76944J01766j93793k88524m39022K75554M79443
$$ -243990 -367275 -402795 -517150 -40206 61560 -132233 -420757 -859779 -584225 -104782
2643a04782J00393K57676K05479m765k65060o19993L2905J96455n4585o38709
$$ -104782 -4389 253287 458766 454001 188941 -431052 -398147 -201692 -256277 -894986
2633h94986j52566J68181J16352Q3314L35793O02795O78651K5991m86306l26247
$$ -894986 -1047552 -879371 -763019 -679705 -343912 258883 937534 963525 477219 150972
2623A50972J12895N24207J18910q27238j46883K57840K9065j07390L72967M41523
$$ 150972 263867 788074 906984 79746 -67137 190703 219768 112378 485345 926868
2613I26868q8429n13268J34227J24748l99724l536o2057k18305m23161J06219
$$ 926868 838439 325171 459398 584146 184422 180886 118829 -99476 -522637 -416418
2603d16418K36629K83042J67504K00446J23260q0408r7188M6186m05279n2431
$$ -416418 -179789 103253 270757 471203 594463 514055 416867 463053 57774 5343
2593E343N87336k62411m86267m6228J73022k21072J88280J18399K49632p1416
$$ 5343 592679 330268 -155999 -202227 -29205 -250277 -61997 56402 306034 234618
2583B34618J6128m6642l24193n0846L68912N26720m36997l02605j86656K31496
$$ 234618 250746 204104 -120089 -170935 197977 724697 287700 -14905 -201561 29935
2573B9935N3387J9708M74105J31316n9812Q8495l95698L0506L24938k03802j77036
$$ 29935 83322 103030 577135 708451 648639 737134 341436 371942 696880 493078 316042
2562C16042m5860l18458o7537N05625j60622j05922L91677j86340k52425j47589
$$ 316042 270182 -48276 -115813 389812 229190 123268 514945 328605 76180 -71409
2552g1409j26365M48248M38759J51508j79070o67006l81639J50953J40264O4015
$$ -71409 -197774 250474 689233 840741 661671 -5335 -386974 -236021 -95757 -31742
2542c1742L30233M9437k66985l28630J59344N4644K68408P5651P3980j68902P8328
$$ -31742 298491 347928 80943 -247687 -88343 -33699 234709 310360 384340 215438 293766
2531B93766K65496j39981j19584M3653j27260m66765L31144K64846J62495k7211
$$ 293766 559262 419281 299697 343350 216090 -250675 80469 345315 507810 480599
2521D80599q7547J13033k02211l26829J79082L50343l01196K89752L60356m07100
$$ 480599 393052 506085 303874 -22955 156127 506470 205274 495026 855382 448282
2511D48282r4878q426k86917r4865l2812j33288o3495K7977N7885M46814k92458
$$ 448282 353404 344978 58061 -36804 -69616 -202904 -266399 -238422 -180537 266277 -26181
2500b6181m19955J4350K82296N5849J62704L72574k56405n45744l74993j31253
$$ -26181 -446136 -431786 -149490 -93641 69063 441637 185232 -360512 -735505 -866758
2490h66758n2368O24840O56157n12438j35601K74840j67921J74844J32533J05833
$$ -866758 -919126 -294286 361871 -150567 -286168 -11328 -179249 -4405 128128 233961
2480B33961k173k56438l68070M75790L74507m12026m6813J86609k47681L17363
$$ 233961 231788 -24650 -392720 83070 457577 45551 -1262 185347 -62334 255029
2470B55029K37950K59464J97292k70339l58573K9327l1347j54690J56684J94801
$$ 255029 492979 752443 949735 679396 320823 350150 318803 164113 320797 515598
2460E15598j86335L57558K08626n21974j65841K03090j73086q8045j15144j02105
$$ 515598 329263 686821 895447 373473 207632 410722 237636 149591 34447 -67658
2450f7658L30208k28839k65704M47723L73607m5803O931J00503k41553J97586
$$ -67658 262550 33711 -231993 215730 589337 543534 550465 650968 409415 607001
2440F07001K43550l61081J9176J07248j68338K73543k1357j13387J13866K52859
$$ 607001 850551 489470 508646 615894 447556 721099 699742 586355 700221 953080
2430I53080k9436N7357P1065k14642J45282K18815j94672J51718M02805k24881
$$ 953080 923644 981001 1052066 837424 982706 1201521 1006849 1158567 1561372 1336491
2420A336491q3242J17563J40838j15387Q5906j51538j99835k3738N83194L05301
$$ 1336491 1253249 1370812 1511650 1396263 1482169 1330631 1130796 1107058 1690252 1995553
2410A995553j26328n93397m51981J53345j4842L11869Q5974O9429K55889O4110
$$ 1995553 1869225 1275828 823847 977192 962350 1274219 1360193 1429622 1685511 1749621
2400A749621N962k63588J17104M52079P474j33211J08765j11201J50324L47947
$$ 1749621 1755583 1491995 1609099 2061178 2068652 1935441 2044206 1933005 2083329 2431276
2390B431276k70775J48817L65288p5648R0110l36684k50967R07403K00305K18899
$$ 2431276 2160501 2309318 2674606 2598958 2689068 2352384 2101417 3008820 3209125 3428024
2380C428024K37448k5581M31181P07050J168727J337845J175934P29433L31371
$$ 3428024 3665472 3639891 4071072 4778122 5946849 7284694 8460628 9190061 9521432
2371I521432M29052M87180J230837J081123J263078J907342K829232M497684Q671310
$$ 9521432 9950484 10437664 11668501 12749624 14012702 15920044 18749276 23246960 31918270
2362C1918270J4801145K1022878K8104413K1331914P386312j32170L55159p611507
$$ 31918270 46719415 67742293 95846706 117178620 124564932 124432762 124787921 117176414
2354A17176414j6545046j7698477j6671656j4404848j1812059q108774n979512
$$ 117176414 100631368 82932891 66261235 51856387 40044328 31935554 25956042
2347B5956042l674500k828263k496148j339197j038723j977691j252737p38317
$$ 25956042 22281542 19453279 16957131 15617934 14579211 12601520 11348783 10610466
2339A0610466r40543q51014j145262r26417q9342n31235k72998j5647o32837o16590
$$ 10610466 9669923 8818909 7673647 6747230 6657888 6126653 5853655 5838008 5205171 4588581
2329D588581j00914k08302k20133J06721L10573j71299m44001l36445J08797k73856
$$ 4588581 4487667 4279365 4059232 4165953 4476526 4305227 3861226 3524781 3633578 3359722
2319C359722n64984K56970M28283p68745j97350O0922j72590j66382j08003l01761
$$ 3359722 2794738 3051708 3479991 2711246 2513896 2574818 2402228 2235846 2127843 1826082
2309A826082J89631K33915J21250k01892j63781K934m1404j88873k71456L07673
$$ 1826082 2015713 2249628 2370878 2168986 2005205 2008139 1966735 1777862 1506406 1814079
2299A814079M68387k24753k99592p9581j28059k91863k70433J55376M07455J55092
$$ 1814079 2282466 2057713 1758121 1678540 1550481 1258618 988185 1143561 1551016 1706108
2289A706108o95746p33778o7688J59960j80469K82497L25506j19652J25050P8474
$$ 1706108 1010362 276584 208896 368856 188387 470884 796390 676738 801788 880262
2279H80262j57566N52772N52989l34806o51899k18857l6889l7337k8653J64100
$$ 880262 722696 1275468 1828457 1493651 841752 622895 586006 548669 520016 684116
2269F84116O6602m71643k51761J67500L35042L3206K46428L40356k11458j57397
$$ 684116 750718 279075 27314 194814 529856 563062 809490 1149846 938388 780991
2259G80991o49420q2259K29443J26696L02981j73499l34097M4738J05656k9411
$$ 780991 131571 49312 278755 405451 708432 534933 200836 245574 351230 321819
2249C21819L81831J9507l89416p8568k95874J46047L87056P0825m27925k44208
$$ 321819 703650 723157 333741 255173 -40701 105346 492402 563227 135302 -108906
2239a08906j14734J90122N53921J74093K43022k07932l63391k08857l7258J97223
$$ -108906 -223640 -33518 520403 694496 937518 729586 366195 157338 120080 317303
2229C17303K51873k25006n44394j17387N436L26169P0547R6111L57699j04766
$$ 317303 569176 344170 -200224 -317611 -312175 13994 84541 180652 538351 433585
2219D33585m16655M49032K10969K16933j75573l58493l38234p6409P0651j87692
$$ 433585 16930 465962 676931 893864 718291 359798 21564 -54845 15806 -171886
2209a71886J91954J32761M56847k99607n1079M00706j01342k44120K3206k56404
$$ -171886 20068 152829 609676 310069 258990 659696 558354 314234 337440 81036
2199H1036k47428j69297J74769J91693j17825l0761J47496k48782M7454N36204
$$ 81036 -166392 -335689 -160920 30773 -87052 -117813 29683 -219099 -171645 364559
2189C64559L9776r9869R7786l04957n03201k1171M25473K95741j66781q3413K09123
$$ 364559 404335 304466 402252 97295 -405906 -427077 -1604 294137 127356 43943 253066
2178B53066j81560J2733J16499J37422j9471k50507J2679o2459K70156N54690
$$ 253066 71506 84239 200738 338160 318689 68182 80861 18402 288558 843248
2168H43248k82818m27066M5104j08292p1580M11144K21864o2881j25928n11373
$$ 843248 560430 133364 178468 70176 -1404 409740 631604 568723 442795 -68578
2158f8578j64389L74052K64584m8182j33527j55633N353l21254k69283L45488
$$ -68578 -232967 141085 405669 357487 223960 68327 73680 -247574 -516857 -171369
2148a71369N32657j49619J3795k5324j67542l52676J71881N3038K4528L9408k04785
$$ -171369 361288 211669 225464 200140 32598 -320078 -148197 -95159 -70631 -31223 -236008
2137b36008l33363J14085R6329N6195O1918R0666R3326M9400j36800K88501P1946
$$ -236008 -569371 -455286 -358957 -302762 -240844 -150178 -56852 -7452 -144252 144249 216195
2126B16195k84734k08670j75153K35296r6083J36449Q5458n302j82544j4565K16831
$$ 216195 -68539 -277209 -452362 -217066 -313149 -176700 -91242 -96544 -279088 -293653 -76822
2115g6822R6991k83172M14263L4845l69939M63084K43209k71470m46875K77186
$$ -76822 20169 -263003 151260 186105 -183834 279250 522459 250989 -195886 81300
2105H1300K42728l40842J5169J97346o8989k7965p60j96062j66761J16346o4509
$$ 81300 324028 -16814 -1645 195701 126712 98747 97987 -98075 -264836 -148490 -212999
2094b12999j42035L32535L24908L87455J52664l46730N33K69233l40131M44951
$$ -212999 -355034 -22499 302409 689864 842528 495798 496331 765564 425433 870384
2084H70384K53189l43435k50946o4481l90255k4969k7112J79321j12287n2468
$$ 870384 1123573 780138 529192 464711 74456 49487 22375 201696 89409 36941
2074C6941j05906J53275K03613l1943N2901j109q3985o4650j52351j72120p1150
$$ 36941 -68965 84310 287923 255980 308881 307772 223787 159137 6786 -165334 -236484
2063b36484k44974n174L8592j634r9405n1090K05536K08214K18564L12691n04949
$$ -236484 -481458 -486632 -448040 -449674 -549079 -600169 -394633 -186419 32145 344836 -160113
2052a60113k41007K51210k02428l4266k01686J46234J92140l21111l2282K51724
$$ -160113 -401120 -149910 -352338 -386604 -588290 -442056 -249916 -571027 -603309 -351585
2042c51585J6085j56629J27688J49735L03944K16540J07191k40468j69395j37778
$$ -351585 -335500 -492129 -364441 -214706 89238 305778 412969 172501 3106 -134672
2032a34672K52873J94290k31618J42755M1951k78518J10473r2709k07673j06269
$$ -134672 118201 312491 80873 223628 265579 -12939 97534 4825 -202848 -309117
2022c09117O0531K51288m04144P094P2559J22042j11890j37265L82259J75511
$$ -309117 -248586 2702 -401442 -394348 -321789 -199747 -311637 -448902 -66643 108868
2012A08868j48515j61072J1994j21683K37738J17081r419o47436j48695J18422
$$ 108868 -39647 -200719 -188725 -310408 -72670 44411 34992 -612444 -761139 -642717
2002f42717K0050J62943J00278M33467n178j44635L31918q6670l63986p1725J02730
$$ -642717 -622667 -459724 -359446 74021 68843 -75792 256126 169456 -194530 -266255 -163525
1991a63525J6058R0100j12644J21450J09148N4700j71776L98310J92175j61229
$$ -163525 -147467 -57367 -170011 -48561 60587 115287 -56489 341821 533996 372767
1981C72767J8183l4786m3675J1027j19081k0149m14105Q3023L82436k79548p3024
$$ 372767 390950 356164 312489 323516 204435 184286 -229819 -146796 235640 -43908 -116932
1970a16932J813o3755K5922K38764l9168M26987q0060O0637J18605j74041Q5779
$$ -116932 -115119 -178874 -152952 85812 46644 473631 393571 454208 572813 398772 484551
1959D84551M35379L26682p66239k56874K08099k78952J78512K45759k49048j17040
$$ 484551 919930 1246612 480373 223499 431598 152646 331158 576917 327869 210829
1949B10829l20055k01887J71003K58522J22131L11736K82135l77181m38046J21098
$$ 210829 -109226 -311113 -140110 118412 240543 552279 834414 457233 19187 140285
1939A40285o9279k9228L94822J18895k02398Q193n07334n6266j06883O828K33452
$$ 140285 71006 41778 436600 555495 353097 361290 -146044 -202310 -309193 -302365 -68913
1928f8913k1599l23541q2770N02299l3249J00358j79601l46258J9029L52558K20021
$$ -68913 -90512 -414053 -496823 5476 -27773 72585 -107016 -453274 -434245 -81687 138334
1917A38334L32903j4593l76601l36035j57606K0671M9031K39522r8124k09549
$$ 138334 471237 456644 80043 -255992 -413598 -392927 -343896 -104374 -202498 -412047
1907d12047K10056j82254K86602L96676m52796K41309j9175k12682M6613j57242
$$ -412047 -201991 -384245 -97643 299033 -153763 87546 68371 -144311 -97698 -254940
1897b54940l27932l24614N11291j12589Q4071L35738L27269j06590J33086j79603
$$ -254940 -582872 -907486 -396195 -508784 -424713 -88975 238294 131704 264790 85187
1887H5187J66205k97362k74238L3109n205J1129K8424L27444J80503m84150M3706
$$ 85187 251392 -45970 -320208 -287099 -292304 -281175 -252751 74693 255196 -228954 -185248
1876a85248M20096k75248K49515L36101n81901J3847K18393m33477l26305K76525
$$ -185248 234848 -40400 209115 545216 -36685 -22838 195555 -237922 -564227 -287702
1866b87702N960N63651J37278l44669J44001L32913l10507l79540k2444K32093
$$ -287702 -281742 281909 419187 74518 218519 551432 240925 -138615 -161059 71034
1856G1034m0067k69077o3371J92216j20758j38160K20958K95159J61116K55989
$$ 71034 30967 -238110 -301481 -109265 -230023 -368183 -147225 147934 309050 565039
1846E65039j04460k50442j14517k27901J98989n9772J74433P5106l57520j21437
$$ 565039 460579 210137 95620 -132281 66708 6936 181369 256475 -101045 -222482
1836b22482N63157j28671l93845k56264K30581o6755k32314L08523M66732J93278
$$ -222482 340675 212004 -181841 -438105 -207524 -274279 -506593 -198070 268662 461940
1826D61940j2774m21085j97163l71252L34196R4979o7272j77108q006j93979N2083
$$ 461940 449166 28081 -169082 -540334 -206138 -111159 -178431 -355539 -363545 -557524 -505441
1815e05441M52764L27374q9584J02094J7478O7361k31797j51015j66168J31336
$$ -505441 -52677 274697 185113 287207 304685 372046 140249 -10766 -176934 -45598
1805d5598k55499L08707K15699o4111j62548m214l50781J67520k3654L21514J79626
$$ -45598 -301097 7610 223309 159198 -3350 -7564 -358345 -190825 -214479 107035 286661
1794B86661j95812j03688m2784j67955n5328N34865L85045m21488j50777L43698
$$ 286661 90849 -12839 -55623 -223578 -278906 255959 641004 219516 68739 412437
1784D12437k11063l22734L8270J66829j63186J23843L03235q2362j01193M83356
$$ 412437 201374 -121360 -83090 83739 -79447 44396 347631 265269 164076 647432
1774F47432r1650k73105l88302J25595J82393J46096j00856K40447n31427m45531
$$ 647432 555782 282677 -105625 19970 202363 348459 247603 488050 -43377 -488908
1764d88908J31459M5108K06148L44271J25147J07631l81818j76041q1463L00562
$$ -488908 -357449 -312341 -106193 238078 363225 470856 89038 -87003 -168466 132096
1754A32096K69726K37458q7249j69190J17017k4792n55202R3249n7886l07330
$$ 132096 401822 639280 552031 382841 499858 475066 -80136 13113 -44773 -352103
1744c52103j68793J30013n6150K79212r8511K57810Q7470l33520m6836J56943
$$ -352103 -520896 -390883 -447033 -167821 -266332 -8522 78948 -254572 -301408 -144465
1734a44465L42772L80385j37012m28779j68118O4291l34148j06329L26078j10016
$$ -144465 198307 578692 441680 12901 -155217 -90926 -425074 -531403 -205325 -315341
1724c15341K32851m01614J9169N05779k76846J07745J32822k57604J64879l30438
$$ -315341 -82490 -484104 -464935 40844 -236002 -128257 4565 -253039 -88160 -418598
1714d18598m24466M98845J11299o00619J11938K36298M90342O5768l06029K21924
$$ -418598 -843064 -344219 -232920 -833539 -721601 -485303 5039 70807 -235222 -13298
1704a3298N65402k83897l84145L29421n43794l53232O8728n77744J66826M35403
$$ -13298 552104 268207 -115938 213483 -330311 -683543 -614815 -1192559 -1025733 -590330
1694e90330J34152Q1305J30726J54610m2955m1297L98907K03783k08296l14120
$$ -590330 -456178 -374873 -244147 -89537 -132492 -173789 225118 428901 220605 -93515
1684i3515j87799L67112r2083l21679P21037L35086l39152k86695K62918Q750
$$ -93515 -281314 85798 -6285 -327964 393073 728159 389007 102312 365230 373980
$$ [...]
##END NTUPLES=NMR SPECTRUM
##END=
