##TITLE=1H_DE-80H_X3
 200.13MHz, d2o
 8 sc
 
 19ns.26.2.2025
##JCAMPDX= 6.0         $$ Bruker NMR JCAMP-DX V2.0
##DATA TYPE= NMR SPECTRUM
##DATA CLASS= NTUPLES
##ORIGIN= UXNMR, Bruker Analytische Messtechnik GmbH
##OWNER= pz
$$ XWIN-NMR		Version 3.5
$$ Fri Jun  5 11:51:28 2026 Russian Standard Time (UT+4h)  Yarkov@DPX200
##.OBSERVE FREQUENCY= 200.1313
##.OBSERVE NUCLEUS= ^1H
##.ACQUISITION MODE= SIMULTANEOUS
##.ACQUISITION SCHEME= undefined
##.AVERAGES= 8
##.DIGITISER RES= 18
##SPECTROMETER/DATA SYSTEM= spect
##.PULSE SEQUENCE= zg30
##.SOLVENT NAME= DMSO
##.SHIFT REFERENCE= (INTERNAL, DMSO, 0, 15.4769)
##AUDIT TRAIL= $$ (NUMBER, WHEN, WHO, WHERE, WHAT)
$$ ##TITLE= Audit trail, XWIN-NMR		Version 3.5
$$ ##JCAMPDX= 5.01
$$ ##ORIGIN= Bruker BioSpin GmbH
$$ ##OWNER= Yarkov
$$ C:/Bruker/XWIN-NMR/data/yarkov2/nmr/H-C/1/pdata/1/auditp.txt
$$ ##AUDIT TRAIL=  $$ (NUMBER, WHEN, WHO, WHERE, WHAT)
(   1,<2026-06-05 11:50:43.09 +0400>,<Yarkov>,<DPX200>,
      <created by zg, POWCHK disabled, PULCHK disabled
       configuration hash MD5:
       00 E9 B6 7A A2 85 ED C7 34 08 36 98 17 FE 4E 26
       data hash MD5: 16K
       9A 0A 8C 1E 36 D8 1E 90 67 B5 9A 20 10 1F EE E8>)
(   2,<2026-06-05 11:50:52.73 +0400>,<Yarkov>,<DPX200>,
      <Start of raw data processing
       efp BC_mod = 2 LB = 0.25 FT_mod = 6 PKNL = 1 PHC0 = -6376.443 PHC1 = 8.221958 SI = 16K 
       data hash MD5: 16K
       19 5F 8C D1 25 5B ED 0E 54 ED CC 4B EC 70 3F 99>)
$$ ##END=
$$ 
$$ hash MD5
$$ BA BB 7C C3 C0 23 1A 52 73 77 CC E8 4D 62 02 CB
##$RELAX= 
##$RELAX= 
##$RELAX= 
##$RELAX= 
##$RELAX= 
##$RELAX= 
$$ Bruker specific parameters
$$ --------------------------
##$DU= <C:/Bruker/XWIN-NMR>
##$EXPNO= 1
##$NAME= <H-C>
##$PROCNO= 1
##$TYPE= <nmr>
##$USER= <yarkov2>
##$AMP= (0..31)
100 100 100 100 100 100 100 100 100 100 100 100 100 100 100 100 100 100 
100 100 100 100 100 100 100 100 100 100 100 100 100 100 
##$AQSEQ= 0
##$AQ_mod= 1
##$AUNM= <au_zg>
##$AUTOPOS= <>
##$BF1= 200.13
##$BF2= 200.13
##$BF3= 200.13
##$BF4= 200.13
##$BF5= 200.13
##$BF6= 200.13
##$BF7= 200.13
##$BF8= 200.13
##$BYTORDA= 1
##$CFDGTYP= 0
##$CFRGTYP= 5
##$CHEMSTR= <none>
##$CNST= (0..31)
1 1 145 1 1 1 1 1 1 1 1 1 1 1 1 1 1 1 1 1 1 1 1 1 1 1 1 1 1 1 1 1 
##$CPDPRG= <>
##$CPDPRG1= <>
##$CPDPRG2= <>
##$CPDPRG3= <>
##$CPDPRG4= <mlev>
##$CPDPRG5= <mlev>
##$CPDPRG6= <mlev>
##$CPDPRG7= <mlev>
##$CPDPRG8= <mlev>
##$CPDPRGB= <>
##$CPDPRGT= <>
##$D= (0..31)
0 0.7 0 0 0 0 0 0 0 0 0 0.03 0 0 0 0 0 0 0 0 0 0 0 0 0 0 0 0 0 0 0 0 
##$DATE= 1780645842
##$DBL= (0..7)
120 120 120 120 120 120 120 120 
##$DBP= (0..7)
150 150 150 150 150 150 150 150 
##$DBP07= 0
##$DBPNAM0= <>
##$DBPNAM1= <>
##$DBPNAM2= <>
##$DBPNAM3= <>
##$DBPNAM4= <>
##$DBPNAM5= <>
##$DBPNAM6= <>
##$DBPNAM7= <>
##$DBPOAL= (0..7)
0.5 0.5 0.5 0.5 0.5 0.5 0.5 0.5 
##$DBPOFFS= (0..7)
0 0 0 0 0 0 0 0 
##$DE= 6
##$DECBNUC= <off>
##$DECIM= 32
##$DECNUC= <off>
##$DECSTAT= 4
##$DIGMOD= 1
##$DIGTYP= 9
##$DL= (0..7)
0 120 120 120 120 120 120 120 
##$DP= (0..7)
$$ [...]
##$SUBNAM2= <"">
##$SUBNAM3= <"">
##$SUBNAM4= <"">
##$SUBNAM5= <"">
##$SUBNAM6= <"">
##$SUBNAM7= <"">
##$SUBNAM8= <"">
##$SUBNAM9= <"">
##$SW= 18.0517328524113
##$SWIBOX= (0..15)
0 0 2 0 0 0 0 0 0 0 0 0 0 0 0 0 
##$SW_h= 3612.71676300578
##$TD= 16384
##$TD0= 1
##$TE= 0
##$TE2= 300
##$TE3= 300
##$TEG= 300
##$TL= (0..7)
0 120 120 120 120 120 120 120 
##$TP= (0..7)
150 150 150 150 150 150 150 150 
##$TP07= 0
##$TPNAME0= <>
##$TPNAME1= <>
##$TPNAME2= <>
##$TPNAME3= <>
##$TPNAME4= <>
##$TPNAME5= <>
##$TPNAME6= <>
##$TPNAME7= <>
##$TPOAL= (0..7)
0.5 0.5 0.5 0.5 0.5 0.5 0.5 0.5 
##$TPOFFS= (0..7)
0 0 0 0 0 0 0 0 
##$TUNHIN= 0
##$TUNHOUT= 0
##$TUNXOUT= 0
##$USERA1= <user>
##$USERA2= <user>
##$USERA3= <user>
##$USERA4= <user>
##$USERA5= <user>
##$V9= 5
##$VALIST= <valist>
##$VCLIST= <CCCCCCCCCCCCCCC>
##$VD= 0
##$VDLIST= <DDDDDDDDDDDDDDD>
##$VPLIST= <PPPPPPPPPPPPPPP>
##$VTLIST= <TTTTTTTTTTTTTTT>
##$WBST= 1024
##$WBSW= 4
##$XGAIN= (0..3)
0 0 0 0 
##$XL= 0
##$YL= 0
##$YMAX_a= 141648
##$YMIN_a= -114282
##$ZGOPTNS= <>
##$ZL1= 120
##$ZL2= 120
##$ZL3= 120
##$ZL4= 120
##$ABSF1= 0
##$ABSF2= 0
##$ABSG= 0
##$ABSL= 0
##$ALPHA= 0
##$AQORDER= 0
##$ASSFAC= 0
##$ASSFACI= 0
##$ASSFACX= 0
##$ASSWID= 0
##$AUNMP= <proc_1d>
##$AZFE= 0.1
##$AZFW= 0.1
##$BCFW= 0
##$BC_mod= 2
##$BYTORDP= 0
##$COROFFS= 0
##$CY= -3
##$DATMOD= 1
##$DC= 0
##$DFILT= <>
##$DTYPP= 0
##$F1P= 0
##$F2P= 0
##$FCOR= 1
##$FTSIZE= 16384
##$FT_mod= 6
##$GAMMA= 0
##$GB= 0
##$INTBC= 1
##$INTSCL= 3.241238e-09
##$ISEN= 128
##$LB= 0.25
##$LEV0= 0
##$LPBIN= 0
##$MAXI= 10000
##$MC2= 0
##$MEAN= 0
##$ME_mod= 0
##$MI= 1.114404
##$NCOEF= 0
##$NC_proc= -9
##$NLEV= 6
##$NOISF1= 3.799351
##$NOISF2= 2.8
##$NSP= 0
##$NTH_PI= 0
##$NZP= 0
##$OFFSET= 15.47695
##$PC= 1
##$PHC0= -6376.443
##$PHC1= 8.221958
##$PH_mod= 1
##$PKNL= yes
##$PPARMOD= 0
##$PSCAL= 0
##$PSIGN= 0
##$REVERSE= no
##$SF= 200.130008957551
##$SI= 16384
##$SIGF1= 3
##$SIGF2= 2
##$SINO= 0.751879
##$SIOLD= 32768
##$SREGLST= <19F.Aceton>
##$SSB= 0
##$STSI= 16384
##$STSR= 0
##$SW_p= 3612.71676300578
##$SYMM= 0
##$S_DEV= 0
##$TDeff= 16384
##$TDoff= 0
##$TI= <>
##$TILT= no
##$TM1= 0
##$TM2= 0
##$TOPLEV= 0
##$USERP1= <user>
##$USERP2= <user>
##$USERP3= <user>
##$USERP4= <user>
##$USERP5= <user>
##$WDW= 1
##$XDIM= 16384
##$YMAX_p= 528107934
##$YMIN_p= -2347728
$$ End of Bruker specific parameters
$$ ---------------------------------
##NTUPLES= NMR SPECTRUM
##VAR_NAME=  FREQUENCY,     SPECTRUM/REAL,   SPECTRUM/IMAG
##SYMBOL=    X,             R,               I
##VAR_TYPE=  INDEPENDENT,   DEPENDENT,       DEPENDENT
##VAR_FORM=  AFFN,          ASDF,            ASDF
##VAR_DIM=   16384,         16384,           16384
##UNITS=     HZ,            ARBITRARY UNITS, ARBITRARY UNITS
##FACTOR=    0.220516191357247, 1,           1
##FIRST=     3097.40208044999, 0,            0
##LAST=      -515.314682555791, 0,           0
##MIN=       -515.314682555791, -2347728,    0
##MAX=       3097.40208044999, 528107934,    0
$$ Real data points
##PAGE= N=1
##DATA TABLE= (X++(R..R)), XYDATA
$$ [...]
7238C506984O34386O87392P74729J18465k98528o75466o18288P29785J82721P1704
7228E113884Q24737j22741p71385n23459O55561m32927k42103m18405P5306J59474
7218D317942M71435J89974n3203R41301Q23826j287745o08779j83020l60972k15587
7208D035172M66494L72455p06960o53576n76855L17180j79798J34522L11663k22228
7198C298069k59615k01120N43344K70024n25029p19857n81144O66750N6083l86947
7188B160558L47964k52680m2832M76304N27164p53658j94835M80185K73357m9834
7178B971693j18342K2893r61534N6318n08087L6616P26776J50835l10329K4349
7168B091188R5214p72818j180701P59734O46508k78187k66345P78003N70972o74690
$$ plain form
7238 3506984 4141370 4828762 5603491 5721956 5423428 4747962 4129674 4859459 5042180 5113884
7228 5113884 5938621 5815880 5044495 4521036 5176597 4743670 4501567 4083162 4158468 4317942
7218 4317942 4789377 4979351 4926148 5867449 6691275 5403530 4794751 4611731 4250759 4035172
7208 4035172 4501666 4874121 4167161 3513585 2936730 3253910 3074112 3208634 3520297 3298069
7198 3298069 3038454 2837334 3380678 3650702 3125673 2405816 1824672 2491422 2547505 2160558
7188 2160558 2508522 2255842 2213010 2689314 3216478 2462820 2267985 2748170 3021527 2971693
7178 2971693 2853351 2876244 1914710 1971028 1462941 1499557 2226333 2377168 2066839 2091188
7168 2091188 2186402 1413584 232883 992617 1639125 1360938 1094593 1872596 2443568 1768878
7158A768878m9186N78942J25740k00461M76163p48992P6023l76553n63039l0516
7148A056999O09189Q80833k51647M16375m29351n25700l12583K41804j25336n02431
7138A058152O6526l68616P2070N92823k90493r782L50736M2276J15104P75849
7128B404645n43896j76755k91704j39489j33509Q3286J026620J36529p15316K90517
7118A940928J31884O47906m1008o06508J98090n66960M98103L3338j03424q5181
7108B047168J73193O72583n11299P6994m54729L7181M35868l32361J61233Q54428
7098C160259K49772p44134l86824N91316J67929j36392L70857O72306o34073Q9059
7088C400075j97467p10144L04917j98897q86551L99512n9053k09893O6115j53643
$$ plain form
7158 1768878 1719692 2298634 2424374 2223913 2700076 1951084 2027107 1650554 1087515 1056999
7148 1056999 1666188 2547021 2295374 2711749 2282398 1756698 1444115 1685919 1560583 1058152
7138 1058152 1124678 756062 828132 1420955 1130462 1120680 1471416 1513692 1628796 2404645
7128 2404645 1860749 1683994 1392290 1252801 1119292 1202578 2229198 2365727 1650411 1940928
7118 1940928 2072812 2720718 2679710 2073202 2271292 1704332 2202435 2235773 2132349 2047168
7108 2047168 2220361 2892944 2381645 2458639 2003910 2041091 2476959 2144598 2305831 3160259
7098 3160259 3410031 2665897 2279073 2870389 3038318 2901926 3272783 3945089 3311016 3400075
7088 3400075 3202608 2492464 2797381 2598484 1711933 2111445 2052392 1842499 1908614 1754971
7078A754971J218612l70393q6682p3724j40819m19039l44758K4105L25310J5341
7068A902924O64453q84697m15178L9171Q77315J08797r65693M42865N28898J169588
7058C468443q25979j04926p04601l96618k5413n10993P68687J76785j97174P6708
7048A724919R33865o27093j87178M12128p9639J52954l38037j25753J69293M22370
7038B457829m59515j98231l54168n71251K54723P70852P09340K8470k95742j71638
7028B170669J88197n32729P47630k35197k80201n05563O11792L61049l30242m38925
7018A756480o5715K52794L20378K31570m27902n24618n40188k93387J215579m46601
7008A478390M97216J49542m80851Q1448N72205K81606K03454k35580m85748L43156
$$ plain form
7078 1754971 2973583 2603190 2516508 2442784 2301965 1882926 1538168 1562273 1887583 1902924
7068 1902924 2567377 1682680 1267502 1306673 2183988 2292785 1327092 1769957 2298855 3468443
7058 3468443 2642464 2537538 1832937 1436319 1410906 899913 1668600 1845385 1648211 1724919
7048 1724919 2658784 2031691 1844513 2256641 2177002 2329956 1991919 1866166 2035459 2457829
7038 2457829 1998314 1800083 1445915 874664 1129387 1900239 2609579 2638049 2342307 2170669
7028 2170669 2358866 1826137 2573767 2338570 2058369 1552806 2164598 2525647 2195405 1756480
7018 1756480 1690765 1943559 2263937 2495507 2067605 1542987 1002799 709412 1924991 1478390
7008 1478390 1975606 2125148 1644297 1725745 2297950 2579556 2783010 2547430 2061682 2404838
6998B404838J65791n95338M07450L82944J08074K8581n42635N8039M43431l07303
6988B553872J94379M97403p83384O6336p92371J199564Q7802l38968j25133j46954
6978B412546N32724P702J2716l69182n8257q14864M58567R87935M00053P53107
6968D323047k13238k63789m4372O86438j94716O93020j214548r28369o3059J086978
6958C867392K45909K36887M71257j352885r29840P09264O3234P79093Q8025J07561
6948D285897j043717j24053N62765L0724n75445j69931O6548j94688n1499k48778
6938B537823O1920L78449N10237N59437M28272l71357p58745M9591Q34140J8410
6928D248177N22005J73367l37129m51707O25910l14029o95193J022254K42138
$$ plain form
6998 2404838 2570629 1975291 2382741 2765685 2873759 2902340 2359705 2417744 2861175 2553872
6988 2553872 2748251 3245654 2462270 2528606 1736235 2935799 3023601 2684633 2559500 2412546
6978 2412546 2945270 2952972 2965688 2596506 2538249 1723385 2181952 3169887 3569940 4323047
6968 4323047 4109809 3846020 3801648 4488086 4293370 4986390 3771842 2843473 2780414 3867392
6958 3867392 4113301 4350188 4821445 3468560 2538720 3247984 3311218 4090311 4178336 4285897
6948 4285897 3242180 3118127 3680892 3711616 3136171 2966240 3032788 2838100 2786601 2537823
6938 2537823 2599743 2978192 3488429 4047866 4476138 4104781 3346036 3395627 4229767 4248177
6928 4248177 4770182 4943549 4606420 4154713 4780623 4466594 3771401 4793655 5035793
6919E035793n84586O33387K27390j282904j48140K71685p84993N47898O57167
6910D572697P45694J19380o57262K80366k51726J1925O58622j201317k40892M65811
6900D503298j47446K86636p36233m29090k43863l23622m26412o4047P14308L43661
6890C477190k35496m66395K09581K93771j9716L90092o64475K96575P27191m61501
6880C546817r29928j26972P08205j98851j22409J219015m4913p41736M16672k81989
6870C443911L4316l27168J3343J51197P85456M44907l84889o05754J278956P31931
6860E566206o71669k17560Q13083Q15878M3355o47703O93043M5137k77188K6406
6850F188988q20427q83088M64770m13938l66693L84296K74653R31646M44508K48794
$$ plain form
6919 5035793 4451207 5084594 5311984 4029080 3880940 4152625 3367632 3915530 4572697
6910 4572697 5318391 5437771 4780509 5060875 4809149 4821074 5479696 4278379 4037487 4503298
6900 4503298 4355852 4642488 3906255 3477165 3233302 2909680 2483268 2419221 3133529 3477190
6890 3477190 3241694 2775299 2984880 3278651 3258935 3649027 2984552 3281127 4008318 3546817
6880 3546817 2616889 2489917 3198122 2999271 2876862 4095877 4050964 3309228 3725900 3443911
6870 3443911 3478227 3151059 3164402 3315599 4101055 4545962 4161073 3555319 4834275 5566206
6860 5566206 4894537 4676977 5490060 6305938 6349293 5701590 6394633 6439770 6162582 6188988
6850 6188988 5368561 4485473 4950243 4536305 4169612 4553908 4828561 5760207 6204715 6453509
6840F453509L03249l93111R3577Q8714q54591J38335M41785m30729j465435j466129
6830B909174N63403L16526l34866l36880J296808J31334K9573J23402m97940j28803
6820D071731j44010n6207J2840N98032l97948L67480k99719p54L97700J70389
6810D719534M1382J09429J9500L06708J081383K96299N87442L57287o3374p3919
6800G381671R13288J147763n53320L77105L58496J50277l24662L32736L89044
6791A0172398k06452J113367Q43724J183945J444794J327968N99581J270782P33016
6782A8483123Q01376J228078R73167M8735k97922K06053J163574K26743K05467
6773B3038394O02218L55018K376390Q23587J351018J173767Q60994J89104l8248
$$ plain form
6840 6453509 6756758 6363647 6457224 6545938 5691347 5829682 6271467 5840738 4375303 2909174
6830 2909174 3472577 3789103 3454237 3117357 4414165 4545499 4575072 4698474 4200534 4071731
6820 4071731 3927721 3871514 3884354 4482386 4084438 4451918 4152199 4151445 4549145 4719534
6810 4719534 4760916 4870345 4889845 5196553 6277936 6574235 7161677 7518964 7455590 7381671
6800 7381671 8294959 9442722 8889402 9266507 9625003 9775280 9450618 9783354 10172398
6791 10172398 9965946 11079313 11923037 13106982 14551776 15879744 16479325 17750107 18483123
6782 18483123 19284499 20512577 21485744 21534479 21236557 21442610 22606184 22832927 23038394
6773 23038394 23640612 23995630 26372020 27195607 28546625 29720392 30581386 30770490 30732242
6764C0732242k25863j11008k24904O48877j518121r79983L32710n45870J81872
6755B8289952J97212M0139M59214k10243l45164j304961l9589l44229p66672n21836
6745B5453823j645615o38554k348502j475528j366434j732633R2629j201241r85562
6736A4152383k29327n9395r0655j227164m77185n38376j233640r47110n51801
6727H797730r44727O41671P2207j338157m95432m66003k34228J95666J150320
6718G379047p32361q42010J05118j30811o76814k55051j28386J1039j18991L73539
6708D984319j29973p43959m97745P3590J03867o9782m87304m2799M06660N25327
6698D122201M03840J57833q0248J0230M14236P37982l63643o65893l0774J95672
$$ plain form
6764 30732242 30506379 30395371 30170467 30819344 29301223 28321240 28653950 28108080 28289952
6755 28289952 28487164 28527303 28986517 28776274 28431110 27126149 27086560 26742331 25975659 25453823
6745 25453823 23808208 23169654 20821152 19345624 17979190 16246557 16339186 15137945 14152383
6736 14152383 13923056 13863661 13773006 12545842 12068657 11530281 10296641 9349531 8797730
6727 8797730 7853003 8494674 8566881 7228724 6733292 6267289 6033061 6228727 7379047
6718 7379047 6646686 5804676 5909794 5778983 5102169 4847118 4718732 4729771 4610780 4984319
6708 4984319 4854346 4110387 3612642 3686232 3790099 3720317 3233013 3190214 3596874 4122201
6698 4122201 4526041 4683874 4603626 4613856 5028092 5766074 5402431 4736538 4705764 4901436
6688D901436O9726O6880N88833p02097O86191j17425l41803L20088O7534P6645
6678E616008J07419m55707j67981J6076M0244M81896n09112j78766K08246l85496
6668D772827l99475M34823j09058j345324J014743J275145p34167o47034k07335
6659D055145N35525j04656o73477N61514M07418M86579p05914K88286L51134K16807
6649E418361K09268O76527n65352m22494k22878N65487Q4641P52655R6896L38093
6639F931204K33119l51620l92181J828013O74643K47165L83505K84746J541254
6630A1379848J207117J593532K65461R8794M86103Q0409j137292j70194m94945
6621A3308833m57591L04761J50466N82474J231889P88724j89163j001361j58256
$$ plain form
6688 4901436 4971162 5038042 5626875 4924778 5610969 5493544 5151741 5471829 5539363 5616008
6678 5616008 5723427 5267720 5099739 5115815 5156059 5637955 5128843 4950077 5158323 4772827
6668 4772827 4373352 4808175 4699117 3353793 4368536 5643681 4909514 4262480 4055145
6659 4055145 4590670 4486014 3812537 4374051 4781469 5268048 4562134 4850420 5201554 5418361
6649 5418361 5627629 6304156 5738804 5316310 5093432 5658919 5743560 6496215 6593111 6931204
6639 6931204 7164323 6812703 6420522 8248535 8923178 9170343 9553848 9838594 11379848
6630 11379848 12586965 14180497 14445958 14544752 15030855 15111264 13973972 13803778 13308833
6621 13308833 12851242 13156003 13306469 13888943 15120832 15909556 15720393 14719032 14560776
6612A4560776o64960j082139j306275j565296r55964k30794j119471n49608r86798
6603F099471J94549Q99586m18446M31365o50902P35665J066519n72648L85754
6594H170913l67332j36678j41036J77958r23917l60370R57785n45809L63332O11207
6584G806053Q32878o90331r09333j493p69689o72400K43224J033756p9291l3499
6574F759875L37340o21900P4089K85456J09575L22056O17388J512141j01915K31367
6564I525472Q25674P83430R61471J329222P07971J716193J928732J039182R20911
6555A9738258Q25360p40465K73860p27110m47405j249829l07933O33727J846556
6546A9845019K327275J191114J687664N3176o29959P19216K14699m70152k6945
$$ plain form
6612 14560776 13895816 12813677 11507402 9942106 8986142 8755348 7635877 7086269 6099471
6603 6099471 6294020 7193606 6775160 7206525 6555623 7291288 8357807 7785159 8170913
6594 8170913 7803581 7666903 7525867 7703825 6779908 6419538 7377323 6831514 7194846 7806053
6584 7806053 8638931 7948600 7039267 7037774 6268085 5595685 5838909 6872665 6793374 6759875
6574 6759875 7097215 6475315 6549404 6834860 6944435 7266491 7883879 9396020 9294105 9525472
6564 9525472 10351146 11134576 12096047 13425269 14133240 15849433 17778165 18817347 19738258
6555 19738258 20563618 19823153 20097013 19369903 18922498 17672669 17364736 17998463 19845019
6546 19845019 22172294 23363408 25051072 25104248 24474289 25193505 25408204 24938052 24911107
6537B4911107K38560p6359n8496N4565M0528O03170K81511k40322j56590m54382
6527B5143292o30374o09037n91652l94339o98795p41320k133825j976314j128155
6518A6239481m90104l30930p83474q19532r7465j148199j164288M36932Q05639
6509A2648060n5622j15971j889928o81157M67943m63976L5653L22675k84350n47782
6499I435545l78750O99499L22743P01049j072163j123121M93409J080123j00569
6490A0057765j093881j00259Q4057N04163n53950n13430m72679J82567J024417
6481I118770o43032o94068J99405m06749M82219M03269J53287N22077K02131P27383
6471A0064692O14302O59206J448969K181597K105732K680614J660943J700600
$$ plain form
6537 24911107 25149667 25073308 25014812 25069377 25109905 25713075 25994586 25754264 25597674 25143292
6527 25143292 24512918 23903881 23312229 22917890 22219095 21477775 19343950 17367636 16239481
6518 16239481 15749377 15418447 14634973 13815441 13717976 12569777 11405489 11842421 12648060
6509 12648060 12592438 12476467 10586539 9905382 10373325 9909349 9945002 10267677 9983327 9435545
6499 9435545 9056795 9756294 10079037 10780086 9707923 8584802 9078211 10158334 10057765
6490 10057765 8963884 8863625 8947682 9451845 8897895 8384465 7911786 8094353 9118770
6481 9118770 8475738 7781670 7981075 7574326 8056545 8459814 8613101 9135178 9337309 10064692
6471 10064692 10678994 11338200 12787169 14968766 17074498 19755112 21416055 23116655
6463B3116655J422748J270692P95213O01088J374430L67852r16093n53216L32472
6454B7811841p14435j011149j678190j551631j420574k726477k332472k065925
6446A4310988o03490j217040j149005k54445l08602k02290r68802r06112J90139
6437H891341O83902M83892J01140k18139k430M11817P58878q41553q66754L1045
6427I433139j005581p47118k33549o23878J20155J69336P12447m6938p46765r24239
6417F107009J75089p0943O57176P4900k84155R58398M35014K33841J519991Q56719
6407A0663039j52552n12938r67408n00652L11463J10720K43293K50119j17838
6398I327246m73586j83201K15017P5137m42610j222189K1918L29053J04835l67698
$$ plain form
6463 23116655 24539403 25810095 26605308 27206396 28580826 28948678 28032585 27479369 27811841
6454 27811841 27097406 26086257 24408067 22856436 21435862 18709385 16376913 14310988
6446 14310988 13707498 12490458 11341453 11087008 10778406 10576116 9607314 8701202 8891341
6437 8891341 9575243 10059135 10160275 9942136 9939706 10351523 11110401 10268848 9402094 9433139
6427 9433139 8427558 7680440 7446891 6823013 6943168 7112504 7824951 7778013 7031248 6107009
6417 6107009 6282098 6211155 6868331 6943231 6659076 7617474 8052488 8286329 9806320 10663039
6407 10663039 10510487 9997549 9030141 8529489 8840952 8951672 9194965 9445084 9327246
6398 9327246 8853660 8670459 8885476 8960613 8518003 7295814 7317732 7646785 7751620 7383922
6388G383922J9996K48003m2957M84198K46486o33083p8432P65641M66981K60465
6378I121220Q16075o20050L18564Q03236M60847P68306P49247m3437L95147P27211
6368A3496366P30454R85812J011797J273031K526145K310284J337433J952612
6360B5623934J676287j87298p77603l7481k026906j512452p04678m50171j501044
6351B0102588n26233N02428J210186J761227K260931K554015R76961P81560P5244
6342B9698907p01359j486402k590246j571029j332429k024361j747914j849181
6334A6395986p14301m74700j257118r29686p98788k95050M4338k42306n16277
6325A1212098o12131r3980O58267L59474j3056m32858k12670J057307l85494l15724
$$ plain form
6388 7383922 7403918 7651921 7608964 8093162 8339648 7706565 7628133 8393774 8860755 9121220
6378 9121220 9937295 9317245 9635809 10439045 10899892 11668198 12417445 12374008 12769155 13496366
6368 13496366 14226820 15212632 16224429 17497460 20023605 22333889 23671322 25623934
6360 25623934 27300221 27112923 26335320 26297839 24270933 22758481 22053803 21603632 20102588
6351 20102588 19576355 20078783 21288969 23050196 25311127 27865142 28842103 29623663 29698907
6342 29698907 28997548 27511146 24920900 23349871 22017442 19993081 18245167 16395986
6334 16395986 15681685 15206985 13949867 13020181 12221393 11926343 11970681 11728375 11212098
6325 11212098 10599967 10505987 11164254 11523728 11510672 11077814 10865144 11922451 11536957 11221233
6315A1221233K30100O12062N19879o39295L26289K52064n75832J40640M74754
6306A2561894K68901J11160N11654j94447p14652j52798J66901K48533k62754
6297A2544392j9902N27538K97175j70503R77174R3176J587865J682700P16986
6288A8236601J298854J008972N23892m3519N9280K42476n36145j390584O96539
6279B0096366L27110l27926P34249J01169K20150J224813J686000J089537l25029
6270B4826439m2061m1133j591346j192777r25277k52063o18742o33191r18964
6261A8610885q92938r18045K53760j95784r77476r11262m00936L14029K25573
6252A5107806M641m15418m9374J36826p34067q08039J52739j43144l2517O47780
$$ plain form
6315 11221233 11451333 12063395 12583274 11943979 12270268 12522332 11946500 12087140 12561894
6306 12561894 12830795 12941955 13453609 13259162 12544510 12391712 12558613 12807146 12544392
6297 12544392 12524490 13052028 13349203 13178700 14155874 14249050 15836915 17519615 18236601
6288 18236601 19535455 20544427 21068319 21024800 21084080 21326556 20790411 19399827 20096366
6279 20096366 20423476 20095550 20829799 20930968 21151118 22375931 24061931 25151468 24826439
6270 24826439 24784378 24743245 23151899 21959122 21033845 20781782 20163040 19529849 18610885
6261 18610885 17717947 16799902 17053662 16857878 15880402 14969140 14568204 14882233 15107806
6252 15107806 15112447 14697029 14647655 14784481 14050414 13242375 13395114 13251970 13219453 13867233
6242A3867233P15365n47347O62022o16569m3001M31364q79370m81835J5274l47954
6232A2775182M14496K70021q45880l89660O03701m12640o15803l52143R77898
6223A2425172q6393M87633P95452j722K83783K29533K99233O50877J110071J31793
6213A6325432k11396J585364J804711M59788P35207R53079L76956k89309J230090
6204B2969922O53874n98388p62846J44394J045869j99240p05915L64342N41284
6195B3453296P54528P45667m75347n17095M02403r22471j86695L98006o42222
6186B3010070p27683j415465o38532j047689N64947j14200k4155K5136p20795
6177A8911634K66735Q2052l66102j96508l50152l16244o86515n17314q84533r25353
$$ plain form
6242 13867233 14582598 14035251 14697273 14080704 14037703 14469067 13589697 13107862 13123136 12775182
6232 12775182 13189678 13459699 12613819 12224159 12827860 12415220 11799417 11447274 12425172
6223 12425172 12338779 12826412 13621864 13620142 13903925 14133458 14432691 15083568 16193639 16325432
6213 16325432 16114036 17699400 19504111 19963899 20699106 21652185 22029141 21739832 22969922
6204 22969922 23623796 23025408 22262562 22406956 23452825 23253585 22547670 22912012 23453296
6195 23453296 24207824 24953491 24478144 23961049 24363452 23440981 23254286 23652292 23010070
6186 23010070 22282387 20866922 20228390 19180701 19745648 19631448 19607293 19632429 18911634
6177 18911634 19178369 19260421 18894319 18697811 18347659 18031415 17344900 16827586 15943053 15017700
6167A5017700K89886o07782M00520l75927J124494N50784j93418k63856n33173
6158A5409228j68281l29855j46500P2128o187k13433q31679M89094L94399j156962
6148A3511952j07823J166841K04694M54453O62646l8332q58162J8216J57868r04163
6138A4268190K83500P0156n70474K12144k83227M9051O24424N16918j2609Q44297
6128A6002370Q56126L03371L13920q80894j43752j07147O26408k94828N9259L82052
6118A7116885k45011L22811L013J25740k06490Q74163K79484N38851J130961M38701
6108B0379108P27225N9023j61239M71777M92588J1950M60495J61298J82577J051475
6098B3836277M60281Q9996J364978J19001l77499p52743n70399o69152r87250
$$ plain form
6167 15017700 15307586 14699804 15100324 14724397 15848891 16399675 16206257 15942401 15409228
6158 15409228 15240947 14911092 14764592 14836720 14830533 14617100 13785421 14274515 14668914 13511952
6148 13511952 13404129 14570970 14775664 15230117 15892763 15854431 14996269 15014485 15172353 14268190
6138 14268190 14551690 14621846 14051372 14263516 13980289 14029340 14653764 15170682 15158073 16002370
6128 16002370 16858496 17161867 17475787 16594893 16451141 16343994 16970402 16675574 16734833 17116885
6118 17116885 16871874 17194685 17197698 17323438 17116948 17991111 18270595 18809446 19940407 20379108
6108 20379108 21106333 21165356 21004117 21475894 21968482 21980432 22440927 22602225 22784802 23836277
6098 23836277 24296558 24386554 25751532 25870533 25493034 24740291 24169892 23500740 22513490
6089B2513490r73883r58627o97841r9404n54341n27156L75520J393896J276734
6080B1748388L16719N19227O84705N95853k46874l03521l02977r9448q38838k78725
6070B1794509j553989o98732J395078L6292L33435j15162p07774l00439O44206
6061B0827424L14630o44310j549007p55953J38157l44929l2493o87414p00279
6052A6565826K2575K38489O82231O27070J4589R07119P17966l29196l37126l7052
6042A9072491K1230o21422l26153r76792j588325p94110O58236k55101r766j29882
6032A5050406l97013P75702K32859k72764Q05181R22969O27967J380844l99081
6023A8727070L47643r5623J203122J214099O38781Q36413K40805J56387n69040
$$ plain form
6089 22513490 21539607 20580980 19883139 19783735 19229394 18702238 19077758 20471654 21748388
6080 21748388 22065107 22584334 23269039 23864892 23618018 23314497 23011520 22912072 22073234 21794509
6070 21794509 20240520 19541788 20936866 20973158 21306593 21191431 20483657 20183218 20827424
6061 20827424 21142054 20497744 18948737 18192784 18330941 17986012 17953519 17266105 16565826
6052 16565826 16588401 16826890 17509121 18136191 18150780 19057899 19775865 19446669 19109543 19072491
6042 19072491 19093721 18472299 18146146 17169354 15581029 14786919 15445155 15190054 15180288 15050406
6032 15050406 14653393 15429095 15661954 15389190 16194371 17117340 17745307 19126151 18727070
6023 18727070 19074713 18979090 20182212 21396311 22035092 22871505 23112310 23268697 22699657
6014B2699657j069288m68664j493474j335867q4826L53011l79714k66682K72323
6005A8226476J49625L47411J39225o50093j009667n71196Q36045J222808n6877
5996A8633757l50844l49839M38530m1452R92145J094470J092950J593267J604264
5987B4707248N5316K63823K05456k74976j515079q64180j120209r64607j491293
5978A9001499l30991K0585m67112n39445q67142R4782K75149k6878m34923k80965
5968A6444559p27821o77339j023013k32047j49831r43636o32278R63174q99922
5959A2121846R6424R85942O73428L88372o05340P86839j20637O5609o30767J405545
5949A5167261K258903J385414L48157j3134k69785k84763k04055o04667q80711
$$ plain form
6014 22699657 21630369 21161705 19668231 18332364 18247538 18600549 18220835 17954153 18226476
6005 18226476 18376101 18723512 18862737 18212644 17202977 16631781 17467826 18690634 18633757
5996 18633757 18282913 17933074 18371604 18330152 19322297 20416767 21509717 23102984 24707248
5987 24707248 24762564 25026387 25231843 24956867 23441788 22577608 21457399 20492792 19001499
5978 19001499 18670508 18691093 18223981 17684536 16817394 16912176 17187325 17160447 16725524 16444559
5968 16444559 15716738 15039399 14016386 13784339 13634508 12690872 12058594 13021768 12121846
5959 12121846 12218270 13204212 13877640 14266012 13660672 14447511 14326874 14392483 13761716 15167261
5949 15167261 17426164 18811578 19159735 19146601 18876816 18592053 18387998 17783331 16902620
5940A6902620j075182m77587o62004l63590j145328j208579l65571j1620m87934
5931A1105225q3668P84982l2910p21297P0287l99593l06894m22893J282214K50460
5921A1525913N53567R55073J198448J385405R78852R69102J14608m2615N1061
5912A7689414o39446p08088o60704q44414n38046q07820p97201J29096n63319
5903A2259472q09440Q66327L44754j482532r83768k11371j51990O23137o50275
5894I804314k90220L08039l10989O16417L20422Q9177J37015k09038K92997j90060
5884A0568074m29207M11800l85877q00976L41193K55539k2391K13763o32099m42643
5874I077176m23384j73805O79685k61882k55390j11626m372l89876m8922l03229
$$ plain form
5940 16902620 15827438 15349851 14687847 14324257 13178929 11970350 11604779 11593159 11105225
5931 11105225 11021557 11806539 11773629 11052332 11122619 10723026 10416132 9993239 11275453 11525913
5921 11525913 12079480 13034553 14233001 15618406 16597258 17566360 17680968 17638353 17689414
5912 17689414 17049968 16341880 15681176 14836762 14298716 13490896 12693695 12822791 12259472
5903 12259472 11450032 12316359 12661113 11178581 10194813 9983442 9831452 10454589 9804314
5894 9804314 9514094 9822133 9511144 10127561 10447983 10537160 10674175 10465137 10758134 10568074
5884 10568074 10138867 10550667 10164790 9363814 9705007 9960546 9938155 10151918 9519819 9077176
5874 9077176 8653792 8479987 9159672 8897790 8642400 8530774 8526402 8136526 8087604 7784375
5864G784375k85896m8194K32737K38964k43889Q13844P8524P003p68357K8753
5854G837864r5405m74173O96348K38318J36846K3770j26368p9L44939l68056M31466
5843H645470k54656J50954M58334J0880j090267q29873j69029J73622N36806K05276
5833G837517J61790Q14700P10923j74033j71549R7627J175508K60709j22866o72566
5823I917760n06401n60127Q0195N93580K41862m549M59155k83437N07876L03897
5813A0749811r82025J60216m56040L7979M17214m87260p25970n83802L89485j80858
5803H338750N36356O5118K6980O00507j42048N317l64182P61636K60739n73569
5793I515604N07939N5079J69873L25901n98395j93850J70848j72921j86151N73917
$$ plain form
5864 7784375 7498479 7450285 7683022 7921986 7678097 8491941 8570465 8577468 7809111 7837864
5854 7837864 7742459 7268286 7964634 8202952 8339798 8363568 8237200 8237121 8582060 8214004 8645470
5843 8645470 8390814 8541768 9000102 9010982 7920715 7090842 6921813 7095435 7632241 7837517
5833 7837517 7999307 8814007 9524930 9350897 9179348 9276975 10452483 10713192 10590326 9917760
5823 9917760 9411359 8851232 8931427 9525007 9766869 9762320 10221475 9938038 10445914 10749811
5813 10749811 9767786 9928002 9471962 9509941 9927155 9439895 8713925 8130123 8519608 8338750
5803 8338750 8875106 8940224 8967204 9567711 9425663 9430980 9066798 9828434 10089173 9515604
5793 9515604 10023543 10078622 10248495 10574396 9976001 9782151 9952999 9780078 9593927 10167844
5783A0167844k17386l46170N34390P9308r28783P15890q18978k42382P46218M15430
5773A0105381K63025k34278K17216k80493j48253O38084R63955o6222L20721K91949
5763A2071085j75642m5649k18602R1502q83537O19794N32802p91818m32586O09731
5753A1377080k23549j72221l22121L35254l16841J90716K631r17274P42213O11383
5743A1307271o65040r14702m5591L46660P83688j37555K72867J05513Q90331k54757
5733A1688685J80199L33022M53210N70387q29653K05165O54047O1601j93633r98693
5723A2124337J74837n02644j99544P59246m48688j335930K63141J61569m52082
5714A0544242L60054j70686J54386o790P2781J80678L71251M98016N10890l7745
$$ plain form
5783 10167844 9950458 9604288 10138678 10217986 9289203 10005093 9186115 8943733 9689951 10105381
5773 10105381 10368406 10134128 10351344 10070851 9922598 10560682 11524637 11458415 11779136 12071085
5763 12071085 11895443 11849794 11631192 11722694 10839157 11458951 11991753 11199935 10767349 11377080
5753 11377080 11153531 10981310 10659189 10994443 10677602 10868318 10870949 9953675 10695888 11307271
5743 11307271 10642231 9727529 9681938 10028598 10812286 10674731 10947598 11053111 11943442 11688685
5733 11688685 11868884 12201906 12655116 13225503 12395850 12601015 13255062 13316663 13123030 12124337
5723 12124337 12299174 11796530 11596986 12356232 11907544 10571614 10834755 10996324 10544242
5714 10544242 10904296 10733610 10887996 10881206 10953987 11134665 11505916 12003932 12514822 12477077
5704A2477077m08800j51944K98997O94183K71194P94940O88169j012290k81419
5695A3370107J51246j50690N25977J78065l3755N99957n85631p00342n28983m55347
5685A2370604O89121j22139N06519J57010j92931o63069n24131p8531Q6933P19983
5675A2949369q34616m82573P26550L94414J81714k02740O76049J032658l25553
5666A4115272o25330j52238l00054p17262P28373Q5757J215991Q23279r08797
5657A4264991Q55942P09358O61592Q9418M65016J873159Q33107q05144r9878j020856
5647A7826705j3365m77375j396556j46519J81173k10068K57874r17469N12403
5638A5616803k61321j77312n75808n49197M54309N10493N19886l87927K77532
$$ plain form
5704 12477077 12068277 11916333 12215330 12909513 13180707 13975647 14663816 13651526 13370107
5695 13370107 13521353 13370663 13896640 14074705 14040950 14640907 14055276 13354934 12825951 12370604
5685 12370604 13059725 12937586 13444105 13601115 13408184 12745115 12220984 12142453 12229386 12949369
5675 12949369 12114753 11632180 12358730 12753144 12934858 12732118 13408167 14440825 14115272
5666 14115272 13489942 13337704 13037650 12320388 13048761 13134518 14350509 15173788 14264991
5657 14264991 15120933 15830291 16491883 16581301 17046317 18919476 19752583 18947439 18847561 17826705
5647 17826705 17813340 17335965 15939409 15792890 15974063 15763995 16021869 15104400 15616803
5638 15616803 15355482 15178170 14602362 14053165 14507474 15017967 15537853 15149926 15427458
5629A5427458O59864J078922N60068j4875R2308O27185m37285o38110n91383J44936
5619A6909088j550965o32772K54098k28769n17352P25851n55081j035412r85285
5610A2383401m31676P41146n42013n51297k60901j029912j16892K88584M26465
5601A0906905k7705M08244k06797L47802p7082j167038P13880J040798k75183
5592A1663824R1701J27706J53809N72076M95230K86969P88642Q76319J69313L55645
5582A5581234J012343K1494n77220j72888n97324n27223q48843K43633L28708
5573A4463914l441m48426K90210l59646k82568o44394j02968Q50461o77230M35048
5563A3520960M09472P35136P18706L20654Q11425L8515K87048M49342n39208j74602
$$ plain form
5629 15427458 16087322 17166244 17726312 17711437 17803745 18430930 17993645 17355535 16764152 16909088
5619 16909088 15358123 14725351 14979449 14750680 14233328 14959179 14404098 13368686 12383401
5610 12383401 11951725 12692871 12150858 11599561 11338660 10308748 10191856 10480440 10906905
5601 10906905 10879200 11287444 11080647 11428449 11351367 10184329 10898209 11939007 11663824
5592 11663824 11755525 11883231 12037040 12609116 13104346 13391315 14179957 15056276 15225589 15581234
5582 15581234 16593577 16615071 16037851 15864963 15267639 14740416 13891573 14135206 14463914
5573 14463914 14460473 14012047 14302257 13942611 13660043 13015649 12912681 13763142 13085912 13520960
5563 13520960 13930432 14665568 15384274 15704928 16516353 16554868 16841916 17291258 16752050 16577448
5553A6577448q35805O3701J98795j513310N56620K76676m96079l63232N48686
5544A5013500m12572k13025m37745L13128q61116m67799k70082l73847L79577
5535A2670019P9943l10636k15142J42419n75043j042276K12462N26324K24281
5526A1712351J53273n89283O42322k69432l66852l23113J91654K80772p72261
5517A0659431L54342R50530n12772o55350K37565K44287P56618J38394m73327
5508A1699718n1579j281117P14341J31323J50479j48743K7923p35481P44666K22465
5498A1473995O0493K0887J82563J032955j324882P3931J434519K77068K34708
5489A3466237M98751K99336N72439J172449J266952J517648J016197J415332J705097
$$ plain form
5553 16577448 15741643 15805344 16004139 14490829 15047449 15324125 14828046 14464814 15013500
5544 15013500 14600928 14387903 13950158 14263286 13402170 12934371 12664289 12290442 12670019
5535 12670019 12749962 12439326 12224184 12366603 11791560 10749284 10961746 11488070 11712351
5526 11712351 11865624 11276341 11918663 11649231 11282379 10959266 11150920 11431692 10659431
5517 10659431 11013773 11964303 11451531 10796181 11033746 11278033 12034651 12173045 11699718
5508 11699718 11648139 10367022 11081363 11212686 11363165 11214422 11242345 10506864 11251530 11473995
5498 11473995 11534488 11555375 11737938 12770893 11446011 11519942 12954461 13231529 13466237
5489 13466237 13964988 14264324 14836763 16009212 17276164 18793812 19810009 21225341 22930438
5480B2930438K601875L058199J450547J326217P96743M6431p09962J00836j689702
5471B9911622j320967j216483j217588o74520J59289J92355l02965N21248J807421
5462B7859412K006686J439639J554935J507555l21418K13572p02090k531471j890559
5453B9136261j358378j903204j448918j336352j494376j112016J99191j139K98856
5444B0979925j29573o95535L93982O8669Q68818j73344o71112Q58128Q50555J228465
5434B3578978J157400J525090R16886N38498J156136J231017J862671K009461
5426C3976137K208756L553856M395490O311658M760581K858078K209412R79364
5418F1253332q26896j077743k482007l162006k565013k945630k217450k154725
$$ plain form
5480 22930438 25532313 28590512 30041059 31367276 32164019 32210450 31500488 31601324 29911622
5471 29911622 28590655 27374172 26156584 25482064 25641353 25833708 25530743 26051991 27859412
5462 27859412 29866098 31305737 32860672 34368227 34046809 34260381 33558291 31026820 29136261
5453 29136261 27777883 25874679 24425761 23089409 21595033 20483017 20682208 20681069 20979925
5444 20979925 20850352 20154817 20548799 20617468 21486286 21312942 20641830 21499958 22350513 23578978
5434 23578978 24736378 26261468 27178354 27716852 28872988 30104005 31966676 33976137
5426 33976137 36184893 39738749 44134239 50445897 55206478 58064556 60273968 61253332
5418 61253332 60426436 59348693 56866686 53704680 51139667 48194037 45976587 43821862
5410D3821862j565151j260695m93270p04824n24598J30762J041456K78337J547990
5401D2271869J822800J435948R08451J590276K28838J49967k56648j314162j484847
5392D5352492k66265k180736j699225j157629j234259j190972m52688N9792r57482
5383C6273028m40292j226513n58721j199364j070527j095729k24780Q4405L54101
5374C0895608K57862n09952M29644J026389p6420j87379M7430q10837o67401j003543
5364B9401401j189145p23192n9092Q57133N58717k11084M31397P92143j07468
5355B9750810K47292Q4274Q3746M54840L23963K89989j097249j252664k07554
5346B8677447N23465M41175M13788J024013R79762P83234J010846P10592L56768
$$ plain form
5410 43821862 42256711 40996016 40502746 39797922 39273324 39404086 40445542 40723879 42271869
5401 42271869 44094669 45530617 46439068 48029344 48258182 48408149 48151501 46837339 45352492
5392 45352492 45086227 42905491 41206266 40048637 38814378 37623406 37170718 37230510 36273028
5383 36273028 35832736 34606223 34047502 32848138 31777611 30681882 30457102 30541507 30895608
5374 30895608 31153470 30643518 31073162 32099551 32023131 31835752 31883182 31072345 30404944 29401401
5364 29401401 28212256 27489064 27429972 28287105 28845822 28634738 29066135 29858278 29750810
5355 29750810 29998102 30082376 30166122 30620962 30944925 31234914 30137665 28885001 28677447
5346 28677447 29200912 29642087 30055875 31079888 32059650 32842884 33853730 34564322 34921090
5337C4921090R0253j82483j10987L48633l40829O6984J16916l81231o98544l80408
5327C3449394q19161m77711j296042k127860O4220n86154M3684m77910J314415
5318B9086875Q58360p16920o7533M37796M44620k60843r66821q71814m88035m51338
5308B7004347O501o28768j17418K62043Q2751k5833J34564l57086n15344r62012
5298B4883745j00955J537982L79150m59803J33489L22195N73382J145401O35694
5289B9050280r8654k12182o71457n04491J43709p36809r5270L7601K9005o77253
5279B6264479j060666J27939k35790J3748l05410o31326n68210o71770r1099m43587
5269B2398308k74916Q74856m68720p57545j40358P15735J48570l54701K84306
$$ plain form
5337 34921090 35011343 34828860 34717873 35066506 34725677 34792661 34909577 34528346 33829802 33449394
5327 33449394 32630233 32152522 30856480 28728620 28792840 28206686 28250370 27772460 29086875
5318 29086875 29945235 29228315 29160782 29598578 30043198 29782355 28815534 27943720 27455685 27004347
5308 27004347 27010848 26382080 26264662 26526705 26609456 26583623 26718187 26361101 25845757 24883745
5298 24883745 24782790 26320772 26699922 26240119 26373608 26695803 27269185 28414586 29050280
5289 29050280 28951626 28739444 28067987 27563496 27707205 26970396 26875126 26912727 26941732 26264479
5279 26264479 25203813 25331752 25095962 25109710 24804300 24172974 23604764 22932994 22841895 22398308
5269 22398308 22123392 22998248 22529528 21771983 21631625 22347360 22495930 22141229 22425535
5260B2425535M10089l51104l04912M96983j14292L35195j88235J29882m83334
5251B2355807P3080L14192k17615k63413O08491N38549j98318M29263R22325p382
5241B4554979k68124P77048O9368j39421J074264O13706Q13572Q75843O5703l91016
5231B8045922q79065K76880R27824J63270P39340q72919K44177N39960n33472
5222B8651917K7600L36758M629j00225k83979k05249L37687N04389N58457k15229
5212B9616755n98755l60931O70349J366714R7634p08777M20297L47603K16938
5203C1067827J75634K95212J201088Q77281l66700P17457M7165J40791k50004
5194C3905751J13873m76547l77443j148990j996050N59284K56317o16174k46822
$$ plain form
5260 22425535 22835624 22484520 22179608 22676591 22562299 22897494 22709259 22839141 22355807
5251 22355807 22428887 22743079 22525464 22262051 22870542 23409091 23210773 23640036 24562361 24554979
5241 24554979 24286855 25063903 25133271 24993850 26068114 26681820 27495392 28371235 28436938 28045922
5231 28045922 27166857 27443737 28371561 28534831 29274171 28401252 28645429 29185389 28651917
5222 28651917 28679517 29016275 29020904 28920679 28636700 28431451 28769138 29273527 29831984 29616755
5212 29616755 29018000 28657069 29327418 30694132 30791766 30082989 30503286 30850889 31067827
5203 31067827 31243461 31538673 32739761 33617042 33250342 33967799 34014964 34155755 33905751
5194 33905751 34019624 33543077 33165634 32016644 30020594 30579878 30836195 30220021 29973199
5185B9973199N70470L85113l95126J28519M96912j6174j114670l99663n15247
5176B9113333L65525j9744m85826n56015j61769j073034J28040N20672k55897
5167B7575285r75859J44356m41908O28193k04753j378807j64801o15474o52330
5158B3913902q84493j66936k77209n15989o93702p95766J161383J229202J1361
5149B2981753q22956p61331m0245J27357M8138m49999o76937L27085P97306l35925
5139B1194246J62684k60076j0214q3903K9453M17266K25975Q80396o55191j079040
5129B0821596K77023P12963N67884K63135k37965q91550p58628n51884M48605
5120B0651179k2720r332k25129P01324j168342L09310m72330r95061M24175Q65723
$$ plain form
5185 29973199 30543669 30928782 30533656 30662175 31159087 31142913 30028243 29628580 29113333
5176 29113333 29478858 29459114 28973288 28417273 28255504 27182470 27310510 27831182 27575285
5167 27575285 26599426 26743782 26301874 26930067 26725314 25346507 25181706 24566232 23913902
5158 23913902 23029409 22862473 22585264 22069275 21375573 20579807 21741190 22970392 22981753
5149 22981753 22158797 21397466 21357221 21484578 21532716 21082717 20405780 20732865 21530171 21194246
5139 21194246 21356930 21096854 21086640 21002737 21032190 21449456 21675431 22555827 21900636 20821596
5129 20821596 21098619 21811582 22379466 22642601 22404636 21513086 20754458 20202574 20651179
5120 20651179 20628459 20619127 20393998 21095322 19926980 20236290 19763960 18768899 19193074 20058797
5110B0058797L39279J519972L59873k62366k15727k19669j98451L36606k1684
5101B1696630K95315m37786m81849N60722j69266L03357J779264J40747M22729
5092B4109863J161682L31938r3928J067571J557680O33233O7485O60231J012921
5083C0508676p65362L4456l55161J58261J78735n46682n43212l46967m18769p10215
5073B7193760p87382k82396p7792j17843R0095p31474P79595K73945K99032P46070
5063B7385610R86498J607145J473834J956506Q48660J265786J216527J578697
5055C8319263N21476L42759p63064O50299p43570k68346j37668J017508J409911
5046D0348568N81856Q73207J040654J143407J833392Q54247j1515O18754J24674
$$ plain form
5110 20058797 20398076 21918048 22277921 22015555 21799828 21580159 21381708 21718314 21696630
5101 21696630 21991945 21554159 21072310 21633032 21463766 21767123 23546387 23687134 24109863
5092 24109863 25271545 25603483 25509555 26577126 28134806 28768039 28835524 29495755 30508676
5083 30508676 29743314 29777770 29422609 29580870 29759605 29212923 28669711 28322744 27903975 27193760
5073 27193760 26406378 26123982 26046190 25928347 26018442 25286968 26066563 26340508 26639540 27385610
5063 27385610 28372108 29979253 31453087 33409593 34258253 35524039 36740566 38319263
5055 38319263 38840739 39183498 38420434 39070733 38327163 38058817 37921149 38938657 40348568
5046 40348568 40930424 41803631 42844285 43987692 45821084 46675331 46663816 47282570 47407244
5037D7407244R48938R29009k24436K9109K03727R05426P83903R04814Q11776N90535
5027E3290045P45941J1774j71256p8352L84178K65987Q70003q69577k27943J527688
5017E5748488m27394O08331J351196Q04217M72993K55686j35387o42650j649889
5008E6385591j958981j307977k134080j735647k314884j073454L82779q30667
5000D5412680j9256M18243j53121k35904N90557J171124J721113J090538O00817
4991E0596791J409036J238255J30050Q81215P55178o4490o90473p32473o08098
4982E2914991m68363j217150j047909p50013j559442j295181p39211j071705j171630
4973D3594387r07058j021324n16121K61439J019464K176665K479464J610708J274135
$$ plain form
5037 47407244 48356182 49285191 49060755 49089864 49293591 50199017 50982920 51887734 52699510 53290045
5027 53290045 54035986 54047760 53876504 53798152 54182330 54448317 55318320 54448743 54220800 55748488
5017 55748488 55321094 55929425 57280621 58084838 58557831 58813517 58678130 58035480 56385591
5008 56385591 54426610 53118633 50984553 49248906 46934022 45860568 46243347 45412680
5000 45412680 45393424 45811667 45658546 45422642 46013199 47184323 48905436 49995974 50596791
4991 50596791 52005827 53244082 53374132 54255347 55010525 54946035 54255562 53523089 52914991
4982 52914991 52446628 51229478 50181569 49431556 47872114 46576933 45837722 44766017 43594387
4973 43594387 42687329 41666005 41149884 41411323 42430787 44607452 47086916 48697624 49971759
4964D9971759J52149l95660m93096j24353j267044j309192p10045M87968n61569
4955D5750917M84734j85573J592657K245913K006529K312344L481689K867916
4947F0557126K206302J428561K03740k24398j635941k366201k582803j896077
4939E5690309k214795j311604q71963j189051m51122J13264K60762J175982J210032
4930E2411814R66786K322232K015070j01472K68087n40674o91976q69138k138555
4921E3642174j515009j204729m58704j568788k01311N15873M88788j93999M58054
4912D9962349K20219k25101J49660O10174L39609L20258J126946j86838l97204
4903E1920072r17337p76948j180409q13012j246552n26156O17700J277076J53147
$$ plain form
4964 49971759 50123908 49728248 49235152 49110799 47843755 46534563 45824518 46312486 45750917
4955 45750917 46235651 46050078 47642735 49888648 51895177 54207521 57689210 60557126
4947 60557126 62763428 64191989 64395729 64171331 62535390 60169189 57586386 55690309
4939 55690309 53475514 52163910 51291947 50102896 49651774 49765038 50025800 51201782 52411814
4930 52411814 53378600 55700832 57715902 57614430 57882517 57341843 56649867 55780729 53642174
4921 53642174 52127165 50922436 50463732 48894944 48693633 49209506 49698294 49504295 49962349
4912 49962349 50182568 49957467 50107127 50717301 51056910 51377168 52504114 52317276 51920072
4903 51920072 51002735 50225787 49045378 48232366 46985814 46459658 47077358 48354434 48507581
4894D8507581N23760J443789R11343J440536J379945O40810J379059J153880J251980
4885E8632683P5579P76548O3422n27105j71544R96525J056052n09133J75239J633616
4875F2201882P71680l11219J288683J740943L69144O35837l46810J78581J222321
4866F7751042N20696M07137m32128M46981j004305k8763j281621j824258N54676
4857F5109457J04681N96391J291602P32329J125651J652584J811462M07611p7289
4848G2754479k05909j579590j37196n64393r11175m21475M27372J326712K117619
4839G2806444J245780R61562n9252r34739j072560j733383j415689q54583j668891
4830F7274689j033445j266645j203829l38233o36086M30950J230538K248169J844014
$$ plain form
4894 48507581 49031341 50475130 51386473 52827009 54206954 54847764 56226823 57380703 58632683
4885 58632683 58708262 59484810 59548232 59021127 58849583 59846108 60902160 60393027 60568266 62201882
4875 62201882 62973562 62662343 63951026 65691969 66061113 66696950 66350140 66528721 67751042
4866 67751042 68271738 68678875 68246747 68693728 67689423 67660660 66379039 64554781 65109457
4857 65109457 65214138 65810529 67102131 67834460 68960111 70612695 72424157 72831768 72754479
4848 72754479 72548570 70968980 70831784 70267391 69356216 68934741 69362113 70688825 72806444
4839 72806444 74052224 75013786 74954534 74019795 72947235 71213852 69798163 68943580 67274689
4830 67274689 66241244 64974599 63770770 63432537 62796451 63227401 64457939 66706108 68550122
4821F8550122K724703L964089K541885J790305n70216j240901k811704k122638
4813G2825645k267657k688317k434635j600619j350565q00129J1028k61011Q83369
4804F2317109O07930J279783J319586K563309P70328R7021j155436k27551n33373
4795F7038706r41477k451436q83550k25991j023653q31005K64673O75624M29197
4786F2051088J379940N6832J12595L66552o8121o83985n12649j112743n09173
4777F1080336L77373j44630J34274Q19137P82977J65720L40155k89151K426J0630
4767F3279247K75543M34877L45051p60991p62234Q49584p93173K11949J441066
4758F4520919L18561J57209J48990M57126P44638L76464R95514J069960q55181
$$ plain form
4821 68550122 71274825 75238914 77780799 79571104 79000888 77759987 74948283 72825645
4813 72825645 70557988 67869671 65435036 63834417 62483852 61683723 61694751 61433740 62317109
4804 62317109 62925039 64204822 65524408 68087717 68858045 68955066 67799630 67572079 67038706
4795 67038706 66097229 63645793 62762243 62536252 61512599 60681594 60946267 61621891 62051088
4786 62051088 63431028 63487860 63600455 63967007 63898886 63214901 62702252 61589509 61080336
4777 61080336 61457709 61313079 61447353 62266490 63049467 63215187 63555342 63266191 63268617 63279247
4767 63279247 63554790 63989667 64334718 63573727 62811493 63661077 62867904 63079853 64520919
4758 64520919 64839480 64996689 65145679 65602805 66347443 66723907 67719421 68789381 67934200
4749F7934200n07265P87480L47918P49283J919571K469956K856677K282618K100408
4740H0940846Q26696J254077K062124O89649L90733N61825L29913j72985Q70009
4731H7752887N97887Q86183k88798j28641j113010p17689M4874o73665J25421
4722H6485449l87964j509764n61348j167355r46569o39491m12592j332443j286353
4713G8241570m85910P9299L35445L87653J297761J73776j93208L0075n73190r42763
4703G8350508j584482k434689k101895j340698r33965k402154k374137n39676
4695F4638812j214225k161861j559382j258803n63493q22524J86627j38837j83403
4686E6922911J521448O31821O53809J138033J200339J205925J423055J740243
$$ plain form
4749 67934200 67426935 68214415 68562333 69311616 71231187 73701143 76557820 78840438 80940846
4740 80940846 81767542 83021619 85083743 85773392 86164125 86725950 87055863 86882878 87752887
4731 87752887 88350774 89236957 88948159 88819518 87706508 86988819 87033693 86360028 86485449
4722 86485449 86097485 84587721 84026373 82859018 81912449 81272958 80860366 79527923 78241570
4713 78241570 77755660 77834959 78170404 78558057 79855818 80029594 79836386 79866461 79293271 78350508
4703 78350508 76766026 74331337 72229442 70888744 69954779 67552625 65178488 64638812
4695 64638812 63424587 61262726 59703344 58444541 57881048 57058524 57245151 57106314 56922911
4686 56922911 58444359 59076180 59729989 60868022 62068361 63274286 64697341 66437584
4678F6437584J314832J434217M72534L00241J101809N80916K52218l05787J10626
4669G1699190o17900m76826R26641p4373n28752q31991o55354q5066l22841q76713
4659F8156015O5968q3966P14541N46571L21180K85929J671136K266032K637440
4650G6580846K680674K786678J481335J886167Q95816M16363J89468p70569k077855
4641H4068923l020651l577129k852253l299279l385796j771305j634950o43839
4633F3883721j139470j596937o71944j91133n47961k37077J40177N98849P46149
4624F0984374R9043M37200N73670J228009J127470P96971J705650O73171Q38873
4615F8464431l78790J920980J213680R83319J042761J666028J508157L70801P50118
$$ plain form
4678 66437584 67752416 69186633 69659167 69959408 71061217 71642133 71894351 71588564 71699190
4669 71699190 71081290 70604464 71531105 71456732 70927980 70095989 69440635 69355569 69032728 68156015
4659 68156015 68221983 68138017 68852558 69399129 69720309 70006238 71677374 73943406 76580846
4650 76580846 79261520 82048198 83529533 85415700 86311516 86727879 86917347 86146778 84068923
4641 84068923 81048272 77471143 74618890 71319611 67933815 66162510 64527560 63883721
4633 63883721 62744251 61147314 60475370 60284237 59736276 59499199 59639376 60238225 60984374
4624 60984374 61083417 61520617 62094287 63322296 64449766 65246737 66952387 67625558 68464431
4615 68464431 68085641 70006621 71220301 72203620 73246381 74912409 76420566 76791367 77541485
4606G7541485P13086J033089Q42354K12302J018684L49412J383103J366352L69790
4597H4829657J315308J672606J598789J31695J189638J639092J508087K772920
4589I6657792K629599K826661L147045L396904L578611L895323L021958L085379
4581A22239272M160508M859766M960657M699987M717994N264021N834735N746517
4573A62483457P496017R841971J2600534J7684880K1840584K7867751L2921922
4566B92737116L7225664L9812448M0722080L8792095L3444729K4955085J5276732
4559E22965949M973882o321206j6683137k3727198l0164335l2925806l2795221
4552C85322928l1657074k8942418k7117095k1535064j8416489j4772095j2287747
$$ plain form
4606 77541485 78254571 79287660 80130014 80342316 81361000 81710412 83093515 84459867 84829657
4597 84829657 86144965 87817571 89416360 89548055 90737693 92376785 93884872 96657792
4589 96657792 99287391 102114052 105261097 108658001 112236612 116131935 119153893 122239272
4581 122239272 126399780 131259546 136220203 140920190 145638184 150902205 156736940 162483457
4573 162483457 169979474 179821445 192421979 210106859 231947443 259815194 292737116
4566 292737116 329962780 369775228 410497308 449289403 482734132 507689217 522965949
4559 522965949 527939831 521618625 504935488 481208290 451043955 418118149 385322928
4552 385322928 353665854 324723436 297606341 276071277 257654788 242882693 230594946
4545B30594946j1359238q945903o514647o802408o682234p153814o294810n362120
4537A71479772n835056l966648l901353m282826k734563j713151r74312j607379
4529A46464484j723891r14595N65520m77670q20877p40686j25222n84451n95213
4520A41047399q94725j312263j027451r01479j494370j194602p52443j221975
4512A32248091j749385m82473j39519J482002L650514J813954J536958K024983
4504A40385125K742331O69438j86917j331950j922022j424970k074029j830219
4496A35026787k016324j798770k592648j487824j409590o60749l29046j108293
4488A23623543J30442M32299K3507J15676J594431m7592r97815n44288j464388
$$ plain form
4545 230594946 219235708 210289805 203775158 196972750 190290516 183136702 176841892 171479772
4537 171479772 165644716 161678068 157776715 153493889 150759326 149046175 148071863 146464484
4529 146464484 144740593 143825998 144391518 143913848 143092971 142352285 142227063 141642612 141047399
4520 141047399 140152674 138840411 137812960 136911481 135417111 134222509 133470066 132248091
4512 132248091 130498706 130016233 129876714 131358716 135009230 136823184 138360142 140385125
4504 140385125 143127456 143796894 143609977 142278027 140356005 138931035 136857006 135026787
4496 135026787 133010463 131211693 128619045 127131221 125721631 125060882 124731836 123623543
4488 123623543 123753985 124186284 124209791 124325467 125919898 125872306 124874491 124330203 122865815
4479A22865815j370012j419319j595402o20554k1035k99122N47127P76484N54419
4470A19418401J194282J499284K987738J807732K878660M161173M532390M953823
4462A43433483N546501M911754L474892K718716L29500q94627k942071k746772
4454A53831376l589421l830892k471610q07139n8772J509123K656410M220896
4446A51459971M056314M957733P137297N932480N531875M363347M318573N964489
4438A93722079O986081P982931R866681J3018273J5548021J6770558J6387604
4431B80282228J4316014J0739897O151715Q49875l136393p085891j0430390j0197288
4423B81489767q900317o727097m354102k693249q98401j410118k106774l990818
$$ plain form
4479 122865815 121495803 120076484 118481082 117860528 117839493 117540371 118087498 118863982 119418401
4470 119418401 120612683 122111967 125099705 126907437 129786097 133947270 138479660 143433483
4462 143433483 148979984 153891738 157366630 160085346 160414846 159520219 156578148 153831376
4454 153831376 150241955 146411063 143939453 143132314 143073542 144582665 147239075 151459971
4446 151459971 155516285 160474018 167611315 173543795 179075670 183439017 187757590 193722079
4438 193722079 200708160 208691091 218557772 231576045 247124066 263894624 280282228
4431 280282228 294598242 305338139 311489854 312339729 309203336 302117445 291687055 281489767
4423 281489767 272589450 265862353 261508251 258815002 257916601 256506483 254399709 250408891
4415B50408891q455120j0808293j1198314j2437015j3414201j0535697r207923
4408A74352328n780356l721698k797248j570867o01078p50060p81141j377827
4400A56972053j800362j854821j540787m57600j075153r6494L77539Q52563J42572
4391A51519510q37568o89012k000284k145223k499703l584255k993468k951801
4383A33818196l406845l184187k874852k182369j137305j831417j332618J22819
4375A17991422n90565o88987j180725o12539k080096j603848j753367k471714
4367A07009581k174163j96465j422472j095655j290755p49193j72142p42746K19013
4358I9385003r49986m96233L01837J423545J493773K539485L536986K679254M004216
$$ plain form
4415 250408891 241953771 231145478 219947164 207510149 194095948 183560251 174352328
4408 174352328 168571972 164850274 162053026 160482159 159881081 159131021 158349880 156972053
4400 156972053 155171691 153316870 151776083 151318483 150243330 150146836 150524375 151376938 151519510
4391 151519510 150681942 149992930 147992646 145847423 143347720 139763465 136769997 133818196
4383 133818196 130411351 127227164 124352312 122169943 121032638 119201221 117868603 117991422
4375 117991422 117400857 116711870 115531145 114918606 112838510 111234662 109481295 107009581
4367 107009581 104835418 104638953 103216481 102120826 100830071 100080878 99908736 99165990 99385003
4358 99385003 98435017 97938784 98240621 99664166 101157939 103697424 107234410 109913664 113917880
4349A13917880K050544O73072J071483j299819o77700r94995o43289K77419L86671
4340A14761266Q37324J629232J532440J565515k08643m87471k18548k45651J06963
4331A19272427k81357p18471j173156o48222j277048k851681l182834k852549
4323A06287109j859158k290598j475234j771932L03955P31604P93002M43073j651032
4314I9510789p52209J054359j692190j526615r84281j234780q82769p77158q65457
4305I1849689j814450q53072k265935q04047j008414r19458l96141m55815l10182
4296H3022175J740849J196792n7098L61686J0681K52344L95430J041183J779931
4287H9743973O91668J041962J174419J840040J814662R08759P06303K27884O06937
$$ plain form
4349 113917880 115968424 116641496 117712979 116413160 115735460 114740465 114097176 114374595 114761266
4340 114761266 115598590 117227822 118760262 120325777 120117134 119629663 119411115 119165464 119272427
4331 119272427 118991070 118272599 117099443 116451221 115174173 112322492 109139658 106287109
4323 106287109 104427951 102137353 100662119 98890187 99194142 99925746 100718748 101161821 99510789
4314 99510789 98758580 99812939 98120749 96594134 95609853 94375073 93492304 92715146 91849689
4305 91849689 90035239 89182167 86916232 86112185 85103771 84184313 83788172 83332357 83022175
4296 83022175 84763024 85959816 85902718 86264404 86275085 86527429 86922859 87964042 89743973
4287 89743973 90435641 91477603 92652022 94492062 96306724 97215483 97921786 98149670 98756607
4278I8756607m02130M21604M07200m84871j787839q13132k04754n94952j202300
4269I4095433m04115j002242o07051o80293K38427K78543k23113k4728J44319
4260I1815180M3069k33016l92952k40112R09887Q29168p41553l04907N53121K13246
4250I2451131L39111K17051O62571J406518L82245o40409q40576p40642j489364
4241I1747636o51256j121274j710828r53119j269088l84994l93392m58997q4227
4232H4720461Q37261K53921J81140J41637m32266J004982L97192q50761P90277
4223H7043844J075144o4051L15540J288536L94907J094803Q91180M94958M55159
4214I2990020P09122j33069k72524L36389O27003L73862P09514q06885j655053
$$ plain form
4278 98756607 98354477 98776081 99183281 98698410 96910571 96097439 95892685 95297733 94095433
4269 94095433 93691318 92689076 92082025 91401732 91640159 91918702 91695589 91670861 91815180
4260 91815180 91858249 91625233 91232281 90992169 91902056 92731224 91989671 91684764 92237885 92451131
4250 92451131 92790242 93007293 93669864 95076382 95458627 94818218 93977642 93237000 91747636
4241 91747636 91096380 89975106 88264278 87311159 86042071 85657077 85263685 84804688 84720461
4232 84720461 85557722 85811643 85992783 86134420 85702154 86707136 87104328 86253567 87043844
4223 87043844 88118988 88054937 88370477 89659013 90053920 91148723 92039903 92534861 92990020
4214 92990020 93699142 93566073 93293549 93629938 94256941 94630803 95340317 94533432 92878379
4205I2878379o02172o3036M05943o10217j523646J45495n77179m17296O58177
4196I0294448l80618M71470k36439o47873j2221k961o35674j163161R85537N99272
4186H9271780j79085N3671M54900j77395q11564j6860k1057Q6175K01348K64199
4176H9126112j95891J9826Q74522K34883J89037P47716R5653N33407J190635O6474
4166I2882374O87676J662361K385647O94398P98197R79734M59116M49379P02764
4157A01701646Q57982K13462Q6406N78936J97987k15621Q31860R41796m55515
4148A04738939L93663J67454o77231j931361j184996j618619k68464M11696k22493
4139I9808588q03656J87273M80400K048N68045l61267k63868m32066P50343l10167
$$ plain form
4205 92878379 92276207 92213171 92619114 92008897 90485251 90630746 90053567 89636271 90294448
4196 90294448 89913830 90385300 90148861 89500988 89488767 89485806 88850132 87686971 88672508 89271780
4186 89271780 89092695 89146366 89601266 89423871 88612307 88595447 88574390 88660565 88861913 89126112
4176 89126112 88930221 88950047 89824569 90059452 90248489 90996205 91091858 91625265 92815900 92882374
4166 92882374 93570050 95232411 97618058 98312456 99110653 100090387 100549503 100998882 101701646
4157 101701646 102559628 102773090 102859496 103438432 103636419 103420798 104252658 105194454 104738939
4148 104738939 105132602 105300056 104622825 102691464 101506468 99887849 99619385 100031081 99808588
4139 99808588 99004932 99192205 99672605 99674653 100242698 99881431 99617563 99185497 99935840 99625673
4129I9625673N06681K97021K33372k05806N84090R33822J154342J529527J73007
4120A04831729o52577N59566N43616N66521Q03798J64588n26679J25322N09973
4111A06925857J78584l12906j45144q67555j33759K33421L36482Q32009O66150
4102A07713139J331706J054604J306666J852488J111438J368430J027724L46986
4094A17113181J259118J029062L13720n74705R95587Q46397M83855M54337l07908
4085A21612644K70897j656128j32311m57251J038696L49948L77562N49917N57362
4076A22511336P80350K49685j10454O76791j225238j442502j879754k130112j448464
4067A15981638n54794n32691p31073r51671r34069L9291j417544N0891j43591
$$ plain form
4129 99625673 100132354 100429375 100662747 100456941 101041031 101974853 103129195 104658722 104831729
4120 104831729 104179152 104738718 105282334 105848855 106652653 106817241 106290562 106415884 106925857
4111 106925857 107104441 106791535 106646391 105778836 105645077 105878498 106214980 107046989 107713139
4102 107713139 109044845 110099449 111406115 113258603 114370041 115738471 116766195 117113181
4094 117113181 118372299 119401361 119715081 119140376 120135963 120982360 121466215 121920552 121612644
4085 121612644 121883541 120227413 120095102 119637851 120676547 121026495 121404057 121953974 122511336
4076 122511336 123291686 123541371 123430917 124107708 122882470 121439968 119560214 117430102 115981638
4067 115981638 115426844 114894153 114163080 113211409 112277340 112316631 110899087 110949978 110806387
4058A10806387p56509m65845o82980j219061q06350l59435J12704m40040l20277
4049A05868594L86111N62471j047739p71798m71074J55940j41485j134645p84024
4040A02622351m45205l20224j110376r22280P06080n91853K93073R45094O39877
4031A01816537K36437L23962N81230k97174m40783j10783J132471k16798p58817
4022A02266282r03482L60439J79402r70859Q87463j20575n04512j725201m06562
4013I9062395J307121J509738m96826o23818n49034m67727q10617q49513p25715
4004I7356004q27793k81983k072112k300146j302789r82068j817115r65043q22527
3995H5984428j737812j520317j415662m19945r29453n67309m54509l00940o10807
$$ plain form
4058 110806387 110049878 109584033 108901053 107681992 106875642 106516207 106628911 106188871 105868594
4049 105868594 106254705 106817176 105769437 104997639 104526565 104682505 104541020 103406375 102622351
4040 102622351 102177146 101856922 100746546 99824266 100530346 99938493 100231566 101176660 101816537
4031 101816537 102052974 102376936 102958166 102660992 102220209 102109426 103241897 103025099 102266282
4022 102266282 101362800 101723239 101902641 100931782 101819245 101698670 101194158 99468957 99062395
4013 99062395 100369516 101879254 101382428 100758610 100209576 99741849 98931232 98081719 97356004
4004 97356004 96528211 96246228 94174116 91873970 90571181 89589113 87771998 86806955 85984428
3995 85984428 84246616 82726299 81310637 80890692 79961239 79393930 78939421 78638481 78027674
3986G8027674k78998N67886j161597j93905r07279o36326k41593m42646k53653
3977G4479563k95807k24533q55376J64260k53455r89684l09972L71970k23779
3968G1863187j37566m7161j065842j220024l25342N04636m68267p22070j488253
3959F6893298n21389j23222O77224O63960L45615Q09733K40101q4236L40844m19268
3949F8822660K11881l74534o25119j50852O6997K22133r75476k67744j022035
3940F5907911Q49343o01497p95687p85001j82902K57212J46271q75969k66245
3931F3653436j1216o22719n56058j11143M6112j58503o99411P0722K34908l66471
3921F1479657J6533m57777N51841R83330N27416J34728R68443J245166J04830
$$ plain form
3986 78027674 77748676 78316562 77154965 76961060 76053781 75417455 75175862 74733216 74479563
3977 74479563 74183756 73959223 73103847 73268107 73014652 72024968 71714996 72086966 71863187
3968 71863187 71725621 71678460 70612618 69392594 69067252 69571888 69103621 68381551 66893298
3959 66893298 66371909 66248687 66925911 67589871 67935486 68745219 68985320 68901084 69241928 68822660
3949 68822660 69034541 68660007 68034888 67884036 67951033 68173166 67197690 66929946 65907911
3940 65907911 66757254 66155757 65360070 64575069 64392167 64649379 64795650 63919681 63653436
3931 63653436 63642220 63019501 62463443 62352300 62398412 62239909 61540498 61611220 61846128 61479657
3921 61479657 61496190 61038413 61590254 62573584 63101000 63235728 64204171 65449337 65554167
3912F5554167K22776P5197L81163M31930L78221M66385L26540n3312R8092k15942
3902F7665217M5317P8896l84170l99168o35502m78838q48715L24762p02113k8016
3892F4637670m5681N96263K51722j57683O88354J402070R15050J530545Q6160
3883F9904470Q82252R12148J252520J190274J662867J319953K416929K091830
3875H1633243K455994L739091L749472M389004M616223N882798P973203Q195912
3867A22634940Q890447R632006R808293J0458549R278512O038038M056752P91548
3859A81589085l371201n097407p380190q186919j0052060j0645327r152184r030182
3851A18673615q204197o557401n292577m653639m730421l100236l358914k095899
$$ plain form
3912 65554167 65776943 65852140 66233303 66665233 67043454 67509839 67836379 67783067 67881159 67665217
3902 67665217 67710534 67789430 67405260 67006092 66370590 65891752 65043037 65367799 64665686 64637670
3892 64637670 64591989 65188252 65439974 65282291 65970645 67372715 68287765 69818310 69904470
3883 69904470 70786722 71698870 72951390 74141664 75804531 77124484 79541413 81633243
3875 81633243 84089237 87828328 91577800 95966804 100583027 106465825 114439028 122634940
3867 122634940 131525387 141157393 150965686 161424235 170702747 176740785 180797537 181589085
3859 181589085 178217884 173120477 165740287 157553368 147501308 136855981 127703797 118673615
3851 118673615 110469418 103912017 98619440 93965801 89235380 86135144 82776230 80680331
3843H0680331k273284k146606j718180k699345j998261q66383j576131k189844
3835F5212297j773649j481622J89223l69217j315592j675540k95855M00041j887537
3826E7002549o87289r55621l17641J86438j336980q80414r1042L17302N46718
3817E3784020j240467q52418R9903l98048m89599n11635K38172J49293n60966
3808E0218255m22753k90503k23616K26055k79486o46075j22522L70558l10725
3799D8519188J24467r81830M02627l02477m66817L88906j27578N78956M48486
3790D8583928q7647K57183R8725l95556P12873Q1259P33342q0206P08570K16013
3780E0828484J05788Q2889O78853k43516m91801P1078m18167K66415R3900o77192
$$ plain form
3843 80680331 78407047 76260441 74542261 71842916 69844655 68978272 67402141 65212297
3835 65212297 63438648 61957026 62146249 61777032 60461440 58785900 58490045 58890086 57002549
3826 57002549 56315260 55359639 55041998 55228436 53891456 53011042 52920000 53237302 53784020
3817 53784020 52543553 51691135 51791038 51392990 50903391 50391756 50629928 50779221 50218255
3808 50218255 49795502 49504999 49281383 49507438 49227952 48581877 48459355 48829913 48519188
3799 48519188 48643655 47661825 48064452 47761975 47295158 47684064 47556486 48135442 48583928
3790 48583928 48496281 48753464 48852189 48456633 49169506 49250765 49984107 49903901 50612471 50828484
3780 50828484 50934272 51017161 51696014 51452498 50960697 51031775 50613608 50880023 50973923 50296731
3770E0296731K92786Q24310N61327m25092J98507n72126J117391Q2803O10703
3761E2987340R36989K43368R28489L26781L57712K25611Q96938o16082p43592
3752E5543554l771Q21674q2377j83684K033J06000M24929j060840n20452J14433
3742E5161499n05239k37289o17966o2154m95833Q0940k27017o61381N27542j031726
3732E1931376j129757n49052j449071k36806n88719K17411l1496n83916r5264
3723D7484706m22597p06201l039N61607l51439M77047Q09497k16059k74235q27306
3713D6531981o43692j94924p2089o16792J28181L14768M60589k64197j099290
3704D4544535N2260j2286R54798l04018N7934j86501m46736K01732m79359J60372
$$ plain form
3770 50296731 50589517 51413827 51975154 51550062 51748569 51176443 52293834 52376637 52987340
3761 52987340 53924329 54167697 55096186 55422967 55780679 56006290 56903228 56287146 55543554
3752 55543554 55539783 56361457 56279080 56095396 56097429 56203429 56628358 55567518 55047066 55161499
3742 55161499 54656260 54418971 53801005 53738851 53243018 53323958 53096941 52435560 52963102 51931376
3732 51931376 50801619 50252567 48803496 48566690 47977971 48195382 48163886 47579970 47484706
3723 47484706 47062109 46355908 46352869 46914476 46563037 47040084 47849581 47633522 47359287 46531981
3713 46531981 45888289 45693365 45621276 45004484 45132665 45447433 45908022 45643825 44544535
3704 44544535 44596795 44584509 45539307 45235289 45293223 45106722 44659986 44861718 44382359 44542731
3694D4542731R3410p0239j54968J23622n75989j35902o57622o62032k64681O14458
3684D2852788N55863p55678o26266J12911l75103Q1632j338825q24474l33462
3675C9349386r0383o2675p73932p97458n77141O07112l41225j356409q28010j415636
3665C3713629o74673R2376k82343j197767m5221j95751l18857N02917l32211K88625
3655C1550724j56810n23044O50722Q00545n26141M00580k05951N1396p64873j415028
3645B9862120n93414O0814p78627j07310R28417l74328o02752L70210k85827l42581
3635B8136722j109343l90670L00825r4706L13347Q6733l95937k30806J28015o96915
3625B6047265N20362p94218k79061o71150K58972J77732j411834O68952Q1978
$$ plain form
3694 44542731 44636141 44565902 44410934 44534556 43958567 43822665 43165043 42503011 42238330 42852788
3684 42852788 43408651 42652973 42026707 42139618 41764515 41846147 40507322 39682848 39349386
3675 39349386 39259003 39196328 38422396 37624938 37047797 37654909 37313684 35957275 35129265 33713629
3665 33713629 33038956 33131332 32848989 31651222 31606001 31410250 31091393 31594310 31262099 31550724
3655 31550724 31393914 30870870 31521592 32322137 31795996 32196576 31990625 32042021 31277148 29862120
3645 29862120 29268706 29329520 28550893 28443583 29372000 28997672 28394920 28765130 28479303 28136722
3635 28136722 27027379 26636709 26937534 26842828 27156175 27242908 26846971 26616165 26744180 26047265
3625 26047265 26567627 25773409 25494348 24823198 25082170 25259902 23848068 24517020 24598998
3616B4598998N6252k95365o0765m50136K22337j8594m08806P923k352m45733j099776
3605B2103983O12420P46643J44093q80025K20937k36562l40856O7226o53246o94335
3595B1090278k2943J38465l07112J65591k80810n46251L77416M93564n63380k09615
3585B0335203Q25904j11093k79701m16576j80979J814324m58290k26057R72962
3576B2275697q53952j019486K25328R13753n81292M56029N34889M05602N0704
3567B2407272r27923j63241m6731N10979k69084k67760Q89888K16356q23718L80208
3557B1906246R7174J28585k00941J751153k50007j039206J45475N01354R75043
3548B4014876L71775n23803K76624J92294j81016o40684K38212J81228O74750
$$ plain form
3616 24598998 24655250 24359885 24299120 23848984 24071321 24052727 23643921 23651844 23649492 23203759 22103983
3605 22103983 22716403 23463046 23607139 22727114 22948051 22711489 22370633 22437859 21784613 21090278
3595 21090278 21067335 21205800 20898688 21064279 20783469 20237218 20614634 21108198 20544818 20335203
3585 20335203 21161107 21050014 20770313 20353737 20172758 21987082 21528792 21302735 22275697
3576 22275697 21421745 20402259 20627587 21541340 20960048 21416077 21950966 22356568 22407272
3567 22407272 21479349 21316108 21269377 21780356 21511272 21243512 22133400 22349756 21526038 21906246
3557 21906246 22003420 22132005 21931064 23682217 23432210 22393004 22538479 23039833 24014876
3548 24014876 24386651 23862848 24139472 24331766 24150750 23510066 23748278 23929506 24604256
3539B4604256N53605L30722R16804j36749M48838K03917J032540O17488R84449
3530B9555870J314696N17748J233953Q62776q4852L75316k0826L08922R4666n7398
3520C4100871p87078p99521k41524j74553O68407O10213J17906M57224q4758J02217
3510C3969404J138527J295194M22878Q44595L19728J58562O01184R62507R12701
3501D0625280J750347P57487J924112K656737K016675K233890K679624K142288
3493E6786440Q53697J089246J161173P44961M05659L74183j31082m82027l99137
3484F0403113q37644p3615J089071L23628M41320M85599p31724M39478P93701
3475F2332927j767745j304452j110066j513029j989835k134538j616851q50300
$$ plain form
3539 24604256 25157861 25488583 26405387 26268638 26717476 26921393 27953933 28571421 29555870
3530 29555870 30870566 31388314 32622267 33485043 33400191 33775507 33754681 34063603 34158269 34100871
3520 34100871 33313793 32514272 32272748 32098195 32766602 33376815 33494721 33951945 33867187 33969404
3510 33969404 35107931 36403125 36826003 37670598 37990326 38148888 38750072 39712579 40625280
3501 40625280 42375627 43133114 45057226 47713963 49730638 51964528 54644152 56786440
3493 56786440 57640137 58729383 59890556 60635517 61041176 61415359 61284277 60802250 60403113
3484 60403113 59565469 59491854 60580925 60904553 61345873 61831472 61099748 61539226 62332927
3475 62332927 60565182 59260730 58150664 56637635 54647800 52513262 50896411 50046111
3467E0046111j275101j384200q38393q62868r69975j077362r15068j70174r08428
3458D1644542j429704q57510j739702q13776j82649j134728j402515j091162J67090
3449C3159886O20247j8237q07332J29953k51285j121194R7545j445818N6866j56643
3439C0263988J39293k09354j114816q1171m94877l42263q78831N28022L93736
3430B8203727j051152l68266k58676J48876J94768l14281k39545n62383p88272
3421B4964796O73400J633n65540k02341j094595l47894M27584M88279p08878J26285
3411B3762729L33625r89485q56063O07920L47781R1457l52795m82164J7094n69019
3401B1911080N30746O94809j324188N66288K3498k63398k98314q61773R23124
$$ plain form
3467 50046111 48771010 47386810 46548417 45685549 44715574 43638212 42723144 42552970 41644542
3458 41644542 40214838 39357328 37617626 36803850 36621201 35486473 34083958 32992796 33159886
3449 33159886 33780133 33761896 32954564 33084517 32833232 31712038 31809583 30363765 30420631 30263988
3439 30263988 30403281 30193927 29079111 28997940 28503063 28160800 27281969 27809991 28203727
3430 28203727 27152575 26784309 26525633 26674509 26869277 26554996 26315451 25753068 24964796
3421 24964796 25638196 25639829 25074289 24871948 23777353 23429459 23857043 24345322 23636444 23762729
3411 23762729 24096354 23106869 22250806 22858726 23206507 23297964 22945169 22463005 22480099 21911080
3401 21911080 22441826 23136635 21812447 22378735 22402233 22138835 21840521 20978748 21901872
3392B1901872l03096k61410N13392j38700J25050L7785m01022j317823q94885
3383A9261163j46852n4383k30197n04770p7013o19826m48593l6338L2948J97408
3373A7373547J26706j609910p60737O70909m693L16929R13823o20956p43113M6518
3363A5709023o09282m06524J82126n55579N38826p87778j85121J252648j232001
3354A3906338k69536L35101L74344r08838o13996M56955j59544n726k62946J81266
3344A3033418k74000K69073J65681P69605n80242l89543J61887n96002M59674
3335A3019551n98434k30256K76021K00969k80116j232306q08139N88465O61070
3326A1596825m39486n50559R06602q00244M89821K2237k40518j95276o20727K73447
$$ plain form
3392 21901872 21598776 21337366 21850758 21712058 21837108 21874893 21473871 20156048 19261163
3383 19261163 19114311 19059928 18829731 18324961 18247948 17628122 17179529 17143191 17176139 17373547
3373 17373547 17500253 15890343 15129606 15800515 15795822 16112751 17026574 16405618 15662505 15709023
3363 15709023 15099741 14693217 14875343 14319764 14858590 14070812 13885691 15138339 13906338
3354 13906338 13636802 13971903 14346247 13437409 12823413 13280368 13120824 13115098 12852152 13033418
3344 13033418 12759418 13028491 13194172 13963777 13383535 12993992 13155879 12559877 13019551
3335 13019551 12421117 12190861 12466882 12667851 12387735 11155429 10347290 10935755 11596825
3326 11596825 11157339 10606780 11513382 10713138 11202959 11225196 10984678 10789402 10168675 10442122
3316A0442122L54857r68301l42071K26823k00446o0657K56149k23187k22p84743
3306H700324m25186K88270l00158L42624O32465J98220k00116n535k18621m95550
3296H516737k48708l17995p94892k1935J163168M99068m15358O5078o21122J176449
3286I000490j80832q16866O78651m5655o35530K60104l18531M65070n14318k49921
3276G642662K44872L86355R9730l88220m3022K87267l32524q35769J26933L45530
3266G533814p52906l32950M75396J107763J013474m98521q04770l68891K1513
3257G393922K74555K56548n9295k9602K35420j13684j216130m94651O42949M81207
3247G371239m60565j40466P83702j37044J57614n79681k29886M44549J067032
$$ plain form
3316 10442122 10796979 9828678 9486607 9713430 9512984 9452327 9708476 9485289 9485067 8700324
3306 8700324 8275138 8563408 8263250 8605874 9238339 9436559 9236443 9230908 9012287 8516737
3296 8516737 8268029 7950034 7155142 7133207 8296375 8795443 8380085 8445163 7824041 9000490
3286 9000490 8819658 8002792 8681443 8635788 8000258 8260362 7941831 8406901 7892583 7642662
3276 7642662 7887534 8273889 8373619 7985399 7942377 8229644 7897120 7061351 7188284 7533814
3266 7533814 6780908 6447958 6923354 8031117 9044591 8546070 7741300 7372409 7393922
3257 7393922 7668477 7925025 7865730 7836128 8071548 7957864 6741734 6247083 6890032 7371239
3247 7371239 6910674 6770208 7553910 7416866 7574480 6994799 6764913 7209462 8276494
3238H276494j43469q94403m43389n05251L65283K92794k99055l38175P95110M97351
3228G603290M47033K21812n97546n22872m77274j666P58959Q4028n80875q4786
3218F850103N88262K87226J61609o7493J190817p9627J63618m58835M77078n66454
3208H546304o82248P44696L41951J47023J48186L72148m31046j14311J15731L80880
3198I569314K46986m15664n41445p8153M65786l11545R80101k2604P8436Q85939
3188A0857151J74813J130822R19386J990718K451932P22527o86000k736N25133
3179A8083746k80743j203253p34256o90102l49101L28918L39808o0523q66555
3170A4567939M22239O95989J86021K61778j111083k51296N09216P36260N76161
$$ plain form
3238 8276494 8133025 7238622 6795233 6289982 6655265 6948059 6649004 6310829 7105939 7603290
3228 7603290 8050323 8272135 7674589 7151717 6674443 6672777 7431736 7515764 6934889 6850103
3218 6850103 7438365 7725591 7887200 7819707 9010524 8930897 9094515 8635680 9112758 8546304
3208 8546304 7864056 8608752 8950703 9097726 9245912 9618060 9187014 9072703 9188434 9569314
3198 9569314 9816300 9400636 8859191 8781038 9246824 8935279 9915380 9892776 9971212 10857151
3188 10857151 11031964 12162786 13082172 15072890 17524822 18247349 17561349 17558613 18083746
3179 18083746 17803003 16599750 15865494 15175392 14826291 15155209 15495017 15434494 14567939
3170 14567939 14990178 15686167 15872188 16133966 15022883 14771587 15280803 16017063 16593224
3161A6593224M22110O88452k81584N82589J395129K65058J604214J84208Q23099
3152B2276499M26548o48431l23443k98067n9691p00750m61301n51005r43669M24793
3142A9141483K379997Q21500K046550J468003k39598j077091j69778J934k290235
3133B2082765j809230o31153j714887j110632r18275r25273l6953m41724k65572
3124A4229066j105178K51118j32258m64417p02189l33918M51869j69943k53424
3115A1770726j61803J12455Q87364R07596R58742p68697o35791n70951J30974
3106A2630615Q16904k65809q64372k14257l18938k71427o07703j249138n89117
3097I066758p28014l59463L61118K35482l87564J30063p95068l12375Q42422o86351
$$ plain form
3161 16593224 17015334 17703786 17422202 18004791 19399920 19664978 21269192 21453400 22276499
3152 22276499 22703047 22054616 21731173 21433106 21373415 20672665 20211364 19660359 18716690 19141483
3142 19141483 21521480 22342980 24389530 25857533 25617935 24540844 24371066 24373000 22082765
3133 22082765 20273535 19642382 17927495 16816863 15898588 14973315 14936362 14494638 14229066
3124 14229066 13123888 13375006 13242748 12778331 12076142 11742224 12194093 12024150 11770726
3115 11770726 11608923 11721378 12608742 13516338 14475080 13706383 13070592 12499641 12630615
3106 12630615 13447519 13181710 12317338 12103081 11784143 11512716 10905013 9655875 9066758
3097 9066758 8338744 7979281 8340399 8575881 8188317 8318380 7523312 7210937 8053359 7367008
3087G367008j59853j86857l48960m48251L7036N19545k03190n64835P453l54831
3077E664265j68897j82119Q16932m48654l75280O85529j021973l09434l02030
3068D358339N4951J67214L58820k30125J85118l53485k42706N74494O83090q11327
3058D744383J015858j14993O87897m52426j88399m91105m5544J26165l03415M31157
3048E409578M52932o77894j44595J2023j9296j06415r45528O0337O31398k10827
3038D461713j128318R1670O59507q38903L2565L20023L01923J169265q05908j21218
3028D142319o44580K12371J235J7677k50311N175j89674J77871p6390j63683o06642
3017B625368r3348J50293n46101L83338K03971L85166L58970m14994p41243K53831
$$ plain form
3087 7367008 7207155 7020298 6671338 6223087 6260123 6779668 6576478 6011643 6019096 5664265
3077 5664265 5495368 5313249 6130181 5681527 5306247 5991776 4969803 4660369 4358339
3068 4358339 4413290 4580504 4939324 4709199 4894317 4540832 4298126 4872620 5555710 4744383
3058 4744383 5760241 5645248 6333145 5880719 5692320 5201215 5155671 5281836 4978421 5409578
3048 5409578 5862510 5184616 5040021 5052044 5032748 4926333 3980805 4041142 4672540 4461713
3038 4461713 3333395 3425065 4084572 3245669 3278234 3598257 3900180 5069445 4263537 4142319
3028 4142319 3497739 3710110 3711345 3729022 3478711 3483886 3294212 3472083 3395693 3232010 2625368
3017 2625368 2532020 2682313 2136212 2519550 2723521 3108687 3467657 3052663 2311420 2565251
3007B565251K81717k94109J20025j28908O85832l1928p0291j28778K46811j27540
2997C118082k84642l32788l51961M70086j82909j30351M51852m15j9876o44840
2987B092238j15236J089110L75019j122041J22850M10876N13445j50943m48993
2978B766325n94637O47700O57908l08457L0440j014513N39668R76222l82356J34806
2968C453106L37657k02502k0707k87674O19942M68265m67636j062370m52427k03548
2958B182106o62690k60538k19614R8178q1116N50616Q69262K65825J86212k07063
2948B721178M01252j091368m32653L08801N90205l82405n74496n44299O34931
2939A631146M6975k31412J06539O54M48650J15565N54589j01815k43296o97531
$$ plain form
3007 2565251 2846968 2552859 2672884 2543976 3229808 3197880 3127589 2998811 3245622 3118082
2997 3118082 2833440 2500652 2148691 2618777 2435868 2305517 2757369 2756954 2737078 2092238
2987 2092238 1977002 3066112 3441131 2319090 2441940 2852816 3366261 3215318 2766325
2978 2766325 2171688 2819388 3477296 3168839 3199279 2184766 2724434 3700656 3318300 3453106
2968 3453106 3790763 3588261 3567554 3279880 3899822 4368087 3900451 2838081 2385654 2182106
2958 2182106 1519416 1258878 1039264 1137442 1056326 1606942 2476204 2742029 2928241 2721178
2948 2721178 3122430 2031062 1598409 1907210 2497415 2115010 1540514 996215 1631146
2939 1631146 1678121 1446709 1553248 1553902 2002552 2118117 2672706 2570891 2327595 1630064
2929A630064k90109K70600M87348o50309p22490N85642N12760R5091j12323n23089
2919A283185k82468k23484M62932N07438k35538J53743K51456M69286j22116L51559
2909B615993k24418j50801p8449n20805j00908L39781O90700J74188J43416r18303
2899A970394m29117K3579n52199j78119j05343K81844J69534J62968m41971j17283
2889G84287Q06730p61280L93310M15681L76231q61960o01924O33186K21530p05953
2879F99838J69906J94275m55436r5482o6274N29447K80340k40952O07497J33166
2869A756325Q56929l70435l12651L26946p49348l48580l73976r8302o62438M08708
2859D33178j90323J203374j19608M23580k16392n36948l00414P50711J089482
$$ plain form
2929 1630064 1339955 1610555 2097903 1447594 725104 1310746 1823506 1918597 1806274 1283185
2919 1283185 1000717 777233 1240165 1747603 1512065 1665808 1917264 2386550 2264434 2615993
2909 2615993 2391575 2240774 2162325 1641520 1540612 1880393 2571093 2745281 2888697 1970394
2899 1970394 1541277 1564856 1012657 834538 729195 1011039 1180573 1343541 901570 784287
2889 784287 1591017 829737 1223047 1638728 2014959 1152999 551075 1184261 1405791 699838
2879 699838 869744 1064019 608583 513101 446827 976274 1256614 1015662 1623159 1756325
2869 1756325 2613254 2242819 1930168 2257114 1507766 1159186 785210 686908 24470 433178
2859 433178 242855 1446229 1326621 1750201 1533809 996861 696447 1447158 2536640
2850B536640r46516l37386l37814o07408P43250k18662J27907K97719M04191Q5751
2840A747672k35124q48809N76309L71642M8088k35191n39774Q2788r3690J55853
2830A029764k20052n05855l75506N03704l64218N20897K73233k57780O9425M99477
2820A173089j03568L43028K71374P92820q46890J55218P62009k3273n59631J54224
2810B118400K37566o95124k67989j95850j78958o5770l39969M5806q8584K04544
2800G74072n3432O0402n59071Q28158m28948J41088O33063N99643l04958j189936
2790E00081p7499J19565J94847M91279J030678p30932n61710O15528R46306p4426
2780B453717m95803n2669L4760j47042m16887j149686M23605K85226J41429o46852
$$ plain form
2850 2536640 1590124 1252738 914924 307516 1050766 832104 960011 1257730 1661921 1747672
2840 1747672 1512548 663739 1240048 1611690 1659778 1424587 884813 967601 873911 1029764
2830 1029764 809712 303857 -71649 432055 67837 588734 861967 604187 673612 1173089
2820 1173089 1069521 1412549 1683923 2476743 1629853 1785071 2547080 2523807 1964176 2118400
2810 2118400 2355966 1660842 1392853 1197003 1018045 952275 612306 658112 569528 774072
2800 774072 720640 781042 221971 1050129 621181 762269 1395332 1994975 1690017 500081
2790 500081 422582 542147 736994 1228273 2258951 1528019 966309 1581837 2528143 2453717
2780 2453717 1957914 1905245 1940005 1792963 1376076 226390 649995 935221 1076650 429798
2770D29798j62656N56498R01362m18963p03342L13172Q13787j1558n92540Q8660
2760A214218L30063j4315J77154j412691K46823J04496P21368P20762j222731
2751H65147L31765j22252M81860J24329k40190n55030M87214J15577j60676O05249
2741A932993J43403O41266j62045q67288n71695O3714n05879M03319Q96793K33458
2731B208039k62998M11308L20272l45171k97319m34095N47125k01871L5875M33066
2721B414231k09964n73669p17578n40360K43668K25037K39708k79193M25670L65716
2711A593266l23428j43359m77808K90674L83493J29238K30079k497n6761p56905
2701H65992K66108K33873K95083l79025L85270L37966l17117m93651k01262J61765
$$ plain form
2770 429798 267142 823640 1725002 1306039 602697 915869 1729656 1718098 1125558 1214218
2760 1214218 1544281 1529966 1707120 294429 541252 645748 1367116 2087878 865147
2751 865147 1196912 1074660 1556520 1680849 1440659 885629 1372843 1488420 1327744 1932993
2741 1932993 2076396 2717662 2555617 1688329 1116634 1180348 674469 1077788 1974581 2208039
2731 2208039 1945041 2356349 2676621 2331450 2034131 1600036 2147161 1945290 1981165 2414231
2721 2414231 2204267 1630598 913020 372660 616328 841365 1081073 801880 1227550 1593266
2711 1593266 1269838 1126479 648671 939345 1322838 1452076 1682155 1679658 1622897 865992
2701 865992 1132100 1365973 1661056 1282031 1667301 2005267 1688150 1194499 993237 1155002
2691A155002n03425K54696K99436j33993j491208K95867J002938o12679o99940
2682d33306K5053j74532J127533O6372Q8883K50748m52716K8001K85503N06012
2672A317551p14331m28563L17562n5982N41965J70839p92787k09255L43328N95704
2662A086031M45758J5431o36949K32173j77410N05339M32060j585379j23933N45728
2652G38849p21312K64146O9820k39145N70880L06592k00510j39849j75388j8969
2642D55114M82051o4975L79367l86165K09501j38338m85213L64202l49197J03473
2632E69820J005799J62133k03491M40215n51771k42263J9233J31344n4287n373
2622A271359K39417n77657j39063P78807N9353r87048r04133P04440M3279M94766
$$ plain form
2691 1155002 651577 906273 1205709 1071716 -419492 -123625 879313 266634 -433306
2682 -433306 -408253 -582785 544748 611120 700003 950751 498035 526036 811539 1317551
2672 1317551 603220 174657 492219 436237 978202 1149041 356254 146999 490327 1086031
2662 1086031 1531789 1547220 910271 1142444 965034 1470373 1902433 317054 193121 738849
2652 738849 17537 281683 351503 112358 683238 989830 789320 649471 474083 455114
2642 455114 937165 872190 1251557 865392 1074893 936555 451342 815544 466347 569820
2632 569820 1575619 1737752 1534261 1974476 1422705 1180442 1199675 1331019 1276732 1271359
2622 1271359 1510776 933119 794056 1572863 1632216 645168 -258965 445475 488754 983520
2612I83520Q0943K51097N09849P6513M09577M70623L73448K75769Q45316n81212
2602C695443k40156m101m6136m54882n49192o43823l61530p3419L05281j120369
2592E07116m36631N93849m42514L94900j47515R3613Q08448p76588l28488O32527
2582H98717K9689L42923l341L00633p71478K15158K52535n86201O83044J06265
2572A467944r89452K49119N99348K99839j87941m7942o9417J48220n57766L0649
2562I42601Q0586k76093R134P79999O36781j616565K78197k88090m38201j95816
2552h7467k67191Q28353R16503l51822j52023J94193M10371m86407k14574K77614
2542A067550j27899j90325J5018j94872l9975R78167K61196j56880j07157J2219
$$ plain form
2612 983520 1064463 1315560 1825409 1901922 2311499 2782122 3155570 3431339 4276655 3695443
2602 3695443 3455287 3451186 3405050 2950168 2400976 1757153 1395623 1322204 1627485 507116
2592 507116 70485 664334 221820 616720 469205 562818 1371266 594678 266190 898717
2582 898717 928406 1271329 1267988 1568621 797143 1012301 1264836 678635 1361679 1467944
2572 1467944 478492 727611 1326959 1626798 1438857 1390915 1321498 1469718 911952 942601
2562 942601 1023187 747094 756228 1536227 2173008 556443 834640 546550 108349 -87467
2552 -87467 -354658 473695 1390198 1038376 886353 1080546 1490917 1004510 789936 1067550
2542 1067550 939651 749326 764344 569472 529497 1507664 1768860 1611980 1504823 1517042
2532A517042M38098j36056l65395P45085n29578n80236l90743m75414j14072N67823
2522F76554P65879j20290n28114M77603P83078n43411j79505l02329K99063J51800
2512A480328l8531O84135r13173m04093O47056n89133n3446m39620N16217k03526
2502F86214n01711N06312J234782k18713j68580J02079o0759n71017M80428L07262
2492A796297l64274P35524o68546k19502L5075J81294J252555J27402j21698J06012
2482B860139l51666o12342K65354M24546K48484p51196p87459N48046l37435j23206
2472A383265p31397K82710j38885K55856l74346L33289j51627M40182l42786j99118
2462G57143O74194Q3111o3970O45380J097506J21797j046100K02566M94372J48894
$$ plain form
2532 1517042 1955140 1819084 1453689 2198774 1669196 1088960 698217 222803 108731 676554
2522 676554 1442433 1322143 794029 1271632 2054710 1511299 1331794 1029465 1328528 1480328
2512 1480328 1441797 2125932 1212759 808666 1455722 866589 813143 373523 889740 686214
2502 686214 184503 690815 1925597 1706884 1538304 1640383 1579624 1008607 1489035 1796297
2492 1796297 1432023 2167547 1499001 1279499 1314574 1495868 2748423 2875825 2754127 2860139
2482 2860139 2508473 1896131 2161485 2586031 2834515 2083319 1295860 1843906 1506471 1383265
2472 1383265 651868 934578 795693 1051549 677203 1010492 858865 1299047 956261 757143
2462 757143 1431337 1514448 1450478 2095858 3193364 3315161 2269061 2471627 2965999 3114893
2452C114893J62710o95892K64342p77770l39074k87836N29472k21290j58797k7042
2442A563716L36276M05404r07487K85379L12325N26358K08288K30569k22653k7122
2432B711053n58133m8543j91048K01064N69294P35800j09968n85708J288543j86493
2422C825861o45790M18811q3320k54647k37468k17790O77571m39411P08614R30832
2412D683263j63399m16133O4552m3927r39655P46944j08551q0740J23249K29172
2402D094775R94933p67698p81854J194983P86207n28537j63110M23048M10421
2393E663168k41611k79708R56448P31585m3869K5310L51595M86445L32981l94383
2383G587961K51N00615j00554q5369J2118O83233L79972M74006L31830j23473
$$ plain form
2452 3114893 3277603 2581711 2846053 2068283 1729209 1441373 1970845 1749555 1590758 1563716
2442 1563716 1899992 2305396 1397909 1683288 1995613 2521971 2730259 2960828 2738175 2711053
2432 2711053 2152920 2104377 1913329 2114393 2683687 3419487 3309519 2723811 4012354 3825861
2422 3825861 3180071 3598882 3515562 3260915 3023447 2805657 3483228 3043817 3752431 4683263
2412 4683263 4519864 4103731 4168283 4124356 3184701 3931645 3823094 3742354 3865603 4094775
2402 4094775 5089708 4322010 3540156 4735139 5521346 4992809 4829699 5252747 5663168
2393 5663168 5421557 5141849 6098297 6829882 6786013 6811323 7162918 7649363 7982344 7587961
2383 7587961 7588212 8088827 7988273 7902904 7915022 8598255 8978227 9452233 9784063 9660590
2373I660590r0698J032649Q87448J44193R71369J430377q2125n30408P62678Q21500
2363A5007573J231868N87775J335233K21880J445515K775259K901104L660813
2355B9167020M036242L598136L570969K328920K056080L951291L404632M637626
2347E6750916N281844R320921J2592114J7803972K7734628N0319881P8721984
2340B58526260J11404299J02223746N5838420J15209j3176527k0930012n6709971
2333D37291424p0080811p1934931n9503299m8263510m0372657l2292618j9146316
2326I5697282j1620859o678936n289904n633292o919006o334694l670846m044044
2318D5505701m611957m011564k984510k814507k902825j892686j827790o79590
$$ plain form
2373 9660590 9569892 10602541 11489989 11634182 12605551 14035928 13953803 13423395 14186073 15007573
2363 15007573 16239441 16827216 18162449 18384329 19829844 22605103 25506207 29167020
2355 29167020 33203262 36801398 40372367 42701287 44757367 48708658 52113290 56750916
2347 56750916 62032760 71353681 83945795 101749767 129484395 179804276 258526260
2340 258526260 369930559 472154305 527992725 528107934 514931407 494001395 437291424
2333 437291424 367210613 295275682 235772383 187508873 147136216 114843598 95697282
2326 95697282 84076423 77397487 72107583 66474291 59555285 53220591 49549745 45505701
2318 45505701 40893744 36882180 33897670 31083163 28180338 26287652 24459862 23780272
2310B3780272p55284j492808j400308m54493q03007j470561o23705o67308l73141
2301A5739657j84001n25804r21776r94991M85940p6853o8825n59845r00586k07230
2291A1785686n43735J79219n45173r36380p78461j49076n2998J99259O5352Q1762
2281I305455j568929n4343K4825n74970l69183n76007R58437J47373k80608l26941
2271F685109m97475l72324J78524K00986Q50783q621j827063m04047N26333J18739
2261E450944j217868m87599O42544R3707P24996N30174p66950q13504K38823m36895
2251C958372j02585N69975J13566j385273j48819q28909M40948P45190P59617
2242D122082J59276p34175J68524p26677K92350M1351Q539K73096m10350J42301
$$ plain form
2310 23780272 23024988 21532180 20131872 19677379 18874372 17403811 16780106 16112798 15739657
2301 15739657 15555656 15029852 14108076 13113085 13599025 13522172 13453347 12893502 11992916 11785686
2291 11785686 11241951 11421170 10875997 9939617 9161156 9012080 8959082 9158341 9223693 9305455
2281 9305455 7736526 7682183 7707008 7132038 6762855 6186848 7145285 7292658 7012050 6685109
2271 6685109 6187634 5815310 5993834 6194820 7045603 7036982 5209919 4805872 5332205 5450944
2261 5450944 4233076 3745477 4388021 4481728 5206724 5736898 4969948 4156444 4395267 3958372
2251 3958372 3855787 4425762 4539328 3154055 3005236 2176327 2617275 3362465 4122082
2242 4122082 4281358 3547183 3715707 2989030 3281380 3322731 3331270 3604366 3194016 3336317
2232C336317O76480m54764n24421p79586l16474R77646K15105J34624r9170m20253
2222B745504o50475N95314n26961P6231k69962r29623j47441K71102P70768K06132
2212B140589j41384M29273l43161j89129J6069k59885P73774m85482O3350n98804
2202A405210o09664l31632O41226P33021O58287n70860k21287l71662J23877m14124
2192A042392o85622R07019l86740J74688k7522R6086J75239k98078J99087p80799
2182D15750O65792M68041p17214N67372o3987J02667N61975l69490k77849K67751
2172A620808j2972l93543O87397k89273j233007L42933N80736L6542K28197k38253
2162A329565N3608p31312Q10969M10442k60508m53346j53341k26687N41440k04727
$$ plain form
2232 3336317 4012797 3558033 3033612 2254026 1937552 2915198 3130303 3264927 3165757 2745504
2222 2745504 2095029 2690343 2163382 2239613 1969651 1040028 892587 1163689 1934457 2140589
2212 2140589 1999205 2428478 2085317 1896188 1912257 1652372 2426146 1940664 2004014 1405210
2202 1405210 795546 463914 1105140 1838161 2496448 1925588 1704301 1332639 1456516 1042392
2192 1042392 356770 1263789 877049 1051737 1024215 1120301 1295540 997462 1196549 415750
2182 415750 1081542 1549583 832369 1399741 1335754 1438421 2000396 1630906 1353057 1620808
2172 1620808 1607836 1214293 1901690 1612417 379410 722343 1303079 1339621 1567818 1329565
2162 1329565 1383173 651861 1462830 1873272 1612764 1159418 1006077 779390 1320830 1116103
2152A116103L44239K1003n97728J81850m70002Q179J83828M98128r45433N26257
2142H66424Q6889j07116P70570K25192r34881k70663j592L6496J8656n77335K09720
2131C22360M65787r38252q8704M65076j74717L57974m91161q52159Q66532N8956
2121h308O20986N72105o43578o80118K78216M16254K94562N67672K12930l61946
2111A268775p90853l50993J98207N47919L3128l03130K16435l47296k96320j35182
2101D0690j37132K50392j69653M99088K03003Q37423p34068m17452j97741j40603
2091C3947L58739q4885n26816M31025r0586O92282N92487n81248l06059N08102
2081A026988J42725m89066j44524J76693R85461p64686p04676J83605O88845k4981
$$ plain form
2152 1116103 1460342 1481345 883617 1065467 595465 603644 787472 1285600 340167 866424
2142 866424 953313 846197 1616767 1841959 907078 636415 634823 671319 689975 112640 322360
2131 322360 788147 -150105 -238809 226267 51550 409524 -81637 -933796 -67264 -8308
2121 -8308 612678 1184783 541205 -138913 139303 555557 850119 1417791 1630721 1268775
2111 1268775 477922 126929 325136 873055 906183 603053 819488 472192 175872 40690
2101 40690 -96442 153950 -15703 483385 686388 1523811 789743 372291 174550 33947
2091 33947 392686 307801 -219015 212010 121424 813706 1406193 824945 518886 1026988
2081 1026988 1169713 680647 536123 712816 1698277 933591 228915 412520 1101365 1076384
2071A076384N2485P31084O67640l01368M14823P8364m85243j319419L93232N40798
2061A848780n27360m94881k78864O41150O7242l68210m24477M75865L33758M26271
2051A699274p12850o01135K72945k39762l50561k59936N91863j34698K59796k32314
2041B92622o22261K87567L58670m90139j36212l28127M30383m58430k51521P43538
2031a73910m79729P94098L66329P38257k4766m11324n67969l56141N76714o997
2021D54562L9437p21072M3994N00012J01030l64471L91878n43955N83615N09604
2011I94634n99155j56900m33092L75902L23026m38476m17763M15882p31905L56024
2001c11823j57258M0151j61203K97369O27971k35853m68699R70143L98086q86179
$$ plain form
2071 1076384 1128869 1859953 2527593 2226225 2641048 2719412 2234169 914750 1307982 1848780
2061 1848780 1321420 826539 547675 1188825 1256067 887857 463380 939245 1273003 1699274
2051 1699274 986424 385289 658234 418472 67911 -192025 399838 265140 524936 292622
2041 292622 -329639 -42072 316598 -173541 -309753 -637880 -207497 -665927 -917448 -173910
2031 -173910 -653639 140459 506788 1245045 1220279 808955 240986 -115155 461559 454562
2021 454562 493999 -227073 -183079 316933 417963 53492 445370 -98585 485030 994634
2011 994634 395479 238579 -194513 181389 504415 65939 -351824 64058 -667847 -311823
2001 -311823 -469081 -428930 -590133 -292764 335207 99354 -369345 600798 998884 112705
1991A12705Q3992L60282k18365l17952L87015l43505p4254j65750m32927N59823
1981d8936M3933l76109L99102n34540J27566M13133N24512o65848l01348Q48612
1971D30077l00840k06603L35085n10615L29335L62941J5275N20065M41474P8419
1961A494613l76431m79158n25776J245829J61414j311246j62978k78401R266L55375
1951A32507K94744k50514J70106K92000n12138Q23442l70598r37284R32695k93825
1941B81135k60087K44926j81291N14446q42856P4723L05673K93349P79874j50123
1931A059769m80049R2985l46509P05383n26553m75765O35767n50221j12063N63079
1921E65823O20668j9908p68907K38254q66062q34273N99812M33134j68701M72032
$$ plain form
1991 112705 196697 556979 338614 20662 407677 64172 -10082 -175832 -608759 -48936
1981 -48936 -5003 -381112 17990 -516550 -388984 24149 548661 -117187 -418535 430077
1971 430077 129237 -77366 257719 -252896 76439 439380 454655 974720 1416194 1494613
1961 1494613 1118182 639024 113248 1359077 1520491 209245 46267 -232134 -222868 132507
1951 132507 427251 176737 346843 638843 126705 950147 579549 -357735 574960 281135
1941 281135 21048 265974 84683 599129 -243727 -169004 136669 430018 1209892 1059769
1931 1059769 579720 672705 326196 1031579 505026 29261 665028 114807 2744 565823
1921 565823 1186491 1166583 397676 635930 -230132 -1064405 -464593 -31459 -200160 271872
1911B71872k89910l899m8771m85836l6185P72879J267737l72671l09523K57185
1901A022878p3705k50907j07202p9113l22625l34787M59606J25412k01996O51703
1891H89264J34880m38221k0814K74276k92402m00613l0568j00292k30205L34713
1881A20018J049144m88413o88171m08214J54299O12867Q72707j92048o9252k6678
1871I36259n93596l88136N51531L64098m2060P668P6431K98964m03750o43702
$$ plain form
1911 271872 -18038 -21937 -70708 -556544 -592729 180150 1447887 1075216 765693 1022878
1901 1022878 949173 698266 591064 511951 189326 -145461 314145 439557 237561 889264
1891 889264 1024144 585923 565109 839385 546983 146370 115802 15510 -214695 120018
1881 120018 1169162 680749 -7422 -415636 -261337 351530 1224237 1032189 962937 936259
1871 936259 342663 -45473 506058 870156 828096 835764 912195 1211159 807409 163707
$$ [...]
##END NTUPLES=NMR SPECTRUM
##END=
