##TITLE=1H_DE-80H_X3
 200.13MHz, d2o
 8 sc
 
 19ns.26.2.2025
##JCAMPDX= 6.0         $$ Bruker NMR JCAMP-DX V2.0
##DATA TYPE= NMR SPECTRUM
##DATA CLASS= NTUPLES
##ORIGIN= UXNMR, Bruker Analytische Messtechnik GmbH
##OWNER= pz
$$ XWIN-NMR		Version 3.5
$$ Fri Jun  5 10:51:48 2026 Russian Standard Time (UT+4h)  Yarkov@DPX200
##.OBSERVE FREQUENCY= 200.1313
##.OBSERVE NUCLEUS= ^1H
##.ACQUISITION MODE= SIMULTANEOUS
##.ACQUISITION SCHEME= undefined
##.AVERAGES= 8
##.DIGITISER RES= 18
##SPECTROMETER/DATA SYSTEM= spect
##.PULSE SEQUENCE= zg30
##.SOLVENT NAME= DMSO
##.SHIFT REFERENCE= (INTERNAL, DMSO, 0, 15.4593)
##AUDIT TRAIL= $$ (NUMBER, WHEN, WHO, WHERE, WHAT)
$$ ##TITLE= Audit trail, XWIN-NMR		Version 3.5
$$ ##JCAMPDX= 5.01
$$ ##ORIGIN= Bruker BioSpin GmbH
$$ ##OWNER= Yarkov
$$ C:/Bruker/XWIN-NMR/data/yarkov2/nmr/H-C/1/pdata/1/auditp.txt
$$ ##AUDIT TRAIL=  $$ (NUMBER, WHEN, WHO, WHERE, WHAT)
(   1,<2026-06-05 10:51:02.14 +0400>,<Yarkov>,<DPX200>,
      <created by zg, POWCHK disabled, PULCHK disabled
       configuration hash MD5:
       00 E9 B6 7A A2 85 ED C7 34 08 36 98 17 FE 4E 26
       data hash MD5: 16K
       BF AF B7 F8 9B 27 AA 5E 82 19 A8 1F 3E C4 04 2F>)
(   2,<2026-06-05 10:51:11.20 +0400>,<Yarkov>,<DPX200>,
      <Start of raw data processing
       efp BC_mod = 2 LB = 0.25 FT_mod = 6 PKNL = 1 PHC0 = -6376.443 PHC1 = 8.221958 SI = 16K 
       data hash MD5: 16K
       4B 4A 35 2D 24 35 71 89 7B 9C 55 79 D0 31 BD 5F>)
$$ ##END=
$$ 
$$ hash MD5
$$ BB 32 35 EB D1 E9 C7 46 D3 62 54 50 0A 87 C2 AF
##$RELAX= 
##$RELAX= 
##$RELAX= 
##$RELAX= 
##$RELAX= 
##$RELAX= 
$$ Bruker specific parameters
$$ --------------------------
##$DU= <C:/Bruker/XWIN-NMR>
##$EXPNO= 1
##$NAME= <H-C>
##$PROCNO= 1
##$TYPE= <nmr>
##$USER= <yarkov2>
##$AMP= (0..31)
100 100 100 100 100 100 100 100 100 100 100 100 100 100 100 100 100 100 
100 100 100 100 100 100 100 100 100 100 100 100 100 100 
##$AQSEQ= 0
##$AQ_mod= 1
##$AUNM= <au_zg>
##$AUTOPOS= <>
##$BF1= 200.13
##$BF2= 200.13
##$BF3= 200.13
##$BF4= 200.13
##$BF5= 200.13
##$BF6= 200.13
##$BF7= 200.13
##$BF8= 200.13
##$BYTORDA= 1
##$CFDGTYP= 0
##$CFRGTYP= 5
##$CHEMSTR= <none>
##$CNST= (0..31)
1 1 145 1 1 1 1 1 1 1 1 1 1 1 1 1 1 1 1 1 1 1 1 1 1 1 1 1 1 1 1 1 
##$CPDPRG= <>
##$CPDPRG1= <>
##$CPDPRG2= <>
##$CPDPRG3= <>
##$CPDPRG4= <mlev>
##$CPDPRG5= <mlev>
##$CPDPRG6= <mlev>
##$CPDPRG7= <mlev>
##$CPDPRG8= <mlev>
##$CPDPRGB= <>
##$CPDPRGT= <>
##$D= (0..31)
0 0.7 0 0 0 0 0 0 0 0 0 0.03 0 0 0 0 0 0 0 0 0 0 0 0 0 0 0 0 0 0 0 0 
##$DATE= 1780642261
##$DBL= (0..7)
120 120 120 120 120 120 120 120 
##$DBP= (0..7)
150 150 150 150 150 150 150 150 
##$DBP07= 0
##$DBPNAM0= <>
##$DBPNAM1= <>
##$DBPNAM2= <>
##$DBPNAM3= <>
##$DBPNAM4= <>
##$DBPNAM5= <>
##$DBPNAM6= <>
##$DBPNAM7= <>
##$DBPOAL= (0..7)
0.5 0.5 0.5 0.5 0.5 0.5 0.5 0.5 
##$DBPOFFS= (0..7)
0 0 0 0 0 0 0 0 
##$DE= 6
##$DECBNUC= <off>
##$DECIM= 32
##$DECNUC= <off>
##$DECSTAT= 4
##$DIGMOD= 1
##$DIGTYP= 9
##$DL= (0..7)
0 120 120 120 120 120 120 120 
##$DP= (0..7)
$$ [...]
##$SUBNAM2= <"">
##$SUBNAM3= <"">
##$SUBNAM4= <"">
##$SUBNAM5= <"">
##$SUBNAM6= <"">
##$SUBNAM7= <"">
##$SUBNAM8= <"">
##$SUBNAM9= <"">
##$SW= 18.0517328524113
##$SWIBOX= (0..15)
0 0 2 0 0 0 0 0 0 0 0 0 0 0 0 0 
##$SW_h= 3612.71676300578
##$TD= 16384
##$TD0= 1
##$TE= 0
##$TE2= 300
##$TE3= 300
##$TEG= 300
##$TL= (0..7)
0 120 120 120 120 120 120 120 
##$TP= (0..7)
150 150 150 150 150 150 150 150 
##$TP07= 0
##$TPNAME0= <>
##$TPNAME1= <>
##$TPNAME2= <>
##$TPNAME3= <>
##$TPNAME4= <>
##$TPNAME5= <>
##$TPNAME6= <>
##$TPNAME7= <>
##$TPOAL= (0..7)
0.5 0.5 0.5 0.5 0.5 0.5 0.5 0.5 
##$TPOFFS= (0..7)
0 0 0 0 0 0 0 0 
##$TUNHIN= 0
##$TUNHOUT= 0
##$TUNXOUT= 0
##$USERA1= <user>
##$USERA2= <user>
##$USERA3= <user>
##$USERA4= <user>
##$USERA5= <user>
##$V9= 5
##$VALIST= <valist>
##$VCLIST= <CCCCCCCCCCCCCCC>
##$VD= 0
##$VDLIST= <DDDDDDDDDDDDDDD>
##$VPLIST= <PPPPPPPPPPPPPPP>
##$VTLIST= <TTTTTTTTTTTTTTT>
##$WBST= 1024
##$WBSW= 4
##$XGAIN= (0..3)
0 0 0 0 
##$XL= 0
##$YL= 0
##$YMAX_a= 285403
##$YMIN_a= -256290
##$ZGOPTNS= <>
##$ZL1= 120
##$ZL2= 120
##$ZL3= 120
##$ZL4= 120
##$ABSF1= 0
##$ABSF2= 0
##$ABSG= 0
##$ABSL= 0
##$ALPHA= 0
##$AQORDER= 0
##$ASSFAC= 0
##$ASSFACI= 0
##$ASSFACX= 0
##$ASSWID= 0
##$AUNMP= <proc_1d>
##$AZFE= 0.1
##$AZFW= 0.1
##$BCFW= 0
##$BC_mod= 2
##$BYTORDP= 0
##$COROFFS= 0
##$CY= -3
##$DATMOD= 1
##$DC= 0
##$DFILT= <>
##$DTYPP= 0
##$F1P= 0
##$F2P= 0
##$FCOR= 1
##$FTSIZE= 16384
##$FT_mod= 6
##$GAMMA= 0
##$GB= 0
##$INTBC= 1
##$INTSCL= 3.241238e-09
##$ISEN= 128
##$LB= 0.25
##$LEV0= 0
##$LPBIN= 0
##$MAXI= 10000
##$MC2= 0
##$MEAN= 0
##$ME_mod= 0
##$MI= 1.114404
##$NCOEF= 0
##$NC_proc= -6
##$NLEV= 6
##$NOISF1= 3.799351
##$NOISF2= 2.8
##$NSP= 0
##$NTH_PI= 0
##$NZP= 0
##$OFFSET= 15.45932
##$PC= 1
##$PHC0= -6376.443
##$PHC1= 8.221958
##$PH_mod= 1
##$PKNL= yes
##$PPARMOD= 0
##$PSCAL= 0
##$PSIGN= 0
##$REVERSE= no
##$SF= 200.130012485511
##$SI= 16384
##$SIGF1= 3
##$SIGF2= 2
##$SINO= 0.751879
##$SIOLD= 32768
##$SREGLST= <19F.Aceton>
##$SSB= 0
##$STSI= 16384
##$STSR= 0
##$SW_p= 3612.71676300578
##$SYMM= 0
##$S_DEV= 0
##$TDeff= 16384
##$TDoff= 0
##$TI= <>
##$TILT= no
##$TM1= 0
##$TM2= 0
##$TOPLEV= 0
##$USERP1= <user>
##$USERP2= <user>
##$USERP3= <user>
##$USERP4= <user>
##$USERP5= <user>
##$WDW= 1
##$XDIM= 16384
##$YMAX_p= 326491474
##$YMIN_p= -600658
$$ End of Bruker specific parameters
$$ ---------------------------------
##NTUPLES= NMR SPECTRUM
##VAR_NAME=  FREQUENCY,     SPECTRUM/REAL,   SPECTRUM/IMAG
##SYMBOL=    X,             R,               I
##VAR_TYPE=  INDEPENDENT,   DEPENDENT,       DEPENDENT
##VAR_FORM=  AFFN,          ASDF,            ASDF
##VAR_DIM=   16384,         16384,           16384
##UNITS=     HZ,            ARBITRARY UNITS, ARBITRARY UNITS
##FACTOR=    0.220516191357247, 1,           1
##FIRST=     3093.87391829827, 0,            0
##LAST=      -518.842844707508, 0,           0
##MIN=       -518.842844707508, -600658,     0
##MAX=       3093.87391829827, 326491474,    0
$$ Real data points
##PAGE= N=1
##DATA TABLE= (X++(R..R)), XYDATA
$$ [...]
10014 -140796 -4472 -54808 -1976 -210543 -195479 -52219 -142520 -233528 -152987 -205325 -127037
10003 -127037 -166669 -136393 -83823 -72944 -169830 -145047 -137231 -132433 -166374 -236252 -97861 -55458
9991 -55458 -212670 -241120 -237692 -206619 -166624 -161386 -217402 -161488 -202926 -149256 -140242 -208116
9979 -208116 -180445 -89054 -22535 -174562 -128788 -76099 -142920 -218644 -131408 -93200 -114880
9968 -114880 -197264 -195423 -109569 -140011 -199003 -162447 -174844 -189835 -196317 -171871 -137459 -185891
9956 -185891 -288616 -270845 -212939 -168892 -238440 -143987 -184786 -152202 -258144 -305876 -231773
9945 -231773 -161042 -148590 -117501 -157551 -250351 -311420 -263679 -93866 -45400 -48984 -63714 -185530
9933 -185530 -203947 -189962 -249905 -261215 -229416 -279393 -249402 -214037 -231467 -173481 -151528 -278222
9921 -278222 -266669 -214744 -223563 -192511 -38577 -100129 -177620 -188603 -108567 -100184 -127815 -211057
9909 -211057 -159718 -200976 -209121 -141097 -127368 -77502 -8844 -59308 -114294 -135948 -149817 -203054
9897 -203054 -221452 -146625 -170935 -70221 -190509 -172254 -184147 -291668 -300827 -231985 -259921
9886 -259921 -198470 -210753 -148503 -72203 -135735 -173683 -145708 -203720 -205613 -235901 -197522 -97633
9874 -97633 -81780 -168329 -135517 -106059 -17493 -3812 -67920 -159369 -70524 -37423 -79508 -54425
9862 -54425 -75877 -45897 -47804 -159802 -6389 21007 -97834 -215361 -306008 -176045 -168962
9851 -168962 -40169 17480 50553 959 -116480 -95959 -6325 131630 120214 112047 131254
9840 131254 185403 265187 238134 304506 309638 305017 251107 245296 286625 226412 205560 238501
9828 238501 188550 290273 339251 171345 171454 242699 232961 218300 40821 43409 77627 38339
9816 38339 170357 115664 65955 -12766 41369 75010 109155 96046 33494 -9964 56818 84525
9804 84525 185261 277094 213808 295377 301533 293237 323139 238489 315467 449615 384359 322129
9792 322129 315541 400564 346288 227314 266039 248559 266812 182210 152212 164162 -20238
9781 -20238 -62587 20115 72315 90115 127469 -5633 -15046 27623 -21895 -13317 -6216 140945
9769 140945 100082 5953 -34165 -99943 -33623 -34231 74546 43318 -129528 -51678 12859 -46218
9757 -46218 -71741 -68752 -89653 -109193 -145575 -121710 -83633 -48437 -18510 -113888 5089 46249
9745 46249 39686 -29526 -141274 -67757 -78743 -103982 -92144 -83485 -125758 -108135 -164502 -146451
9733 -146451 -122935 -192505 -114030 -143076 -199323 -134266 -100610 -174503 -169952 -176722 -93894 -74822
9721 -74822 -113266 -82611 1980 -3867 62691 -38453 -40812 -56273 -127555 -90834 -30226 9795
9709 9795 36799 -22809 -74109 -138592 -27952 -55660 -5736 32737 -99232 -74931 -70324 -85375
9697 -85375 -6277 -23778 6083 114981 48806 96093 79910 117405 67048 10440 14460 42118
9685 42118 22830 136030 168423 163624 309697 372192 479904 497793 508826 607965 445495
9674 445495 428439 247760 175933 252155 329025 349666 149976 84721 106892 136064 41741
9663 41741 29729 -12833 70306 120652 124957 184334 12863 30868 83840 72395 111124 163
9651 163 12154 97117 93454 210233 281278 371202 388745 400907 426812 489903 512663 543282
9639 543282 487906 510134 373188 353479 253523 268854 262104 263475 229810 177580 121262 115054
9627 115054 78379 -29294 -38814 -26122 -28797 -5524 -34632 -63370 -38250 47520 94314 21480
9615 21480 -27867 90278 137641 138297 142556 109305 145947 89818 120469 166438 97667 74587
9603 74587 77021 -21210 130996 111560 89244 -62557 -16848 93289 -46839 -139427 8199
9592 8199 30331 -9036 17810 86159 74002 33087 62907 95562 -37124 -68852 -99926 10289
9580 10289 106727 24333 110449 88422 62335 91013 -26917 -7752 51427 18044 -68061 -27245
9568 -27245 -44518 -25055 -130243 -91900 -134913 -175604 -166885 -125593 -29452 35791 -45293 -9449
9556 -9449 25584 -21938 -22770 -49425 -11446 -44017 -32363 27617 29502 -32214 -36899 16200 62875
9543 62875 61453 80949 37323 -5492 44165 50382 57754 41058 -42214 -78627 3182 44739
9531 44739 -67580 -68984 -55727 48051 -5069 51056 28385 -5813 83510 131929 92957 183055
9519 183055 168438 280887 341950 328757 417160 439360 591145 642371 656314 633437 564513
9508 564513 695313 777409 718803 726985 663516 628102 660688 525003 589457 444885 282943
9497 282943 223239 201507 169731 284936 309530 200018 143073 235281 271227 228938 186456
9486 186456 146912 207580 138683 81744 213975 194530 104013 97555 103560 83734 157270 140735
9474 140735 159843 146388 23984 193801 79808 34285 -18584 -52748 52526 158846 119972
9463 119972 99633 122393 112371 108620 68831 135974 175846 156307 120073 54263 84764 53518
9451 53518 -35525 2550 70374 70123 97934 185016 199985 205298 289220 168224 48531 60007
9439 60007 48303 88830 122198 38337 70176 196170 98421 33866 22782 68535 84470 87252
9427 87252 211382 145084 201682 219619 119618 168922 177496 128235 176418 171390 110807 81359
9415 81359 77595 204112 239376 150563 207601 156482 116144 80131 31938 -65506 41922 53598
9403 53598 65307 203265 280580 254577 203257 258430 291961 324309 317627 258706 109857 26131
9391 26131 29178 19917 -36547 4641 -31057 -76802 124106 111150 -36434 22840 44810 37173
9379 37173 -25077 30384 67633 141604 206412 102206 35992 31655 100128 188231 156537 223484
9367 223484 334388 315558 271942 244589 265885 256749 163937 135721 219971 211553 239211 320564
9355 320564 273902 243859 171110 287052 347879 361622 443227 297347 213066 184896 202650
9344 202650 335204 319278 333979 318974 250351 296511 299612 211703 187606 221428 213692 258827
9332 258827 150723 246578 305638 249789 190758 174888 231121 248802 331198 346475 336743 189810
9320 189810 117871 132033 95832 137449 144579 140411 82820 155593 93895 -34306 92918 79394
9308 79394 181225 290874 232244 137658 62310 173767 262305 171012 182693 106404 117567
9297 117567 223907 275972 212460 223294 176043 283619 376055 348513 420949 404955 469715
9286 469715 434172 441351 552180 641752 622595 630392 587014 592015 538696 597200 605063 531100
9274 531100 563255 551891 490025 357060 340864 346600 430445 280870 270524 352371 368095
9263 368095 481167 538787 440534 491632 453780 473675 564566 561171 579653 656012 690762 666666
9251 666666 651701 561203 569983 709831 756370 737680 798834 717882 775267 662328 609788
9240 609788 763725 794515 771298 778419 759784 834703 876430 865143 970924 984037 1051456
9229 1051456 1145148 1061822 1055730 1022134 961237 912931 891214 914823 888840 824666 840150 860092
9217 860092 942975 886595 819706 922323 898993 814174 785627 740186 712701 729950 669452
9206 669452 768555 788938 745455 750628 672975 804343 914147 870603 807152 948181 1081014
9195 1081014 1047240 998021 1036198 1068622 1039358 906902 771918 783481 822191 809476 781241
9184 781241 763222 690753 794466 852936 752929 734509 693078 744571 732404 782560 762481
9173 762481 819214 897482 769358 706163 633564 574463 602320 607837 584378 628485 648297 687314
9161 687314 606724 666695 751026 802606 726337 636793 606643 705024 743795 676993 648212 680005
9149 680005 728641 661039 635879 619442 640317 689074 684521 539983 531715 597967 594463 550687
9137 550687 572596 640598 621246 575939 530346 567744 459152 472507 654543 668069 574644
9126 574644 552438 682585 725892 874540 938858 999113 1001894 1064267 1113113 1009442 1059850
9115 1059850 1189098 1258157 1245026 1195316 1141578 1172549 1120520 1092453 1055763 1120140 1205893
9104 1205893 1196065 1259589 1251906 1281248 1359505 1409844 1499171 1491086 1495291 1608685 1802769 1953076
9092 1953076 2072606 2073752 2212829 2323979 2249279 2183180 2177015 2029504 1760316 1705539 1681907
9081 1681907 1528436 1411603 1408523 1468031 1453163 1375866 1382916 1401166 1321916 1262522 1371659
9070 1371659 1385592 1448786 1506408 1532648 1585291 1644654 1698429 1818171 1945779 2055789 2180655
9059 2180655 2250473 2341376 2411503 2345755 2281818 2203901 2107756 2153475 2059151 2126816 2019426
9048 2019426 1936533 2040918 2148192 2111871 2074184 2045751 1929503 1992467 2013664 1953477 1993208
9037 1993208 1993501 1966689 1943261 1949355 1858496 1921782 2073129 2171081 2298481 2493203 2761511
9026 2761511 2953840 2966897 3064736 3077927 2962584 3021222 3001714 3112598 2986434 2804400
9016 2804400 2726923 2767638 2633342 2607327 2585104 2710266 2762650 2781330 2852928 2976582 3102151
9005 3102151 3177669 3392688 3377508 3487773 3507162 3415629 3400708 3419789 3374214 3317716 3336551
8994 3336551 3488203 3534328 3398990 3325981 3458290 3594799 3748424 3822952 3937731 4021184
8984 4021184 4028958 4133300 4187796 4307151 4325273 4307281 4193980 4061182 4095801 4063647 3889321
8973 3889321 3881452 3921520 3904388 3897390 3871825 3828660 3942867 4064066 4093001 4153735 4185640
8962 4185640 4304042 4463330 4498321 4733245 4941475 5142818 5398124 5652093 6001174 6346764
8952 6346764 6718937 7198224 7844746 8529740 9260052 10330771 11570278 13216391 15286768
8943 15286768 17843419 20984041 24725605 28998044 33612646 38381923 43441313 48473219
8935 48473219 52910019 57083520 61180921 64610055 67060483 69379231 72638704 76523379
8927 76523379 80576679 85608928 89055798 86602106 81246507 75070353 66245983 56631288
8919 56631288 47878343 40855013 34990522 29857625 25844184 22727972 20454418 18719243
8911 18719243 17313503 16237712 15244838 14562803 13917350 13357838 12836664 12338751 11943358
8902 11943358 11640399 11272330 11053690 10688756 10544257 10367793 10135858 10123765 10135566 10259520
8892 10259520 10192780 10061469 10231633 10407725 10605885 10934574 11544183 12455268 13749695
8883 13749695 15788166 18925120 22980110 27659791 32913264 37661500 41335728 43801625
8875 43801625 44338943 42945619 40040880 36274658 32096442 27791406 23980069 20674890
8867 20674890 18172353 16118630 14489588 13282653 12387123 11733298 11206539 10754940 10387100
8858 10387100 10181130 10028062 10107859 10194980 10378324 10511763 10689101 11220862 11803505 12626527
8848 12626527 13656329 15338324 17759715 21362304 26511055 33120785 40706887 48488458
8840 48488458 55222525 60026960 62271716 61617907 58253738 53011708 46563474 39856258
8832 39856258 33469848 27762558 23158488 19484888 16690597 14585195 13042511 11865349
8824 11865349 11072809 10460277 9858655 9308068 8940987 8663310 8514969 8299340 7996130
8815 7996130 7846056 7664898 7469247 7370490 7207618 6960857 6938269 6940185 6925116 6908502 6997715
8804 6997715 7197343 7214617 7297545 7420464 7287658 7039122 6716048 6234681 5844505 5525086
8794 5525086 5240394 4962057 4701384 4523430 4419643 4356800 4281389 4218904 4166758 4165750 4158902
8783 4158902 4162943 4170271 4282411 4301125 4242507 4243396 4295719 4318045 4382337 4331799 4301464 4268622
8771 4268622 4212869 4162666 4095704 3988869 3912894 3984635 3833544 3741283 3681030 3633127 3460056
8760 3460056 3480867 3443309 3456669 3453827 3401199 3329241 3446019 3279674 3281288 3214142 3131987
8749 3131987 3168423 3065894 3069485 3178625 3353662 3286124 3213772 3332340 3410277 3354954 3387735
8738 3387735 3442496 3514781 3515903 3542381 3508492 3501723 3423130 3473522 3354173 3304136 3265241 3255807
8726 3255807 3365187 3413381 3387524 3450897 3574225 3683875 3816233 3914824 4079680 4241936
8716 4241936 4344852 4625457 4832538 5145533 5408610 5755282 6032320 6525825 7135784 7699090
8706 7699090 8552050 9634483 10998661 12878391 15575551 18773689 22604092 26725771
8698 26725771 30577944 33854486 36452999 38193176 39242610 39949881 40505847 40727279 40550902
8689 40550902 39738449 38242946 35830803 32730777 29239339 25580274 21965918 18895684
8681 18895684 16382982 14181086 12490551 11141952 10058960 9288642 8837996 8500021 8244479
8672 8244479 8147598 8033099 8004639 8311388 8718096 9293589 10179696 11506584 13241009 15455204
8662 15455204 18053714 20668658 22928312 24861712 26366226 27229999 27873595 28215412 28527261
8653 28527261 28832950 28597048 28006431 26752405 24866703 22831293 20504201 18011716 15849517
8644 15849517 13868524 12030050 10567528 9410484 8535910 7825395 7180869 6664720 6142456
8635 6142456 5764496 5447039 5038735 4692013 4491233 4245995 3988568 3811767 3607671 3435630
8625 3435630 3361728 3236240 3050612 2998773 3021262 2938956 2869777 2804697 2774364 2803714 2758607
8614 2758607 2733967 2865662 2953004 2949650 3015897 3032763 3023204 3018775 2894525 2858590 2803022 2728003
8602 2728003 2720234 2621371 2448548 2375037 2348453 2170387 2070355 2011203 1964958 1959268 1899334
8591 1899334 1796408 1804247 1730727 1712356 1668771 1715541 1617825 1560087 1579802 1655658 1586919
8580 1586919 1586604 1315864 1383650 1523515 1441027 1556540 1497546 1486067 1390639 1307565 1324975
8569 1324975 1298403 1194627 1202095 1113838 1110299 1214787 1130460 1046374 869883 843447 937831
8558 937831 913628 976763 963348 1014444 1026860 1072901 1112171 1157546 1150950 1137841 1057671 919987
8546 919987 904359 855318 936002 908656 945701 832550 637490 718234 679495 737610 804651
8535 804651 779271 736535 776416 611162 606432 493056 491134 603419 596975 479365 537161
8524 537161 543553 498589 538607 526275 484403 474066 602873 641643 665173 701404 704047 742496
8512 742496 780329 723421 763787 717745 658304 612365 559261 473734 456573 463154 531192 541591
8500 541591 452419 444549 477530 481844 395966 380376 466715 448609 423274 533301 522178 401966
8488 401966 329202 397794 338267 397954 467889 552571 457657 464361 589745 546557 471191 464989
8476 464989 616928 590569 609958 544970 496809 491796 456720 416385 389268 277708 422124
8465 422124 406642 301164 321537 279671 286872 340583 321740 285684 351394 354743 438631 422435
8453 422435 326302 325714 382752 372571 390124 488477 438183 492416 615653 595998 559580 547684
8441 547684 515571 386530 301529 349828 368385 317036 324391 342611 304959 293390 276209 366913
8429 366913 374004 240710 261234 268012 255035 410838 421932 315644 365512 277429 238630
8418 238630 221006 223796 246130 328668 281833 307414 426824 419908 376229 375223 495189 497875
8406 497875 425497 345601 477278 366917 392129 339645 302822 335046 347291 407013 350636
8395 350636 277100 297841 339897 245038 228695 293629 257957 153747 209104 179667 113572
8384 113572 199678 258607 255414 191723 258027 342891 274027 329865 385065 331597 377791 306622
8372 306622 198171 207120 302026 346871 311449 385762 300073 263810 383537 482796 512143
8361 512143 407761 441731 508362 387883 413012 452779 416448 509950 490108 307703 350967
8350 350967 406912 372860 406703 354303 373001 383770 424992 528866 581472 529420 468942
8339 468942 441056 465098 517297 460709 542143 581528 548131 566475 554517 429798 426953 610075
8327 610075 694574 620471 573480 568606 727521 663016 604540 631761 542297 478115 559743 573697
8315 573697 642581 644426 513018 586591 563911 522823 475438 587730 532633 444928 575976
8304 575976 545911 609232 495717 381953 395428 540561 595500 531383 508638 474312 568495
8293 568495 449337 307484 355287 396839 450620 415034 354576 319953 332677 410635 373579
8282 373579 374654 311594 461155 471289 412493 532982 564797 627636 561377 491169 546478
8271 546478 653201 612922 578734 531642 505700 552535 403117 359940 332198 368729 445347
8260 445347 413805 367346 306060 292928 368879 286871 196786 176416 156791 190756 217035 291823
8248 291823 307245 300804 215372 117235 130897 229521 147980 82025 99257 130772 117599 129309
8236 129309 171771 130707 193922 160929 103487 108351 143129 195734 160490 190351 137294 117219
8224 117219 167401 150966 134635 135862 201418 221038 173246 197779 157964 199797 225782 107340
8212 107340 46197 55131 47670 68304 98769 103279 58683 30346 145730 138957 186447 156116
8200 156116 70853 57610 120556 67968 65905 -51735 -91054 -227855 454033 901645 457660
8189 457660 474257 326323 378899 395236 348941 397242 367642 346062 470541 470586 486464 594616
8177 594616 512456 519911 571357 794451 902161 809201 869572 916057 754553 653049 603648
8166 603648 605344 540916 445378 573597 576387 578704 501094 402998 437715 420128 315113 245731
8154 245731 245873 223791 367641 310404 323339 309081 301142 278526 219611 228963 240241 302299
8142 302299 224873 203980 293894 319125 306311 361746 339414 383420 483184 426142 332736 356852
8130 356852 285433 281652 244652 198417 169664 185407 92743 93928 92511 131613 55603 -42892
8118 -42892 41513 80199 116837 -1055 1763 17334 -82528 56573 53874 82404 165917 64076
8106 64076 65349 125099 79105 89676 26593 -60116 -4075 -14381 -11330 -49320 -44722 21056
8094 21056 69616 45742 -10594 41028 38801 110617 80177 -103427 8375 27902 35745 -22363
8082 -22363 12542 28544 -4934 -10803 -15339 -54670 -114962 -145780 -103555 -47771 -50364 -19648
8070 -19648 -52892 -127128 -114216 -90941 -55581 -36950 30402 27795 3752 -46 -7445 77120
8058 77120 -76336 -96782 -108767 -126214 11394 67356 -46866 4899 -24461 -40745 -90881
8047 -90881 -65771 -98015 -30197 -20716 -50578 -120673 -99806 37588 -29287 -51107 28433 101922
8035 101922 103783 177624 18979 -37476 12400 -31831 -45142 50237 69187 4069 -49003 -19517
8023 -19517 25967 -79809 -95938 -25248 8909 -38608 36666 82108 27431 -18070 -113806 -29975
8011 -29975 -22879 16400 22892 -53270 -33838 -5314 14710 -8259 20041 160989 179568 126250
7999 126250 139526 112542 121619 131778 163999 182434 72593 34987 17090 -21195 -12798 -8810
7987 -8810 -100800 -78401 -52033 -97636 -45869 -47831 18221 116054 152042 175084 147059 130368
7975 130368 41798 75842 32379 11645 74421 47634 -40107 48483 -78015 -93886 76824
7964 76824 73908 72991 10674 15859 -29309 -2769 32835 46235 46649 8556 -20676 -53414 -24444
7951 -24444 -116418 -112923 -140462 -140681 -85977 -61873 -21857 -35353 -123270 -95970 -41538 67259
7939 67259 46135 -29704 11628 -43288 -80999 22622 24853 44866 82532 58612 102379 104307
7927 104307 -63057 -100800 1810 2342 -20982 -156840 -152466 -159153 -121159 -60552 -24875 -43696
7915 -43696 -84944 -120393 -98370 -54139 -41449 -42845 4173 -20906 -51566 -13183 49570 24394
7903 24394 27966 -66521 -6480 55600 16560 -43005 -18950 -6438 -94166 -13506 18414 1236
7891 1236 37282 30103 13882 3943 10648 -42151 53496 52124 68729 50420 -81143 -186465
7879 -186465 -193401 -150959 -16488 -32954 -8281 33367 -71418 55670 224437 191298 95893
7868 95893 108275 127667 205107 190477 164529 134563 -13382 -76659 -31538 39416 59806 33442
7856 33442 -22264 -24905 14369 86446 171520 48257 -121003 -137564 -128701 -125094 -60093 63021
7844 63021 91726 37096 -5559 37027 37544 -60181 -18705 -83046 48184 53694 -54590 -27243
7832 -27243 33782 55824 68453 -8966 -34145 -59916 -74868 1754 29632 89447 69289 25363
7820 25363 6208 38042 -61139 -46267 46176 -1192 53479 -17836 3386 78576 129598 139138
7808 139138 138785 40921 64906 134952 23476 5469 41168 202144 90752 142355 137728 8155
7796 8155 -25021 -26948 59331 -3595 11595 111049 94960 136367 128854 50999 84054 83018 52365
7783 52365 -24154 -94324 -71796 13032 11005 9828 -21261 -39769 -33755 59068 43750 -42619
7771 -42619 -41379 61401 -4166 59843 31283 -1206 81392 -52469 -10057 160601 117783
7760 117783 157538 148024 51709 61152 76665 75244 -9167 -48560 103353 71682 79269 20043
7748 20043 -44017 60460 94114 38210 12348 29997 111660 84341 -5346 12795 6004 59020
7736 59020 89810 63014 79141 161191 144016 67248 74845 78255 25057 67621 -22894 -501
7724 -501 -8328 63424 101128 83250 82258 165071 58560 52195 105693 19051 -80349 -27245 15141
7711 15141 -8992 -40084 13872 38818 -52978 -88187 -85945 -35384 -23542 22311 -82870 -83405
7699 -83405 -9903 35053 20378 -31077 -2754 45552 77064 -20704 -15857 54007 19035 -10012
7687 -10012 -9981 40338 87766 9608 38427 -24080 -19521 67820 110568 67557 15255 -72414 -147911
7674 -147911 -126843 -114239 -31485 47647 52656 102167 48199 -23562 -49384 -39845 -156714 -157448
7662 -157448 -11344 -8619 50883 94109 11144 -66667 -68195 54705 22229 -56726 -43093 -33009
7650 -33009 1364 -1090 -8311 -67028 -36262 -69022 -66585 -87737 -86615 -67443 -150790 -163287 -130742
7637 -130742 -42046 -94314 -149416 -92703 -75418 -40787 -60693 -43790 -162970 -67528 5784
7626 5784 -38436 -97321 -92630 -100478 -49347 -109283 -118527 -123516 -8388 26370 -6600 -18540 -18830
7613 -18830 -67554 69311 101762 2184 -41173 -29871 46494 62032 43027 -59681 -127762
7602 -127762 -199721 -106792 -68192 -8984 -3483 11273 51690 74630 21192 8825 -34063 -53448
7590 -53448 -39882 22519 146071 88644 106896 41078 -47797 -49277 -29652 -93650 -1111 54518
7578 54518 38693 100355 -42871 -88444 90779 115242 13591 30108 92763 89782 130626
7567 130626 129159 59663 155965 130851 140326 120031 85299 78866 133867 -16226 34849 30891
7555 30891 93227 92319 104545 91298 104944 95297 103253 189417 155131 188986 156514 79027 25279
7542 25279 -10881 3658 17922 5828 64102 83943 3753 -31206 -24192 -35904 -4067 64251
7530 64251 -21801 -66070 -34312 35423 113823 -120498 -65222 22806 105204 36273 21728 2453
7518 2453 27330 105088 94712 5414 -10529 76661 64485 -14746 15332 73496 44208 119504
7506 119504 75531 101383 64823 -29015 8135 -67412 53162 29483 -86431 -37691 -1305
7495 -1305 -44201 52428 5378 -112976 2581 30140 -24597 -10579 35990 -27123 -60901 -7321
7483 -7321 -59817 -12778 11171 77427 58619 -76519 -41129 50276 30419 -74282 -39211 -60802
7471 -60802 -10579 -110320 -44349 -86099 -40355 78785 22243 10501 78474 46427 -68388
7460 -68388 -47382 -47822 -103766 -34894 -166379 -151294 -100379 -192301 -113729 -19344 -5196 44259
7448 44259 27303 23304 63519 24372 80100 69326 13073 -47163 -24904 -33937 3421 774
7436 774 -101480 -83822 -56443 -176034 30786 87324 -5225 19077 7676 50135 19001 -25236
7424 -25236 29935 -11776 -86907 21590 99320 81105 -101491 -28675 28021 -44552 27052
7413 27052 79150 61111 115523 -24408 5240 48222 108392 96825 -9062 89026 54480
7402 54480 73811 68570 88711 171373 199585 138243 24834 -64735 -18299 210 91848 73331
7390 73331 106566 53467 -78667 -119626 53111 2596 -82468 -36323 -5032 46961 73918
7379 73918 111116 112853 62097 -2983 1167 -9891 12002 78183 64757 5695 -5331 109778
7367 109778 93667 194446 162366 125317 87867 112801 -488 -104303 -27316 -95171 -46595
7356 -46595 1649 36112 -9192 -29011 8816 -3728 61820 129476 147228 126893 45929 1852
7344 1852 -46944 -110191 -81648 -33136 -89495 95784 29797 56147 36310 83962 74906 100384
7332 100384 97833 42044 -49343 65194 153528 147139 55640 -13117 30514 123892 -23844 -91536
7320 -91536 18695 8673 41102 -38151 8013 61130 -33596 40183 19637 -35503 1362 2050
7308 2050 11736 -100847 -91162 -106364 -41942 -105916 -113303 -90412 -88318 -125327 -80460 -75862 -73737
7295 -73737 -63692 -44489 -31402 -80824 -116488 -88923 -39855 -89286 -75668 -80698 -91039 -95285
7283 -95285 -136907 -145697 -156513 -110672 -65280 -6828 -31532 -59498 -7248 -29644 -9050 -33091
7271 -33091 -33917 -43372 -61577 -100767 -143464 -103684 -90630 -106449 -97999 -5708 4234 133950 137223
7258 137223 125744 73434 31102 102744 43958 -17035 -34899 -54938 -31364 6928 33158 140128
7246 140128 44463 8157 55286 81721 123982 63630 28900 -21589 105584 116423 -15913
7235 -15913 -95141 -89214 -88449 -101093 46283 -1871 -26001 -70047 -15609 57647 13900 68807
7223 68807 -57452 -78477 -94379 -558 -37288 -89416 21366 -28464 -27302 -9790 -26441 -15267
7211 -15267 -72523 -39787 2191 21642 22182 -29726 -46631 37508 87193 8529 -2589 8734
7199 8734 44203 59745 117000 160716 40677 43742 88559 27551 45097 -45622 -33873 1559
7187 1559 -98403 -62597 -7339 42082 23347 31047 19631 -96793 -114411 -65177 -47400 -34343
7175 -34343 109124 132771 160554 96164 -24803 -109262 -150764 -138748 -142599 -120501 -99106 -137917
7163 -137917 -23968 -57868 -35308 -39397 -142737 -111260 -55722 -96303 -162107 -202663 -246424
7152 -246424 -179992 -75883 -155203 -150972 -128806 -147185 -85020 -26480 -29971 -11734 -39164 -140741
7140 -140741 -121723 -72710 -110557 17808 17979 -23158 54286 65843 71296 36376 25354 -34523
7128 -34523 -51496 -74232 27534 46535 -129633 -165661 -84096 -37149 -112229 -54871 -12514
7117 -12514 -121866 -134224 -38417 1310 -74080 -103573 -10264 -53548 -78804 -18171 -188204
7106 -188204 -141121 -63927 -80217 -5293 79287 -32625 46801 43777 92681 89900 -12794 42247
7094 42247 265256 206741 106729 113658 12375 2803 81522 101697 189285 184882 100960 84269
7082 84269 138563 181952 175223 244635 316149 292337 317900 234197 133749 135858 186112 220483
7070 220483 133200 112797 92839 119014 98171 98546 3807 127784 94295 90415 78958 152092
7058 152092 171955 33307 18243 -20229 -41220 -50513 -18488 10104 -40013 -20947 90354
7047 90354 61183 93083 35063 64877 80383 10391 -40450 -12691 -119264 -96586 -17097 -21985
7035 -21985 11368 -94379 -69055 -48427 8807 3027 12854 9709 -79777 -116324 -62272 -117234
7023 -117234 -123990 -56721 -156294 -77586 -27244 -10468 -37761 -55496 -46440 -21164 -7999 -26292
7011 -26292 -66907 -191523 -169700 -94435 -1190 11015 -45470 -42809 -76497 -54082 114485 -19187
6999 -19187 -80106 1221 -12223 -24828 -97845 -138928 -87975 19481 72264 -30932 -51204
6988 -51204 -33229 -36751 -67020 -25553 -61709 -24983 -82432 -129569 -113075 -92061 -57507 -175289
6976 -175289 -116532 -102499 -27122 -87201 -132914 -228187 -204624 -72218 -68910 -98220 -40908 -51331
6964 -51331 -71805 -88385 -122289 -46889 -160641 -155880 -188322 -129964 -120281 -103596 -99653 -89414
6952 -89414 -47732 -73512 -144657 -213790 -75108 -44562 -76261 -40398 13979 -19298 -66007 -12155
6940 -12155 -138709 -131260 -98293 -54047 -27104 -61115 414 46303 -23304 -85777 -57944 -72519
6928 -72519 -103101 -182524 -50019 6267 -73379 -91613 -104144 -113840 -76459 7911 97278 -5315
6916 -5315 -9719 -34111 -82181 -70827 -68305 -67441 -115022 -100886 -101508 -133798 -37932 -31016 -116079
6903 -116079 -72960 14758 23787 146058 74551 -19247 -6881 -19265 21558 -65050 -133792 -85747
6891 -85747 -652 -25054 -35341 -43152 -67764 -107060 -145595 -152462 -198613 -185988 -97115 -115764
6879 -115764 -124156 -55774 -5256 -82597 -227986 -161507 -114033 -147291 -34362 -54634 -66254
6868 -66254 -51741 -5163 -32983 -168310 -78780 -20472 -117702 -74456 -78949 -54427 -79762 -18292
6856 -18292 2268 17245 59503 -26242 -27338 -65180 -95200 -32751 14089 -137860 -121407 -110620
6844 -110620 -50577 -58276 -84015 -10775 -12921 -107855 -112933 -70653 -139040 -128972 -129371 -185466 -106935
6831 -106935 -72025 -47275 31535 106963 -29717 -98821 -32390 -46682 -91524 -129235 -122351 -37366
6819 -37366 -48312 -6574 40948 -102037 -129071 -131902 -69400 -56328 -81302 -130357 -13276 20347
6807 20347 46835 69748 -16462 -37520 -159127 -60500 -6028 115397 6100 -81183 -34374
6796 -34374 21224 56665 -150236 -96413 -52510 -66899 -3547 -90325 -86723 14494 -49716 -50886
6784 -50886 -64762 15313 33341 -46217 27738 84964 7965 72237 37483 101908 110438 151760
6772 151760 152527 64443 96549 215234 276996 139098 174671 170686 84829 168170 125456 120134
6760 120134 173943 201994 69899 -13408 53816 71941 104440 106674 136528 147685 125203 62288
6748 62288 -27055 -45666 -75888 -105634 -25353 49804 42092 48150 37897 5804 142389 69738
6736 69738 -4398 -12221 5740 61051 -72928 -70389 -139290 -157582 -119929 -98190 -80647 -126626
6724 -126626 -206211 -140730 -113540 -94832 -54934 -122011 -51055 -24704 -64260 47173 -29280
6713 -29280 -151327 -56465 -11000 -70406 -121406 -24638 -18198 -89161 -181753 -138779 -119776 -92317
6701 -92317 -32374 -112882 -154341 -111882 -64966 -147582 -183379 -88146 -90447 4677 -59434 -87596
6689 -87596 -115302 -159133 21817 77257 104910 149269 108118 121115 128445 105098 130302 203706
6677 203706 253657 251698 210540 224276 124325 73323 30870 74796 1218 -23413 29304 89132
6665 89132 -117975 -165024 -44332 45121 52566 -8686 71385 1821 -22827 -31566 -8135 -71973
6653 -71973 34693 -44461 -171125 -110825 -106885 -123127 -190763 -194015 -120258 -84997 -84330 -102138
6641 -102138 -45510 -9995 -115729 -201701 -183533 -83942 -18489 -18376 -11419 81273 155184 70305
6629 70305 32507 24332 37233 6313 12146 50726 28477 73038 76081 48488 121284 122542 -34499
6616 -34499 -5749 -54637 -48820 26321 -18683 -26351 -60048 47774 39027 -102134 -137392 -88396
6604 -88396 -64904 -9947 65205 9814 -54525 -13411 1221 -12887 104766 67329 11483 31856
6592 31856 28774 75001 62197 -45097 123411 173682 4526 -5408 16777 106649 39651 54107
6580 54107 69862 79834 -43641 48820 164694 142869 93572 141239 140710 86456 101634 102772
6568 102772 106407 185254 179629 214946 205666 232789 249224 296324 368411 277980 330420 413651
6556 413651 392253 311202 363936 340193 352434 340750 285680 348128 394065 471738 494383 480198
6544 480198 508114 564533 482123 416001 360277 325395 370589 398292 384816 262830 274711
6533 274711 181526 39516 122799 209535 217655 242727 246909 291575 239472 188130 150201 205162
6521 205162 73649 -13009 119049 188266 260860 272268 301199 205237 258403 248208 240757
6510 240757 319286 331061 391339 381090 326085 313114 318236 212112 189410 140329 248083
6499 248083 210297 293621 338272 325220 377941 403496 439716 503573 647303 780961 827666
6488 827666 879832 817144 643956 578535 583455 579889 562379 608645 556174 602003 495343 555726
6476 555726 608555 723518 802163 743673 754355 722194 584481 574148 607288 579673 561835
6465 561835 398596 379862 429035 501819 408184 346132 301054 323769 332762 400924 396311 369912
6453 369912 424087 366174 347449 369729 330931 343764 252208 281691 316593 230398 183641 99244
6441 99244 188235 409440 371443 403485 417973 410761 383981 344597 371061 391282 382046 357255
6429 357255 318200 295505 239770 337105 453965 385310 321205 265809 152113 119491 267598
6418 267598 235352 263972 185046 248787 281508 305530 367791 534616 532069 532441 569439 427796
6406 427796 469986 499188 519229 425367 297314 305359 365406 418285 278108 299553 244691
6395 244691 210486 195560 316331 276637 356301 320949 323625 381752 212167 188294 219511
6384 219511 226913 314960 392859 323329 280698 318324 277431 177571 246512 244843 194376 223999
6372 223999 238880 261576 483074 558281 489411 435425 415275 377880 354930 426090 461173
6361 461173 488272 488090 474837 529996 579205 769259 846368 906223 922854 895834 942490 875103
6349 875103 810588 729415 706029 769124 691883 661832 643651 670852 691425 726179 799988 829903
6337 829903 891340 966853 985553 961432 1045805 1111344 1067662 1184124 1151765 1087711 1054018
6326 1054018 998461 920579 879481 846244 761223 863935 861769 876812 905230 863787 888175
6315 888175 841044 782788 796283 840522 838195 785182 848965 844360 942801 1036725 976326 960511
6303 960511 952479 1036201 1052818 1067637 1107402 1136745 1153335 1134677 1107897 1244910 1283668 1286682
6291 1286682 1340652 1283453 1346055 1492563 1571228 1685437 1700455 1824525 2049108 2273080
6281 2273080 2539148 2787630 2992089 3327351 3799233 4279085 5166069 6528092 8225885
6272 8225885 10236474 12169221 13778984 14722505 15023222 14563628 13413201 12076245 10885250
6263 10885250 9802092 8908521 8253137 7961268 8116323 8681644 9951713 11620867 13509089
6254 13509089 15174763 16233111 16445069 15819137 14601910 13002885 11323171 9802437
6246 9802437 8340069 7160221 6194807 5322464 4727751 4323430 4008879 3731823 3407544
6237 3407544 3314870 3225151 3226576 3212549 3121548 3079463 3034400 3115864 3188753 3139987 3099999 3028493
6225 3028493 3037133 3051653 3105060 3108413 3063988 3300526 3364849 3443800 3630036 3747714 3936771
6214 3936771 4219091 4466839 4808350 5252116 5858536 6492005 7240322 8353339 9611911
6205 9611911 11407678 13898930 17486110 22159481 27746567 33318177 37864243 40438699
6197 40438699 40867322 39385821 36572290 33074440 29488286 26463517 23967350 22063683
6189 22063683 21185892 21491458 22998155 26098691 30435747 35249301 39502756 42038816
6181 42038816 42547700 41051177 37855633 33681633 29191016 25013024 21168240 17970404
6173 17970404 15284752 13202921 11595575 10343485 9352839 8498440 7843703 7293879 6886379
6164 6886379 6544459 6229340 5983619 5688939 5528451 5347647 5144565 5093297 4917551 4669792
6154 4669792 4582123 4482230 4367773 4301332 4219038 4164587 4120606 4121640 4219309 4215110 4199480 4390482
6142 4390482 4550646 4477572 4612810 4769945 4909763 5052451 5329801 5668437 6099156 6749443
6132 6749443 7400032 8191759 9323555 10566958 12430257 15178624 18923099 23848999 29220935
6123 29220935 34294696 38173083 40019129 39525107 37359245 34000927 30057256 26299494
6115 26299494 22898691 20030341 17785079 16090568 15115430 14611268 14667456 15444114 16941490
6106 16941490 19499796 23510438 28530559 33863458 38454831 41282319 41954834 40566073
6098 40566073 37358517 33134096 28666767 24286737 20468981 17199991 14545308 12410961
6090 12410961 10743006 9389960 8365465 7582364 6854782 6373489 5935455 5569379 5281786
6081 5281786 5138496 4873862 4594067 4480953 4331649 4215314 4043887 3895429 3887079 3838300
6071 3838300 3811627 3699974 3633382 3656329 3625233 3581314 3643684 3794023 3792360 3972331 4188154
6060 4188154 4433684 4754785 5218630 5876697 6694815 8030912 9714456 11702956 13625263
6051 13625263 14992005 15524465 15302910 14422971 13121999 11606612 10318190 9113569 7918262
6042 7918262 7106567 6478660 6122495 5997346 6101946 6512270 7126636 8054923 9444097
6033 9444097 11333328 13470403 15180105 16273012 16514401 15843176 14634759 13054422 11294984
6024 11294984 9740338 8285657 7073153 6146075 5312601 4838150 4412965 3984824 3661328
6015 3661328 3298223 3104001 2894798 2652921 2588710 2497506 2342686 2253324 2181276 2114239
6005 2114239 1934312 1874410 1949063 1811434 1726437 1728862 1663287 1569705 1492749 1532821 1462853
5994 1462853 1502752 1460003 1395584 1412242 1444198 1445046 1449090 1351748 1364736 1387126 1232035 1305776
5982 1305776 1186758 1104236 1107167 1224775 1157089 1135970 1144273 1120070 1027896 998499 1170015
5971 1170015 1182784 1111867 1091582 1133968 1073051 988225 927548 914741 890724 916944 940813
5960 940813 948190 954389 1039005 1092522 1186978 1146263 1173796 1114000 1060725 1143687 1081542 991456
5948 991456 1038523 1002580 1013335 1009875 943102 999748 1086443 1150353 1064617 1041108 997050 1022997
5936 1022997 963239 918981 903336 776374 746704 846310 718943 598341 539909 490188 620318
5925 620318 717786 764860 715515 626006 518091 513125 567820 496118 480186 509870 512773 460822
5913 460822 491863 643006 538844 589877 513277 404648 438614 426534 400675 316644 320445
5902 320445 347372 375202 318517 273223 344197 428271 412371 434657 430614 343395 412830 450859
5890 450859 439951 488620 527386 512632 663559 779677 703839 634008 616769 625598 564211
5879 564211 540989 463996 500859 528846 505513 477139 517042 605679 655320 561571 567014 619191
5867 619191 543955 505613 463679 440168 341472 352893 386948 364879 406030 345471 337521 315644
5855 315644 324354 364381 350387 308603 340813 316259 261990 204535 207703 207588 245031 224608
5843 224608 210946 161012 237232 232900 224562 249646 189947 169306 261560 230427 210691 272412
5831 272412 239049 418537 432015 329096 260813 328679 228795 250530 295116 375484 399858
5820 399858 352833 364666 358235 370762 358217 356961 393574 424639 437505 470111 388372 436647
5808 436647 479086 407634 368565 356270 305919 312251 382039 450306 385121 322927 326002 310837
5796 310837 360363 375542 401826 459663 451636 634739 694200 590313 656023 590260 550706
5785 550706 573519 488225 449894 427524 412100 479832 401809 405032 398906 469992 398932 433430
5773 433430 438684 434349 449014 413121 576741 516467 494182 609286 663835 606851 610779 612660
5761 612660 494865 468797 500242 477643 392359 344610 350570 354105 313762 312084 395394 316352
5749 316352 205579 315263 380511 355117 379737 421822 438511 398834 357793 354417 258065
5738 258065 303127 349517 359597 314216 349313 333236 409014 472200 358870 307644 388147
5727 388147 358836 319934 320525 404057 425056 345832 403110 400661 439564 493736 563420 509170
5715 509170 367913 386853 409353 467063 471139 373735 402208 485316 473132 382829 528749
5704 528749 504494 486856 454617 504937 442357 431345 397628 547926 454914 337241 382048
5693 382048 374062 372390 432426 556167 503666 593379 658528 641007 677874 620823 679843 694660
5681 694660 573206 567159 491187 538376 622311 550643 523875 587551 573348 544669 588602 559897
5669 559897 588742 594027 501502 573207 504738 506517 602661 691570 665916 655351 720045 719686
5657 719686 799979 716147 638757 574761 672435 723698 697942 754043 690096 654896 634568 535782
5645 535782 603533 630740 632665 675580 730912 798217 763899 781339 802249 814555 694913 637957
5633 637957 687956 635670 514213 562861 568077 484628 481865 527313 519252 484817 479226 565051
5621 565051 559411 513779 566777 426462 401229 468265 568600 590829 458624 492400 488173
5610 488173 577429 606678 588194 525940 461881 379259 449680 365608 410493 390490 415389 411024
5598 411024 366926 377272 345125 348335 356793 359046 336761 381894 368223 313123 217651 275982
5586 275982 223790 327206 422247 382590 321274 251886 256047 234064 211312 305441 303907 341159
5574 341159 363139 392878 441846 437470 376064 348039 389855 380084 243824 212321 295810 245916
5562 245916 185506 178572 333490 442888 361177 374963 375460 326601 375620 289493 245484 356628
5550 356628 323002 242723 274859 372001 382197 411565 372585 419988 544611 463487 447312
5539 447312 434385 384195 350070 279050 329951 356380 315414 372328 348425 327533 421689 399843
5527 399843 392584 393674 401433 395190 407113 408307 266472 404038 334220 269724 338762 376197
5515 376197 458734 521207 471530 445292 485248 441960 503868 496645 476864 592733 618065 577343
5503 577343 595247 519183 447267 456791 636389 651970 587839 606434 676662 676324 662571 752213
5491 752213 765478 720909 785093 870677 889356 705734 670102 666094 505115 583357 678399
5480 678399 641815 609070 671229 687842 645023 678009 748596 856708 871499 718102 690195
5469 690195 838312 866083 842320 910182 1001343 1098379 1191911 1231886 1337494 1241154 1184106
5458 1184106 1291996 1230223 1157694 1138452 1153910 1141056 1027749 968385 1088089 1069004 1120760
5447 1120760 1191125 1179292 1239658 1220268 1205330 1271299 1272323 1319248 1216634 1256008 1276448
5436 1276448 1345080 1402339 1380454 1430659 1418229 1390921 1356650 1385956 1358575 1407564 1450384
5425 1450384 1415825 1431364 1357843 1397098 1541756 1539786 1547469 1492444 1565354 1692127 1637103
5414 1637103 1606334 1581525 1516800 1500164 1523134 1603384 1578717 1600767 1598016 1705718 1760022
5403 1760022 1660188 1718427 1755470 1748297 1804160 1832131 1917991 1976554 1906998 1949366 2051155
5392 2051155 1974445 1945725 1977054 2006911 2084030 2104358 2209020 2376524 2471532 2545879 2419310
5381 2419310 2417358 2397759 2412149 2517079 2539753 2612677 2607310 2672720 2811458 2821956 2812329 2921287
5369 2921287 2946654 3067145 3265837 3318604 3313390 3325594 3319081 3447749 3612315 3689189 3792374
5358 3792374 3924084 4040821 4217579 4336099 4599937 4921101 5056306 5344161 5904532 6639895
5348 6639895 7860809 9392476 11355131 13384463 15034042 16213907 17567860 18608941
5340 18608941 18807585 18318927 17328283 16116569 14609521 13094927 12100285 11534855 11117071
5331 11117071 10961243 10805491 10761252 10954282 11261452 11811854 12560173 13896284 16366603
5322 16366603 19861846 24374144 29562766 34159495 37539137 40634783 43195237 43730950
5314 43730950 42259951 39665095 36635218 33182279 29841247 27899347 27358926 28012927
5306 28012927 29298955 30033118 29608122 29465698 29175662 28934675 29862351 32024379 35325057
5297 35325057 38699192 41339583 45155852 51308708 59399432 69352755 78543374 84964448
5289 84964448 88559649 88804610 87981568 87611788 87758408 88586543 89702105 90139755 89871944
5280 89871944 87147581 81454056 76539127 72018755 67124143 62473847 57427248 52504865
5272 52504865 48197387 43793448 40120128 38367031 38925063 41475732 45211569 49212673
5264 49212673 52593778 53611979 53442470 53108450 52095314 51203863 50845390 50704564 50574448
5255 50574448 49353250 46987270 44998677 43567168 42611888 42631558 42778131 43010492 43630665
5246 43630665 43901760 44023529 44238743 44757486 45381832 46253026 47554624 48390084 47756607
5237 47756607 45864386 43267703 39998856 36480888 33383386 31298798 30176909 29792925
5229 29792925 29967543 30448914 31157178 31421803 30938240 29976244 28887871 27678166 26118338
5220 26118338 24109286 22200778 20373884 18528339 16839601 15409745 14503347 14034841
5212 14034841 13915086 14079526 14401741 14786632 14619976 14136136 13535290 12615817 11637848
5203 11637848 10722369 9949030 9288476 8588309 8050586 7716023 7367852 7033768 6876712
5194 6876712 6686006 6506733 6319274 6097707 6182644 6092012 6026891 5993211 5923885 5827671 5683899
5183 5683899 5769527 5854290 5789726 5820961 5926981 5934600 5933036 5976670 6090930 6164588 6274097
5172 6274097 6481892 6604311 6919270 7325264 7857192 8614363 9885069 11599212 13726992
5163 13726992 16096183 18426191 20987201 24316431 28275538 31966144 34229167 35277158
5155 35277158 35335045 32932874 29361394 25854349 22387575 19073418 16179904 13925778
5147 13925778 12228658 10897667 9983080 9366326 8960267 8817442 8804464 8832132 8791172 8996663
5137 8996663 9528052 10422640 11625873 13138352 14782303 15666581 15949603 16223534 16216277
5128 16216277 16460232 17381627 18754670 20410581 21509849 21960325 22544660 23588724 25806946
5119 25806946 29891165 35778834 42866316 48001200 49167131 48381060 45878340 41092659
5111 41092659 35804296 31207958 27901195 25363490 23664607 23990305 26535638 31223444
5103 31223444 37613174 43516995 46027406 45604520 43849593 40464596 35654710 31531526
5095 31531526 28770252 26693334 24683901 22607775 20640285 19207095 18042732 17113733
5087 17113733 16526188 16137211 15612887 14920488 14292550 13355044 12499634 11963649 11565263
5078 11565263 11204216 11000316 10868324 10930917 11318809 11696269 12442400 13491657 15251036
5069 15251036 18041390 21868729 26767460 31730380 35166465 38007509 41628150 44498398
5061 44498398 45972104 46261322 45945071 44010695 40791672 37748949 34895125 32903168
5053 32903168 32325599 32962752 33809551 34914844 37229682 40047547 43635926 48790902 54473203
5044 54473203 58278014 58408473 57404702 55989359 52718058 48674721 44841721 42423374
5036 42423374 40779505 39232239 37626648 36667595 36444942 35413299 33915015 33247738 33103012
5027 33103012 33351251 33728667 34449551 36074849 37175074 36027244 33507996 31320243 27944664
5018 27944664 23981294 20493237 17743156 15638409 13650516 12104245 10949143 10172394
5010 10172394 9524731 9063228 8748742 8335202 8052489 7907214 7694390 7447634 7252685
5001 7252685 7123329 6972802 6904416 6729434 6619073 6537660 6285789 6272073 6196429 6092373
4991 6092373 5959470 5937296 5958006 5874708 5773019 5637435 5569605 5484058 5422746 5343441 5301092
4980 5301092 5335363 5450973 5340163 5163688 5098033 5099922 5082565 5069242 4994581 4996953 5000363
4969 5000363 5034893 4973435 4920963 4991903 4973667 4986562 5011279 4965494 4931421 4953614 4913161
4958 4913161 4885919 4969290 5034303 4990285 5016286 5006952 5074086 5119924 5181094 5140680 5110013 5144751
4946 5144751 5113428 5125010 5155404 5156548 5189636 5076322 5094694 5065261 5112184 5108681 5131476 5228325
4934 5228325 5190206 5149810 5136936 5152729 5237617 5279789 5247512 5355356 5367736 5317211 5274726
4923 5274726 5391709 5530724 5671804 5712039 5673037 5635891 5586017 5721301 5803305 5899528 5990139
4912 5990139 5919802 5896876 5930854 6023930 6025616 6135027 6276406 6400061 6531989 6601891 6732668
4901 6732668 6942431 7227187 7412466 7644198 7957230 8256428 8429982 8567253 8597264 8518815
4891 8518815 8468588 8324247 8187818 8142243 8098240 8164777 8300538 8372836 8481805 8717418
4881 8717418 8860739 9186674 9510731 9669881 10002748 10203732 10382544 10603471 10795635 10900268
4871 10900268 11118786 11263458 11417082 11668993 12036338 12645266 13421700 14132559 15204312
4862 15204312 16934816 19559808 23156356 27722286 32616796 36528030 38616426 38948239
4854 38948239 38017303 35987996 33265847 30719217 28611927 26820852 25625160 24901381
4846 24901381 24791034 25425690 27092981 30051824 34291462 39819481 46156466 52638299
4838 52638299 58744601 64335229 69143568 71966165 72354431 71283705 69392149 66835442
4830 66835442 64031861 61838642 60456097 59844239 59864524 60380871 61426370 63167027 65618321
4821 65618321 69155233 73535103 78528934 83472383 87016431 88807333 89285048 88921748
4813 88921748 88125375 87312068 87080466 87887121 89236490 90953306 92821825 94719643 96373719
4804 96373719 98192594 99776204 100978000 101944197 102695090 103143453 103416491 103542865 103716744
4795 103716744 104067401 104361938 104656765 104755488 104605760 104393348 104064294 103742927 103743296 103823462
4785 103823462 104072684 104200613 104290889 104344510 104318402 103990691 103245240 101905114 99851827
4776 99851827 97317767 94345864 91034869 87613463 84395033 81512543 78991858 76900596
4768 76900596 75556306 74652334 74004848 73383682 72534790 71416430 70186986 68639474 66793301
4759 66793301 64681331 62256805 59437884 56165956 52747754 49372448 46206128 43231106
4751 43231106 40568870 38142539 35937563 34032545 32299263 30874784 29676307 28793176
4743 28793176 28214218 27926503 27885840 28425794 29512948 31598234 35283872 40544096 47155295
4734 47155295 53357180 57879066 60063481 59407765 56895843 53950968 51705788 51434484
4726 51434484 53622674 57935847 62307588 63291292 61523856 58859103 54432821 48852502
4718 48852502 44049045 40893821 39552673 39919432 41953249 45144199 48362692 50719232
4710 50719232 51797140 52000071 51820664 50706358 49890848 50890185 52113530 53198857 54440143
4701 54440143 53771959 50609556 46756482 42181200 36778552 31793676 27806815 24601555
4693 24601555 21924599 19697084 18000118 16740767 15781089 15071275 14628809 14064514 13488509
4684 13488509 12997412 12643021 12120163 11771047 11551019 11310572 11048861 10850748 10730793
4675 10730793 10637315 10581189 10459975 10304106 10108556 10116628 10004294 9849294 9720488 9633368
4665 9633368 9629712 9547612 9467275 9375035 9548429 9749823 10034976 10428772 10797111 11260506
4655 11260506 11709812 12039701 12299229 12256629 12085775 11894174 11478998 10972824 10562474 10283539
4645 10283539 9977320 9848069 9677060 9565885 9473615 9385679 9294442 9336416 9276330 9181555
4635 9181555 9129995 9144597 9192105 9243343 9183054 9124022 9200538 9221513 9195313 9205216 9239045 9365114
4623 9365114 9468130 9615553 9906031 10040774 10170806 10375453 10605805 10770825 10891565 11038570
4613 11038570 11136714 11250967 11400154 11590729 11811062 12030108 12350998 12807244 13236475 13803049
4603 13803049 14349799 14981389 15458552 15875881 16428042 16827849 17161207 17521582 18029069
4594 18029069 18508684 19185702 19986988 20921817 22097269 23568661 25243288 27486005 30110780
4585 30110780 33669354 38586698 44934777 52597081 60965404 68825295 75361504 81168163
4577 81168163 87016260 94531509 105888120 123325360 148494787 180804320 217058161
4570 217058161 254509771 289166189 314643898 326491474 325440356 312050162 287447426
4563 287447426 257034802 226181641 197270368 172324700 152231009 136103326 122275094
4556 122275094 110127434 99162754 89023455 79973259 72334217 66222579 61906737 59508420
4548 59508420 58678845 58667293 58246512 56859838 54454143 51136761 46999757 42744590 38701421
4539 38701421 35069125 31974480 29287061 26951998 25010839 23564315 22310093 21314386
4531 21314386 20440604 19762593 19199558 18598880 18176876 17606840 17079631 16561901 16212432
4522 16212432 15849648 15650086 15347054 14984420 14871122 14946788 14957014 15096991 15331828 15803412
4512 15803412 16354438 16815537 17334238 17626140 17701773 17406316 17029476 16318921 15327796 14515079
4502 14515079 13672641 12863468 12165676 11501358 10923389 10444836 10024019 9889136 9650831
4493 9650831 9486599 9276565 9084036 8960120 8872621 8716894 8579064 8528276 8413538 8351834
4483 8351834 8271256 8326983 8296289 8287311 8283879 8148753 8128600 8272483 8216863 7970996 7966868
4472 7966868 7936372 7766968 7590881 7547597 7462082 7349047 7202696 7017831 6962983 6989538
4462 6989538 6947532 7051985 7161578 7081959 7182113 7232123 7318618 7328030 7226342 7258479 7209028
4451 7209028 7090491 7038844 7021803 7010363 6988988 7058322 7123578 7133095 7001562 7012144 7132010
4440 7132010 7014989 6822218 6668426 6497642 6480305 6383263 6308462 6222265 6102252 5948610
4430 5948610 5928495 5938058 5830365 5634841 5600174 5505755 5389766 5275545 5137605 5090902 5076023
4419 5076023 4954624 4859549 4909521 4883474 4932965 4906330 4817808 4806702 4789186 4925288 5125670
4408 5125670 5277645 5457875 5852961 6328192 6651488 6707517 6647386 6484397 6076557 5695510
4398 5695510 5200456 4852275 4666774 4454088 4158428 3966631 3899873 3768235 3670708 3619043
4388 3619043 3566643 3532081 3529243 3464991 3449607 3487887 3448388 3400771 3525902 3528905 3518523 3473263
4376 3473263 3441270 3404057 3369273 3323692 3245336 3424077 3536827 3391754 3348040 3252618 3345561
4365 3345561 3477301 3417345 3377739 3265770 3344566 3404788 3403369 3403190 3445523 3392235 3362076 3394483
4353 3394483 3435862 3341674 3414107 3452800 3453098 3460714 3460054 3443817 3466110 3393789 3403518 3451382 3422944
4340 3422944 3393847 3330495 3370269 3469946 3548554 3604873 3550618 3428905 3469903 3451456 3437402
4329 3437402 3476329 3394065 3379204 3566584 3638642 3612063 3627002 3695246 3662606 3646484 3583312
4318 3583312 3518905 3546153 3572810 3626564 3740409 3806668 3830067 3881898 3861286 3885560 3939312
4307 3939312 3912442 4119034 4128576 4113837 4141374 4144810 4269594 4239694 4194034 4103539 4161429
4296 4161429 4160833 4154585 4096297 4066955 4105576 4002899 3942242 3960184 3997661 4093961 4256965 4359598
4284 4359598 4531436 4729144 4952187 4976417 4930790 4849701 4660801 4486829 4172811 4015194
4274 4015194 3844140 3738330 3633860 3500341 3275416 3140614 3195811 3138511 3155452 3201077
4264 3201077 3113613 3069670 2974819 2884626 3002378 3054073 2880964 2936866 2941597 2942317 2888205 2918118
4252 2918118 2915834 2839190 2900713 2926991 2921376 2879575 2972896 2992823 2988936 2983629 2975908 2979802 2967529
4239 2967529 2978543 2978977 3028067 3111599 3066837 3026500 2947254 3084067 3263810 3389275 3332192
4228 3332192 3275521 3226752 3402666 3343552 3328763 3403835 3321995 3339525 3303488 3270758 3304162
4217 3304162 3381705 3393797 3393202 3394645 3510730 3562492 3519143 3587183 3527841 3538602 3521611 3512368
4205 3512368 3613796 3613632 3578528 3477040 3661211 3799003 3718638 3821925 3958281 3989210 3938483
4194 3938483 3884918 4005965 4132472 4223199 4154832 4185478 4345726 4422086 4506919 4667002 4723406
4183 4723406 4784206 4858418 4976534 5038009 4921810 4966825 5119975 5169711 5206641 5335401 5421348
4172 5421348 5643870 5879948 6124279 6390665 6696867 6920631 7217920 7531379 7840226 8164022
4162 8164022 8547538 8960621 9235262 9624534 9776463 10055033 10498790 10974982 11479071 11892408
4152 11892408 12341101 12945722 13416474 13582737 13892233 14057866 14243224 14538206 14964805
4143 14964805 15451081 16004907 16684640 17330771 18147835 18694959 19114460 19667763 20155112
4134 20155112 20573520 21003316 21500186 22002466 22409551 22835831 23302568 23743686 24141282
4125 24141282 24782400 25201486 25667670 26040295 26451014 27124760 27879290 28998359 30372467
4116 30372467 31899440 33547692 34920631 35870092 36417726 36727713 36929234 36981138 37082699
4107 37082699 37373956 37800567 38304744 38855268 39405626 40053735 40591651 41071654 41317502
4098 41317502 41079587 40651910 40051205 39227583 38561904 38047165 37956362 38396699 39227363 40561132
4088 40561132 42503545 44517473 46451291 48290957 49769185 51046351 52323266 53565075
4080 53565075 54746399 55741431 56437445 57033554 57724212 58313380 58832517 59085729 59055889
4071 59055889 58833180 58327478 57617900 57065405 56855485 56662328 56800198 57375023 58243026
4062 58243026 59270679 60328801 61220182 61861971 62110480 62137871 61948092 61474510 60879876
4053 60879876 60401338 59994020 59839147 59863318 60007010 60590225 61335670 61818127 62176305 62275887
4043 62275887 62117623 61931218 61625919 61443731 60981092 60365583 59771547 59139008 58500157
4034 58500157 57865776 56886068 55510470 53807958 51875400 49731048 47621041 45712577
4026 45712577 44007274 42825470 42204458 41807692 42172644 42633992 43108753 43785374 44088756
4017 44088756 44141721 44025942 43549381 43000591 42313932 41304867 40418013 39569964 38861228
4008 38861228 38512267 38293236 38285434 38443528 38234035 37604341 36711105 35645412 34222112
3999 34222112 32898106 31776969 30704632 29793804 28991323 28263771 27592389 26879957 26219536
3990 26219536 25570195 24982016 24365644 23856799 23269799 22749194 22310278 21880344 21518642
3981 21518642 21240046 20852704 20403794 19846297 19314661 18763499 18149523 17550112 16830910
3972 16830910 16299428 15758766 15253576 15031730 14819783 14478759 14052175 13515873 12940616
3963 12940616 12343258 11903900 11575805 11123947 10801587 10459725 10136019 9916070 9530538
3954 9530538 9189287 8904793 8546611 8186933 7999639 7897090 7621320 7397245 7092791 6839827
3944 6839827 6785873 6654752 6448470 6363243 6262504 6208767 6119828 5969336 5994874 5885747
3934 5885747 5865424 5870939 5805319 5685480 5571373 5512543 5633036 5543593 5519429 5638947 5547872
3923 5547872 5568396 5550640 5513700 5539954 5558332 5550530 5621585 5621557 5712941 5845168 5858386 5777504
3911 5777504 5699873 5884411 5912273 5955071 6000338 6000965 6102066 6078330 6128767 6295073 6342716
3900 6342716 6356448 6487566 6639441 6702518 6797058 6872012 6884605 6974276 7110954 7189194 7306295
3889 7306295 7399325 7481765 7604183 7654722 7761397 7849418 7936301 7927060 8070023 8226511 8327417
3878 8327417 8288256 8233060 8255780 8299883 8325406 8329927 8405498 8518540 8523000 8436324 8441685 8409964
3866 8409964 8293654 8125322 8135635 8075148 8013116 7927516 7757940 7604243 7586666 7389504
3856 7389504 7296693 7155181 7109499 7047172 6882509 6727778 6627685 6452105 6330749 6290105
3846 6290105 6125360 6048525 6024646 5892295 5729725 5604036 5608780 5578876 5484330 5360129 5259638
3835 5259638 5285371 5123652 4975945 4906291 4856145 4780977 4792697 4652652 4564967 4421006 4373923
3824 4373923 4461816 4467887 4463185 4402837 4246463 4275372 4176750 4040087 4031775 4011227 4047228 3879755
3812 3879755 3841496 3893997 3867257 3838470 3775330 3761576 3820679 3684861 3505181 3446900 3501150
3801 3501150 3573188 3521567 3447807 3337871 3365919 3442496 3346504 3261338 3347932 3391450 3406631
3790 3406631 3437688 3510656 3437142 3400642 3312372 3252696 3219857 3157860 3089685 3149299 3011742
3779 3011742 2909478 2976757 2940145 2933303 2957391 2805852 2760232 2883258 2824770 2755684 2678973
3768 2678973 2574981 2658334 2773771 2817958 2837502 2831819 2939678 3049264 3015679 2972479 2865700
3757 2865700 2842402 2843854 2692471 2625925 2541187 2644814 2700215 2680450 2662242 2535093 2559009
3746 2559009 2523375 2489815 2598766 2587040 2585374 2545930 2433162 2397042 2514901 2460888 2512656
3735 2512656 2496311 2489205 2618893 2669514 2560245 2647217 2730668 2674027 2659031 2757364 2673376
3724 2673376 2555567 2585706 2469631 2450315 2407838 2314427 2352064 2455680 2417235 2388081 2344586
3713 2344586 2296047 2290672 2254722 2262088 2380450 2346461 2280290 2377770 2434450 2491777 2482815 2504097
3701 2504097 2561719 2659155 2609480 2577142 2528031 2464471 2469825 2423207 2285822 2230955 2263914
3690 2263914 2231690 2167164 2150380 2148718 2062830 2125837 2261998 2268577 2125664 2143675 2200281
3679 2200281 2137443 2165441 2213824 2241547 2269826 2352813 2262835 2295067 2465831 2528923 2556349
3668 2556349 2518965 2519250 2346331 2277537 2167268 2130206 2175830 2047669 1926469 1984870 2003042
3657 2003042 2016700 2031552 2057925 2129732 2076750 2052065 2012989 2041325 2028323 1949470 2058695
3646 2058695 2192094 2177656 2097211 2157981 2256962 2279471 2297720 2373164 2488727 2332062 2324669
3635 2324669 2513305 2453598 2496229 2441300 2262011 2272703 2219505 2166714 2224856 2148307 2105194
3624 2105194 2137598 2136646 2087471 2189223 2205914 2196519 2199223 2239587 2134360 2166336 2230265 2194416
3612 2194416 2372977 2455845 2380113 2411688 2349743 2379725 2484173 2410614 2519369 2572033 2556142
3601 2556142 2607851 2586156 2597457 2642306 2586867 2630596 2623937 2478839 2550483 2623831 2652796
3590 2652796 2637969 2531568 2548123 2555620 2614842 2506117 2572258 2659015 2642138 2579702 2723584
3579 2723584 2783692 2911128 3032736 2976112 3022596 3045668 3076264 3030939 3222366 3386915 3365614
3568 3365614 3463972 3549023 3576247 3527365 3660475 3735827 3776602 3761801 3631704 3756453 3839535
3557 3839535 3874259 3917780 4028187 4079392 4189899 4298702 4277391 4251040 4342985 4346561 4351267
3546 4351267 4363288 4303149 4317215 4209031 4324746 4454819 4490236 4612452 4769916 4891198
3536 4891198 4884460 4818260 4872406 4888493 4870186 4942716 4950856 5022097 4990790 4979743 5121128 5120720
3524 5120720 5139660 5310828 5449679 5607527 5721340 5911611 6065525 6211496 6344334 6541902
3514 6541902 6581239 6686130 6897381 7124788 7484662 7736798 8129477 8509752 9100922 9606002
3504 9606002 9965766 10414635 10742263 11086522 11458618 11656120 11867431 12233319 12444525 12771889
3494 12771889 13008882 13158328 13280687 13140606 12990118 12719679 12166132 11486335 10761980
3485 10761980 10086426 9568695 8923105 8351577 7854492 7528593 7055642 6726176 6492379
3476 6492379 6203940 6188281 6098909 5879163 5838365 5724811 5504328 5436128 5259991 4977844
3466 4977844 4874328 4756194 4624595 4566632 4354228 4349112 4279548 4201369 4179548 4200220 4155201
3455 4155201 4127225 4057128 4046352 3937347 3840376 3796796 3627652 3477914 3206009 3090771
3445 3090771 3059623 3046893 3007666 2949823 2884241 2889217 2854377 2749034 2847646 2774721 2719610
3434 2719610 2549258 2540519 2619448 2418129 2374422 2402349 2369938 2375955 2333584 2281668 2325889
3423 2325889 2390100 2296741 2157061 2258096 2236181 2164545 2197578 2129714 2192584 2252333 2316207
3412 2316207 2403981 2309670 2197102 2276524 2320616 2244953 2259236 2231199 2224593 2112338 2027904
3401 2027904 1918814 1903048 1946187 1936070 1941821 1919923 1905813 2034788 2105695 2054922 2208700
3390 2208700 2125860 2008920 2013200 1952644 1944013 1809214 1686176 1694990 1748962 1695278 1602356
3379 1602356 1576122 1613257 1651580 1612411 1538687 1548455 1541787 1614151 1608548 1532917 1461442 1452179
3367 1452179 1615345 1540922 1387331 1419279 1442390 1455551 1468711 1512510 1456356 1432219 1419958
3356 1419958 1371565 1334315 1337762 1159918 1245085 1323625 1221409 1275461 1251213 1198186 1188126
3345 1188126 1250679 1180457 1131036 1202708 1213252 1276660 1276330 1249101 1178189 1214175 1216389 1097087
3333 1097087 1142253 1151026 1126479 1106910 1176819 1203333 1161665 1119747 1127110 1161349 1244231 1242002
3321 1242002 1173204 1178937 1170316 1103979 1058787 1027230 1139816 1157541 1081153 1097152 1051003 1098671
3309 1098671 1143108 1071767 1011623 1002176 1146664 1110243 1017263 1008814 967988 980000 1084424
3298 1084424 1037053 1044443 1044041 1064674 991849 1012097 1093385 1062148 1096925 1215230 1119931 1057525
3286 1057525 984632 936813 1011830 1063330 1037083 952755 972154 954965 1024474 1125378 1032510
3275 1032510 1028273 1035901 974058 1006921 1009668 919941 966816 1079721 1066125 1012405 1002479 1045270
3263 1045270 1063335 993242 993861 1016172 981379 969260 1076405 1105589 1076316 1120163 1108959 1131842
3251 1131842 1119877 1158070 1083581 1083437 1099865 1034856 1005198 1096079 1005210 1129095 1168994 1190625
3239 1190625 1086867 1105677 1182393 1095138 1255109 1220736 1215524 1249031 1201544 1288184 1281267
3228 1281267 1432002 1595469 1641579 1735101 1810915 1910593 1929075 1797567 1786694 1901949 1946536
3217 1946536 1977792 1885247 1824370 1857202 1774688 1715771 1739131 1675689 1754770 1852780 1758371
3206 1758371 1819406 1852585 1869639 1800983 1922174 2015984 2023239 2057311 2138775 2226328 2297064
3195 2297064 2442695 2595047 2842517 2984416 3141779 3256103 3430944 3781202 3945149 4077576
3185 4077576 4263090 4285312 4354899 4421798 4399809 4402859 4373065 4229026 4160859 4148629 4124463
3174 4124463 4075563 4115761 4197743 4246300 4240786 4306767 4387436 4461511 4596715 4691212 4726734
3163 4726734 4739577 4886250 5078736 5233789 5526689 5931720 6342901 6850164 7401446 7838560
3153 7838560 8032017 7999492 7864232 7325594 6960466 6649822 6193666 5801485 5477139 5209155
3143 5209155 4918098 4653774 4602279 4522662 4427233 4353228 4382160 4421578 4431964 4503164 4470156
3132 4470156 4537498 4695378 4799360 4930727 5135994 5149388 5251042 5441298 5504008 5500152
3122 5500152 5377275 5120795 5014184 4832771 4588447 4426565 4119199 3863539 3622057 3445588
3112 3445588 3428157 3406265 3233308 3057685 2990317 3044438 3005839 3028656 2984746 2857130 2845591
3101 2845591 2933703 2786362 2654141 2682348 2615475 2546249 2494121 2426476 2339292 2216067 2150232
3090 2150232 2018293 1934122 1955077 1948775 1869208 1812394 1728647 1709827 1627221 1589987 1661794
3079 1661794 1565559 1473646 1517681 1533591 1366031 1286953 1351884 1381627 1291544 1334087 1222295
3068 1222295 1278486 1278378 1226565 1167977 1310366 1280547 1191084 1203483 1105487 1103737 1087879 1084274
3056 1084274 1101262 1080050 1096370 966133 919902 899317 885508 930155 938579 873473 849714
3045 849714 811311 851764 964311 875012 833943 786213 829920 836207 828274 837164 848602 775600
3033 775600 782213 872207 775890 804825 817983 744365 759071 802680 759905 618502 641165 696152
3021 696152 611056 619248 653729 649051 638082 456602 459655 511409 547720 693924 708214 546205
3009 546205 532497 508854 560760 586987 525659 476523 455626 490153 572713 565139 419629 385762
2997 385762 431733 420047 436991 504763 481623 482460 474400 472117 427686 345869 328210 380693
2985 380693 308446 312571 303311 286724 283154 335538 379491 393118 323070 410942 473553 362412
2973 362412 281606 285041 341327 246246 260628 266207 344513 381105 283019 318677 356068 321822
2961 321822 314091 380299 391289 368659 259711 221360 359274 270697 166977 207786 254504
2950 254504 268557 225182 215218 289542 339154 278844 241940 264308 226690 254965 293984 285860
2938 285860 351314 278107 276785 327974 302291 147783 67877 129221 44414 175070 246921
2927 246921 218310 240107 217577 157376 238158 296756 272592 236054 203711 198883 129693 142864
2915 142864 224269 245650 287870 285662 268585 186104 235355 273579 245931 168294 97180 138390
2903 138390 158732 159800 195898 211902 190987 156590 321317 287666 267928 346818 256639 149235
2891 149235 134921 122491 196307 277218 148361 130285 173964 207147 270353 231141 245880
2880 245880 221005 163370 213623 166638 69699 93077 227108 232053 170333 168647 168936 134242
2868 134242 84428 109058 193793 226268 133402 148235 231468 272330 296600 138891 196255
2857 196255 223878 180086 152979 159921 88195 129547 155961 161131 203886 177997 164125 144663
2845 144663 92216 65083 96871 150379 169460 154468 82471 86656 158383 241898 204702 176861
2833 176861 57833 166898 244255 164000 139412 96695 123720 177647 196172 201719 267400
2822 267400 178839 134337 190150 120808 135807 203743 159784 206733 171695 140941 142924 56837
2810 56837 58499 48035 184312 148342 27697 12081 60170 191390 176087 89495 145491
2799 145491 172381 131441 113419 181057 260894 190315 182208 213628 155168 143879 116829 129647
2787 129647 221754 133643 140633 141986 184061 46023 22612 137953 155253 19271 124677
2776 124677 74915 45467 79380 55004 50301 132121 154390 244498 288039 196492 140969 125755
2764 125755 90863 11056 -2280 -76729 40804 91245 196034 116152 68671 184713 89862
2753 89862 88579 99995 37339 67747 59314 37076 50618 142752 75169 153712 216520 168747
2741 168747 196846 177279 135775 103062 81186 149209 120121 145453 194259 130731 158278 149300
2729 149300 56389 79645 157670 110244 152597 192412 152871 152943 122521 160807 173198 147330
2717 147330 105396 7000 85821 77514 -41376 7498 118338 131771 136217 172648 -2636
2706 -2636 27784 135465 107014 207643 195041 139264 128689 90978 49488 42166 70503 55277
2694 55277 36341 154825 172642 94119 15879 110269 126672 136843 147109 17740 -148742
2683 -148742 -66224 59559 35643 -13826 -16377 66893 81661 26758 -14976 41701 119987 131154
2671 131154 167266 -16796 -3452 17011 -64499 30227 77714 41666 78084 190438 119932
2660 119932 107464 24322 93101 123687 134818 85162 44993 28270 70592 66805 31925 -1333
2648 -1333 101681 130269 114751 132863 46972 63137 50415 -12348 -17158 39640 126548 171240
2636 171240 103086 77280 55526 107315 226120 203951 139389 121644 71527 69046 65242 104229
2624 104229 142606 313519 401206 318049 405517 387469 314860 373462 339808 264113 180634
2613 180634 68736 53393 149688 119122 29727 -24071 37975 158461 168545 73170 134842
2602 134842 191571 186185 167645 188324 188405 187385 166741 156375 164513 138003 145872 167571 254352
2589 254352 160548 159196 132850 102983 131582 78961 221781 226099 88903 154125 166302 39624
2577 39624 108917 162850 103360 87950 62658 141461 148059 192759 195731 166907 120055 152674
2565 152674 251545 194227 129112 146897 137606 112675 57106 58678 98595 36742 68695 91771
2553 91771 152567 7221 3233 95982 73534 99706 140084 176167 165928 202715 208748 209119
2541 209119 119933 180779 144182 102727 48793 80001 144524 191804 149250 198373 107485 47144
2529 47144 73926 17406 60493 21421 181299 152545 123300 226908 188910 167909 102753
2518 102753 127163 83820 102777 85907 180119 220045 170034 124433 89863 115732 182970 157138
2506 157138 57498 133738 176869 101552 156016 198355 65238 49603 261 131492 241127
2495 241127 210731 148567 158751 233297 290762 268145 402712 268075 239985 208958 165393
2484 165393 208847 253143 328425 299750 272448 299208 220777 180882 242756 204956 226546 213108
2472 213108 174409 245464 244675 315668 306957 248260 172868 157275 282390 279403 183412 126533
2460 126533 172691 245523 288153 250940 397786 346719 342116 374448 263647 252775 200664
2449 200664 297171 304401 309114 318081 385485 299694 306009 287986 249427 392924 314418 308350
2437 308350 301577 318043 371786 343125 387388 389136 403604 459219 428424 409105 557680 463214
2425 463214 433027 532550 420808 398198 426170 372292 455830 542490 459843 619621 625827
2414 625827 575198 567466 604237 526673 535612 729133 823162 779286 732126 720118 633180 760169
2402 760169 853253 851647 800929 834731 858229 804953 887360 861750 877034 991247 915639 897668
2390 897668 1040391 1062389 1188522 1204264 1248984 1383320 1362844 1344847 1496113 1559030 1644433
2379 1644433 1810989 1938994 2031938 2174446 2414049 2573551 2835446 3302817 3809277 4444948
2369 4444948 4980963 5290505 5666505 6011273 6569504 7176896 8057947 9325943 10894610
2360 10894610 13349589 17312360 24382709 34361465 46831346 59983154 67507684 67042678
2352 67042678 65406984 60226486 50209282 40596839 32872818 26829416 21206202 16470885
2344 16470885 13036618 10830422 9572235 8858227 8169816 7565784 6977929 6472067 6033242
2335 6033242 5448882 4917979 4560626 4128875 3750534 3448658 3199162 3002121 2824032 2635571
2325 2635571 2480019 2367297 2250858 2130526 2218125 2095101 1977982 1978893 1852927 1865445
2315 1865445 1867436 1759942 1715687 1549570 1657233 1531119 1483451 1486280 1422147 1317399 1335153
2304 1335153 1334542 1342633 1387531 1325898 1281249 1229244 1174315 1149516 1020888 994652 970840 985304
2292 985304 978659 922920 878409 935992 817074 950623 965659 877080 914869 838922 825865
2281 825865 771525 712307 664731 556063 662579 658385 646623 707982 777401 878115 740290
2270 740290 618048 607960 594951 529424 545399 499170 615050 546859 532420 468162 410739
2259 410739 371978 389692 407139 475577 561077 453523 409256 424892 435400 465603 390506
2248 390506 382965 324560 360372 450976 430597 449739 399631 382965 459959 343126 350304 424690
2236 424690 378420 274457 302260 368138 353692 280968 238334 347747 237913 239312 223443
2225 223443 249507 365885 364711 314659 238139 258513 222032 141259 157434 139820 68581 194200
2213 194200 130633 154505 169255 189732 150588 204197 229494 193875 120160 152384 196458 173912
2201 173912 212689 101545 102988 171972 172683 217692 220319 205668 206404 278705 257181 203782 179729
2188 179729 170173 123534 250391 172256 171878 207440 101560 69650 67033 42425 140394 116427
2176 116427 28921 209069 67357 50663 67870 60050 122975 18630 -16540 29057 -55373
2165 -55373 4516 79243 71713 95203 11046 24080 91611 99203 190457 252176 281074 115282
2153 115282 188415 136133 22977 119537 186042 9633 99415 228804 118197 115013 61552
2142 61552 -74641 -10752 85986 74142 115724 11665 -59714 78087 -2823 34503 25279
2131 25279 93206 43608 66440 149887 56180 76821 71423 80400 68779 33312 63686 45843
2119 45843 -30655 12823 10437 31187 80467 37698 109470 120837 18497 46657 -3797 -50284
2107 -50284 56469 69750 47886 192761 134388 134411 179238 266191 168238 77393 31062 25395
2095 25395 77753 27980 -44711 34737 98374 157933 296909 198612 234577 372037 339478
2084 339478 406708 526861 498311 455529 417876 376090 276126 253232 77617 59715 160460
2073 160460 159213 209952 62453 92956 41497 29748 83022 141394 44293 18152 120791
2062 120791 -16106 82509 133039 74290 28322 1542 62704 102903 -3197 -13886 16163
2051 16163 -26966 -31517 45421 42617 -78483 -116705 16267 -39698 11693 77146 74466 129480
2039 129480 64856 46163 82855 87401 114707 33380 -52917 35552 2693 42021 100607 95265
2027 95265 126604 101229 68967 119621 77006 38303 95264 22142 -55266 -91061 -22848 6001
2015 6001 83219 55595 -40285 -33765 -68723 -24851 20567 -24067 -42997 120074 74299 84159
2003 84159 168800 110851 218049 213788 63299 81301 17949 18595 80286 79152 72830 183554
1991 183554 81813 81156 148304 127155 -917 -52628 13427 576 24125 38786 85625 234883
1979 234883 55654 24026 22946 50428 69766 -26370 -34656 107195 61259 56365 175427 77953
1967 77953 103521 114516 33329 -17333 -54373 -25373 19503 2179 -43284 31722 166298 67846
1955 67846 32219 1784 32246 42617 47332 45554 39073 26444 -29671 -10202 -82813 13808
1943 13808 64762 -34972 122053 160915 41340 31174 79091 -21045 -21305 27835 113436 95146
1931 95146 45752 59907 141108 -67652 -73520 -37497 -50591 24228 92729 149290 59224 1050
1919 1050 -62548 17432 127844 8885 46039 75620 84998 138756 116184 103810 103020 112130
1907 112130 57752 -1644 94706 51661 37826 12130 62016 100651 90391 78660 107113 -24653
1895 -24653 56798 73721 -61 51875 17224 90488 64519 62801 -5621 -9503 36943 66823
1883 66823 89142 90417 136818 89071 80247 77651 9978 49134 19554 61784 1496 26485
1871 26485 84974 48596 59952 -18416 97622 97505 7715 -19929 68127 -25454 -98724 -45214
1859 -45214 -71913 61348 49980 -54567 -55058 29232 -31964 8770 -45262 -80459 -93162 -27426
1847 -27426 -42834 38130 33061 3170 69608 13039 -48128 -39979 -49434 -84467 -9569 64677
1835 64677 71984 108203 -1512 -65173 45907 95591 -109718 -78465 61814 112662 10128
1824 10128 -49707 44485 57836 32671 6595 -9982 38133 65022 116868 61923 64740 76282
1812 76282 47377 66409 -11140 39822 62155 -59038 8869 20705 48080 34220 25501 -15995
1800 -15995 56677 70142 150432 80105 55716 44189 42843 165415 108610 12780 34869 22845
1788 22845 -18298 3321 63442 123711 73707 161365 186279 35299 37519 91399 97708 117301
1776 117301 49301 83813 50696 73115 37628 148382 15313 97003 -20504 -51832 22653
1765 22653 19903 -28058 -48212 40496 139495 118335 166481 60844 18394 -3301 44618 175972
1753 175972 163167 109431 83418 4263 -31116 41498 6004 -60231 -85331 -86567 -55824 25639
1741 25639 126666 121095 53810 -19671 121810 145753 153245 69228 8689 -59049 -76730 -153889
1729 -153889 -109490 28556 66880 88547 -11353 -19640 45454 -29742 -66135 162918 47886
1718 47886 -97483 -84401 -31037 112531 98076 -83055 13730 3157 -42675 -19165 -46912
1707 -46912 5467 58045 36602 54868 -3911 27791 -88398 6735 17724 -13702 64103 48430
1695 48430 -32142 -58173 -79085 -18557 39083 -60054 -52543 -13604 42160 -12665 -47753 -93135
1683 -93135 -114523 -29991 -39908 48331 17883 -5194 58187 32387 -81247 16039 17549 -6627
1671 -6627 47134 49140 116163 186428 214045 212668 249761 189988 91827 26954 -53633 -24567
1659 -24567 24127 84685 35721 -7039 51444 99745 73214 16931 17295 11733 69139 48817
1647 48817 48654 26755 31785 18129 -30477 302 -26559 91883 134096 50867 75936 73875
1635 73875 80656 -2636 -4944 26897 -5721 -30641 12614 94328 -45145 -53808 22860 77064
1623 77064 38354 -24913 -97520 -999 62028 -31564 -1628 -85386 -61253 -86173 -112750 4430
1611 4430 60505 17347 10918 12900 -44029 74565 94713 -26854 54731 193083 154172 42474
1599 42474 26293 -27279 80659 6745 -1491 90480 43342 -27942 -77809 -57720 -66862 -38594
1587 -38594 29592 -14255 26981 77635 109002 53554 64978 33699 -75588 -65710 5404 2719
1575 2719 -24547 14725 28980 -31013 45968 46030 -30335 -26138 -120169 -43407 -42407 -18437 86509
1562 86509 42961 -98069 -69866 -83002 -51884 18309 -31938 -89158 14038 126677 139793
1551 139793 121300 131242 106016 58602 -61006 -41454 51273 61008 189062 167119 30503
1540 30503 -7964 27522 -30152 69320 82565 12018 -9273 -11505 -31575 43589 35160 74179
1528 74179 -5658 -84779 -17472 -49151 -25289 36195 60805 24900 -91451 -23660 28091 -37098
1516 -37098 -35364 17234 29343 1186 36189 45725 -8003 37841 91233 26521 34893 108347
1504 108347 32806 80056 144926 -52512 -108629 -65041 -41948 67855 29708 -22281 30553
1493 30553 9588 -3441 -124852 -101045 2232 100686 98032 115199 125718 70304 87400 101284
1481 101284 60073 91729 -13397 -59643 67845 50485 22151 62908 -80809 -10769 314
1470 314 -6953 28434 -26911 -1742 -109223 -37519 -29086 -28215 -42546 67780 59674 -35796 -26521
1457 -26521 4327 74795 23936 41984 91483 82599 33572 101366 90189 151246 87692 40909
1445 40909 -46391 -34790 55466 47440 84940 43337 -9763 -21808 -113678 -138299 -66711 15552
1433 15552 -1400 19604 -19312 15541 -25933 -45463 -24039 38007 25354 -19546 27028 64534
1421 64534 -19900 97571 127739 -62793 -70168 -68048 -52783 -31207 -27523 -80688 22501 -58942
1409 -58942 -14978 23294 81087 54100 -27962 -137781 8553 4494 -37326 -101823 -87324 -89749
1397 -89749 -90215 58052 -3587 19238 -52322 -149005 -47264 -12781 -77764 -85701 -121316 -22752
1385 -22752 76925 104818 117086 45787 -48391 -8386 -48591 -54434 -317 -57426 65857 94300
1373 94300 44895 123766 150021 125260 115397 42283 -28583 -79351 -37282 -46055 -17461 -23048
1361 -23048 -24263 -80565 -26993 -29353 -132294 -169080 -152776 -11366 -80401 -59343 -41629 -52204
1349 -52204 -96112 -20836 28483 -20703 -38135 -56161 -78167 3414 20855 69628 60533 -85258
1337 -85258 -85671 -63212 -97710 -159571 -40116 -84863 -49391 -34483 -63526 15926 22426 57863
1325 57863 83087 90248 58753 -2254 43294 23646 -44918 47065 73614 34643 25033 -71519
1313 -71519 -76993 -42841 -96590 26442 27889 -58208 -32470 -56854 8617 -30087 21608 45319
1301 45319 47603 86968 18861 -56013 -40922 11979 26105 72968 -52573 26906 3367 -75365
1289 -75365 -9562 74104 2267 41259 81451 35740 12828 -67673 -108338 -38378 37270 38821
1277 38821 -66933 -29835 52754 99617 115820 133670 65695 8904 5514 -1813 28897 45852
1265 45852 8689 44773 100089 93777 80994 -18115 -54211 -37312 78581 136959 186774 127616
1253 127616 106947 27903 364 -9689 -2884 -87385 28141 96340 15206 88229 32426 -45584
1241 -45584 -19261 10481 54036 31854 100897 131012 71659 13153 -34349 -20978 -26739 -7682
1229 -7682 -39379 -59160 -38808 -118760 -186346 -96090 -40555 -57563 -40430 -17951 -23996 35421
1217 35421 19225 -37584 -18459 -51314 -48770 54818 28939 -53347 -18299 -141996 -240732 -194286
1205 -194286 -101835 -35102 -42857 17820 129031 59800 42133 106089 -6745 -11088 89502
1194 89502 94885 73652 72519 4846 -29261 82 144492 33193 67132 29765 -32426 64423
1182 64423 66936 46277 -11550 -95235 24460 -54498 -20392 -15891 16428 -64341 -61575 -100222
1170 -100222 -79497 36384 48506 56308 98586 95022 70138 46693 -89836 13731 -119168
1159 -119168 -219462 -230063 -57768 -37205 8207 41765 -84477 -50195 7612 -25759 1957
1148 1957 -87871 -97630 -58172 -95722 -14001 -9585 -18885 120967 129818 134579 -15420 -26178 -885
1135 -885 2901 -94757 -61817 -42447 -66328 -24901 50771 50246 102598 135333 4857 18534 85207
1122 85207 47047 70126 94479 13179 85095 69444 179507 69331 103184 135435 44795
1111 44795 -40744 -122806 -158572 -111512 -38370 50129 78186 -17437 -15298 43166 126182 -43836
1099 -43836 34334 45412 -45481 -34400 54583 84971 10850 113740 86545 28271 33456 -8053
1087 -8053 26997 54998 27931 59896 -15596 -112627 19792 87542 -4940 -2128 -303 -16656
1075 -16656 67384 -25929 -1401 -11279 -38648 -41776 -48624 12976 -21613 21456 -62426 -177711
1063 -177711 -144541 -149801 -45540 11303 -96781 13935 9180 30403 65250 -19814 41383
1052 41383 114096 78051 45854 79287 -18967 -22684 104814 105629 64651 -57041 -145571 18386
1040 18386 -14145 8599 95430 -41295 -72952 -30449 -51107 -30322 -48388 -138073 -44385 -3383
1028 -3383 -3756 5692 -28433 -48569 -47348 38696 133040 76702 61231 100176 119598 108690 84237
1015 84237 -18276 -22544 -22263 -82090 -44956 84975 1308 -46267 2989 -3343 -84003 -16936
1003 -16936 -57357 -43717 -72578 -38046 31675 55603 791 14961 -58883 8283 30940 26034
991 26034 152614 119670 78214 -45408 -57546 58918 838 -63639 -3199 -78294 -110839
980 -110839 -9531 108258 78512 8122 279 5122 -54819 56180 15536 110864 179222 72155
968 72155 26650 -8582 46297 82711 111681 177727 87598 136068 261186 164201 104108 108724
956 108724 10874 27901 44957 102858 13207 -72418 18758 -26068 -39338 10691 -21863 4180
944 4180 -27057 -22111 -62123 -110395 -86416 -81288 -45186 -30098 -58968 51733 -33978 -13436
932 -13436 25980 -91599 -77054 35692 3531 -21264 -16444 -65209 15154 -13613 -9161 35830
920 35830 71788 48211 88586 -28756 -27903 -28927 3434 20456 42 122299 48499 -15797
908 -15797 -64264 -11639 26662 5199 -54186 -18584 22522 -8375 4064 14604 95870 -5350
896 -5350 -83247 -90694 -37751 -39991 -97932 -9455 -78246 -72497 45036 75468 -11210 49423 68308
883 68308 37169 -38372 13940 36899 -2878 96411 146416 64518 32112 34274 19119 35956
871 35956 -64263 -91296 -147651 -74591 47603 38550 31969 10885 -96432 -63680 -55680 -86320
859 -86320 -44926 -55069 -63275 -129588 -105944 -13209 -10283 86679 117069 55796 41271 -5613
847 -5613 26264 80319 142049 94138 -40258 -106128 -68689 -30125 -8148 18025 -75643 -72221
835 -72221 -52565 32081 22453 -39069 -46065 -99794 -153638 -51998 8341 89370 26556 -13716
823 -13716 50839 16479 -17180 -37597 -43506 55547 105788 2702 -65357 -123268 -66891 -66247
811 -66247 -19476 32053 35838 -74297 34001 88028 39820 -8245 -52127 29838 -43055 -7511
799 -7511 -1436 -43677 10846 53231 -18957 79841 -12126 17715 -41207 -74738 -20293 -103921
787 -103921 -83703 20086 -7257 -42641 29 -1576 -15188 65976 136701 25617 3614 -34665
775 -34665 -55459 62463 172881 70546 -72902 -135985 -174650 -62359 -69537 -73287 -17941
764 -17941 -89023 -61069 -57143 35926 -20386 -52557 -55684 -94974 44369 -33195 -14002 74686
752 74686 110700 144930 105943 -45489 -34777 28681 59844 65889 -24003 33802 135684 34039
740 34039 -116729 26590 27630 16456 65616 84931 -25679 58143 100204 86789 33261 33073
728 33073 91810 86365 52116 23600 7068 81638 81133 -23407 20813 127526 111515 48720
716 48720 -83710 -69338 11647 -22825 -40023 61383 -42260 -97410 -4492 61898 -58035
705 -58035 -20750 30303 -27025 50788 62998 30363 -18576 -20887 -77122 -15052 11573 -24708
693 -24708 17347 -46340 -65328 88777 91744 125188 85104 10654 -27079 -133906 -73553 737
681 737 -33476 -10379 4520 36914 62388 66462 -11945 -58591 2706 55943 29302 -24666 -61535
668 -61535 -7825 33940 -76554 4900 51265 17600 128605 60429 -27741 -12297 -10856 -59024
656 -59024 12939 75567 65944 103551 139417 118766 97388 -8029 -3225 9312 -95250 -33294
644 -33294 23450 -75485 25023 -16197 14308 49321 -53788 -119629 11519 -58446 -16402
633 -16402 92745 -12095 1106 21588 42716 -66312 -66630 -46341 -102449 -76355 -1933 -118913
621 -118913 -101794 -109010 -141482 -146065 -156293 28008 116415 24249 19400 9202 26951 -24047
609 -24047 -72973 -32660 -17366 -18548 -14618 27524 -37892 -94178 -38357 99117 -40370 -27612
597 -27612 -51616 -160897 -163088 -223725 -132284 -119920 -199661 -52553 -38503 -96792 -28896 40356
585 40356 8379 -132766 -82591 -120136 -187062 -102473 -101122 -97888 -63768 -136771 -108143 -89102
573 -89102 -78955 -60490 -18748 -59379 -108950 -168110 -104627 -20742 -50751 -33814 -92760 4665
561 4665 -15490 -158633 -16929 81668 75015 -22516 -29033 -75078 -35255 -75320 -10383 2680
549 2680 -27319 38754 -7806 -17707 24530 -17410 18328 48914 -3216 8988 -73786 -77352 -171731
536 -171731 -45716 -51039 -118478 33309 69162 -31468 -105050 -92277 -59158 -6649 7697
525 7697 73419 18730 77457 99431 -69395 -50885 28081 67416 34044 -676 -8428 -47810
513 -47810 -18743 -25749 -204401 -132508 -6599 -64531 19236 49695 56197 26117 -74594 27056
501 27056 59811 39010 65719 8435 -67772 -81301 -28565 72546 39594 -3111 38464 12717
489 12717 18806 14690 -57417 56305 24797 84768 108783 90285 93917 32364 -4899 -36031
477 -36031 -30081 18438 56950 11058 -13377 -69378 -8116 -15664 -102015 -114246 20238 46088
465 46088 60428 -56995 -113940 -75549 -73425 -62754 -128607 -45639 19197 -556 -71412 -147924
453 -147924 -41083 -90577 -57241 -54744 -45029 63920 81662 53235 -67842 5500 -34407 76412
441 76412 51358 -38305 61663 -44880 -29416 36504 80639 -20015 -120654 -158430 -88322
430 -88322 3516 119154 92997 106528 83055 68751 62817 -96521 26653 122884 -12863
419 -12863 86362 86927 -23131 100104 80060 -69264 -78844 -4069 68546 30682 11750 57566
407 57566 65499 86371 26216 36114 -67154 -96893 -93544 46658 9943 -33929 -122597 -36614
395 -36614 -73980 -73139 10165 -25909 -81956 -100841 -60759 -27905 -40937 -74243 -43043 -119657
383 -119657 -48340 -23350 21376 -32356 -116771 -60592 -28396 -10633 13205 -58454 -40720 -71278
371 -71278 -111008 -132762 59335 110471 -15781 -72088 -36939 41551 25214 -48218 -4573 -31972
359 -31972 23474 41259 -69213 -66447 -19707 -50214 20201 44641 30185 30473 10628 -41096
347 -41096 -54936 -5344 13523 -33771 -82140 5665 2951 31690 20972 -37591 1818 36244
335 36244 5473 44848 72161 29001 -46468 68260 -31948 21988 -37949 -37445 35136 21363
323 21363 -66115 -34064 -43945 -80947 1417 -54875 -77283 3216 -88164 -143887 -133710 -106613
311 -106613 -109429 -63256 -44117 -153693 -38069 -52758 21546 -1219 -80292 -1653 5991 -122490
299 -122490 -95769 -42375 -12464 -18509 99639 68102 -55169 -95889 16436 176824 15725
288 15725 -59946 -24397 26896 56436 4679 -45229 -98732 -6587 49648 76304 78816 49115
276 49115 12075 26814 79624 11795 -65902 -34052 -12126 5239 -4361 -25577 -53935 -43100
264 -43100 -67581 -47005 -19340 -15648 -12702 -96284 -82492 -65158 -21881 -49915 -96023 -44311
252 -44311 -47445 -52687 -63005 -137000 -154677 -46305 -55811 -121628 -103794 -59889 -33666 -92175
240 -92175 -137534 -22466 -5805 -46789 46524 57070 -62787 -103083 -87366 26177 -5805
229 -5805 26681 56268 -73011 -86758 -37249 -12442 23506 -19642 -99690 -91733 -25131 11672
217 11672 -7121 -33773 -26023 -76035 -9231 44502 -12315 15947 4473 59433 15826 55346
205 55346 -10410 -31927 -23508 10064 -19126 -26636 -79542 -107557 -117526 -65524 -76723 -166546 -109410
192 -109410 -78336 -97393 -57748 -55242 -63597 -49501 -99030 -75877 -21226 -22476 -36713 -74955
180 -74955 -53766 18993 -29449 -54427 -72856 -50731 -130815 -112007 -125792 -136878 -122444 -81711
168 -81711 -27375 -157966 -35025 -65076 -130789 -126990 -108973 -119589 -158560 -169125 -194240 -144750
156 -144750 -59526 -39754 -53279 1566 -89357 -174842 -206298 -187831 -164718 -149675 -110434 -10239
144 -10239 -70110 -104230 -91143 -90536 -123495 -75422 -42998 -106171 -75924 -44939 -51643 -75709 -119529
131 -119529 -92278 -101097 -139695 -123711 -1806 -22264 -164753 -177437 -203848 -95078 -159167
120 -159167 -147435 -124902 -69953 -136229 -129906 -99914 -123326 -57330 -50366 -55317 -178235 -231817
108 -231817 -169311 -36084 34931 -46379 -141728 -110410 -118235 -86067 -152504 -196905 -78901 -95403
96 -95403 -110153 -72780 -126797 -136369 -194603 -154641 -133730 -124703 -165708 -176967 -229276 -236494 -165197
83 -165197 -248451 -271430 -198579 -149104 -163815 -152902 -125008 -170520 -141550 -106884 -166710 -160153
71 -160153 -164088 -111545 -131077 -97116 -84517 -159686 -160619 -199603 -254841 -207656 -184331 -151014 -148618
58 -148618 -181903 -132768 -205415 -224446 -248239 -263988 -136339 -135116 -194494 -200160 -209607 -161093
46 -161093 -133973 -153155 -133295 -155391 -119050 -146410 -162222 -129263 -193101 -149426 -154470 -192420
34 -192420 -181300 -164406 -114504 -127692 -187700 -198200 -201112 -237079 -261573 -229888 -220030 -222362 -230920
21 -230920 -254033 -245287 -220431 -266340 -285162 -208491 -157278 -228190 -216011 -188055 -175406 -221782
9 -221782 -302399 -285018 -326774 -287741 -222389 -232129 -213275 -271589 -286557
0 -286557
$$ Imaginary data points
##PAGE= N=2
##DATA TABLE= (X++(I..I)), XYDATA
16383 -907297 -882900 -820993 -861750 -891286 -938661 -863866 -785920 -804186 -763333 -744499 -728917
16372 -728917 -699676 -758219 -732389 -741170 -678238 -547320 -588399 -572883 -553697 -592791 -469112
16361 -469112 -454374 -450950 -420478 -397189 -400084 -416228 -396699 -408751 -334500 -402580 -395538 -394128
16349 -394128 -358617 -329822 -292628 -318964 -383713 -254130 -241272 -332045 -257337 -179291 -206815
16338 -206815 -174194 -216004 -149782 -133359 -119195 -89864 -90918 -101351 -73991 -68443 14470 113844
16326 113844 21607 32013 22887 30144 94734 128621 124421 78640 106256 124518 168300 179109
16314 179109 132471 154926 205473 140272 197161 250513 253334 349588 301950 235419 360673
16303 360673 340038 324334 333775 318505 340455 262676 279802 366093 460906 471213 410963 498578
16291 498578 432449 418764 542523 515594 558556 604491 607391 549327 643117 638009 743397
16280 743397 652675 631486 738108 653889 595916 508711 587457 692813 675858 678346 644555
16269 644555 688043 712454 729299 757118 767725 783252 784626 866671 873207 882408 856077 941812
16257 941812 893985 836286 931865 933123 939111 999135 930187 1008349 903370 974796 1053538 943969
16245 943969 926393 873739 882217 971193 970955 983366 1046870 1054605 1124727 1027358 1080085 1110193
16233 1110193 1083946 1096736 1149580 1144557 1186760 1072038 1122156 1211849 1117771 1166838 1104924
16222 1104924 1122816 1225649 1117954 1227250 1238516 1299464 1277329 1160096 1235316 1225937 1229246
16211 1229246 1325470 1333437 1285040 1369059 1352949 1248846 1265227 1326451 1338936 1419539 1378776
16200 1378776 1288985 1299204 1429206 1497110 1396403 1375412 1407470 1486144 1464726 1326387 1349399
16189 1349399 1308937 1384762 1438406 1505452 1506415 1478612 1484692 1393621 1280698 1389951 1409696
16178 1409696 1389529 1442426 1387669 1464385 1556117 1465778 1557274 1524514 1475773 1470153 1374649
16167 1374649 1491410 1607633 1610989 1539093 1456238 1532214 1598458 1566204 1436545 1392059 1438799
16156 1438799 1523041 1544846 1570343 1533193 1576387 1619984 1533108 1585004 1505144 1601008 1637505
16145 1637505 1563492 1587332 1658522 1663434 1735426 1623550 1535558 1562460 1519352 1615753 1634842
16134 1634842 1650689 1583989 1442299 1393001 1407910 1422642 1569607 1650496 1672132 1638059 1548665
16123 1548665 1589729 1692569 1550413 1576613 1617729 1650249 1740719 1570915 1622945 1641997 1613199
16112 1613199 1625810 1589590 1556743 1619948 1635719 1658178 1754339 1782561 1689166 1654658 1564085
16101 1564085 1619169 1591102 1621551 1637552 1572452 1529342 1593139 1635673 1638241 1749056 1741070
16090 1741070 1674757 1636414 1583698 1576789 1687838 1708665 1729109 1733657 1684272 1763657 1763283 1694931
16078 1694931 1755556 1690425 1705000 1699031 1645579 1663593 1510882 1511840 1594635 1694306 1709800 1659373
16066 1659373 1696719 1649748 1714362 1704013 1672989 1814406 1836090 1687195 1711554 1772342 1723500
16055 1723500 1778150 1720680 1695776 1703131 1736406 1712219 1749231 1711485 1661592 1682237 1573795
16044 1573795 1625624 1661559 1664487 1647601 1650021 1702758 1716095 1811730 1839032 1819346 1792186 1751325
16032 1751325 1682009 1575616 1650114 1805558 1761539 1712396 1689442 1640020 1672564 1669098 1708666
16021 1708666 1708284 1702841 1646675 1694948 1792697 1834775 1865053 1845943 1794424 1710712 1708376 1743955
16009 1743955 1811452 1821866 1767221 1665368 1727452 1727330 1623860 1615189 1719866 1774628 1694964
15998 1694964 1673781 1749727 1690458 1622913 1675633 1654496 1692744 1617992 1609850 1730980 1791653
15987 1791653 1660141 1687686 1633770 1691272 1721544 1713674 1696637 1822491 1759990 1724343 1724813
15976 1724813 1657102 1696900 1694989 1628042 1733239 1808112 1811237 1730180 1712549 1835062 1841184
15965 1841184 1757370 1791397 1794096 1803481 1835680 1669749 1644622 1732323 1655114 1658943 1797624
15954 1797624 1797127 1758129 1754429 1728915 1707941 1740002 1841743 1854864 1814059 1797099 1703320 1642127
15942 1642127 1681848 1756189 1716030 1659627 1612436 1725401 1714509 1731075 1653026 1727260 1734802
15931 1734802 1631626 1692661 1735484 1724805 1734711 1660958 1692252 1685306 1703861 1599194 1666574
15920 1666574 1602883 1693977 1672837 1600760 1694515 1716307 1672381 1642198 1779022 1733151 1730009
15909 1730009 1778212 1826199 1839398 1822942 1801690 1772527 1644617 1633029 1634377 1699326 1740910
15898 1740910 1809621 1773811 1698533 1721174 1699276 1721461 1724037 1708955 1679506 1678705 1630833 1642929
15886 1642929 1767667 1719099 1649461 1584704 1558366 1666061 1841322 1797425 1785975 1815143 1782007
15875 1782007 1822299 1678734 1669273 1693665 1693164 1720378 1774108 1757866 1764946 1764243 1705476 1694646
15863 1694646 1674552 1567841 1620958 1813940 1740909 1657541 1816709 1769819 1700157 1703277 1715639
15852 1715639 1799538 1878292 1767807 1736682 1744790 1799345 1803422 1732691 1824518 1740024 1686199
15841 1686199 1749733 1756323 1752746 1790656 1807776 1762512 1708507 1649705 1627072 1690364 1614783 1694746
15829 1694746 1740399 1780367 1772048 1769270 1781775 1788144 1814786 1742413 1747274 1751392 1792990 1862249
15817 1862249 1755129 1802215 1767633 1778158 1719591 1700753 1776995 1737483 1807308 1786023 1744895
15806 1744895 1740592 1840438 1730510 1702609 1791131 1774123 1785657 1776683 1690778 1654821 1728792
15795 1728792 1772069 1731133 1631002 1779113 1786808 1747554 1646855 1559813 1643145 1698679 1744836
15784 1744836 1782164 1813203 1844896 1812420 1794465 1756633 1771517 1661954 1681014 1710018 1706248
15773 1706248 1754991 1778797 1734428 1761544 1819350 1654683 1619196 1743368 1692521 1721853 1747246
15762 1747246 1690130 1730134 1711019 1743530 1688109 1651715 1771346 1756767 1758020 1807428 1730628
15751 1730628 1780531 1725853 1570945 1738501 1701486 1646166 1701278 1666611 1786823 1831774 1870625
15740 1870625 1880080 1783825 1807960 1954552 1865805 1715434 1647780 1644220 1646808 1709425 1677482
15729 1677482 1734719 1757438 1708903 1729186 1841660 1862200 1825691 1827474 1747177 1704436 1738981
15718 1738981 1717256 1709106 1694892 1654310 1718241 1684308 1782770 1836929 1706480 1670385 1735054
15707 1735054 1776926 1782585 1740987 1760450 1850227 1691068 1696508 1685426 1776439 1819671 1767575
15696 1767575 1714307 1647382 1643710 1695737 1624018 1619374 1707657 1630798 1665373 1771861 1837753
15685 1837753 1836323 1774263 1779606 1692188 1661462 1740149 1776614 1791755 1811189 1737821 1726445 1650507
15673 1650507 1696458 1742554 1804273 1852091 1750974 1735187 1768537 1825056 1794719 1771075 1884065
15662 1884065 1891961 1812615 1930537 1908628 1895114 1886078 1800483 1714054 1745106 1746229 1794860 1850354
15650 1850354 1813213 1840119 1775795 1749523 1815359 1740813 1722707 1731974 1754456 1757777 1770456 1830819
15638 1830819 1841776 1773640 1780579 1739440 1765347 1808364 1756520 1818584 1932224 1850751 1835981
15627 1835981 1813405 1689759 1759639 1865445 1808761 1770127 1743245 1753219 1700967 1764264 1860731
15616 1860731 1751474 1743635 1624714 1655893 1741257 1731223 1776388 1762185 1874633 1896902 1789258
15605 1789258 1823642 1731818 1715687 1773094 1777219 1840752 1813467 1730996 1741559 1779603 1826429
15594 1826429 1739384 1656429 1809050 1877574 1901405 1905086 1829246 1792207 1755189 1739145 1742983
15583 1742983 1592539 1750356 1784794 1785767 1842444 1813166 1734038 1665789 1739704 1754947 1774424
15572 1774424 1809507 1755989 1772954 1791070 1758271 1809892 1862701 1835837 1802086 1835770 1748029
15561 1748029 1730484 1736427 1705664 1695057 1754699 1782109 1757024 1717535 1738154 1837922 1938797
15550 1938797 1875318 1760010 1738418 1838195 1917342 1885969 1714731 1793901 1890827 1972932 1871801
15539 1871801 1709872 1754243 1822821 1851702 1760373 1696254 1728917 1759311 1723621 1812163 1848465
15528 1848465 1806512 1710953 1741866 1697514 1643005 1689863 1771525 1762175 1789975 1868920 1837898
15517 1837898 1885987 1942652 1893979 1829555 1740309 1717639 1761892 1856382 1837510 1821581 1735532
15506 1735532 1803562 1810012 1831655 1855046 1883568 1896453 1879779 1771699 1738819 1801844 1781184
15495 1781184 1716329 1842267 1876745 1738319 1792430 1750864 1792540 1747766 1796179 1884328 1882284
15484 1882284 1804438 1898943 1810604 1750142 1700905 1699783 1781207 1704038 1724501 1770437 1651570
15473 1651570 1783791 1727858 1643741 1674451 1716722 1757116 1770012 1822544 1831376 1858549 1842773
15462 1842773 1854071 1810803 1798153 1841724 1844213 1783368 1855363 1913270 1885811 1925457 1877197
15451 1877197 1837747 1884790 1832314 1787377 1833300 1781614 1797685 1737456 1788411 1874588 1883343
15440 1883343 1906978 1781181 1751886 1729461 1761711 1883753 1941006 1914500 1833310 1839063 1826788
15429 1826788 1900585 1926074 1875764 1811845 1888973 1861457 1855723 1841073 1806233 1752226 1719252
15418 1719252 1748510 1754122 1803636 1792668 1766373 1769578 1840165 1818414 1914227 1818153 1864688 1880573
15406 1880573 1826715 1778010 1675904 1634163 1718962 1761229 1711618 1794763 1894544 1854279 1762364
15395 1762364 1823086 1778105 1765058 1794839 1821819 1937399 1803531 1745429 1789667 1716485 1770354
15384 1770354 1821821 1685993 1815676 1816448 1712618 1808666 1891637 1756213 1774097 1843997 1753348
15373 1753348 1774333 1764037 1791250 1816612 1757240 1711022 1838391 1800083 1720114 1888633 1861042
15362 1861042 1900018 2003249 1874192 1795277 1807213 1826663 1893577 1945924 1876533 1818973 1757416
15351 1757416 1736935 1803859 1880089 1840473 1869124 1896360 1866572 1885466 1850391 1788292 1843732
15340 1843732 1896872 1796505 1780075 1796148 1903714 1856566 1750891 1857742 1862180 1844138 1998245
$$ [...]
##END NTUPLES=NMR SPECTRUM
##END=
