##TITLE=1H_DE-80H_X3
 200.13MHz, d2o
 8 sc
 
 19ns.26.2.2025
##JCAMPDX= 6.0         $$ Bruker NMR JCAMP-DX V2.0
##DATA TYPE= NMR SPECTRUM
##DATA CLASS= NTUPLES
##ORIGIN= UXNMR, Bruker Analytische Messtechnik GmbH
##OWNER= pz
$$ XWIN-NMR		Version 3.5
$$ Fri Jun  5 10:40:05 2026 Russian Standard Time (UT+4h)  Yarkov@DPX200
##.OBSERVE FREQUENCY= 200.1313
##.OBSERVE NUCLEUS= ^1H
##.ACQUISITION MODE= SIMULTANEOUS
##.ACQUISITION SCHEME= undefined
##.AVERAGES= 8
##.DIGITISER RES= 18
##SPECTROMETER/DATA SYSTEM= spect
##.PULSE SEQUENCE= zg30
##.SOLVENT NAME= DMSO
##.SHIFT REFERENCE= (INTERNAL, DMSO, 0, 15.4472)
##AUDIT TRAIL= $$ (NUMBER, WHEN, WHO, WHERE, WHAT)
$$ ##TITLE= Audit trail, XWIN-NMR		Version 3.5
$$ ##JCAMPDX= 5.01
$$ ##ORIGIN= Bruker BioSpin GmbH
$$ ##OWNER= Yarkov
$$ C:/Bruker/XWIN-NMR/data/yarkov2/nmr/H-C/1/pdata/1/auditp.txt
$$ ##AUDIT TRAIL=  $$ (NUMBER, WHEN, WHO, WHERE, WHAT)
(   1,<2026-06-05 10:39:02.71 +0400>,<Yarkov>,<DPX200>,
      <created by zg, POWCHK disabled, PULCHK disabled
       configuration hash MD5:
       00 E9 B6 7A A2 85 ED C7 34 08 36 98 17 FE 4E 26
       data hash MD5: 16K
       3B 88 39 17 72 50 50 FD 42 AD 45 DA DB 69 4B DB>)
(   2,<2026-06-05 10:39:10.85 +0400>,<Yarkov>,<DPX200>,
      <Start of raw data processing
       efp BC_mod = 2 LB = 0.25 FT_mod = 6 PKNL = 1 PHC0 = -6376.443 PHC1 = 8.221958 SI = 16K 
       data hash MD5: 16K
       73 52 E3 E9 23 E9 98 AC D5 EB BA 00 43 9A C1 96>)
(   3,<2026-06-05 10:39:21.92 +0400>,<Yarkov>,<DPX200>,
      <abs ABSG = 5 
       data hash MD5: 16K
       6A A5 1B 08 18 C7 DE 8D 9B 3F AF 03 7A 74 DA B1>)
$$ ##END=
$$ 
$$ hash MD5
$$ BC 6C BB 28 69 6A A3 BA B0 41 FC 1F DD 4F 9D 64
##$RELAX= 
##$RELAX= 
##$RELAX= 
##$RELAX= 
##$RELAX= 
##$RELAX= 
$$ Bruker specific parameters
$$ --------------------------
##$DU= <C:/Bruker/XWIN-NMR>
##$EXPNO= 1
##$NAME= <H-C>
##$PROCNO= 1
##$TYPE= <nmr>
##$USER= <yarkov2>
##$AMP= (0..31)
100 100 100 100 100 100 100 100 100 100 100 100 100 100 100 100 100 100 
100 100 100 100 100 100 100 100 100 100 100 100 100 100 
##$AQSEQ= 0
##$AQ_mod= 1
##$AUNM= <au_zg>
##$AUTOPOS= <>
##$BF1= 200.13
##$BF2= 200.13
##$BF3= 200.13
##$BF4= 200.13
##$BF5= 200.13
##$BF6= 200.13
##$BF7= 200.13
##$BF8= 200.13
##$BYTORDA= 1
##$CFDGTYP= 0
##$CFRGTYP= 5
##$CHEMSTR= <none>
##$CNST= (0..31)
1 1 145 1 1 1 1 1 1 1 1 1 1 1 1 1 1 1 1 1 1 1 1 1 1 1 1 1 1 1 1 1 
##$CPDPRG= <>
##$CPDPRG1= <>
##$CPDPRG2= <>
##$CPDPRG3= <>
##$CPDPRG4= <mlev>
##$CPDPRG5= <mlev>
##$CPDPRG6= <mlev>
##$CPDPRG7= <mlev>
##$CPDPRG8= <mlev>
##$CPDPRGB= <>
##$CPDPRGT= <>
##$D= (0..31)
0 0.7 0 0 0 0 0 0 0 0 0 0.03 0 0 0 0 0 0 0 0 0 0 0 0 0 0 0 0 0 0 0 0 
##$DATE= 1780641542
##$DBL= (0..7)
120 120 120 120 120 120 120 120 
##$DBP= (0..7)
150 150 150 150 150 150 150 150 
##$DBP07= 0
##$DBPNAM0= <>
##$DBPNAM1= <>
##$DBPNAM2= <>
##$DBPNAM3= <>
##$DBPNAM4= <>
##$DBPNAM5= <>
##$DBPNAM6= <>
##$DBPNAM7= <>
##$DBPOAL= (0..7)
0.5 0.5 0.5 0.5 0.5 0.5 0.5 0.5 
##$DBPOFFS= (0..7)
0 0 0 0 0 0 0 0 
##$DE= 6
$$ [...]
##$SUBNAM3= <"">
##$SUBNAM4= <"">
##$SUBNAM5= <"">
##$SUBNAM6= <"">
##$SUBNAM7= <"">
##$SUBNAM8= <"">
##$SUBNAM9= <"">
##$SW= 18.0517328524113
##$SWIBOX= (0..15)
0 0 2 0 0 0 0 0 0 0 0 0 0 0 0 0 
##$SW_h= 3612.71676300578
##$TD= 16384
##$TD0= 1
##$TE= 0
##$TE2= 300
##$TE3= 300
##$TEG= 300
##$TL= (0..7)
0 120 120 120 120 120 120 120 
##$TP= (0..7)
150 150 150 150 150 150 150 150 
##$TP07= 0
##$TPNAME0= <>
##$TPNAME1= <>
##$TPNAME2= <>
##$TPNAME3= <>
##$TPNAME4= <>
##$TPNAME5= <>
##$TPNAME6= <>
##$TPNAME7= <>
##$TPOAL= (0..7)
0.5 0.5 0.5 0.5 0.5 0.5 0.5 0.5 
##$TPOFFS= (0..7)
0 0 0 0 0 0 0 0 
##$TUNHIN= 0
##$TUNHOUT= 0
##$TUNXOUT= 0
##$USERA1= <user>
##$USERA2= <user>
##$USERA3= <user>
##$USERA4= <user>
##$USERA5= <user>
##$V9= 5
##$VALIST= <valist>
##$VCLIST= <CCCCCCCCCCCCCCC>
##$VD= 0
##$VDLIST= <DDDDDDDDDDDDDDD>
##$VPLIST= <PPPPPPPPPPPPPPP>
##$VTLIST= <TTTTTTTTTTTTTTT>
##$WBST= 1024
##$WBSW= 4
##$XGAIN= (0..3)
0 0 0 0 
##$XL= 0
##$YL= 0
##$YMAX_a= 774031
##$YMIN_a= -707366
##$ZGOPTNS= <>
##$ZL1= 120
##$ZL2= 120
##$ZL3= 120
##$ZL4= 120
##$ABSF1= 15.50009
##$ABSF2= -2.55176
##$ABSG= 5
##$ABSL= 3
##$ALPHA= 0
##$AQORDER= 0
##$ASSFAC= 0
##$ASSFACI= 0
##$ASSFACX= 0
##$ASSWID= 0
##$AUNMP= <proc_1d>
##$AZFE= 0.1
##$AZFW= 0.1
##$BCFW= 0
##$BC_mod= 2
##$BYTORDP= 0
##$COROFFS= 0
##$CY= -3
##$DATMOD= 1
##$DC= 0
##$DFILT= <>
##$DTYPP= 0
##$F1P= 0
##$F2P= 0
##$FCOR= 1
##$FTSIZE= 16384
##$FT_mod= 6
##$GAMMA= 0
##$GB= 0
##$INTBC= 1
##$INTSCL= 3.241238e-09
##$ISEN= 128
##$LB= 0.25
##$LEV0= 0
##$LPBIN= 0
##$MAXI= 10000
##$MC2= 0
##$MEAN= 0
##$ME_mod= 0
##$MI= 1.114404
##$NCOEF= 0
##$NC_proc= -7
##$NLEV= 6
##$NOISF1= 3.799351
##$NOISF2= 2.8
##$NSP= 0
##$NTH_PI= 0
##$NZP= 0
##$OFFSET= 15.4472
##$PC= 1
##$PHC0= -6376.443
##$PHC1= 8.221958
##$PH_mod= 1
##$PKNL= yes
##$PPARMOD= 0
##$PSCAL= 0
##$PSIGN= 0
##$REVERSE= no
##$SF= 200.130014910769
##$SI= 16384
##$SIGF1= 3
##$SIGF2= 2
##$SINO= 0.751879
##$SIOLD= 32768
##$SREGLST= <19F.Aceton>
##$SSB= 0
##$STSI= 16384
##$STSR= 0
##$SW_p= 3612.71676300578
##$SYMM= 0
##$S_DEV= 0
##$TDeff= 16384
##$TDoff= 0
##$TI= <>
##$TILT= no
##$TM1= 0
##$TM2= 0
##$TOPLEV= 0
##$USERP1= <user>
##$USERP2= <user>
##$USERP3= <user>
##$USERP4= <user>
##$USERP5= <user>
##$WDW= 1
##$XDIM= 16384
##$YMAX_p= 519134848
##$YMIN_p= -830369
$$ End of Bruker specific parameters
$$ ---------------------------------
##NTUPLES= NMR SPECTRUM
##VAR_NAME=  FREQUENCY,     SPECTRUM/REAL,   SPECTRUM/IMAG
##SYMBOL=    X,             R,               I
##VAR_TYPE=  INDEPENDENT,   DEPENDENT,       DEPENDENT
##VAR_FORM=  AFFN,          ASDF,            ASDF
##VAR_DIM=   16384,         16384,           16384
##UNITS=     HZ,            ARBITRARY UNITS, ARBITRARY UNITS
##FACTOR=    0.220516191357247, 1,           1
##FIRST=     3091.44833060085, 0,            0
##LAST=      -521.268432404927, 0,           0
##MIN=       -521.268432404927, -830369,     0
##MAX=       3091.44833060085, 519134848,    0
$$ Real data points
##PAGE= N=1
##DATA TABLE= (X++(R..R)), XYDATA
$$ [...]
7103C815022k21546j72267n6978k2647L6430n5244j13562j09005j75529j79811
7093B744863l3887K33170l17100j68618N2944k31048j87922j54554q006k17504
7083A712338p4624n1947L7485j05163p2829l4346m5306j71806k20343R6321j5972
7072A053808n3595o137k69110M6491O2011o3403L3323j22819P299j4429O4575
7061G38014K848J28700M2726K79603R2686j293J93226P2249k7755P6833m025J17161
7049A710973j60179l37049J30091J59554K8349k95596R6593O5276j78292j77229
7039A042491l00801J54775K98715q6443j88340k76930O464J16487l2098j0685
7029G23635j76573J7181L56818j23123p8536P479J18099k0822q0992m3136Q3222
$$ plain form
7103 3815022 3593476 3421209 3364231 3341584 3378014 3322770 3209208 3100203 2924674 2744863
7093 2744863 2710976 2944146 2627046 2458428 2511372 2280324 2092402 1937848 1929842 1712338
7083 1712338 1637714 1585767 1623252 1518089 1445260 1410914 1365608 1193802 973459 1069780 1053808
7072 1053808 1000213 994076 724966 771457 833468 770065 803388 680569 687868 673439 738014
7061 738014 740862 869562 912288 1191891 1284577 1283284 1476510 1548759 1521004 1597837 1593812 1710973
7049 1710973 1550794 1213745 1343836 1503390 1531739 1236143 1332736 1398012 1219720 1042491
7039 1042491 741690 896465 1195180 1108737 920397 643467 649931 766418 734320 723635
7029 723635 547062 564243 921061 797938 719402 726881 844980 824158 743166 700030 783252
7018G83252K1028q2147J57117L472p4355N4322p1570j4411J77104q126J04801
7007A050487J00964J9377P1456j9831k33288j78094J04951L07682J18108m1508
6997A300304n877n7178j71532J07588O3172k03729j69204j12015J1746K5112m5097
6986G43290j30839O1813J87095j03461k10828n8496K96098J38041r6812p470J01652
6975I20083j8046m7271J48072J95634P4764o2315o7731O9429m4128l5050J80506
6964A313947K4870N7765P7135k03870M6472o8476m6708j04139k27267j96582K00109
6953H73256J0081j23667j26753M7459J28551k57912n2901Q9104N0780P2383J05868
6942H16249K27460j27664j50175l0664J823J76672p4043O6049p1243l2126m6932
$$ plain form
7018 783252 804280 722133 879250 882722 808367 862689 791119 776708 953812 945686 1050487
7007 1050487 1151451 1170828 1242284 1222453 989165 811071 916022 1223704 1341812 1300304
6997 1300304 1294427 1237249 1065717 1173305 1236477 1032748 863544 751529 763275 788387 743290
6986 743290 612451 674264 861359 757898 547070 488574 784672 922713 825901 818431 920083
6975 920083 902037 854766 1002838 1198472 1273236 1210921 1143190 1212619 1168491 1133441 1313947
6964 1313947 1338817 1396582 1473717 1269847 1316319 1247843 1201135 1096996 869729 673147 873256
6953 873256 883337 759670 632917 680376 808927 551015 498114 587218 637998 710381 816249
6942 816249 1043709 916045 765870 735206 737029 913701 839658 905707 834464 802338 755406
6931G55406M0734J23589m2598p4736Q7209K00176J39165M4475J10261J13894K8136
6920A525711J1945k13596l08l299K7303O7622J33178q0626k67869J95229K35382
6909A630672n3619M7127J66739j3747J05478j40456J99725j83338J81522k2902
6899A917201J00898K1177p9467K825n6109O1708P6537J585j01221q9115p4992
6888A781027J93663K5362j32031j60066q250P8864J0062j15668J4930r1646L28468
6877A924715L5185j10488o1871J15613J41424M0833R716j91184o5321J70681j20011
6866A889292p4792j14090Q1018K45829K1016N8559j3805N2067K49731J60252k28498
6855B326579J24066J05543J41531M9062j7053J37037J31639P0957r0758j11120
$$ plain form
6931 755406 796140 919729 877131 802395 889604 1089780 1228945 1273420 1383681 1497575 1525711
6920 1525711 1537656 1324060 1323752 1320453 1347756 1415378 1548556 1467930 1200061 1395290 1630672
6909 1630672 1577053 1624180 1790919 1777172 1882650 1742194 1941919 1758581 1940103 1917201
6899 1917201 2018099 2039276 1959809 1962634 1906525 1968233 2044770 2046355 1945134 1856019 1781027
6888 1781027 1974690 2000052 1868021 1707955 1699705 1778569 1788631 1672963 1687893 1596247 1924715
6877 1924715 1959900 1849412 1787541 1903154 2044578 2085411 2095127 1903943 1838622 2009303 1889292
6866 1889292 1814500 1700410 1781428 2027257 2048273 2106832 2093027 2145094 2394825 2555077 2326579
6855 2326579 2450645 2556188 2697719 2746781 2729728 2866765 2998404 3069361 2978603 2867483
6845B867483P2521j17630J50115P5133m0297J04515j47101J6566J07833R6132
6835C185270q0927P0786R2127M4607j44007o2212m7022J05808J07022K38080j8329
6824C491203K8886o6435k530K8996L0091r1233p0002J24711O2504Q3610J04446
6813C724247N7660Q7223J12621J67335r075J70258K12907o7901J73094J0851K07194
6802D846414J20596J79816L32927J59540P4163K42377L0548K04023L80795J45691
6792F716890J07840J86358k3362Q1801J75101K76444J12957M10596K45637J34681
6782H424943K62673J50239K29845J84511K16313K33248J43149J48127L06915J47254
6772A0447217J44712R590L67035J69027K87473O00281J67274K79135M04233K98007
$$ plain form
6845 2867483 2940004 2822374 2972489 3047622 3007325 3111840 2964739 2981305 3089138 3185270
6835 3185270 3104343 3175129 3267256 3311863 3167856 3105644 3058622 3164430 3271452 3509532 3491203
6824 3491203 3520089 3453654 3451124 3480120 3510211 3418978 3348976 3473687 3536191 3619801 3724247
6813 3724247 3781907 3869130 3981751 4149086 4140011 4310269 4523176 4455275 4628369 4639220 4846414
6802 4846414 4967010 5146826 5479753 5639293 5713456 5955833 5986381 6190404 6571199 6716890
6792 6716890 6824730 7011088 6987726 7069527 7244628 7521072 7634029 8044625 8290262 8424943
6782 8424943 8687616 8837855 9067700 9252211 9468524 9701772 9844921 9993048 10299963 10447217
6772 10447217 10591929 10601519 10968554 11137581 11425054 12025335 12192609 12471744 12875977 13173984
6762A3173984L62970M16875L47699K56154K90325J22485j0250P4869J65348N521
6752A5205980J59247K80530q4223L21891L39767L62138L39391N24719L56222M07110
6742A8212772O65158Q04317O06628N72131J151767J197345J115466J266646J424805
6733B7017035J503545J614211J643364J751013J611272J274048J084144J151153
6725C8649785R99266M25459m846j64221l24800p43437j234543j368720j543775
6716C4690168j497422j396546j597806j779523j813125j640911j456916j510730
6708B1997189j299581j345973j004547p11076n52767q16728r02597q35185o94370
6699A3834365m18078m27650n30614l23220k94362l99724l00654k95202j59597
$$ plain form
6762 13173984 13536954 13953829 14301528 14557682 14848007 14970492 14960242 15035111 15200459 15205980
6752 15205980 15365227 15645757 15561534 15883425 16223192 16585330 16924721 17449440 17805662 18212772
6742 18212772 18877930 19682247 20288875 20861006 22012773 23210118 24325584 25592230 27017035
6733 27017035 28520580 30134791 31778155 33529168 35140440 36414488 37498632 38649785
6725 38649785 39649051 40074510 40069664 39905443 39580643 38837206 37602663 36233943 34690168
6716 34690168 33192746 31796200 30198394 28418871 26605746 24964835 23507919 21997189
6708 21997189 20697608 19351635 18347088 17636012 17083245 16266517 15363920 14528735 13834365
6699 13834365 13416287 12988637 12458023 12134803 11840441 11440717 11140063 10844861 10685264
6690A0685264k81848j58594k7549k2826q7147q4411K64375K68670j59701k11545
6680A0184688j08794M4993p068j15016k8584k6246P9337j07646j78659j31633
6670I605372N1368J22402n0893N5982J76579J50610R2536P7453K38597J15586
6660A0635592J1087O5944K6158K30321J88691K54283j36320k04752n8647l37923
6650A0674434m35148k00148k09293l76739n0397l52592j56962k55847n0900p6580
6640H509828k43015j01115p7479o219O0215O3006k39986k2042K4215j23618j12352
6629G731438j29398k87463k77758j81365k31658k02096k09788n66980j89870j37744
6619E317318k17189l26133l37932l7975k6295q9660J5412j46605L6635q8404m8031
$$ plain form
6690 10685264 10403416 10244822 10217273 10194447 10107300 10022889 10287264 10555934 10396233 10184688
6680 10184688 10075894 10120887 10113819 9998803 9970219 9943973 10023310 9915664 9737005 9605372
6670 9605372 9656740 9779142 9728249 9784231 9960810 10111420 10203956 10281409 10520006 10635592
6660 10635592 10646679 10712623 10738781 10969102 11157793 11412076 11275756 11071004 11012357 10674434
6650 10674434 10239286 10039138 9829845 9453106 9402709 9050117 8893155 8637308 8586408 8509828
6640 8509828 8266813 8165698 8088219 8082000 8142215 8205221 7965235 7943193 7967408 7843790 7731438
6629 7731438 7602040 7314577 7036819 6855454 6623796 6421700 6211912 5644932 5455062 5317318
6619 5317318 5100129 4773996 4436064 4398089 4371794 4282134 4297546 4150941 4187576 4099172 4051141
6608D051141p0335J26603m0257m6863Q5291j19498K5071j2310m2713j34523j83840
6597C637767o3335K26979K6682J44546K32297j19345j21722n8827N694j10420
6587C800316q550O699k45584m0851k7982J57053N5866L8733K51329K89523K41585
6576D518137j55070j85329J26361J06500J23712J0618j05782N4530k71579n3598
6566D168500K15284n1505J2103J76204L2314J21360J8896M3109Q0323J33114j3809
6555D935893j65792J74406K04531L00064O6868j78326n5909K01881M14567K60766
6545F158949J81822M58933L47541P64107N82659P48369O36252Q30012R41153R12959
6535A2562756P34477P57494R61880P21749O87152M61667M91003M54809N03158
$$ plain form
6608 4051141 3980806 4107409 4067152 4020289 4105580 3986082 4011153 3998843 3956130 3821607 3637767
6597 3637767 3574432 3801411 3828093 3972639 4204936 4085591 3963869 3905042 3910736 3800316
6587 3800316 3791766 3798465 3552881 3512030 3484048 3641101 3696967 3735700 3987029 4276552 4518137
6576 4518137 4363067 4177738 4304099 4410599 4534311 4544929 4439147 4493677 4222098 4168500
6566 4168500 4383784 4332279 4344382 4520586 4552900 4674260 4693156 4736265 4816588 4949702 4935893
6555 4935893 4770101 4944507 5149038 5449102 5515970 5337644 5281735 5483616 5898183 6158949
6545 6158949 6340771 6799704 7147245 7911352 8494011 9242380 9878632 10708644 11649797 12562756
6535 12562756 13297233 14054727 15016607 15738356 16425508 16887175 17378178 17832987 18336145
6526A8336145L15514N42112M42944K38935K67004L9197Q2668L00532J71755K81882
6516B1018688J14137k5923k67166l76057m13262p85911o07493n05827l08020m13688
6506A7429478m66227n30930o40312p20085q15619q75709r11055j072595q49097
6497A0547849q42567q63358q45085o33621j61183m22174o28021l11114k45010
6488E595716j69001j28649k15390j50667j19187j14971j25967j26638j8572J45459
6478D572133O0722K3985l0516l9830J69923L39764J17091J26978k9164Q4589K14314
6467E609989L0207P0286Q9062r00m0220j10415k19158q1443p5679p1070k23052
6456D977607j86226Q6376m6506q7080k21258J15302j59175J31342Q4360J7399
$$ plain form
6526 18336145 18651659 19193771 19636715 19875650 20142654 20181851 20264519 20565051 20736806 21018688
6516 21018688 21132825 21106902 20839736 20463679 20050417 19264506 18657013 18151186 17843166 17429478
6506 17429478 16963251 16432321 15792009 15071924 14256305 13380596 12469541 11396946 10547849
6497 10547849 9705282 8841924 7996839 7363218 7202035 6779861 6151840 5840726 5595716
6488 5595716 5426715 5298066 5082676 4932009 4812822 4697851 4571884 4445246 4426674 4572133
6478 4572133 4632855 4656840 4626324 4586494 4756417 5096181 5213272 5340250 5311086 5395675 5609989
6467 5609989 5640196 5710482 5799544 5798644 5758424 5648009 5428851 5347408 5271729 5200659 4977607
6456 4977607 4791381 4877757 4831251 4744171 4522913 4638215 4479040 4610382 4694742 4712141
6446D712141R7341L1903j02410o4699k3020j8584p7304m5907p1936j03535M85526
6435D819516J07318J92558K53455J81210K32949J61837j84642J16302m6099j15667
6425E718737J47221q8223l77609j52719K23366l53066o8072K10354M1841M9890
6415E351720J50654J06619P47n2566P1044R7635L2023L86247J46241J89663N06154
6404F986181K89853L17090J09961k37724o5921L27370P5146J9164Q479l258o7809
6393G758532K07976m6082J08518J49689J1910Q6627j38841j84715j21828k58572
6383G573214j39143J85829J10557O0038K25649J66630j66194k9193k4301M5915
6373H009001J31353j10155k91606j64204k86213k80318l09017j83811m60920o2224
$$ plain form
6446 4712141 4809482 4841385 4738975 4674276 4651256 4632672 4555368 4509461 4437525 4333990 4819516
6435 4819516 4926834 5119392 5372847 5554057 5787006 5948843 5764201 5880503 5834404 5718737
6425 5718737 5865958 5777735 5400126 5247407 5470773 5117707 5049635 5259989 5301830 5351720
6415 5351720 5502374 5608993 5609740 5557174 5628218 5725853 5757876 6144123 6290364 6480027 6986181
6404 6986181 7276034 7593124 7703085 7465361 7399440 7726810 7801956 7821120 7829599 7826341 7758532
6393 7758532 7966508 7920426 8028944 8178633 8190543 8277170 8138329 7953614 7831786 7573214
6383 7573214 7434071 7619900 7730457 7790495 8016144 8182774 8016580 7987387 7963086 8009001
6373 8009001 8140354 8030199 7738593 7574389 7288176 7007858 6698841 6515030 6054110 5991886
6363E991886P198q9002J45694J14332n0629k5324J31983J63882O1921J39585j2091
6352F579435k0394j91096K60254J02417J17789K11216K33091J33542J58845J50474
6342G735573K65162K74371r5455K30976Q055Q3541K48732J83283L7112J24646
6332I095996K30569P5683J41276K13126j4063J98402L35128J87702K25934L20967
6322A1010720K83536J78532J70780L37973K778J4652j59276r5770l8974L589J50261
6311A1858801k13750k8980J85080j4439k15707k88441O7409j03600j59963Q4811
6301A1171221J18581P737j21299J04483J89259m0812q6301j49986k06047L7362
6291A1024198j64620j50530k69795l07658j3626l76181k73110j85307O195J9739
$$ plain form
6363 5991886 5999084 5910082 6055776 6170108 6119479 6094155 6226138 6390020 6451941 6591526 6579435
6352 6579435 6559041 6367945 6628199 6730616 6848405 7059621 7292712 7426254 7585099 7735573
6342 7735573 8000735 8275106 8179651 8410627 8418682 8502223 8750955 8934238 8971350 9095996
6332 9095996 9326565 9402248 9543524 9756650 9742587 9940989 10276117 10463819 10689753 11010720
6322 11010720 11294256 11472788 11643568 11981541 11984319 11998971 11839695 11743925 11704951 11708540 11858801
6311 11858801 11645051 11616071 11801151 11786712 11571005 11282564 11349973 11246373 11086410 11171221
6301 11171221 11289802 11297539 11176240 11280723 11469982 11429170 11342869 11192883 10986836 11024198
6291 11024198 10859578 10709048 10439253 10131595 10117969 9741788 9468678 9283371 9289566 9309305
6281I309305r4099j53205l72J10890k49490q597j15916J46287K94090J85403n3323
6270I370973j852L83467N17549L34778J96632K02929K3412K44711K74653L60395
6260A1907647L11104n6398j7905q9076k10478j34869l56262l25200l00244l00172
6250A0428147q014J66008O5413n300L65500M50111M13873L92783K93983k115P6
6239A2560465K19949j05931k93046l77188j20431m2808o9650j73603o941k42619
6229A1348197N4456m9347k74912j49112m1671j73657j995M7836o4319J14708j36863
6218A0673321l06091M9780q0234K43333L45314K07783Q3559N0844L12949J08008
6208A1688566L58957N3626J52675L6975J56453N9151o6615J57622O0664J34153
$$ plain form
6281 9309305 9215206 9062001 9061629 9172519 8923029 8914432 8798516 8944803 9238893 9424296 9370973
6270 9370973 9369121 9752588 10270137 10604915 10801547 11004476 11027888 11272599 11547252 11907647
6260 11907647 12218751 12162353 12144448 12055372 11844894 11710025 11353763 11028563 10728319 10428147
6250 10428147 10420133 10586141 10651554 10646254 11011754 11461865 11875738 12268521 12562504 12560389 12560465
6239 12560465 12780414 12674483 12381437 12004249 11883818 11841010 11771360 11597757 11590816 11348197
6229 11348197 11402653 11353306 11078394 10929282 10887611 10713954 10711959 10759795 10695476 10810184 10673321
6218 10673321 10367230 10417010 10336776 10580109 10925423 11133206 11216765 11267609 11580558 11688566
6208 11688566 12047523 12101149 12253824 12290799 12447252 12506403 12439788 12597410 12658074 12792227
6198A2792227n1047K48854N67694K89670M04318N46942P20013N68601J113774
6189A7201046Q76200O08443P60408n097l48679o05404n74084k34738m69981o83887
6179A6524227n10579m6283J9440P6793M87139M64831N12194P29716K81502M3273
6169A8582253k67495p43889m49961n53747o50503o18869o55418n87591m48209
6160A3606571j02642k90987K0914J53504p9050J35364j5298k73240q2847q0784
6150A2991505k62085k09774j49245m46966j65738j6288J71363r6737k20549j13421
6140A1482065r7319L5112R165p698k24212K68181K36385m3414j79906K04481j62404
6129A1520436J31513J21366j30412K78208r638J41122J63434J24865J22839L71289
$$ plain form
6198 12792227 12741180 12990034 13557728 13847398 14251716 14798658 15518671 16087272 17201046
6189 17201046 18077246 18685689 19446097 19441000 19092321 18486917 17912833 17678095 17208114 16524227
6179 16524227 16013648 15967365 15986805 16063598 16550737 17015568 17527762 18257478 18538980 18582253
6169 18582253 18314758 17570869 17120908 16567161 15916658 15297789 14642371 14054780 13606571
6160 13606571 13503929 13212942 13233856 13387360 13308310 13443674 13428376 13155136 13072289 12991505
6150 12991505 12729420 12519646 12370401 11923435 11757697 11741409 11912772 11816035 11595486 11482065
6140 11482065 11384746 11419858 11429023 11421325 11197113 11465294 11701679 11658265 11478359 11682840 11520436
6129 11520436 11651949 11773315 11642903 11921111 11911473 12052595 12216029 12340894 12463733 12835022
6119A2835022K68180K54882K33522j4521M3182L67416K37322K19210r605K45185
6109A4679795N09566J83413K52214M86545P32205J127248J188473J002963J040563
6100B1202985N88517P2626k83512l86954k46033o27289n20980k20431k18057j9293
6090A9341579k11466j76041o953J95544K63130L12611M85190R77621R98140R74465
6080B3153820O86350N11799K9816n99478m51048m78055n71562l84521l50403j68116
6070B1378602l53946Q8330K80521l7653k60079m05313n34415p49856n37618j45536
6060A8723037k18141k63748k26079l16970m33048l57353j74478j83716k55761
6051A6293743r1523K5539K52856K05536j2793J73780K11809l3840K74166r8498
$$ plain form
6119 12835022 13103202 13358084 13591606 13577085 13620267 13987683 14225005 14444215 14434610 14679795
6109 14679795 15189361 15372774 15624988 16111533 16843738 17970986 19159459 20162422 21202985
6100 21202985 21791502 21864128 21580616 21193662 20947629 20320340 19799360 19578929 19360872 19341579
6090 19341579 19130113 18954072 18947119 19142663 19405793 19718404 20203594 21181215 22179355 23153820
6080 23153820 23840170 24351969 24381785 23782307 23331259 22853204 22281642 21897121 21546718 21378602
6070 21378602 21024656 21112986 21393507 21355854 21095775 20690462 20156047 19406191 18868573 18723037
6060 18723037 18504896 18241148 18015069 17698099 17265051 16907698 16733220 16549504 16293743
6051 16293743 16202220 16227759 16480615 16686151 16673358 16847138 17058947 17025107 17299273 17200775
6041A7200775j38647K92389K2901J03833Q1585K08345L56936O39828O67061Q43647
6031B0278653O58181O38370L26810K67215K23649j28913q0213o7388j77243q4555
6021B1854566q6942R5780K73275L96731O99658M77294M57299M11265K91935M18316
6011B5289177L73368O45787O72118L00833k07955n02939o60414p48022n56916
6002B4605037o18212q35704o92520n05432m59412k82859m00433o17464l10168
5993A9882833K6753j47551p55642k11949l6609q9410J8518m6980k28357k25942
5983A8185664K5728O4999R9031L4629J86984K51738K18096M36344K75267p0264
5973A9708216j38680j18403o6761m0696m6250L3563j6762J88210K89101K10058
$$ plain form
6041 17200775 17062128 17354517 17377418 17481251 17562836 17771181 18128117 18767945 19435006 20278653
6031 20278653 20936834 21575204 21902014 22169229 22392878 22263965 22183752 22116364 21939121 21854566
6021 21854566 21767624 21863404 22136679 22533410 23233068 23710362 24167661 24578926 24870861 25289177
6011 25289177 25662545 26308332 26980450 27281283 27073328 26570389 25909975 25161953 24605037
6002 24605037 23986825 23151121 22458601 21953169 21493757 21210898 20810465 20193001 19882833
5993 19882833 19909586 19762035 19006393 18794444 18757835 18668425 18686943 18639963 18411606 18185664
5983 18185664 18211392 18276391 18375422 18410051 18597035 18848773 19066869 19503213 19778480 19708216
5973 19708216 19569536 19451133 19384372 19343676 19297426 19330989 19314227 19502437 19791538 20001596
5963B0001596N27590Q8807K81143L48801K31463j17210k85014k73463o1596r7073
5953B0645044j84763J01722K59283J55011L04419K06498J99048k0828m17649m76572
5943B0771213k44522j12132j80866n4193p3162K72575M30943M62510M96744K55129
5933B2024239q9269k92897j19185R9862j4965l09405m19494j73149j47667l54300
5923B0203770k19947p8095J17570M01135P10968O45736K56549M20490M09161K59977
5913B3127314j51199k94061j09295M17606K32475Q9358K56641J77409J72192L11576
5903B4230016M06450K56674K47469J41872J24361j00717m6867n07760n75996m42089
5893B3733413p70025m42880p24033r15160m44602k05972m48856k25601j18029
$$ plain form
5963 20001596 20529186 20617993 20899136 21247937 21479400 21362190 21077176 20803713 20742117 20645044
5953 20645044 20460281 20562003 20821286 20976297 21280716 21487214 21686262 21665434 21247785 20771213
5943 20771213 20526691 20414559 20233693 20179500 20106338 20378913 20809856 21272366 21769110 22024239
5933 22024239 21934970 21642073 21522888 21622750 21607785 21298380 20878886 20705737 20558070 20203770
5923 20203770 19983823 19905728 20023298 20424433 21135401 21781137 22037686 22458176 22867337 23127314
5913 23127314 22976115 22682054 22572759 22990365 23222840 23312198 23568839 23746248 23918440 24230016
5903 24230016 24636466 24893140 25140609 25282481 25406842 25306125 25259258 24751498 24175502 23733413
5893 23733413 22963388 22520508 21796475 20881315 20436713 20230741 19781885 19556284 19438255
5884A9438255j85287K9521K3443j00813j9021m9849l1456L50q8916j99626r790
5873A8806811Q6849O2845Q8309J42489j02731P1709L21181N00200L41932P2603
5863B0392197J76662Q1025k35272j40656o547j34665M0402M7999K5910N4494m28019
5852A9873530m44756j53702m76852l16441l40205l13514k56517o7074K3789J31949
5842A7660207l2382J06679K06861M7668l862l9651p3720j89818j02541K8772k48162
5831A7360051l76850o0467j17466q4789M2733J69017j33547K86059L98313K31277
5821A7714331K81262P1207J25990J45418j01560k96078N4086K24319L29341j70995
5811A8377321K26964k09703J00492N4922j92441j64263J09895K65116K23625P8442
$$ plain form
5884 19438255 19252968 19282489 19305932 19205119 19186098 19136249 19104793 19105143 19016227 18816601 18806811
5873 18806811 18893660 18956505 19044814 19187303 19084572 19156281 19477462 19977662 20319594 20392197
5863 20392197 20568859 20649884 20414612 20273956 20267409 20132744 20173146 20221145 20247055 20301549 19873530
5852 19873530 19428774 19275072 18798220 18481779 18141574 17828060 17571543 17504469 17528258 17660207
5842 17660207 17627825 17734504 17941365 17989033 17985171 17945520 17871800 17681982 17579441 17608213 17360051
5831 17360051 16983201 16922734 16805268 16720479 16763212 16932229 16798682 17084741 17483054 17714331
5821 17714331 17995593 18066800 18192790 18338208 18236648 17940570 17994656 18218975 18548316 18377321
5811 18377321 18604285 18394582 18495074 18549996 18357555 18193292 18303187 18568303 18791928 18870370
5801A8870370P804k39832m38093j10658J6972J48022J23923K79292L81674P00592
5791A9740066L73153j11981l72258m43920o73988m65456n66222n07555m94264
5782A6477575p3546j40062j38355J6636l4685k98845j06857J98739K24284K36569
5772A6361453J00167q9293J54083J50900l2843j01190j70337J26803K81688L22414
5762A7103845J14935j54577k26257j89368l22360m02522l28689k08322L84461
5753A5771146M16559N21170O09683M49999J74300k74530k05467n04375k29721
5744A6728764K8047r9837K41757K87084J58550J67532J97543J99573k24659k83895
5734A7400459k88130m28677n28972n21067k04149l21193k92819l11584o2211J19414
$$ plain form
5801 18870370 18878174 18638342 18200249 18089591 18106563 18254585 18378508 18657800 19039474 19740066
5791 19740066 20113219 20001238 19628980 19185060 18511072 18045616 17479394 16971839 16477575
5782 16477575 16404029 16263967 16125612 16142248 16107563 15808718 15701861 15900600 16124884 16361453
5772 16361453 16461620 16372327 16526410 16677310 16644467 16543277 16372940 16499743 16781431 17103845
5762 17103845 17218780 17064203 16837946 16648578 16326218 15923696 15595007 15386685 15771146
5753 15771146 16187705 16708875 17318558 17768557 17942857 17668327 17462860 16958485 16728764
5744 16728764 16756811 16656974 16898731 17185815 17344365 17511897 17709440 17909013 17684354 17400459
5734 17400459 17112329 16683652 16154680 15633613 15429464 15108271 14815452 14503868 14441657 14561071
5724A4561071k8501K24473L0918L6714J8734K91707L90001J87370K95864L44563
5714A6352914N02373M29613L30100O73283R23033J246434J772397K491405L543977
5705B8265529L809667K240582K15122o97681j836063k398207j889982j777088
5697B5931879j746396j760500j802101j596214j025744l13244n05811l86076J42273
5688A6938066O64877R42373Q76185Q08611J87094k99329m59627l59825m47293
5679A8851132o14317n50587k68405j26702k8837q8838J43196N6554J60492Q4707
5669A7618395j5213Q9404p2911j44924n2754l1295j69083k80154j55929l4732
5659A6750804k04194j8827m40440k13953P1859L4325J90414L42210M19196K82372
$$ plain form
5724 14561071 14532570 14757043 14787961 14824675 14843409 15135116 15525117 15712487 16008351 16352914
5714 16352914 16855287 17284900 17615000 18288283 19211316 20457750 22230147 24721552 28265529
5705 28265529 32075196 34315778 34530900 33833219 31997156 29598949 27708967 25931879
5697 25931879 24185483 22424983 20622882 19026668 18000924 17687680 17181869 16795793 16938066
5688 16938066 17602943 18545316 19421501 20230112 20417206 20117877 19658250 19298425 18851132
5679 18851132 18236815 17686228 17417823 17291121 17262284 17173446 17316642 17373196 17533688 17618395
5669 17618395 17603182 17692586 17619675 17474751 17421997 17390702 17221619 16941465 16785536 16750804
5659 16750804 16546610 16527783 16087343 15873390 15945249 15979574 16169988 16512198 16931394 17213766
5649A7213766K66865N05131M70368N10457N80136L94520K70279P8606L25509J68301
5639B0783938l12210j12454q4138l91171m66852l87644k97536j870M1242k50978
5629A8520327L30825J72054k35151j44091l0759K8294N5605K29215K98821M74364
5619A9699504j29073k69654m50229m02914k28114j76628K50081l13175k30622
5610A7749176k88456n3560r1285k84152o2224j36413j9670j23113k84531o9599
5600A6336173M28673K5191M15382P25882P20266N70542L43224J61745r2625o4723
5590A9569730K14562L3052k8845R279J89066j35111J43668N44164P31790O62623
5580B1933978K79926j58761n57212o80998q61364p85470o03266m76760n70411
$$ plain form
5649 17213766 17480631 17985762 18456130 18966587 19546723 19941243 20211522 20290128 20615637 20783938
5639 20783938 20471728 20359274 20275136 19883965 19417113 19029469 18731933 18730063 18771305 18520327
5629 18520327 18851152 19023206 18788055 18643964 18613205 18641499 18697104 18926319 19225140 19699504
5619 19699504 19570431 19300777 18850548 18447634 18219520 18042892 18292973 17979798 17749176
5610 17749176 17460720 17407160 17315875 17031723 16969499 16833086 16813416 16690303 16405772 16336173
5600 16336173 16764846 16790037 17205419 17931301 18651567 19222109 19565333 19727078 19634453 19569730
5590 19569730 19784292 19817344 19788499 19797778 19986844 19851733 19995401 20539565 21271355 21933978
5580 21933978 22213904 22055143 21497931 20816933 19955569 19170099 18566833 18090073 17519662
5571A7519662j31238o7901J90877L94676M40826P67659J317940J131590O67284
5562B2231375J57267l78071n99592o57812n54183o11700o30329l77586k08806
5553A8370563J14321O05269P41919N70972P16116K1073n10934n69916n59279p23930
5543A8776174p53841n82447l59529m90079l16932l49498k40169j34302q7847L5834
5533A5497364j25417J09203P1051j45752j11731q0660m66303k67332j96624r5385
5523A4188414j86659l12022J21232K66888M15131L51648J73146J9244k82463j92311
5513A4562248L44148L8841j28705K03549L15237J26886K36862R0612Q5307k22911
5503A5652074n6043l7015k52283j05166p6180j95761k73862k19081l03254l14182
$$ plain form
5571 17519662 17388424 17320523 17511400 17906076 18346902 19114561 20432501 21564091 22231375
5562 22231375 22388642 22010571 21410979 20753167 20198984 19587284 18956955 18579369 18370563
5553 18370563 18484884 19090153 19832072 20403044 21119160 21140233 20629299 20059383 19500104 18776174
5543 18776174 18022333 17439886 17080357 16590278 16273346 15923848 15683679 15549377 15461530 15497364
5533 15497364 15371947 15481150 15552201 15406449 15294718 15214058 14747755 14480423 14283799 14188414
5523 14188414 14001755 13689733 13810965 14077853 14492984 14844632 15017778 15037022 14754559 14562248
5513 14562248 14906396 14945237 14816532 15020081 15335318 15462204 15699066 15789678 15874985 15652074
5503 15652074 15596031 15559016 15306733 15201567 15125387 14929626 14655764 14436683 14133429 13819247
5493A3819247m11617l3800k20955k48941j03275J41823J32318J50887K77415J6128
5483A3519230N7849K45832K01334L54669K52765M03503K60605N48024M64414N05099
5473A6813324M64248M28586K94446L59266K92844M17399K45205K8028K28282k02189
5463A9369439O2759j10157m61523l61251l83106j74499j4583k21995k34234M0225
5453A7511075j05733K0579k10053l10980l0521J54480K88865L59559M28504M44124
5443A8549899Q19245J101770J493518J560640J567888J532957J457070J071543
5435B9154530R45585N50240O90857O63316L49351J70308O0176n571n29365m90815
5425C1558612m23551o86764m73674k42538m55115n72969k45176P0053p0861L1280
$$ plain form
5493 13819247 13407630 13373830 13152875 12903934 12800659 12942482 13074800 13225687 13503102 13519230
5483 13519230 13577079 13822911 14024245 14378914 14631679 15035182 15295787 15843811 16308225 16813324
5473 16813324 17277572 17706158 18000604 18359870 18652714 19070113 19315318 19343346 19571628 19369439
5463 19369439 19432198 19322041 18860518 18499267 18116161 17941662 17927079 17705084 17470850 17511075
5453 17511075 17405342 17425921 17215868 16904888 16874367 17028847 17317712 17677271 18105775 18549899
5443 18549899 19369144 20470914 21964432 23525072 25092960 26625917 28082987 29154530
5435 29154530 30100115 30650355 31341212 32004528 32353879 32524187 32584363 32578792 32049427 31558612
5425 31558612 31135061 30448297 29974623 29732085 29276970 28704001 28458825 28528878 28458017 28489297
5415B8489297K48247O26468O43040O57655J61470L0649J31635j93152k54321m5632
5405C0495356L3376M30082K72546J27067L35259P19370L74903N70560Q84672N22209
5395C4765400P16766M21494P8365n1677m02325l3128J13446K99974K58897L61455
5385C6528667M03682K14502K2911J8031r3186L38527O58564j3578K53363J13379
5375C8444862L45847Q19929R08376J339587K171341K907382L450905K796453J902418
5366E5087100Q09210m04291r51932j090283j164364q74860j252185j167461j151542
5357D7839392j142639j375078j153772q70298q10855n39481k54867l8804N26590
5348D2180188M52324Q92916R94318R47786K62684K6280n4790j78958k37450j58587
$$ plain form
5415 28489297 28737544 29364012 30007052 30664707 30826177 30856826 30988461 30795309 30540988 30495356
5405 30495356 30528732 30958814 31231360 31358427 31693686 32413056 32787959 33358519 34243191 34765400
5395 34765400 35482166 35903660 35982025 35930348 35528023 35494895 35608341 35908315 36167212 36528667
5385 36528667 36932349 37146851 37169762 37187793 37094607 37433134 38091698 38078120 38331483 38444862
5375 38444862 38790709 39610638 40519014 41858601 44029942 46937324 50388229 53184682 55087100
5366 55087100 55896310 55492019 54540087 53449804 52285440 51410580 50158395 48990934 47839392
5357 47839392 46696753 45321675 44167903 43297605 42486750 41947269 41692402 41653598 42180188
5348 42180188 42632512 43525428 44519746 45467532 45730216 45756496 45701706 45522748 45285298 45126711
5338D5126711j05005j90465n9061Q1323J39812J85010J31714K7773R589p1230
5328D5276171m13856m67520o26483o81823r73166q59265r35196r36493o38530
5319C8743839p16164o62561n15279m73298o18203k12358k89453k86187j34032
5310C4836304P3413K73416P34929O31539Q08319O41493O73750Q91873J114531
5301D0679567Q70095P49311R10463J276185Q40154J086995R32905Q09944O45216
5292D8800835M73302p7168l81921p12860m77961r26998j065759q28613q29546
5283D3973311q04712r10820q79229q06879n72445p97965m26279k50962k0327J73400
5273C8677093M09009N28271L34029R6352m9782j25968j92409n60643m42458o62505
$$ plain form
5338 45126711 45021706 44831241 44772180 44853503 44993315 45178325 45310039 45337812 45347401 45276171
5328 45276171 44862315 44394795 43768312 43086489 42113323 41254058 40318862 39382369 38743839
5319 38743839 38027675 37365114 36849835 36376537 35758334 35545976 35256523 34970336 34836304
5310 34836304 34909717 35183133 35918062 36549601 37357920 37999413 38673163 39565036 40679567
5301 40679567 41549662 42298973 43209436 44485621 45325775 46412770 47345675 48155619 48800835
5292 48800835 49274137 49196969 48815048 48102188 47624227 46697229 45631470 44802857 43973311
5283 43973311 43168599 42257779 41378550 40571671 39999226 39201261 38774982 38524020 38503693 38677093
5273 38677093 39086102 39614373 39948402 40044754 39994972 39869004 39676595 39115952 38673494 38010989
5263C8010989p35223p44311q21708q33177r24668q07141r45630o42011n71170
5254C0985950l56932m26065J99399K16014L67538M37637K21864K08304L46360
5245C2200069K41849L84837M86224P05727P07865N30258J17442O9919o791l20317
5235C5117082K5251j8743O6315l5345J16385L18896N00251L87141R6359j3281
5225C6560311m64l85607m95205m05942n07807n32663l85675l40455j62293J76708
5215C3520908L42909O24286N86063J90119M72397o1103J30371J32123L6581n1821
5205C5922833l70520k16106k2751J04778M93213O26533M99311M04538M36703N52086
5195C8430618O84698M54090K49336j98493k29140m73342n25120m31302m52020
$$ plain form
5263 38010989 37275766 36531455 35709747 34876570 33951902 33144761 32199131 31557120 30985950
5254 30985950 30629018 30202953 30402352 30618366 30985904 31423541 31645405 31853709 32200069
5245 32200069 32441918 32826755 33312979 34018706 34726571 35256829 35374271 35444190 35437399 35117082
5235 35117082 35142333 35123590 35189905 35154560 35270945 35589841 36090092 36477233 36573592 36560311
5225 36560311 36559847 36174240 35679035 35273093 34765286 34232623 33846948 33506493 33344200 33520908
5215 33520908 33863817 34488103 35074166 35264285 35736682 35675579 35805950 35938073 35974654 35922833
5205 35922833 35552313 35336207 35313456 35418234 35911447 36537980 37037291 37441829 37878532 38430618
5195 38430618 39115316 39569406 39818742 39620249 39391109 38917767 38392647 37961345 37509325
5186C7509325m25802m89230l29903l30071n25414n67421m43618l40728l23625
5177C3733513j91714n55295o6785K46221k6141J69963K71536K04127L56277O77810
5167C4819512O15055M98251N30880K95276K84634L31872J53352J17010J56148
5158C7801990J47231J33200o6075j36594k41224n50236p35392q02290p86558o39707
5148C4124345o92114o10867n40570o91927o92491n91717j42588k83852k38684
5139B9639535m96011m40729k1000j29323k84432m84632m67212M4066r8018R0075
5129B7352319r6854Q2170j6506M7506k82498n88063j9209m7426l41860k41783
5119B5847796J12397k47025k65778j05480j74090m84610j83197k57383j99694
$$ plain form
5186 37509325 37083523 36594293 36264390 35934319 35408905 34841484 34397866 34057138 33733513
5177 33733513 33541799 32986504 32919719 33165940 33139799 33309762 33581298 33785425 34141702 34819512
5167 34819512 35434567 35932818 36463698 36758974 37043608 37375480 37528832 37645842 37801990
5158 37801990 37949221 38082421 38016346 37879752 37638528 37088292 36352900 35550610 34764052 34124345
5148 34124345 33432231 32821364 32280794 31588867 30896376 30304659 30162071 29878219 29639535
5139 29639535 29143524 28702795 28681795 28552472 28268040 27783408 27316196 27360262 27262244 27352319
5129 27352319 27255465 27337635 27321129 27368635 27086137 26498074 26478865 26431439 26089579 25847796
5119 25847796 25960193 25713168 25447390 25341910 25167820 24683210 24500013 24242630 24042936
5110B4042936k16097k82602j63117j83757k0407j49690p4226j27680R0504J15446
5100B3031310k6647N2208L01665L12867N23263Q86235P58657O33279N93258J66807
5090B7232902K57278p7693j18752j95797k94466l09945n6080k0620Q858k5940
5080B6399745n3037L31843J85012J17145Q5502J09460L26615L24719K77907L15881
5070B8420792K96870M85194M12497N97114L96934K25449M30836L96054M99876
5061C2161616O86551M36488O72649Q10410O28364K70160L68456J49641o5095K16257
5051C6335497K33044K76447K37600L60334M76330N35514P68919Q31928O87789
5042D0743402P85454R93515Q22925L79177M1276k11532m12552k87174k6322j87826
$$ plain form
5110 24042936 23826839 23544237 23381120 23197363 23176956 23027266 22953040 22825360 22915864 23031310
5100 23031310 23004663 23056871 23358536 23671403 24194666 25080901 25839558 26472837 27066095 27232902
5090 27232902 27490180 27412487 27293735 27097938 26803472 26493527 26437447 26416827 26425685 26399745
5080 26399745 26346708 26678551 26863563 26980708 27066210 27175670 27502285 27827004 28104911 28420792
5070 28420792 28717662 29202856 29615353 30212467 30609401 30834850 31265686 31661740 32161616
5061 32161616 32848167 33284655 33957304 34767714 35396078 35666238 36034694 36184335 36119240 36335497
5051 36335497 36568541 36844988 37082588 37442922 37919252 38454766 39223685 40055613 40743402
5042 40743402 41528856 42522371 43345296 43724473 43765749 43554217 43141665 42854491 42828169 42640343
5032D2640343j00357N1460K6574L32785O6980K08806N17766L40090N22284M91549
5022D5098280L34771P4650k43461l56971k61534j94612j851J65234J80276O7683
5012D4862465L3626p3441k7989r2299q7981L00729O74311N90918O11972P18590
5002D7510901P53883P74586O76855O47035P23875M99494M18322K86525O6591P735
4992E2365802j11924Q6544J54829M2003M4736R8144K98247N1792j35364l56192
4982E2538617l94340j68523j648K52455K69343K57598M33422L69192M26300K63480
4972E4245896K39355L481m3430L94385J41513M34703J93616k1950k69445p18833
4962E4599291q18459o87136p01611p28847p84767o70916k65205m46438j56128
$$ plain form
5032 42640343 42539986 42591446 42618020 42950805 43017785 43226591 43744357 44084447 44606731 45098280
5022 45098280 45433051 45507701 45264240 44907269 44645735 44451123 44449272 44614506 44794782 44862465
5012 44862465 44896091 44822650 44794661 44702362 44614381 44915110 45589421 46180339 46792311 47510901
5002 47510901 48264784 49039370 49716225 50363260 51087135 51586629 52004951 52291476 52358067 52365802
4992 52365802 52253878 52340422 52495251 52537254 52581990 52680134 52978381 53030173 52894809 52538617
4982 52538617 52144277 51975754 51974106 52226561 52495904 52753502 53186924 53556116 53982416 54245896
4972 54245896 54485251 54488732 54445302 54839687 54981200 55415903 55609519 55587569 55318124 54599291
4962 54599291 53780832 53093696 52392085 51663238 50878471 50207555 49942350 49495912 49339784
4953D9339784j51880j09121K27491J40304k2245j61465o5956o9058J98383p2129
4943D9254108p15P828K69176K49894L17651J45722K04513J72789K21721L49817
4933E1192504L58240L50127K48167K00936K28674J73539J41753J23681K56898
4924E3274519K84816N28982P20795P99255O27090L59122J79166k01638k00347
4915E6371760m75966o24292n15674l11910j1673m62104k10526j47396k65733J8770
4905E3365256J90711O36125R67344J234576J342031J227900J054616N99289k54261
4896F0363587n39732p13534q38820r27997j022991q48633n42297m01755L9524
4887E4567352K36168K82490O28844J171442J289803J817773J789480J833943J628284
$$ plain form
4953 49339784 49187904 49078783 49306274 49446578 49424333 49262868 49196912 49127854 49326237 49254108
4943 49254108 49253393 49261221 49530397 49780291 50097942 50243664 50448177 50620966 50842687 51192504
4933 51192504 51550744 51900871 52149038 52349974 52578648 52752187 52893940 53017621 53274519
4924 53274519 53559335 54088317 54809112 55608367 56235457 56594579 56773745 56572107 56371760
4915 56371760 55895794 55271502 54755828 54443918 54432245 53970141 53759615 53612219 53346486 53365256
4905 53365256 53555967 54192092 55159436 56394012 57736043 58963943 60018559 60617848 60363587
4896 60363587 59823855 59110321 58271501 57343504 56320513 55471880 54929583 54527828 54567352
4887 54567352 54803520 55086010 55714854 56886296 58176099 59993872 61783352 63617295 65245579
4878F5245579J386427R22379Q4594p17431p35031p82192j025257j049453j054805
4869F2274810q97057m00948l09638l81019q4693N3725N09770Q28435R77580J008763
4859F3579728J057769J473905J017204P10832N43985K27185k0636k50672k41954
4850F8097346j98738j9653k1932j6653J93859K99463N44255O61431Q27879M28279
4840G0795536Q11066P78869Q5744m3614n0758Q7375K74744L00569L76471N08227
4830G3924229N34930O79525O59469P40492J331794J704482J586185J804503J791890
4821H4757499J501292J615478P45254N16545M58721j48964m42012p55420q39864
4812H7408529o90061k98529k53740l05115j7495N93263N53778R49308J027401
$$ plain form
4878 65245579 66632006 67554385 67638979 66921548 66186517 65404325 64379068 63329615 62274810
4869 62274810 61377753 60976805 60667167 60286148 60201455 60255180 60764950 61593385 62570965 63579728
4859 63579728 64637497 66111402 67128606 67839438 68383423 68610608 68589972 68339300 68097346
4850 68097346 67898608 67878955 67857023 67840370 68034229 68333692 68877947 69539378 70367257 70795536
4840 70795536 71606602 72385471 72471215 72427601 72376843 72464218 72738962 73039531 73416002 73924229
4830 73924229 74459159 75138684 75798153 76538645 77870439 79574921 81161106 82965609 84757499
4821 84757499 86258791 87874269 88619523 89136068 89594789 89445825 89003813 88248393 87408529
4812 87408529 86718468 86419939 86166199 85861084 85843589 86436852 86990630 87939938 88967339
4803H8967339J351632J753904K237038K342961K115080K173356K026105J857570
4795A04824985J977014J572963J544708J143010P25904K13508l12234q26957j401866
4786A09461035j329257j258812j571583r66552o94138m52304J82096P44046J020382
4777A05134913J341922J191723J042611J087578Q92143Q96724J088522P42890
4769A13419026Q75200J308541J112392O96262N47171K97110j96968o38207p80085
4760A16640442q88594j120209j051607j447236j260937j455460j302948j225386
4752A06888065j233219j153932q97974r02644p51386m37016j66711j10578M2863
4743A01277468L61839M68466N52485N65551Q56562Q20224N03479K60359o6757
$$ plain form
4803 88967339 90318971 92072875 94309913 96652874 98767954 100941310 102967415 104824985
4795 104824985 106801999 108374962 109919670 111062680 111788584 112002092 111689858 110862901 109461035
4786 109461035 108131778 106872966 105301383 104334831 103640693 103188389 103370485 104114531 105134913
4777 105134913 106476835 107668558 108711169 109798747 110690890 111587614 112676136 113419026
4769 113419026 114294226 115602767 116715159 117411421 117958592 118255702 118058734 117420527 116640442
4760 116640442 115751848 114631639 113580032 112132796 110871859 109416399 108113451 106888065
4752 106888065 105654846 104500914 103602940 102700296 101948910 101511894 101345183 101234605 101277468
4743 101277468 101639307 102107773 102660258 103225809 104082371 104902595 105406074 105666433 105599676
4734A05599676m45436n58227r32182q01353n74362q039L25137J26850k96013o18904
4724A01817147o75255j196922j078519q26365j002417o00911q7927L51492P85158
4715I7485481P07822L87803j11870j93758r04841r96082p20844j006506r07006
4706I3740199m93043j90512j37145j30335P4374L64185L49305K78007N06354P95730
4696I5157119J299111J858659K361305K871697L620649M433661N633073O935737
4688A24171011Q225237J0148297J1041392J1274092J0652964Q940058O985896
4681A91438947M352163J513442q07650l061666m923963o086715o418900o744707
4673A69260951o904173o801092o823419o774783o835410o551568n913627n274119
$$ plain form
4734 105599676 105154240 104596013 103663831 102862478 102288116 102280077 102605214 102732064 102436051 101817147
4724 101817147 101141892 99944970 98866451 98040086 97037669 96436758 96348831 96700323 97485481
4715 97485481 98193303 98581106 98469236 98275478 97370637 96374555 95653711 94647205 93740199
4706 93740199 93247156 93056644 92919499 92789164 92863538 93227723 93577028 93855035 94361389 95157119
4696 95157119 96456230 98314889 100676194 103547891 107168540 111602201 117235274 124171011
4688 124171011 132396248 142544545 153585937 164860029 175512993 184453051 191438947
4681 191438947 195791110 197304552 196496902 193435236 188511273 182424558 176005658 169260951
4673 169260951 162356778 155555686 148732267 141957484 135122074 128570506 122656879 117382760
4665A17382760m596327l491354k558747j576619j202102n55229R9859M88295N69528
4656A04560064N98271N94235O1521k26110j056867j916664k363921k787373k875030
4647I4588126k849505k488712k205762j423065q84729o72699j80915O4923M57254
4638H4404916N16480N84248R30468J190878J350212J669003J658950J706995J921779
4629I5933929J853038J670027J455362J211212R76463O72231k8078j67894k97470
4620A03278820m28426m27893k99859l04266j40039K52689O24773J009489J502333
4611A05067621K284566K848030L325012M084746M792934N506668O473589P483622
4603A41866788Q939250J0768386J3038838J4666999J5465526J5109206J3740940
$$ plain form
4665 117382760 112786433 109295079 106736332 105159713 103957611 103402382 103502241 103990536 104560064
4656 104560064 105158335 105752570 105814091 105587981 104531114 102614450 100250529 97463156 94588126
4647 94588126 91738621 89249909 87044147 85621082 84736353 84063654 83882739 83947662 84404916
4638 84404916 84921396 85505644 86436112 87626990 88977202 90646205 92305155 94012150 95933929
4629 95933929 97786967 99456994 100912356 102123568 103100031 103772262 103744184 103576290 103278820
4620 103278820 102850394 102422501 102122642 101818376 101678337 101931026 102555799 103565288 105067621
4611 105067621 107352187 110200217 113525229 117609975 122402909 127909577 134383166 141866788
4603 141866788 150806038 161574424 174613262 189280261 204745787 219854993 233595933
4596B33595933J1087146P429317L715592P5112l001998m785795o195209o573001
4588B35347097o338612n633448m525152l679493k618824j645667k26962J002573
4580B11681512K336194L673401N218667P007949Q790889J0451471J1036157J1155865
4572B71352105J0792776R257257P508437N902259M119521K560712J743527J394025
4564C14630619J161514J407262J435220O46360o99391k483281n244661p851574
4556C03002068j0593480j3337364j4878622j5846307j5717847j4758532j3408629
4549B04461287j1230206q871320o890655n248877l266992k186278j478412j115249
4541A64173298r52039o09297k91289J41350O42040J547052K596491L717092M305359
$$ plain form
4596 233595933 244683079 252112396 255827988 255903100 252901102 248115307 241920098 235347097
4588 235347097 229008485 223375037 218849885 215170392 212551568 210905901 210678939 211681512
4580 211681512 214017706 217691107 222909774 229917723 238708612 249160083 260196240 271352105
4572 271352105 282144881 291402138 298910575 304812834 308932355 311493067 313236594 314630619
4564 314630619 315792133 317199395 318634615 319280975 318581584 316098303 310853642 303002068
4556 303002068 292408588 279071224 264192602 248346295 232628448 217869916 204461287
4549 204461287 193231081 184359761 177469106 172220229 168953237 166766959 165288547 164173298
4541 164173298 163221259 162611962 162320673 162462023 163104063 164651115 167247606 170964698 175270057
4532A75270057M169899L749848K744969J696423J036645o63815k009547l239592
4524A82754887m285256m697164n161844m767665l970807k688536k029787j357631
4516A53796197k62876M9704M03304N56400M30240J54500J13635J84977k13928
4507A55212153r0447m07107m20971m33756n75138o73498r32022r61375r67150
4498A49750689q05124r64315j182736q33083o35961l10562J22695R08047J608522
4489A47658172K191487K757580L437145L528263L645110M096026M138557M810828
4481A76263168N349299O480924P325784Q638213R910334J0310127J0333853R962212
4473B44573914R218793Q924984Q044336P138928N898256M441342K130965m70322
$$ plain form
4532 175270057 179439956 183189804 185934773 187631196 188667841 188004026 185994479 182754887
4524 182754887 178469631 173772467 168610623 163842958 159872151 157183615 155153828 153796197
4516 153796197 153533321 153583025 153986329 154542729 154972969 155127469 155241104 155426081 155212153
4507 155212153 155121706 154714599 154293628 153859872 153284734 152611236 151679214 150717839 149750689
4498 149750689 148945565 147981250 146798514 145965431 145329470 145018908 145141603 146049650 147658172
4489 147658172 149849659 152607239 156044384 159572647 163217757 167313783 171452340 176263168
4481 176263168 181612467 188093391 195419175 204057388 213967722 224277849 234611702 244573914
4473 244573914 253792707 262717691 270762027 277900955 283799211 288240553 290371518 289901196
4465B89901196l062644n527265p458639p944850p628498o043950l461100j87576
4457B48586674L046864O040958Q458066R508739Q960545P226629N033090K591682
4449B99453247L25537j147001k004331k529253k806732l383079l219868l893696
4441B80794824m169729m328615m474341l624198l162722k847334k313249k140572
4433B53734064j937056j811962j496271j191422j288342j070479j320259q64069
4425B42754204n2886J722576M884821R478375J5846596K2667747K8231406L0843313
4417C56376152L0351536K5845680J7967820Q581599j822624j2747733k0803077
4410D03749353k5659172k7127911k6335581k3030707j9309180j5214872j1042103
$$ plain form
4465 289901196 286838552 281311287 273852648 265907798 258279300 252235350 248774250 248586674
4457 248586674 251633538 257674496 266132562 275641301 284601846 291828475 296861565 299453247
4449 299453247 299778784 298631783 296627452 294098199 291291467 287908388 284688520 280794824
4441 280794824 276625095 272296480 267822139 264197941 261035219 258187885 255874636 253734064
4433 253734064 251797008 249985046 248488775 247297353 246009011 244938532 243618273 242754204
4425 242754204 242701318 244423894 249308715 258787090 274633686 297301433 325532839 356376152
4417 356376152 386727688 412573368 430541188 439122787 437300163 424552430 403749353
4410 403749353 378090181 350962270 324626689 301595982 282286802 267071930 256029827
4403B56029827p905764n745402m228682l017992k577636k908424l189708l455726
4395B23000493m172572m795458n169811n170430m567840l695581k748810j956307
4387A90723684j206417k58678O9194K24816M09835M91347J071321J284368J752803
4378A94562273K357200K651575K687241J927301Q61690q10723k585310m343069
4370A97308178o002811o720695o710030o569939o007386n010964m343741l593322
4362A52349290k895724k243515j590751j117451n31256l01842j38551J37971K55261
4353A43923432q5134J81386Q2995k92063k97077l45485k25926j82351n84063l73479
4343A41802235k78818m41318p98696r48069r55229q69179o24348q44738o69584
$$ plain form
4403 256029827 248124063 242378661 238149979 235131987 232554351 229645927 226456219 223000493
4395 223000493 218827921 214032463 208862652 203692222 199124382 195428801 192679991 190723684
4387 190723684 189517267 189258589 189327783 189552599 189962434 190453781 191525102 192809470 194562273
4378 194562273 196919473 199571048 202258289 204185590 205047280 204236557 201651247 197308178
4370 197308178 191305367 184584672 177874642 171304703 165297317 160286353 155942612 152349290
4362 152349290 149453566 147210051 145619300 144501849 143970593 143668751 143530200 143668171 143923432
4353 143923432 143838298 144019684 144102679 143810616 143513539 143168054 142942128 142759777 142175714 141802235
4343 141802235 141523417 141082099 140283403 139335334 138380105 137510926 136886578 136041840 135372256
4334A35372256m85674l29411k34088j24773j12929J52158L45006M93392O97740
4325A35773677M17702K66963M82438N44668M15248M67507O65509O18467Q17970
4316A40470149R42496J291715J723099K000311K462778K679936L053428L234686
4308A57858598K921340K447025J856154J281053O39615k32435j324389k039585
4300A63407376k732345k926627k769258k430764j936925j641766j099543j121542
4292A46748606p85973q94370p36363r71373j527752j918712k000581j933279k087643
4283A33892560k236376j727796j548300j317054j197764j179709p01827n14001
4275A23469733m49059l67730l77779k45681m90794l84982p1538N724J8481J05879
$$ plain form
4334 135372256 134886582 134557171 134323083 134198310 134085381 134237539 134582545 135075937 135773677
4325 135773677 136191379 136458342 136940780 137485448 137900696 138368203 139033712 139652179 140470149
4316 140470149 141412645 142704360 144427459 146427770 148890548 151570484 154623912 157858598
4308 157858598 160779938 163226963 165083117 166364170 167003785 166771350 165446961 163407376
4300 163407376 160675031 157748404 154979146 152548382 150611457 148969691 147870148 146748606
4292 146748606 145962633 145068263 144331900 143360527 141832775 139914063 137913482 135980203 133892560
4283 133892560 131656184 129928388 128380088 127063034 125865270 124685561 123983734 123469733
4275 123469733 123020674 122652944 122275165 122029484 121538690 121153708 121082170 121087894 121106375 121212254
4265A21212254K47899M77778O74562M47476M41420N05282M54986K21246N88173
4256A25271076L57721M75914P39128O63824O91495M28251J32749K3599j17335
4247A28666422l8092K48415K79347J17190R409K95935J69244O07253R63057J127142
4237A32445322R00584N66348J63844m47267q59646j130599j134365r33244l81507
4228A29189470p05919p54117k69548m09341m29825n3726j67613J77318K17256
4219A26793955J74972L41632P65393N65165N36369O70935J082047J115452J210668
4210A33256588J469614J766055J465520J231830J046856Q95629M24644K65197
4202A41821933k60595o52074o01653m42153p21739p14880o82049j081241q17562
$$ plain form
4265 121212254 121460153 121937931 122612493 123059969 123501389 124006671 124461657 124682903 125271076
4256 125271076 125628797 126104711 126843839 127507663 128199158 128627409 128760158 128783757 128666422
4247 128666422 128628330 128876745 129156092 129273282 129282691 129578626 129747870 130355123 131318180 132445322
4237 132445322 133345906 133912254 134076098 133628831 132769185 131638586 130504221 129570977 129189470
4228 129189470 128483551 127729434 127459886 127050545 126620720 126566994 126399381 126576699 126793955
4219 126793955 126968927 127310559 128075952 128641117 129177486 129848421 130930468 132045920 133256588
4210 133256588 134726202 136492257 137957777 139189607 140236463 141132092 141556736 141821933
4202 141821933 141561338 140909264 140307611 139865458 139143719 138428839 137746790 136665549 135847987
4193A35847987r64963r71212o42195l21447r9272J95776J43487K46976Q67086
4184A34302223J044476P14258P45852Q81570J079336J122414J155124R89694P02718
4175A42737665O23431P58111O58576K26248N1609J35430N2577M17178O9351j65640
4165A45564536j52384K03703N6767J75656J68113N53783P04700J069107J558285
4156A49902266J731639J660855J638490J519359J309945R95124Q73422N30519
4148A60161619K02914L71029J26023K26377M96814K70645j0216J37555m56479
4139A61526281j222311j682521k368555k560849k617570k391529k097006j790679
4131A44795261j717047j584326r06500m00985j9364M75176O15905Q74128J220292
$$ plain form
4193 135847987 134883024 133911812 133269617 132948170 132848898 133044674 133188161 133435137 134302223
4184 134302223 135346699 136060957 136806809 137688379 138767715 139890129 141045253 142034947 142737665
4175 142737665 143361096 144119207 144777783 145004031 145055640 145191070 145243647 145660825 145730176 145564536
4165 145564536 145412152 145615855 145672622 145848278 146016391 146570174 147274874 148343981 149902266
4156 149902266 151633905 153294760 154933250 156452609 157762554 158757678 159631100 160161619
4148 160161619 160364533 160735562 160861585 161087962 161584776 161855421 161845205 161982760 161526281
4139 161526281 160303970 158621449 156252894 153692045 151074475 148682946 146585940 144795261
4131 144795261 143078214 141493888 140587388 140186403 140167039 140642215 141258120 142132248 143352540
4122A43352540Q02968R39588P53510P16049R70147J244197J309288J160221J169414
4113A52417922J657618K084853J908311J756695J734744J121866M30239j22711
4105A62989537p68816j356774j512692j126895q93296o07315m89382l01512j14181
4096A55818674k17626K12922O01443N58876M24710J85954J66526J70725n5896
4087A57866308L4101j40595j83317l47034p12131p24089m30971O4204L00187M28067
4077A56154730O37325M21999L40725L81096K67313N71198L57403M23027R03210
4068A60458026P90681O43871R50635Q76083O86217N45144J87578O7456j65044
4059A65040647l73181j11945J0113k08843O4224j3766K59829L90323L84401P62216
$$ plain form
4122 143352540 144155508 145095096 145848606 146564655 147534802 148778999 150088287 151248508 152417922
4113 152417922 154075540 156160393 158068704 159825399 161560143 162682009 163112248 162989537
4105 162989537 162220721 160863947 159351255 158224360 157331064 156723749 156234367 155932855 155818674
4096 155818674 155601048 155813970 156415413 156974289 157398999 157584953 157751479 157922204 157866308
4087 157866308 157900409 157759814 157576497 157229463 156517332 155793243 155362272 155426476 155726663 156154730
4077 156154730 156792055 157214054 157554779 157935875 158203188 158774386 159131789 159554816 160458026
4068 160458026 161248707 161892578 162843213 163719296 164405513 164950657 165138235 165205691 165040647
4059 165040647 164667466 164555521 164565634 164356791 164421015 164407249 164667078 165057401 165441802 166204018
4049A66204018P09202O08947Q58437J081277J235904J269059Q74339P59494N73263
4040A74173940k2131k87346m69980j064142j393109j398914j351296r21019q40830
4031A66425173n03841l72058l36685k93157m53968m22044k73557n68469k19215
4022A62982179J13253K25197J3807K81741L42297J066026J383808J364224J286360
4013A69058892N98487J85681m68603p02290j604009j729199k067649j932994j960588
4004A59377728j403229j336601j177519r36821n66452m45864q65822j117521j075121
3995A50452778j014144j421542j702354j803914j609417j470724j343490j233372
3987A38853821j116178n96916j99516J37633K30878K27977r1246J0487k1736m62550
$$ plain form
4049 166204018 166913220 167522167 168380604 169461881 170697785 171966844 172841183 173600677 174173940
4040 174173940 174151809 173864463 173394483 172330341 170937232 169538318 168187022 167266003 166425173
4031 166425173 165921332 165549274 165212589 164919432 164465464 164043420 163769863 163201394 162982179
4022 162982179 163095432 163320629 163334436 163616177 163958474 165024500 166408308 167772532 169058892
4013 169058892 169657379 169843060 169374457 168672167 167068158 165338959 163271310 161338316 159377728
4004 159377728 157974499 156637898 155460379 154523558 153957106 153511242 152645420 151527899 150452778
3995 150452778 149438634 148017092 146314738 144510824 142901407 141430683 140087193 138853821
3987 138853821 137737643 137140727 136941211 137078844 137309722 137537699 137446453 137456940 137435204 136972654
3977A36972654j011815j145403j247351q40452p81589j202882j133619j496249
3969A28113294j135434r63216j138300j264053j106569j222255j301297j274082
3961A18708088j526063j232738r72431j526354j519142j452341j075159q58026
3953A08545834j000720p56013q94759m36248j78958k96077n91208j092563j293368
3944A02005920j343233j276387j033009q67845r94668o58251l96577o46998n56107
3935I4232845o68763q73314j87610l15623j00903l39735l84026j47921k09636
3926I1005314k47397k29983r1417k62034k87176k33124k71417j58061k14288M34718
3916H9445135M28532M98469O42845P16867R61738J238182J083830J211231J458802
$$ plain form
3977 136972654 135960839 134815436 133568085 132727633 131946044 130743162 129609543 128113294
3969 128113294 126977860 126014644 124876344 123612291 122505722 121283467 119982170 118708088
3961 118708088 117182025 115949287 114976856 113450502 111931360 110479019 109403860 108545834
3953 108545834 107545114 106789101 105894342 105458094 105279136 104983059 104391851 103299288 102005920
3944 102005920 100662687 99386300 98353291 97485446 96490778 95832527 95435950 94788952 94232845
3935 94232845 93564082 92690768 92503158 92187535 92086632 91746897 91362871 91214950 91005314
3926 91005314 90757917 90527934 90436517 90174483 89887307 89654183 89382766 89224705 89010417 89445135
3916 89445135 89873667 90372136 91014981 91731848 92693586 93931768 95015598 96226829 97685631
3907I7685631J745889J823857J497868J505281P63799O45814N44470M19600L43324
3898A06975533L40606K78061N5267k01648k71605j189385j803942j961472k262708
3889I9958707k226611j974784k265293j908950j741895j804730j009877q12800
3881H6213767k79983l608j71459o8606k90672r7506j29995n5032J62227L24805
3871H5603938p1428J87831L31478J04111N00848M64887M96886M70806P38560R40397
3861H9768314J312205J584076J670615J619941J286888J054007M42979Q3l43272
3852I8395836n11096j079677j630056j648469j827710j749678j569450j454791
3844H6924909j182155o88738q42071n60057k06411N2110M24939O24512R50018
$$ plain form
3907 97685631 99431520 101255377 102753245 104258526 105022325 105668139 106212609 106632209 106975533
3898 106975533 107316139 107594200 107649467 107447819 107176214 105986829 104182887 102221415 99958707
3889 99958707 97732096 95757312 93492019 91583069 89841174 88036444 87026567 86213767
3881 86213767 85933784 85930176 85758717 85690111 85399439 85301933 85171938 85116906 85279133 85603938
3871 85603938 85532510 85720341 86051819 86155930 86656778 87121665 87618551 88089357 88827917 89768314
3861 89768314 91080519 92664595 94335210 95955151 97242039 98296046 98739025 98739108 98395836
3852 98395836 97884740 96805063 95175007 93526538 91698828 89949150 88379700 86924909
3844 86924909 85742754 85054016 84211945 83651888 83445477 83497587 83922526 84547038 85497056
3835H5497056R24126P56195M66974L38159J41492k85512o87831j115068j066084
3826H4969507j093688p71115r99296n79507j90640p13617p69331j075150j319329
3817G7457834j047259j016507j128027q87159p73222m89019n87002m61732m24374
3808G0643533p48361p87303p48412r89837o57540q91787n71908m43421n54312
3799F4250652n61196o87403k63828j63025j61462k59590J65475K89689k61228
3790F2348084k20537M9955N8595N2060j02776m24387J08199L58774J37814o1924
3780F2303857j46777j48112k3220r1548j1105P7243k01317k49315l9405L4529
3770F1504830J07469K39563K72518K66233L04861r0351L235N6254o39725m87764
$$ plain form
3835 85497056 86421182 87177377 87644351 87982510 88124002 87838490 87150659 86035591 84969507
3826 84969507 83875819 83104704 82105408 81525901 81335261 80621644 79852313 78777163 77457834
3817 77457834 76410575 75394068 74266041 73378882 72605660 72116641 71529639 71067907 70643533
3808 70643533 69895172 69107869 68359457 67369620 66712080 65820293 65248385 64804964 64250652
3799 64250652 63689456 63002053 62738225 62575200 62413738 62154148 62319623 62609312 62348084
3790 62348084 62127547 62177502 62236097 62288157 62185381 61760994 61869193 62227967 62365781 62303857
3780 62303857 62157080 62008968 61985748 61894200 61883095 61960338 61759021 61509706 61470301 61504830
3770 61504830 61612299 61851862 62124380 62390613 62695474 62605123 62608358 62664612 62024887 61537123
3760F1537123n49692l66210p66676o26352m99732o57408m24847k03469k49251
3751E7193486m21937l20456K7319o8938m5637j51537j31792K05186K25363K91366
3741E6802423n9168j43416K80652K1547K29324J05017J96827P3420J31967m9525
3731E7589068J31228M9901k33135p3808p9365q4278l96493l13580m70137l04425
3721E5814976j15519m75313o73591n59012m08303m77671l38822n10379m96243
3712E1760123k33548m50547k43505j69850o0515k01892j44723m0385J12319m3622
3702E0283855l28106k34856j98671k42137K7738n40841n58875k36600j42600k40744
3692D7588163n49547m21184j34628k24120p4251l7569j20738j42413j20802j86600
$$ plain form
3760 61537123 60987431 60621221 59854545 59228193 58728461 58071053 57646206 57442737 57193486
3751 57193486 56771549 56451093 56478412 56409474 56363837 56212300 56080508 56285694 56511057 56802423
3741 56802423 56743255 56599839 56880491 56902038 57131362 57236379 57433206 57506626 57638593 57589068
3731 57589068 57720296 57770197 57537062 57463254 57383889 57299611 56903118 56589538 56119401 55814976
3721 55814976 55699457 55224144 54550553 53991541 53583238 53105567 52766745 52256366 51760123
3712 51760123 51526575 51076028 50832523 50662673 50602158 50400266 50255543 50215158 50327477 50283855
3702 50283855 49955749 49720893 49522222 49280085 49307823 48766982 48208107 47971507 47828907 47588163
3692 47588163 47038616 46617432 46482804 46258684 46184433 46146864 46026126 45883713 45762911 45576311
3682D5576311k97315m12045j71376j31982k89340l29106k7941j49212n59858k86120
3672D2922016k32957o170R5323o4570J07281J85387n025l21680m64079m42423
3662D1773103m89574n12431m27358l16291l77389l74688k58389j48979l0439N6514
3652C8894079J8027p8085o0506j10073J12996p627k28772r8121L1952k7238j58153
3641C8288479o2108K49614L20753K04302K36064M47256J96088j08190J5706l04902
3631C9483062j27364l07078j56051j55631J2103L01268p3948j87877j48877J22045
3621C8761652K6255k41085K47601K57671N2686Q4040R2008P3768j39987J10256
3611C9324865J1561K9848m6420K6508L29744k2880K94852M63411O9591j5937J03731
$$ plain form
3682 45576311 45278996 44866951 44695575 44563593 44274253 43945147 43917206 43767994 43208136 42922016
3672 42922016 42689059 42682889 42778212 42713642 42820923 43006310 43001285 42679605 42215526 41773103
3662 41773103 41283529 40771098 40343740 40027449 39650060 39275372 39016983 38868004 38837565 38894079
3652 38894079 38912106 38834021 38773515 38663442 38776438 38768811 38540039 38441918 38473870 38446632 38288479
3641 38288479 38226371 38475985 38796738 39001040 39237104 39684360 39880448 39772258 39787964 39483062
3631 39483062 39355698 39048620 38892569 38736938 38749041 39050309 38976361 38788484 38639607 38761652
3621 38761652 38787907 38546822 38794423 39052094 39104780 39188820 39280828 39354596 39214609 39324865
3611 39324865 39336426 39366274 39319854 39346362 39676106 39653226 39948078 40411489 40481080 40465143 40568874
3600D0568874J34105o763L13804J66618P922J11868K77677L12370L83316L78811
3590D2648602L27448N67198K36549O18775P07844L33475M86603M36168L37939
3581D6700601J96653q1509K90168O9661m1519N3941K5830j6918J68811L229L40474
3570D7709422K99759J27800N06831K65640K98093O22152Q64778Q10373R73069
3561E2477917J134959J004830J301398J372865J069496J097397P85299J104878
3553F1349039J177901J216963J326541J187279J345294J289318J235836R88918
3545G1117089Q28468Q88962J054606Q19320Q77465O84233R67127J347563J495764
3536H0080597J514030J984421K547496K332926K905061K648098K380716K450596
$$ plain form
3600 40568874 40702979 40696216 41010020 41176638 41184560 41296428 41574105 41886475 42269791 42648602
3590 42648602 42976050 43543248 43779797 44398572 45106416 45439891 45926494 46362662 46700601
3581 46700601 46897254 46815745 47105913 47175574 47134055 47187996 47213826 47196908 47365719 47368948 47709422
3570 47709422 48009181 48136981 48643812 48909452 49207545 49829697 50694475 51504848 52477917
3561 52477917 53612876 54617706 55919104 57291969 58361465 59458862 60244161 61349039
3553 61349039 62526940 63743903 65070444 66257723 67603017 68892335 70128171 71117089
3545 71117089 71945557 72834519 73889125 74708445 75585910 76270143 77237270 78584833 80080597
3536 80080597 81594627 83579048 86126544 88459470 91364531 94012629 96393345 98843941
3528I8843941K559886K685396K668558K651939L042781L323929M299724N404080
3520A25480234O483081P687844Q825047R753373J0769614J1413097J1796782J2435734
3512B04644806J2410720J1516803R554740O555214L225069l22758l786700o618638
3504B37179256r120863j0395284j1113731j1052850j0280814r444283q288350
3497A67483081p485806o180234n329129m105913l408577l579787m225674m542953
3489A28625008m521336m444398m669641m971352n346379n836920n789346n494586
3481H7551050m828020m083151l269800l090566k639605k360750k074939j761595
3473F3442624j690846j484349j465447j471150j270674j087508r65895m28103
$$ plain form
3528 98843941 101403827 104089223 106757781 109409720 112452501 115776430 120076154 125480234
3520 125480234 131963315 139651159 148476206 158229579 168999193 180412290 192209072 204644806
3512 204644806 217055526 228572329 238127069 244682283 247907352 247584594 243797894 237179256
3504 237179256 228058393 217663109 206549378 195496528 185215714 175771431 167483081
3497 167483081 159997275 153817041 148487912 144381999 140973422 137393635 133167961 128625008
3489 128625008 124103672 119659274 114989633 110018281 104671902 98834982 93045636 87551050
3481 87551050 82723030 78639879 75370079 72279513 69639908 67279158 65204219 63442624
3473 63442624 61751778 60267429 58801982 57330832 56060158 54972650 54006755 53578652
3465E3578652K88274R27731K448138L665488L624895J946924L75896r32546j994116
3456F3929336k456896k885774l224112k977300k802196k896171k520398k159962
3448D2006527j733132j238707j077977r49368n80564o10717n13933m24319l95460
3439C4482350m27942k86572j43068n10726k43644J673J05897M63876R59154J454887
3429C5855885J393411P59225m40307j123101j241003j550189j252821j184289
3421C1216811o55815n75252k87475r3989J45347L63264M18977M75986M43901J36956
3411C1588711k08744l17547l06934o10512o23216p66864p76528m50250l20217
3402B7207899n4424m5407l3936P088K01610K63870N17391M4681r424l18356l59521
$$ plain form
3465 53578652 53866926 54794657 57242795 60908283 64533178 66480102 66855998 65923452 63929336
3456 63929336 61472440 58586666 55362554 52385254 49583058 46686887 44166489 42006527
3448 42006527 40273395 39034688 37956711 37007343 36426779 35816062 35302129 34877810 34482350
3439 34482350 34054408 33767836 33624768 33114042 32870398 32872071 32977968 33441844 34400998 35855885
3429 35855885 37249296 38008521 37568214 36445113 35204110 33653921 32401100 31216811
3421 31216811 30560996 29985744 29698269 29604280 29749627 30112891 30531868 31007854 31451755 31588711
3411 31588711 31379967 31062420 30755486 30144974 29521758 28754894 27978366 27528116 27207899
3402 27207899 27153475 27108068 27074132 27081220 27282830 27546700 28064091 28108772 28099348 27780992 27421471
3391B7421471p03857q47413p90139o97750n53142o20418l58481m59904l69254
3382B2021113m93940j24375K1883m14388p683j94483k22493j59959k08257j27106
3372B0090312j01781j17539l75040o1568j59658l57864j6435j58709k36235j31481
3362A8374002K5186m5651K53564k8548J60266K01601L13600K13107L6732O42864
3352B0146723L55004L61724j7485m27459l69298l18878k05280m86035k98319j95363
3342A8545334k69647k17082P6555q069O3228N9066J89226L34174R6236J83905
3332A9052926k34861k30117p1781j2295l67520j93358k13812n63088j44430k33958
3322A6787706l02563j70109p7981k3067k48906k22647K38380L9752K4958o7169
$$ plain form
3391 27421471 26717614 25870201 25080062 24382312 23829170 23208752 22850271 22390367 22021113
3382 22021113 21527173 21402798 21424681 21010293 21002610 20808127 20585634 20425675 20217418 20090312
3372 20090312 19988531 19870992 19495952 19434384 19274726 18916862 18900427 18741718 18505483 18374002
3362 18374002 18399188 18353537 18607101 18578553 18738819 18940420 19254020 19467127 19503859 20146723
3352 20146723 20501727 20863451 20845966 20418507 20049209 19730331 19525051 19039016 18740697 18545334
3342 18545334 18275687 18058605 18135160 18127091 18190319 18249385 18438611 18772785 18869021 19052926
3332 19052926 18818065 18587948 18516167 18503872 18136352 17942994 17729182 17166094 17021664 16787706
3322 16787706 16485143 16315034 16237053 16213986 15965080 15742433 15980813 16020565 16045523 15978354
3312A5978354m4253J26781j26301L15938m17008k86101P4672O652j98834m2176
3302A5387724j57667m10043j62781j47139P0430M645j35986l7854m0978k11483
3292A4158868j10880j37857P86P542l16772k63169R819k21743j73171j46624P4534
3281A2881333j35559j68540j35435k270L98819K39981m9809j89926K21852L01188
3271A3361634j80302p6326J95792J47129o7024j33094J80260o6093N2092J35283
3261A3549351J41358j79405P2893J85234J48954K00968O6995q8964J1175L12556
3251A4421115M23459R2529P4123m3610j92828L9601q25j21547l69410J50303J42917
3240A4615827j32493j70178N1774J39473J05352O8743P8189K93606m3208O079
$$ plain form
3312 15978354 15934101 16060882 15934581 16250519 15833511 15547410 15622082 15628734 15429900 15387724
3302 15387724 15230057 14820014 14657233 14510094 14580524 14585169 14449183 14411329 14370351 14158868
3292 14158868 14047988 13910131 13910917 13918459 13601687 13338518 13348337 13126594 12953423 12806799 12881333
3281 12881333 12745774 12577234 12441799 12439529 12838348 13078329 13028520 12838594 13060446 13361634
3271 13361634 13181332 13105006 13300798 13447927 13380903 13247809 13428069 13361976 13414068 13549351
3261 13549351 13690709 13511304 13584197 13769431 13918385 14119353 14186348 14097384 14108559 14421115
3251 14421115 14844574 14937103 15011226 14967616 14774788 14814389 14813564 14692017 14322607 14472910 14615827
3240 14615827 14483334 14313156 14364930 14504403 14609755 14678498 14756687 15050293 15007085 15013164
3230A5013164Q348P6833K84862K21545J33313J2270L53445M12489Q0498L20974
3220A6917741K05955L86158K04248J65786J99073M35799O13600N12146L81013
3211B0021519N33056R04517R70330R98223P31543J309759J529701J640600J432724
3202C0071972J673956J931010K379346K935322L087108L486274M056193M359599
3194E3980780M389748M569244M820480M235574L429054K475859J690724R58396
3186H0549859R95009J395278J828681J155732J6354j08679p92635j501725j330795
3177H2207079j125521j329513p15424m02138J44363L61122Q54076J459679K249653
3168H3703376L314655N258206Q342735J2094141J6615357J8948757J6428838Q963747
$$ plain form
3230 15013164 15021512 15098345 15383207 15604752 15738065 15750335 16103780 16516269 16596767 16917741
3220 16917741 17123696 17509854 17714102 17879888 18078961 18514760 19128360 19640506 20021519
3211 20021519 20554575 21459092 22429422 23427645 24159188 25468947 26998648 28639248 30071972
3202 30071972 31745928 33676938 36056284 38991606 42078714 45564988 49621181 53980780
3194 53980780 58370528 62939772 67760252 71995826 75424880 77900739 79591463 80549859
3186 80549859 81544868 82940146 84768827 85924559 85940913 85832234 85039599 83537874 82207079
3177 82207079 81081558 79752045 79036621 78634483 78778846 79139968 79994044 81453723 83703376
3168 83703376 87018031 92276237 100618972 112713113 129328470 148277227 164706065 173669812
3160A73669812R93040n925832j1255360j3500771j3244680j1935075j0299232
3153A08501902r568786q144632o796069o048216n289151m501180l969864l439903
3145F0744101k654460j958240j585144j059011l44160M6804J21094R41195J353508
3136E5605687J839379K377848K818385L094598K386956J643173J65141j386871
3128F8544296k713398l774785m497321m554473m436860m269235m296963l538804
3120C6462457k960013k455639k220080j963110j644047j760663j452031j252238
3112B0754636j234053j049151j020987p89756q47643j016025p07989o36696p14650
3103A2737686n47179p33948o90546k60009k34353k98076j27752l12173j79150
$$ plain form
3160 173669812 174662852 168737020 157481660 143980889 130736209 118801134 108501902
3153 108501902 98933116 90788484 83992415 77944199 72655048 68153868 64184004 60744101
3145 60744101 58089641 56131401 54546257 53487246 53143086 53189890 53310984 54252179 55605687
3136 55605687 57445066 59822914 62641299 65735897 68122853 69766026 69931167 68544296
3128 68544296 65830898 62056113 57558792 53004319 48567459 44298224 40001261 36462457
3120 36462457 33502444 31046805 28826725 26863615 25219568 23458905 22006874 20754636
3112 20754636 19520583 18471432 17450445 16660689 15813046 14797021 14089032 13452336 12737686
3103 12737686 12190507 11456559 10766013 10506004 10271651 9973575 9845823 9533650 9354500
3094I354500m15677j62789m14123k58206l1136k30873K9435k23727k24730j30626
3084G292048k94672j74643j77470j68151K8506j93092k07461k5412j92842j66459
3074E720352j39423k02193p7814j19358l62058k58616r9097N4862q6541j91928
3064D238186J4350j80035j52704j45466K20589k52754k00120P6771L4978q9663
3054C564132l16458k87986O1822J392m3277p7655K15142p5532l28960m2025k6798
3043B643797J0508r1063n8223j01665j03431R8447K0990j78041j28519o7641k29448
3032A815711O5236L362j6266j90150j34522K64285J1756O639q3959R5511O8498
3021A906101k3035l33742r1376J83900R143j52964M1791j87256j2933J40560j74883
$$ plain form
3094 9354500 8938823 8776034 8361911 8103705 8072569 7841696 7871131 7647404 7422674 7292048
3084 7292048 6997376 6822733 6645263 6477112 6505618 6312526 6105065 6079653 5886811 5720352
3074 5720352 5580929 5378736 5300922 5181564 4819506 4560890 4461793 4516655 4430114 4238186
3064 4238186 4252536 4072501 3919797 3774331 3994920 3742166 3542046 3618817 3653795 3564132
3054 3564132 3247674 2959688 3021510 3022902 2979625 2901970 3117112 3041580 2712620 2670595 2643797
3043 2643797 2654305 2563242 2505019 2403354 2299923 2398370 2419360 2241319 2112800 2045159 1815711
3032 1815711 1880947 1884309 1868043 1677893 1543371 1807656 1819412 1826051 1742092 1837603 1906101
3021 1906101 1883066 1549324 1457948 1641848 1650991 1498027 1539818 1352562 1339629 1480189 1305306
3010A305306q7880j15528j77887j0647q5687K58303J83183j13947j67132L5354
3000A023438N7600j06314N8268o4122j60401r8646R5254J38134j93605j60468
2990E89138M6524R9964j1856K2508O2052J7832R4592k39544J431k939j78106J04700
2978F06296m1960J14070J87851j43000m4333j74404O7937O5047L7171j85253k12298
2967B77124J07941l7716R4742J44137j36045k3291K0684P4295J15726j9359j75669
2956D42569k6053J01656n0742n0909p3334k5437o5717J97763p5491Q5960M9479
2945E09744j65145j43757n5098P4039j17135N2371N6428K2672k3805L7131l0428
2934B17017L421j70344Q2467P9119J24950o4165k08268J35332M01059n9244k65117
$$ plain form
3010 1305306 1217426 1101898 924011 913364 827677 1085980 1269163 1155216 988084 1023438
3000 1023438 1081038 974724 1032992 968870 808469 709823 805077 943211 749606 589138
2990 589138 635662 735626 723770 746278 808330 826162 920754 681210 682641 679702 501596 606296
2978 606296 564336 678406 866257 723257 678924 504520 572457 637504 674675 489422 277124
2967 277124 385065 347349 442091 586228 450183 426892 447576 521871 637597 618238 442569
2956 442569 416516 518172 467430 416521 343187 317750 252033 449796 374305 460265 509744
2945 509744 344599 200842 145744 219783 102648 155019 211447 234119 210314 247445 217017
2934 217017 220438 50094 132561 211680 336630 272465 64197 199529 600588 541344 276227
2923B76227m1586R6105j2289M8456j3405n9900J72240j17648n7775L4668p8011
2912B47082j75506O9728J04820J05434K15714m6384P0504j01923J11413K00978
2902H01860k25101k01249j91632J57313J72793L413J13660J4255j11651N8522
2892E92183j11377j29893k3554J13938n9841l3628j7772j14150R1620K71537J48581
2881G27644L6235K20829j46095j12279J78406J1670j49680k33790l0612J43118
2871F45446j22963q690J14919J289l3931j06532j30603m544O9919o4312K9322
2860C89320j82219J21414q7070N389j2121r7913l5041K35408q8990j33858K55925
2849C70244K6735J40886N4722o8312j6589j83824J1948Q5485k2699j66222o2435
$$ plain form
2923 276227 234641 330746 318457 366913 353508 293608 465848 348200 290425 325093 247082
2912 247082 71576 141304 246124 351558 567272 520888 591392 489469 600882 801860
2902 801860 576759 375510 183878 341191 513984 517397 631057 645312 533661 592183
2892 592183 480806 350913 327359 441297 381456 347828 330056 215906 307526 579063 727644
2881 727644 763879 984708 838613 726334 904740 916410 766730 532940 502328 645446
2871 645446 522483 513793 628712 630001 596070 489538 358935 354391 424310 359998 389320
2860 389320 207101 328515 241445 246834 234713 136800 101759 337167 248177 114319 370244
2849 370244 396979 537865 592587 524275 507686 323862 335810 421295 398596 232374 169939
2838A69939M8446M1756n2299j71979k06264J70609J11130k7379K51346j83890
2828A51415j40807J66762J78349Q7699J04346k32591J35164L5978k3048p714j32308
2817C23245k12309L1105m5757k8381J47091k59268K2093J06540p73K97962r9175
2806B82373j03146R1415j05315j17298J12645m2620j06056l1418l7353J96427
2796A39654J38695j27710m8842J53032J425Q9161Q2346J33449J17010q7112n7750
2785E33358l6186K02268K87236k71834k63551L8221R9316k5958j55838q6583j80985
2774A39464R0321K67909j23256l90556N0841J80465K15435N3037r1746P2612Q2410
2763E46936m2876l7625K686m227O2533j78786l05308J09136O8005k17036L6952
$$ plain form
2838 169939 218385 260141 207842 35863 -170401 208 111338 83959 335305 151415
2828 151415 10608 177370 355719 443418 547764 315173 450337 486315 463267 455553 323245
2817 323245 110936 142041 96284 67903 214994 -44274 -22181 84359 83586 381548 282373
2806 282373 179227 270642 165327 48029 160674 118054 11998 -19420 -56773 139654
2796 139654 278349 150639 101797 254829 256254 345415 427761 561210 678220 591108 533358
2785 533358 497172 699440 986676 714842 451291 489512 588828 562870 407032 320449 139464
2774 139464 229785 497694 374438 -16118 34723 215188 430623 483660 391914 464526 546936
2763 546936 504060 466435 469121 464894 527427 348641 43333 152469 220474 3438 40390
2752D0390j353J66797O3662J34362J53282j0923k50679r5408l7553o3191Q9890
2741A89276J84004j16123J877Q6424j71614j6380k2651j92410J41447O0791m775
2730A39866q6902l8374k5432J26741L11495J35623P3637q271Q288O9832j8826
2719F87677k93801K27535l8388j33355K56227k35787l05493j05784r3168N1009
2709A6672J79250j54001l19368L9049l0129J27875J77977j50393j0947q8332q197
2698b20544J21056k59499J3813J03813M7495J73830J77318j90464n9577r3521
2688a86280O1325n7816M9527J47243J91716j19602j39616J75814O9258l892q1748
2677A05929j80973P9603j14400p2844q7715m6268Q9183L8878k6299N8396j90494
$$ plain form
2752 40390 39037 205834 269496 403858 557140 546217 295538 200130 162577 99386 189276
2741 189276 373280 257157 259034 345458 173844 157464 134813 -57597 83850 144641 139866
2730 139866 52964 14590 -10842 115899 427394 563017 636654 628383 636671 706503 687677
2719 687677 393876 621411 583023 449668 705895 470108 164615 58831 -34337 16672
2709 16672 195922 41921 -277447 -238398 -268527 -140652 37325 -113068 -124015 -212347 -220544
2698 -220544 -99488 -358987 -345174 -241361 -193866 -20036 157282 -33182 -92759 -186280
2688 -186280 -124955 -182771 -133244 13999 205715 86113 -53503 122311 191569 187677 105929
2677 105929 -75044 4559 -109841 -182685 -270400 -316668 -227485 -188607 -214906 -156510 -347004
2666c47004l10007k5149j6874J02953K55298M2382j25762j4016N4987L8784J46448
2655a97960K26849j52726l2169j95303Q4908j39982k48997Q1679J90830M3602
2645c39269j04912K33334J59284j41494j4020m4024J88715j76455j45577J04560
2635b79858J90021j034K20563M7845L8914K3076P898j09388m0785l2611j01195
2624c6554L5206K739N8948p3273k3895j1195m7059o5170K9655N0081j37091n3989
2612b71597p321j28256J33446o0554p2718l5211P1829J88707M8942k2882K0522
2601a35093P3718l7441j33163k78351M7586L25841O9248L5516j3660l05575R1252
2590b60122J89121N479p4760p355j67786j42081J02434n5134j23723k55532L24856
$$ plain form
2666 -347004 -657011 -682160 -699034 -596081 -340783 -298401 -424163 -438179 -383192 -344408 -197960
2655 -197960 28889 -123837 -156006 -351309 -266401 -406383 -655380 -573701 -382871 -339269
2645 -339269 -444181 -210847 -51563 -193057 -207077 -251101 -62386 -238841 -384418 -279858
2635 -279858 -89837 -90871 129692 177537 216451 239527 247425 138037 97252 64641 -36554
2624 -36554 -1348 1391 60339 -12934 -36829 -48024 -95083 -160253 -130598 -80517 -217608 -271597
2612 -271597 -278918 -407174 -273728 -334282 -407000 -442211 -370382 -181675 -132733 -155615 -135093
2601 -135093 -61375 -98816 -231979 -510330 -462744 -136903 -67655 -32139 -45799 -351374 -260122
2590 -260122 -71001 -65522 -140282 -147637 -315423 -457504 -355070 -410204 -533927 -789459 -464603
2579d64603M1345J58781j56847r365L35927j68774o1704O2147J08305J1185L1762
2568a11841Q651j52245j57304q4371K81190J1526K9463J31367j53267j50650J06416
2557b41065N3748J4151K06528K7552j36772k83500L289q1979k052j55762J70339
2546d25523K47010j95670j41750l6302J69070K42445j59011l1426q4339L8457
2536c77039J16027O4040j45645j75792J98023o9743o2256J17939l9193r3450Q3197
2525c83892J10781J3100q1859K28298P2746j92030L3418L02728j75701j77895
2515b50306J79688N504k47746j6534R1437J4461j48797N7855K01684j9597k9347
2504a61698j80486n7489L0915J21255K82841j6997m6139j90993J15471K27287
$$ plain form
2579 -464603 -423258 -264477 -421324 -430689 -94762 -263536 -325240 -263093 -154788 -143603 -111841
2568 -111841 -103190 -255435 -412739 -497110 -215920 -204394 -174931 -43564 -196831 -347481 -241065
2557 -241065 -187317 -173166 33362 60914 -75858 -359358 -356069 -438048 -440100 -595862 -425523
2546 -425523 -178513 -374183 -515933 -552235 -383165 -140720 -299731 -331157 -415496 -377039
2536 -377039 -261012 -196972 -342617 -518409 -320386 -390129 -452385 -334446 -373639 -467089 -383892
2525 -383892 -273111 -260011 -341870 -113572 -40826 -232856 -199438 103290 -72411 -250306
2515 -250306 -70618 -65114 -312860 -329394 -237957 -223496 -372293 -314438 -112754 -132351 -161698
2504 -161698 -342184 -399673 -368758 -247503 35338 18341 -27798 -218791 -103320 123967
2494A23967j81099j33531N6088j5686j38938N9917M1605q6493Q0044J3935j41309
2483c21500K01378M5071m9451q7728K70077r9611o3450j26342j00235K26946J13478
2472H633J30581j86263j09904K41228P644q0045J44032Q7018j50242k28740K04121
2461F8063L0558O6551j17224K34737N0587j447Q8822J75512J53493J70459j00334
2450H19777p9886p6636R7408J15605Q7531k83119k0229K02507n774m8499l46395
2439D62290M0372K56418J89181j46617n5520k01664J73829J09244j56635J97347
2429H68245L145j6026K97318L3502J1383O181K53583J92245J77110m3210k4871
2418A758605J44490N9953o2240l61160j10717J79103q7107J47431j77999l1738
$$ plain form
2494 123967 -57132 -190663 -134575 -150261 -289199 -229282 -187677 -274170 -194126 -180191 -321500
2483 -321500 -120122 -75051 -124502 -212230 57847 -41764 -105214 -231556 -331791 -104845 8633
2472 8633 139214 -47049 -156953 84275 91919 11874 155906 242924 92682 -136058 68063
2461 68063 98621 165172 47948 282685 333272 331825 420647 596159 749652 920111 819777
2450 819777 739891 663255 760663 876268 963799 680680 660451 862958 857184 808685 462290
2439 462290 502662 759080 948261 801644 746124 544460 718289 827533 670898 868245
2429 868245 871390 855364 1152682 1186184 1197567 1203748 1457331 1649576 1826686 1783476 1758605
2418 1758605 1903095 1963048 1900808 1539648 1428931 1608034 1520927 1668358 1490359 1458621
2408A458621K26473L9575j26896K91983J95254j50161O1540O5392K71312L5569
2398B368662J97849J95530M7361L34083M0610J82332K35850J49313J27858K48973
2388D128421L10045K1101J98187N79281P63301N82464P07286R88114P55273O79100
2378I712573M40165M99525N24308O24699J081138J359237J830796K450052L918709
2369B2441202O387971J0903138J6975758K2051249K0226080Q881436j007024p322869
2361I9536941j3347287j4835694j3270386j1539372r500206p837978o681507m753625
2353A7770886l115727j880010j235085j006847j080144p76655n59024p36056r67509
2344F413829o36243m37042m29217m16768l44787l07878k46726j48958m08844j23942
$$ plain form
2408 1458621 1685094 1724669 1597773 1889756 2085010 1934849 1996389 2061781 2333093 2368662
2398 2368662 2566511 2762041 2809402 3143485 3184095 3366427 3602277 3751590 3879448 4128421
2388 4128421 4438466 4459567 4657754 5237035 6000336 6582800 7290086 8278200 9033473 9712573
2378 9712573 10152738 10652263 11176571 11801270 12882408 14241645 16072441 18522493 22441202
2369 22441202 28829173 39732311 56708069 78759318 98985398 107866834 106859810 99536941
2361 99536941 86189654 71353960 58083574 46544202 37043996 29206018 22524511 17770886
2353 17770886 14655159 12775149 11540064 10533217 9453073 8676418 8117394 7381338 6413829
2344 6413829 5777586 5340544 4911327 4494559 4149772 3841894 3595168 3446210 3037366 2913424
2334B913424j82744J1622M7738j52775l15420k58075J98597J43420k42815j3461
2324B149511L260j54548q5953k60731j2082P1620k99990O7477J12171r3441q8556
2313A408738m6739j09254r6317j10210l88386M1678P2864j38091m9363J7672J4711
2302F17303K50040j49573J83182Q485j66621Q5613n9443j07231q4415k18418n7067
2291C01855j3839q736L5234n0317Q3948j6333K4982j62120J47687J81427k02281
2280C21507m0389r3600R2782K4452k80956k62658M5342J41318j95458l5967P4989
2269b08638L2235K49474l7858p1070K75986P0283k93986j13974L0922j40886R1255
2258a16257J5601J61599j90326j3802N9298j87576J6585J27833k4145o9875M0666
$$ plain form
2334 2913424 2730680 2742302 2790040 2637265 2321845 2063770 2262367 2405787 2162972 2149511
2324 2149511 2152771 1998223 1912270 1651539 1639457 1711077 1411087 1478564 1590735 1497294 1408738
2313 1408738 1361999 1252745 1156428 1046218 657832 699510 772374 634283 584920 602592 617303
2302 617303 867343 717770 900952 909437 742816 828429 768986 661755 577340 358922 301855
2291 301855 288016 279280 314514 264197 348145 331812 356794 194674 342361 523788 321507
2280 321507 281118 187518 280300 304752 23796 -238862 -193520 -52202 -247660 -283627 -208638
2269 -208638 -176403 73071 35213 -35857 240129 310412 16426 -97548 -66626 -207512 -116257
2258 -116257 -100656 60943 -129383 -143185 -83887 -271463 -254878 -127045 -151190 -221065 -180399
2247a80399n6159p6444N1783j32984J8047J8717M130J15872r1508J25284k04155
2236d07816P2121K33578l49030J45073R4235j07173O8262n9198J11581J04355
2226i4012K2806k14056q7231r0941l8698m2674J83022j34239k4327J18364J43543
2215b58443q7941j88012L8141n5090J4851J20520J6413o6018l6189J00855R6541
2204c04372j71098J21129m0640p0460J7095r2611k58185J08036P0449K72445J1349
2193c36863j10303m4450j49117l9679J58526K34590J06371l7099j40740j91938
2183e50702j41479Q4252K68599M4873j87161j12799N5057j44894o994K01742r4080
2172e83586J47634j4451k5231P0154j71243M2251P7525M7288j7451l1980q8510
$$ plain form
2247 -180399 -236558 -313002 -261219 -394203 -376156 -357439 -353309 -237437 -328945 -203661 -407816
2236 -407816 -335695 -102117 -451147 -306074 -211839 -319012 -250750 -309948 -198367 -94012
2226 -94012 -71206 -285262 -372493 -463434 -502132 -544806 -361784 -496023 -520350 -401986 -258443
2215 -258443 -346384 -534396 -496255 -551345 -536494 -415974 -399561 -465579 -501768 -400913 -304372
2204 -304372 -475470 -354341 -394981 -465441 -448346 -540957 -799142 -691106 -620657 -348212 -336863
2193 -336863 -447166 -491616 -640733 -680412 -521886 -287296 -180925 -218024 -358764 -550702
2183 -550702 -692181 -607929 -339330 -294457 -481618 -594417 -539360 -684254 -691248 -489506 -583586
2172 -583586 -435952 -450403 -475634 -405480 -576723 -534472 -456947 -409659 -427110 -459090 -547600
2161e47600j76243k0960K5490J66041q1052J03855O3924m3006O6301M6163j94068
2150e91155j07993K92635J4497n3285k45567J18721R8812K12142M4383j79379
2140c96189j8784l4574K0562j26562J72332q1769J5479l9971R9564O6965j30572
2129d53519j7252j46803n1291N0294J18754O3240Q2950j88507j4348J13445J5871
2118d27166j51098p4406N5231K26230q475r6291K2581j68988J50347K0911J23577
2107c27547j1122r2793K50704K7958k31770Q198k7950k33686J47995J83926L4704
2096b71383m7345L1033J57903O8325J39932o438M2349n0013k56866j097n4348
2085b47948j40965J77549m5285n9564k3613j9201m9750N2416J7434P2002j22650
$$ plain form
2161 -547600 -723843 -744803 -719313 -553272 -634324 -530469 -466545 -509551 -443250 -397087 -591155
2150 -591155 -699148 -406513 -392016 -445301 -690868 -572147 -473335 -261193 -216810 -396189
2140 -396189 -414973 -449547 -428985 -555547 -383215 -464984 -449505 -489476 -389912 -322947 -453519
2129 -453519 -470771 -617574 -668865 -618571 -499817 -436577 -353627 -542134 -556482 -443037 -427166
2118 -427166 -578264 -652670 -597439 -371209 -379684 -475975 -453394 -622382 -472035 -451124 -327547
2107 -327547 -338669 -431462 -180758 -152800 -384570 -376372 -404322 -638008 -490013 -306087 -271383
2096 -271383 -318728 -287695 -129792 -61467 78465 72027 114376 64363 -192503 -193600 -247948
2085 -247948 -388913 -211364 -256649 -316213 -339826 -359027 -408777 -356361 -338927 -266925 -389575
2074c89575j66894l5873J71262K61784j24837K1404R9984n3820k72702j8544J0077
2063d97734j52554O5633J35676j00551p9085j5986J26174J27735o7672J33476
2053c24888N9842k45602P7884J17257K10958J03980j70795l4586r1822p1786N3980
2042c15578j75519l0157J16574k57371R2088j33795K2378N4155J27714m1881J37505
2031d03887l1181q4535J08642r9654K0235O4164N3233O8554k96737K1953j12067
2020f91280M8370J27713P5357n9360K13495N6300l70599L8183j29713J3345J68408
2009e09781L09837k19406L490J46964J44011j65301l773p6448j6666j12105K25691
1998b73487K0089j3729m0234j9142k380N647p3614r2718m6228N1775o7473p4349
$$ plain form
2074 -389575 -556469 -592342 -421080 -159296 -284133 -262729 -162745 -216565 -489267 -507811 -497734
2063 -497734 -650288 -584655 -448979 -549530 -628615 -644601 -518427 -390692 -458364 -324888
2053 -324888 -265046 -510648 -432764 -315507 -104549 -569 -171364 -205950 -297772 -369558 -315578
2042 -315578 -491097 -521254 -404680 -662051 -569963 -703758 -681380 -627225 -499511 -541392 -403887
2031 -403887 -435068 -519603 -410961 -510615 -490380 -426216 -372983 -304429 -601166 -579213 -691280
2020 -691280 -642910 -515197 -439840 -499200 -285705 -229405 -600004 -561821 -691534 -678189 -509781
2009 -509781 -199944 -419350 -415860 -268896 -124885 -290186 -293959 -370407 -387073 -499178 -273487
1998 -273487 -253398 -267127 -307361 -326503 -328883 -323236 -396850 -489568 -535796 -484021 -551494 -625843
1986f25843L76642N1521j32834q607K07505j217n9991Q7704j10680k45805J13122
1975c48483o9295M6329l5663K2877J61370q1584N2556j68130M1844J47189j11874
1964c42864M5775o4640q7756J09737n9637m8706O7433J18275J6699k20476J07658
1953c58502Q3748p8430J11445j96592K6556N050J7350k07047L4433J81393N9370
1942c21226J5265N9188k19752p9956P4151P624O9487J036l1893J13813M7620n1751
1930c16394J47200j76298k8249j12992J74666m5505o0320j1204R5041j12066J45523
1919c00598J71123o7114l37179K8154K10077k8747j76838o3677J11652Q3664j2581
1908c82064J3347q5082K49327N4469k1773K1708k18940R5859K9226P2964n5427
$$ plain form
1986 -625843 -249201 -197680 -330514 -339121 -131616 -132833 -192824 -105120 -215800 -461605 -348483
1975 -348483 -417778 -371449 -407112 -384235 -222865 -304449 -251893 -420023 -378179 -230990 -342864
1964 -342864 -297089 -361729 -449485 -339748 -399385 -448091 -380658 -262383 -245684 -466160 -358502
1953 -358502 -274754 -353184 -241739 -438331 -411775 -406725 -389375 -596422 -561989 -380596 -321226
1942 -321226 -305961 -246773 -466525 -546481 -472330 -464706 -395219 -394183 -426076 -312263 -264643 -316394
1930 -316394 -169194 -345492 -373741 -486733 -312067 -357572 -417892 -429096 -334055 -446121 -300598
1919 -300598 -129475 -196589 -533768 -505614 -295537 -324284 -501122 -564799 -453147 -369483 -382064
1908 -382064 -368717 -453799 -204472 -150003 -171776 -150068 -369008 -273149 -243923 -170959 -226386
1897b26386l2497L7979Q5012o2796k06199N7655m2397n2971J61744j76528J6254
1886d41130J32614J2349l44128J13911J68997k6272J38825P5489p2383L6726j70924
1875c75926O9092J02640p2831j09834J34116q7383k20914J59697J01433J00794
1865a99116K1232M6805j61213r6827K7575J04504O6912J34555j15688j54017K3135
1854c02143L8457n1203j30228k95234j2658K46049J52315J21205j76744k9562
1844d39746Q0586J29543L88568j84732o7495m397q8147J7576L656j80090p4056
1833d18734J27337N558j65252K25245J78055m6629l3346j15391K00133K0657k37632
1822b59999q8366J83634Q5403l1187j05538r7806L1710M2452m1449J7945K5820
$$ plain form
1897 -226386 -258883 -220904 -135892 -198688 -404887 -347232 -389629 -442600 -280856 -457384 -441130
1886 -441130 -308516 -296167 -640295 -526384 -357387 -383659 -244834 -169345 -241728 -205002 -375926
1875 -375926 -306834 -204194 -277025 -386859 -252743 -340126 -561040 -401343 -299910 -199116
1865 -199116 -177884 -131079 -292292 -389119 -361544 -257040 -190128 -55573 -171261 -325278 -302143
1854 -302143 -263686 -314889 -445117 -740351 -753009 -506960 -354645 -233440 -410184 -439746
1844 -439746 -359160 -229617 158951 -25781 -93276 -97673 -185820 -168244 -164588 -344678 -418734
1833 -418734 -291397 -285839 -451091 -225846 -47791 -94420 -127766 -243157 -43024 -22367 -259999
1822 -259999 -348365 -164731 -79328 -110515 -216053 -313859 -282149 -239697 -281146 -263201 -237381
1811b37381j61357R3612K981m4825o434m0481R4167K47930M1326p8552r0849k90659
1799d70522K73665K79314K0437k70060j36314l7852R7651j5165j6561n3432K19028
1788a09811J45633O082j43845j52291j49187J54854J76294q632j12345q4647j09493
1777c87388O2723J67390r3921l7797J81858j91195J9692K55568k09558j84325
1767d16953K36855J72013m1011K9593q1165j92075k4145J63986q1690K05939q2870
1756a11523M655j31010P3368p6967K8075l4609o6829O7182J18968j43285j17045
1745c89020k8750L4837K9943Q8410Q0916O173K5811j49941J54090m4864o205Q2849
1733a15751l38670J7169K34010J44228j8244J0354j8764j68429n1950K11963k9053
$$ plain form
1811 -237381 -398738 -305126 -302145 -346970 -353404 -393885 -299718 -51788 -10462 -89014 -179863 -470522
1799 -470522 -196857 82457 102894 -167166 -303480 -341332 -243681 -258846 -275407 -328839 -109811
1788 -109811 35822 41904 -101941 -254232 -403419 -248565 -72271 -80903 -193248 -277895 -387388
1777 -387388 -324665 -157275 -251196 -288993 -107135 -298330 -278638 -23070 -232628 -416953
1767 -416953 -180098 -8085 -49096 -19503 -100668 -292743 -316888 -152902 -234592 -28653 -111523
1756 -111523 -106868 -237878 -164510 -241477 -213402 -248011 -314840 -247658 -128690 -271975 -389020
1745 -389020 -417770 -382933 -352990 -264580 -183664 -177491 -151680 -301621 -147531 -192395 -198600 -115751
1733 -115751 -454421 -437252 -203242 -59014 -77258 -66904 -85668 -254097 -306047 -94084 -123137
1722a23137L6569k8380k12340R0311m1221J55555M0159R8362j21551j56704n0065
1711c12442J26139J62967P4912l7164J0993j36769o9993j61384N4645n5505k8301
1700c71902J98464p6320J43494l4932J72709q1468N2525j7550j60091J53607J9464
1689b000r0454p8228J20278J36110j21495k22702j12742P7825K74493j86836l8879
1678b44630k38l6010P328j08073J4602O6869J07J29064J002P8721P3184N476j98086
1665b10684j11346M1715K13612k12k14211p6800R09R3848R6657N7881j6116K44536
1653A19789J2220n1588j26217L0284R7704j34053n1520j14497j1289m1870L4039
1642b36998M517P197R9574k02324J70868J98626N3591k48077J7170p0242M155
$$ plain form
1722 -123137 -86568 -114948 -327288 -236977 -278198 -122643 -82484 15878 -105673 -262377 -312442
1711 -312442 -186303 -23336 51576 14412 25405 -111364 -181357 -342741 -288096 -343601 -371902
1700 -371902 -173438 -249758 -106264 -141196 31513 -49955 2570 -14980 -175071 -21464 -2000
1689 -2000 -92454 -170682 -50404 85706 -35789 -258491 -371233 -293408 -18915 -205751 -244630
1678 -244630 -244868 -280878 -273550 -381623 -367021 -300152 -300045 -170981 -169979 -91258 -18074 -12598 -210684
1665 -210684 -322030 -280315 -66703 -66915 -281126 -357926 -357017 -263169 -166512 -108631 -124747 119789
1653 119789 132009 80421 -45796 -15512 82192 -51861 -103381 -217878 -229167 -271037 -236998
1642 -236998 -232481 -225284 -125710 -328034 -157166 41460 95051 -153026 -135856 -206098 -201943
$$ [...]
##END NTUPLES=NMR SPECTRUM
##END=
