##TITLE=1H_DE-80H_X3
 200.13MHz, d2o
 8 sc
 
 19ns.26.2.2025
##JCAMPDX= 6.0         $$ Bruker NMR JCAMP-DX V2.0
##DATA TYPE= NMR SPECTRUM
##DATA CLASS= NTUPLES
##ORIGIN= UXNMR, Bruker Analytische Messtechnik GmbH
##OWNER= pz
$$ XWIN-NMR		Version 3.5
$$ Thu Jun  4 11:54:58 2026 Russian Standard Time (UT+4h)  Yarkov@DPX200
##.OBSERVE FREQUENCY= 200.1313
##.OBSERVE NUCLEUS= ^1H
##.ACQUISITION MODE= SIMULTANEOUS
##.ACQUISITION SCHEME= undefined
##.AVERAGES= 8
##.DIGITISER RES= 18
##SPECTROMETER/DATA SYSTEM= spect
##.PULSE SEQUENCE= zg30
##.SOLVENT NAME= CDCl3
##.SHIFT REFERENCE= (INTERNAL, CDCl3, 0, 15.413)
##AUDIT TRAIL= $$ (NUMBER, WHEN, WHO, WHERE, WHAT)
$$ ##TITLE= Audit trail, XWIN-NMR		Version 3.5
$$ ##JCAMPDX= 5.01
$$ ##ORIGIN= Bruker BioSpin GmbH
$$ ##OWNER= Yarkov
$$ C:/Bruker/XWIN-NMR/data/yarkov2/nmr/H-C/1/pdata/1/auditp.txt
$$ ##AUDIT TRAIL=  $$ (NUMBER, WHEN, WHO, WHERE, WHAT)
(   1,<2026-06-04 11:54:02.82 +0400>,<Yarkov>,<DPX200>,
      <created by zg, POWCHK disabled, PULCHK disabled
       configuration hash MD5:
       00 E9 B6 7A A2 85 ED C7 34 08 36 98 17 FE 4E 26
       data hash MD5: 16K
       35 7D B5 86 4E F3 57 01 57 79 D2 C7 66 30 94 00>)
(   2,<2026-06-04 11:54:16.48 +0400>,<Yarkov>,<DPX200>,
      <Start of raw data processing
       efp BC_mod = 2 LB = 0.25 FT_mod = 6 PKNL = 1 PHC0 = -6376.443 PHC1 = 8.221958 SI = 16K 
       data hash MD5: 16K
       55 37 F9 2D DC EC 3C AC 5D 1E F6 93 BE 3B A0 33>)
$$ ##END=
$$ 
$$ hash MD5
$$ 39 6F 5A 73 A0 FA D8 AA EA CD E7 C2 D1 B4 D4 82
##$RELAX= 
##$RELAX= 
##$RELAX= 
##$RELAX= 
##$RELAX= 
##$RELAX= 
$$ Bruker specific parameters
$$ --------------------------
##$DU= <C:/Bruker/XWIN-NMR>
##$EXPNO= 1
##$NAME= <H-C>
##$PROCNO= 1
##$TYPE= <nmr>
##$USER= <yarkov2>
##$AMP= (0..31)
100 100 100 100 100 100 100 100 100 100 100 100 100 100 100 100 100 100 
100 100 100 100 100 100 100 100 100 100 100 100 100 100 
##$AQSEQ= 0
##$AQ_mod= 1
##$AUNM= <au_zg>
##$AUTOPOS= <>
##$BF1= 200.13
##$BF2= 200.13
##$BF3= 200.13
##$BF4= 200.13
##$BF5= 200.13
##$BF6= 200.13
##$BF7= 200.13
##$BF8= 200.13
##$BYTORDA= 1
##$CFDGTYP= 0
##$CFRGTYP= 5
##$CHEMSTR= <none>
##$CNST= (0..31)
1 1 145 1 1 1 1 1 1 1 1 1 1 1 1 1 1 1 1 1 1 1 1 1 1 1 1 1 1 1 1 1 
##$CPDPRG= <>
##$CPDPRG1= <>
##$CPDPRG2= <>
##$CPDPRG3= <>
##$CPDPRG4= <mlev>
##$CPDPRG5= <mlev>
##$CPDPRG6= <mlev>
##$CPDPRG7= <mlev>
##$CPDPRG8= <mlev>
##$CPDPRGB= <>
##$CPDPRGT= <>
##$D= (0..31)
0 0.7 0 0 0 0 0 0 0 0 0 0.03 0 0 0 0 0 0 0 0 0 0 0 0 0 0 0 0 0 0 0 0 
##$DATE= 1780559642
##$DBL= (0..7)
120 120 120 120 120 120 120 120 
##$DBP= (0..7)
150 150 150 150 150 150 150 150 
##$DBP07= 0
##$DBPNAM0= <>
##$DBPNAM1= <>
##$DBPNAM2= <>
##$DBPNAM3= <>
##$DBPNAM4= <>
##$DBPNAM5= <>
##$DBPNAM6= <>
##$DBPNAM7= <>
##$DBPOAL= (0..7)
0.5 0.5 0.5 0.5 0.5 0.5 0.5 0.5 
##$DBPOFFS= (0..7)
0 0 0 0 0 0 0 0 
##$DE= 6
##$DECBNUC= <off>
##$DECIM= 32
##$DECNUC= <off>
##$DECSTAT= 4
##$DIGMOD= 1
##$DIGTYP= 9
##$DL= (0..7)
0 120 120 120 120 120 120 120 
##$DP= (0..7)
$$ [...]
##$SUBNAM2= <"">
##$SUBNAM3= <"">
##$SUBNAM4= <"">
##$SUBNAM5= <"">
##$SUBNAM6= <"">
##$SUBNAM7= <"">
##$SUBNAM8= <"">
##$SUBNAM9= <"">
##$SW= 18.0517328524113
##$SWIBOX= (0..15)
0 0 2 0 0 0 0 0 0 0 0 0 0 0 0 0 
##$SW_h= 3612.71676300578
##$TD= 16384
##$TD0= 1
##$TE= 0
##$TE2= 300
##$TE3= 300
##$TEG= 300
##$TL= (0..7)
0 120 120 120 120 120 120 120 
##$TP= (0..7)
150 150 150 150 150 150 150 150 
##$TP07= 0
##$TPNAME0= <>
##$TPNAME1= <>
##$TPNAME2= <>
##$TPNAME3= <>
##$TPNAME4= <>
##$TPNAME5= <>
##$TPNAME6= <>
##$TPNAME7= <>
##$TPOAL= (0..7)
0.5 0.5 0.5 0.5 0.5 0.5 0.5 0.5 
##$TPOFFS= (0..7)
0 0 0 0 0 0 0 0 
##$TUNHIN= 0
##$TUNHOUT= 0
##$TUNXOUT= 0
##$USERA1= <user>
##$USERA2= <user>
##$USERA3= <user>
##$USERA4= <user>
##$USERA5= <user>
##$V9= 5
##$VALIST= <valist>
##$VCLIST= <CCCCCCCCCCCCCCC>
##$VD= 0
##$VDLIST= <DDDDDDDDDDDDDDD>
##$VPLIST= <PPPPPPPPPPPPPPP>
##$VTLIST= <TTTTTTTTTTTTTTT>
##$WBST= 1024
##$WBSW= 4
##$XGAIN= (0..3)
0 0 0 0 
##$XL= 0
##$YL= 0
##$YMAX_a= 545692
##$YMIN_a= -492913
##$ZGOPTNS= <>
##$ZL1= 120
##$ZL2= 120
##$ZL3= 120
##$ZL4= 120
##$ABSF1= 0
##$ABSF2= 0
##$ABSG= 0
##$ABSL= 0
##$ALPHA= 0
##$AQORDER= 0
##$ASSFAC= 0
##$ASSFACI= 0
##$ASSFACX= 0
##$ASSWID= 0
##$AUNMP= <proc_1d>
##$AZFE= 0.1
##$AZFW= 0.1
##$BCFW= 0
##$BC_mod= 2
##$BYTORDP= 0
##$COROFFS= 0
##$CY= -3
##$DATMOD= 1
##$DC= 0
##$DFILT= <>
##$DTYPP= 0
##$F1P= 0
##$F2P= 0
##$FCOR= 1
##$FTSIZE= 16384
##$FT_mod= 6
##$GAMMA= 0
##$GB= 0
##$INTBC= 1
##$INTSCL= 3.241238e-09
##$ISEN= 128
##$LB= 0.25
##$LEV0= 0
##$LPBIN= 0
##$MAXI= 10000
##$MC2= 0
##$MEAN= 0
##$ME_mod= 0
##$MI= 1.114404
##$NCOEF= 0
##$NC_proc= -5
##$NLEV= 6
##$NOISF1= 3.799351
##$NOISF2= 2.8
##$NSP= 0
##$NTH_PI= 0
##$NZP= 0
##$OFFSET= 15.41304
##$PC= 1
##$PHC0= -6376.443
##$PHC1= 8.221958
##$PH_mod= 1
##$PKNL= yes
##$PPARMOD= 0
##$PSCAL= 0
##$PSIGN= 0
##$REVERSE= no
##$SF= 200.130021746439
##$SI= 16384
##$SIGF1= 3
##$SIGF2= 2
##$SINO= 0.751879
##$SIOLD= 32768
##$SREGLST= <19F.Aceton>
##$SSB= 0
##$STSI= 16384
##$STSR= 0
##$SW_p= 3612.71676300578
##$SYMM= 0
##$S_DEV= 0
##$TDeff= 16384
##$TDoff= 0
##$TI= <>
##$TILT= no
##$TM1= 0
##$TM2= 0
##$TOPLEV= 0
##$USERP1= <user>
##$USERP2= <user>
##$USERP3= <user>
##$USERP4= <user>
##$USERP5= <user>
##$WDW= 1
##$XDIM= 16384
##$YMAX_p= 281363319
##$YMIN_p= -517973
$$ End of Bruker specific parameters
$$ ---------------------------------
##NTUPLES= NMR SPECTRUM
##VAR_NAME=  FREQUENCY,     SPECTRUM/REAL,   SPECTRUM/IMAG
##SYMBOL=    X,             R,               I
##VAR_TYPE=  INDEPENDENT,   DEPENDENT,       DEPENDENT
##VAR_FORM=  AFFN,          ASDF,            ASDF
##VAR_DIM=   16384,         16384,           16384
##UNITS=     HZ,            ARBITRARY UNITS, ARBITRARY UNITS
##FACTOR=    0.220516191357247, 1,           1
##FIRST=     3084.61206262625, 0,            0
##LAST=      -528.104700379532, 0,           0
##MIN=       -528.104700379532, -517973,     0
##MAX=       3084.61206262625, 281363319,    0
$$ Real data points
##PAGE= N=1
##DATA TABLE= (X++(R..R)), XYDATA
$$ [...]
$$ plain form
7699 109441 87357 115494 77622 88045 66435 92179 109832 168809 130501 79673 31560 60457
7687 60457 105581 128569 83895 47234 78221 109264 83169 79551 108478 57213 25663 32487
7675 32487 74414 59064 39663 74727 33225 56082 27270 50398 60964 82653 75929 33583
7663 33583 80069 35577 15202 -6301 19152 29743 71438 72322 15175 54839 101256 69031
7651 69031 45839 32956 36883 31953 51657 17137 -36900 6426 76969 74447 35708 5252
7639 5252 40177 97260 87562 36033 31910 72043 85766 74877 48721 57937 64877 3554 26037
7626 26037 97725 106335 65985 51128 93595 101747 73619 99097 154508 138217 115362 68524
7614 68524 66875 113501 95408 104144 112675 128225 102826 62731 80447 99445 66054 40322
$$ packed form
7699A09441k2084K8137l7872J0423k1610K5744J7653N8977l8308n0828m8113K8897
7687F0457M5124K2988m4674l6661L0987L1043k6095l618K8927n1265l1550O824
7675C2487M1927j5350j9401L5064m1502K2857k8812K3128J0566K1689o724m2346
7663C3583M6486m4492k0375k1503K5453J0591M1695Q84n7147L9664M6417l2225
7651F9031k3192j2883L927m930J9704l4520n4037M3326P0543k522l8739l0456
7639E252L4925N7083r698n1529m123M0133J3723j0889k6156R216O940o1323K2483
7626B6037P1688Q610m0350j4857M2467Q152k8128K5478N5411j6291k2855m6838
7614F8524j649M6626j8093Q736Q531J5550k5399m0095J7716J8998l3391k5732
$$ plain form
7602 40322 21130 10803 32820 4888 38652 49476 57882 27250 52017 48080 67549 104589
7590 104589 109873 107864 89483 80028 8745 18458 41718 32037 44255 28842 40623 90743 115369
7577 115369 164902 150678 133319 86556 88441 73150 56027 59223 103732 115715 73082 39741
7565 39741 24308 33603 45154 39376 79747 68409 33798 24281 19337 76303 70430 -3443 -14966
7552 -14966 49867 41145 22007 67973 60095 69652 80737 26479 -6524 67894 76706 171591 178250
7539 178250 104969 62185 55492 73700 89958 117677 100072 81753 117123 104368 82958 93064
7527 93064 75922 57684 32848 45868 83793 92957 139434 194151 149926 99344 82190 111990
7515 111990 96798 97555 107816 171411 181093 103537 56481 102963 128333 163016 181526 162561
$$ packed form
7602D0322j9192j0327K2017k7932L3764J0824Q406l0632K4767l937J9469L7040
7590A04589N284k009j8381r455p1283R713K3260r681J2218j5413J1781N0120K4626
7577A15369M9533j4224j7359m6763J885j5291j7123L196M4509J1983m2633l3341
7565C9741j5433R295J1551n778M0371j1338l4611r517m944N6966n873p3873j1523
7552a4966O4833q722j9138M5966p878R557J1085n4258l3003P4418Q812R4885O659
7539A78250p3281m2784o693J8208J6258K7719j7605j8319L5370j2755k1410J0106
7527I3064j7142j8238k4836J3020L7925R164M6477N4717m4225n0582j7154K9800
7515A11990j5192P57J0261O3595R682p7556m7056M6482K5370L4683J8510j8965
$$ plain form
7503 162561 135916 121576 134757 133194 140152 144720 135242 152739 131841 152665 166713 196168
7491 196168 177536 204405 200642 192054 259654 292371 274818 261825 228317 179775 149469 143226
7479 143226 172178 188536 145648 229346 220108 165158 157826 152928 160887 148469 175153 180987 209509
7466 209509 234543 246099 240409 253357 204175 196244 233234 242294 281562 271853 267797 237779 137449
7453 137449 123269 145796 153023 202690 157780 116314 124421 127482 149774 176930 156646 113446
7441 113446 86818 68274 92941 141751 218154 187251 133690 126862 115742 101337 125217 141149
7429 141149 160746 139796 120332 69386 50773 119051 123726 188762 135384 32113 64447 37793
7417 37793 76317 120233 114616 104839 88583 138796 187464 223061 247727 233004 186295 116006
$$ packed form
7503A62561k6645j4340J3181j563O958M568r478J7497k0898K0824J4048K9455
7491A96168j8632K6869l763q588O7600L2717j7553j2993l3508m8542l0306o243
7479A43226K8952J6358m2888Q3698r238n4950p332m898P959j2418K6684N834K8522
7466B09509K5034J1556n690J2948m9182p931L6990R060L9268r709m056l0018j00330
7453A37449j4180K2527P227M9667m4910m1466Q107L061K2292K7156k0284m3200
7441A13446k6628j8544K4667M8810P6403l0903n3561o828j1120j4405K3880J5932
7429A41149J9597k0950j9464n0946j8613O8278M675O5036n3378j03271L2334k6654
7417C7793L8524M3916n617r777j6256N0213M8668L5597K4666j4723m6709p0289
$$ plain form
7405 116006 131775 97825 105216 87782 111843 110538 85102 72918 70370 159211 141647 93743
7393 93743 138153 127662 171302 255280 277626 245497 228002 158601 212944 183711 142093 200507
7381 200507 166217 134333 96369 99126 93148 70762 63576 86734 90152 108816 131867 139260 183660
7368 183660 175959 162375 127242 88812 52598 82257 162710 148953 160850 128653 39845 25344
7356 25344 115785 134481 104600 61771 -5456 30832 76776 104019 151194 89720 50212 16683
7344 16683 -4398 -12993 51038 64941 46475 5463 -14130 -44774 -13484 45121 93789 110941
7332 110941 65767 31998 -2114 42060 113887 90017 53695 27234 19508 28703 22825 14597
7320 14597 47349 76124 44517 47068 39514 85245 111202 107083 189966 277585 336273 391715
$$ packed form
7405A16006J5769l3950P391j7434K4061j305k5436j2184k548Q8841j7564m7904
7393I3743M4410j0491M3640Q3978K2346l2129j7495o9401N4343k9233m1618N8414
7381B00507l4290l1884l7964K757n978k2386p186K3158L418J8664K3051P393M4400
7368A83660p701j3584l5133l8430l6214K9659Q0453j3757J1897l2197q8808j4501
7356B5344R0441J8696k9881m2829o7227L6288M5944K7243M7175o1474l9508l3529
7344A6683k1081q595O4031J3903j8466m1012j9593l0644L1290N8605M8668J7152
7332A10941m5174l3769l4112M4174P1827k3870l6322k6461p726R195n878q228
7320A4597L2752K8775l1607K551p554M5731K5957m119Q2883Q7619N8688N5442
$$ plain form
7308 391715 499768 559194 554858 474426 387531 319482 247121 187213 177356 190284 169270 121669
7296 121669 109065 107768 80000 60811 50542 39997 40985 22575 11414 37650 63700 75278
7284 75278 54614 55892 62845 100059 60371 55533 21398 -9039 -5405 -8307 33233 78765 138413
7271 138413 112058 96806 120522 92405 87716 117416 94655 44312 60219 103123 71124 46894
7259 46894 87595 89085 99677 74860 33416 33470 46023 52616 46560 80674 77597 103279 117200
7246 117200 103308 127813 117260 119949 87740 60588 84714 119650 88905 104736 115087 93947
7234 93947 78820 133018 143636 113438 101663 122473 153340 115179 142590 147453 97634 77278
7222 77278 87947 84777 117495 157416 105452 106994 56299 40857 3228 -10814 2210 -13223
$$ packed form
7308C91715J08053N9426m336q0432q6895o8049p2361n9908r857J2928k1014m7601
7296A21669j2604j297k7768j9189j0269j0545R88j8410j1161K6236K6050J1578
7284G5278k0664J278O953L7214l9688m838l4135l0437L634k902M1540M5532N9648
7271A38413k6355j5252K3716k8117m689K9700k2761n0343J5907M2904l1999k4230
7259D6894M0701J490J0592k4817m1444N4J2553O593o056L4114l077K5682J3921
7246A17200j3892K4505j0553K689l2209k7152K4126L4936l0745J5831J0351k1140
7234I3947j5127N4198J0618l0198j1775K0810L0867l8161K7411M863m9819k0356
7222G7278J0669l170L2718L9921n1964J542n0695j5442l7629j4042J3024j5433
$$ plain form
7210 -13223 2929 7942 19806 12772 45956 74555 101100 34322 10477 18940 10168 -5179 36177
7197 36177 53508 78067 53249 42107 44761 68786 101848 60285 66572 94094 68989 21967
7185 21967 32392 71656 27955 9955 55397 79517 102558 64690 80795 50807 -11084 -24075
7173 -24075 -21083 44173 45898 58036 45565 -10240 75 -14623 20738 37565 37056 12993 21968
7160 21968 75233 84302 78162 88157 121668 59451 69886 75030 80048 69450 41779 18009 57700
7147 57700 64166 38932 106726 79221 78978 67621 95948 82908 94560 134608 131608 119353 95558
7134 95558 54141 93195 119689 144927 128276 54647 53650 103197 150826 110004 105689 150377
7122 150377 164245 89322 80191 115118 179265 170216 143663 184203 162064 121912 147004 136845
$$ packed form
7210a3223J6152N013J1864p034L3184K8599K6545o6778k3845Q463q772j5347M1356
7197C6177J7331K4559k4818j1142K654K4025L3062m1563O287K7522k5105m7022
7185B1967J0425L9264m3701j8000M5442K4120K3041l7868J6105k9988o1891j2991
7173b4075K992O5256J725J2138j2471n5805J0315j4698L5361J6827n09k4063Q975
7160B1968N3265R069o140R995L3511o2217J0435N144N018j0598k7671k3770L9691
7147E7700O466k5234O7794k7505k43j1357K8327j3040J1652M0048l000j2255k3795
7134I5558m1417L9054K6494K5238j6651p3629r97M9547M7629m0822m315M4688
7122A50377J3868p4923r131L4927O4147r049k6553M0540k2139m0152K5092j0159
$$ plain form
7110 136845 145939 141581 121059 120761 122868 154670 169159 204454 145379 124717 162263 151268 185295
7097 185295 205624 181998 228912 191280 201218 259524 268351 198010 150214 177110 172837 144850
7085 144850 188152 245369 246259 235050 221961 207276 163945 218346 186601 190606 158551 101998
7073 101998 67399 47699 145486 150703 94551 34312 39087 7404 -24731 19988 -17090 35372
7061 35372 84539 45729 53345 29505 -14301 108526 122900 62670 77403 55894 24710 45117
7049 45117 67361 77200 66027 52285 30767 42429 63762 87907 116000 96612 39766 24652
7037 24652 49263 112100 48989 1279 26564 -33323 -647 50996 72530 79722 18801 -20073
7025 -20073 -4631 12435 49238 35555 72886 101502 3490 -16114 9214 7422 72567 68350
$$ packed form
7110A36845R094m358k0522k98K107L1802J4489L5295n9075k0662L7546j0995L4027
7097A85295K0329k3626M6914l7632R938N8306Q827p0341m7796K6896m273k7987
7085A44850M3302N7217Q90j1209j3089j4685m3331N4401l1745M005l2055n6553
7073A01998l4599j9700R7787N217n6152o0239M775l1683l2135M4719l7078N2462
7061C5372M9167l8810P616k3840m3806J22827J4374o0230J4733k1509l1184K0407
7049D5117K2244R839j1173j3742k1518J1662K1333K4145K8093j9388n6846j5114
7037B4652K4611O2837o3111m7710K5285n9887L2676N1643K1534P192o0921l8874
7025b0073J5442J7066L6803j3683L7331K8616r8012j9604K5328j792O5145m217
$$ plain form
7013 68350 52300 23702 62225 41525 72058 119044 100937 35341 8943 -22250 88775 117914
7001 117914 91273 68641 71639 80303 55458 82952 66042 25063 50873 42038 -7218 12464
6989 12464 38160 37152 30099 35140 57591 71139 82949 143809 115977 85235 68028 77895 36214
6976 36214 39470 61715 72349 108741 60297 -15982 43613 64187 86649 45413 28829 25167
6964 25167 21738 12570 -21498 -35480 -13889 9703 -7520 57559 69352 86794 48167 27111
6952 27111 43181 -12531 6642 17513 34313 98493 57537 24934 28740 61974 63618 63733 127378
6939 127378 123666 111428 -1558 81154 82502 22597 98627 114668 88233 71906 49983 65909
6927 65909 48650 80018 49764 39082 10108 -34042 20198 47482 86008 49738 95187 57569
$$ packed form
7013F8350j6050k8598L8523k0700L0533M6986j8107o5596k6398l1193J11025K9139
7001A17914k6641k2632K998Q664k4845K7494j6910m0979K5810q835m9256J9682
6989A2464K5696j008p053N041K2451J3548J1810O0860k7832l0742j7207R867m1681
6976C6214L256K2245J0634L6392m8444p6279N9595K0574K2462m1236j6584l662
6964B5167l429r168l4068j3982K1591K3592j7223O5079J1793J7442l8627k1056
6952B7111J6070n5712J9173J0871J6800O4180m0956l2603L806L3234J644J15O3645
6939A27378l712j2238j12986Q2712J348n9905P6030J6041k6435j6327k1923J5926
6927F5909j7259L1368l0254j0682k8974m4150N4240K7284L8526l6270M5449l7618
$$ plain form
6915 57569 48910 31542 55165 90800 100869 99021 89318 89067 100974 143569 105876 72773 55749
6902 55749 48797 14913 33783 65956 96065 64159 29079 72715 78655 78121 114551 104296 51861
6889 51861 129284 141012 89599 55137 74312 105899 119245 91328 38075 35276 34139 32697
6877 32697 34766 33979 47238 30662 31400 43453 41048 92557 73740 45457 75986 43120 29724
6864 29724 56619 65578 100583 89587 81859 68899 88691 121902 126988 89602 82008 56487 37495
6851 37495 107687 125460 130750 75714 59071 37658 40243 50241 35957 47329 56236 29644 25900
6838 25900 27733 90528 121313 130409 142561 104397 84262 102773 109918 135718 120254 93610
6826 93610 48401 72770 74320 39066 86566 168554 181559 162114 113525 125214 131298 123115
$$ packed form
6915E7569q659j7368K3623L5635J0069j848r703k51J1907M2595l7693l3103j7024
6902E5749o952l3884J8870L2173L0109l1906l5080M3636N940n34L6430j0255n2435
6889E1861P7423J1728n1413l4462J9175L1587J3346k7917n3253k799j137j442
6877C2697K069p87J3259j6576P38J2053k405N1509j8817k8283L0529l2866j3396
6864B9724K6895Q959L5005j0996p728j2960J9792L3211N086l7386p594k5521j8992
6851C7495P0192J7773N290n5036j6643k1413K585R998j4284J1372Q907k6592l744
6838B5900J833O2795L0785R096J2152l8164k0135J8511P145K5800j5464k6644
6826I3610m5209K4369J550l5254M7500Q1988J3005j9445m8589J1689O084q183
$$ plain form
6814 123115 171434 187903 150158 101306 98232 49411 90223 137933 159914 121066 75048 20781
6802 20781 40059 116509 165631 141105 136161 91742 118069 138495 155911 170987 181679 227739
6790 227739 204515 150901 138215 134051 154110 215361 253288 191681 175532 153298 227085 286863
6778 286863 273649 250248 207956 186867 159747 179464 200671 197242 186527 140334 134039 118905
6766 118905 141569 174589 144091 175531 210870 176203 127220 150622 148704 179503 196332 211629
6754 211629 172141 141614 123473 166666 214989 219636 195618 176278 129355 51116 61729 132618
6742 132618 176846 193667 172972 176064 168162 108142 116249 159730 149594 160065 106097 82831
6730 82831 76327 78224 154097 214389 214436 182384 131884 76503 70433 101893 171522 207792 182957
$$ packed form
6814A23115M8319J6469l7745m8852l074m8821M0812M7710K1981l8848m6018n4267
6802B0781J9278P6450M9122k4526m944m4419K6327K0426J7416J5076J0692M6060
6790B27739k3224n3614j2686m164K0059O1251L7927o1607j6149k2234P3787N9778
6778B86863j3214k3401m2292k1089k7120J9717K1207l429j0715m6193o295j5134
6766A18905K2664L3020l0498L1440L5339l4667m8983K3402j918L0799J6829J5297
6754B11629l9488l0527j8141M3193M8323M647k4018j9340m6923p8239J0613P0889
6742A32618M4228J6821k0695L092p902o0020Q107M3481j0136J0471n3968k3266
6730H2831o504J897P5873O0292M7l2052n0500n5381o070L1460O9629L6270k4835
$$ plain form
6717 182957 163727 140882 90376 90737 151906 184408 171314 120561 99576 66839 60197 93134
6705 93134 131292 146458 99448 82969 86824 105663 136355 189016 240260 165022 122890 141668
6693 141668 91828 82382 79003 158353 149279 116770 98047 113876 115303 134786 146940 138170 74568
6680 74568 128029 90087 121494 157105 112500 151582 136532 180478 178001 147271 152084 195384
6668 195384 189096 142848 134614 197094 168898 131713 154545 154143 178443 157593 98841 71130
6656 71130 100717 133451 124780 169338 178092 139228 150584 223405 206383 117690 116807 170388 147628
6643 147628 140111 122132 192008 193730 207822 203141 189650 225205 172877 197177 239728 286232
6631 286232 316355 270270 337161 306269 308578 298134 312669 355440 368546 310554 275332 300374
$$ packed form
6717A82957j9230k2845n0506L61O1169L2502j3094n0753k0985l2737o642L2937
6705I3134L8158J5166m7010j6479L855J8839L0692N2661N1244p5238m2132J8778
6693A41668m9840r446l379P9350r074l2509j8723J5829J427J9483J2154q770o3602
6680G4568N3461l7942L1407L5611m4605L9082j5050M3946k477l0730M813M3300
6668A95384o288m6248q234O2480k8196l7185K2832m02K4300k0850n8752k7711
6656G1130K9587L2734q671M4558Q754l8864J1356P2821j7022q8693q83N3581k2760
6643A47628p517j7979O9876J722J4092m681j3491L5555n2328K4300M2551M6504
6631B86232L0123m6085O6891l0892K309j0444J4535M2771J3106n7992l5222K5042
$$ plain form
6619 300374 306388 267174 274976 327232 322639 317802 268908 249625 292903 289814 315002 351706 333691
6606 333691 319154 316641 326042 318794 333979 311797 285548 288632 316166 298784 328166 295727
6594 295727 284303 323206 306712 306409 300522 274604 294915 308512 311668 340627 371796 334209
6582 334209 337078 348685 352044 370276 367166 356069 379435 373920 403193 369796 338244 344900 356541
6569 356541 394443 361904 372139 442525 462403 505893 615237 659583 601815 552279 557925 521714
6557 521714 484887 552927 586131 573925 559188 577128 547626 604942 653909 687644 701890 674175
6545 674175 657256 653599 641141 577259 552335 557126 500338 455165 464534 445334 428222 435423
6533 435423 468217 466811 447238 466405 496991 473542 494762 480277 422938 473873 494812 459975
$$ packed form
6619C00374O014l9214P802N2256m593m837m8894j9283M3278l089K5188L6704j8015
6606C33691j4537k513R401p248J5185k2182k6249L084K7534j7382K9382l2439
6594B95727j1424L8903j6494l03n887k5918K0311J3597L156K8959L1169l7587
6582C34209K869J1607L359J8232l110j1097K3366n515K9273l3397l1552O656J1641
6569C56541L7902l2539J0235P0386J9878M3490J09344M4346n7768m9536N646l6211
6557E21714l6827O8040L3204j2206j4737J7940k9502N7316M8967L3735J4246k7715
6545F74175j6919l657j2458o3882k4924M791n6788m5173R369j9200j7112P201
6533D35423L2794j406j9573J9167L0586k3449K1220j4485n7339N0935K0939l4837
$$ plain form
6521 459975 488302 526150 511112 481844 485741 481039 525489 479383 404930 425309 472039 473927
6509 473927 482073 535258 504140 568249 638408 578844 563962 610688 588513 558256 557910 604115
6497 604115 613527 625013 665631 758704 842233 860503 895788 865817 862997 814078 822527 808887
6485 808887 719578 670572 687617 684030 705618 750944 801768 830343 874425 938126 936094 937938
6473 937938 978790 868516 713132 616797 596893 551673 498558 521674 525815 492541 427728
6462 427728 385941 438887 460231 480466 514301 449103 391206 396781 433416 506722 515540 466785
6450 466785 444129 438846 457063 462131 532641 586545 617635 589095 595834 640549 681182 704713
6438 704713 706984 764523 738111 709265 735714 711119 665103 661846 670947 694103 697719 662782
$$ packed form
6521D59975K8327L7848j5038k9268L897m702M4450m6106p4453K0379M6730J888
6509D73927Q146N3185l1118O4109P0159n9564j4882M6726k2175l0257l46M6205
6497F04115R412J1486M0618R3073Q3529J8270L5285k9971k820m8919Q449j3640
6485H08887q9309m9006J7045l587K1588M5326N0824K8575M4082O3701k032J844
6473I37938M0852j10274j55384r6335j9904m5220n3115K3116M141l3274o4813
6462D27728m1787N2946K1344K0235L3835o5198n7897N575L6635P3306Q818m8755
6450D66785k2656n283J8217N068P0510N3904L1090k8540O739M4715M0633K3531
6438G04713K271N7539k6412k8846K6449k4595m6016l257R101K3156L616l4937
$$ plain form
6426 662782 646017 691966 769660 826273 854993 924921 928037 936012 925896 951499 960576 927643
6414 927643 842335 765403 764244 740858 725901 756902 772343 716371 739868 751140 790220 777700
6402 777700 793562 801962 777259 729033 664824 690589 679627 695184 694066 614440 633198 672333
6390 672333 688226 727852 781973 753277 689511 632032 637151 644211 659136 684063 753928 749561
6378 749561 715312 744637 761150 759511 740972 768495 771208 822554 809259 852304 835792 864623
6366 864623 916765 837774 864762 952325 971886 913913 899937 953271 1005508 1031755 1079637 1121871
6354 1121871 1219740 1311501 1410766 1585015 1613757 1656466 1755104 1733021 1718544 1669204 1615212
6343 1615212 1630570 1652845 1668237 1634292 1577011 1555241 1542403 1567617 1634780 1727081 1778488
$$ packed form
6426F62782j6765M5949P7694N6613K8720O9928L116P975j0116K5603R077l2933
6414I27643q5308p6932j159k3386j4957L1001J5441n5972K3497J1272L9080j2520
6402G77700J5862Q400k4703m8226o4209K5765j0962J5557j118p9626J8758L9135
6390F72333J5893L9626N4121k8696o3766n7479N119P060J4925K4927O9865m367
6378G49561l4249K9325J6513j639j8539K7523K713N1346j3295M3045j6512K8831
6366H64623N2142p8991K6988Q7563J9561n7973j3976N3334N2237K6247M7882M2234
6354A121871R7869R1761R9265J74249K8742M2709R8638k2083j4477m9340n3992
6343A615212J5358K2275J5392l3945n7281k1770j2838K5214O7163R2301N1407
$$ plain form
6332 1778488 1834401 1874281 1954744 2030185 2058781 2077087 2052444 1986703 1928774 1856062 1823542
6321 1823542 1789717 1757499 1670030 1643300 1641162 1602957 1606378 1612186 1626497 1630659 1628339 1642297
6309 1642297 1714186 1784796 1792488 1812795 1856235 1886610 1891785 1970193 2045164 2126870 2267151 2407687
6297 2407687 2501594 2661279 2843768 3043243 3348139 3728176 4124367 4655281 5502983 6708365
6287 6708365 8391092 10325900 12251442 13804156 14756853 15046473 14856821 14116383 12992366
6278 12992366 11742089 10485932 9437251 8779173 8450382 8521955 9119459 10232337 11904576
6269 11904576 13667105 15171956 16093542 16295636 15852475 14838171 13420058 11891288 10394696
6260 10394696 8997072 7807139 6790550 5995891 5398722 5003388 4682375 4456580 4236407
$$ packed form
6332A778488N5913L9880Q0463P5441K8596J8306k4643o5741n7929p2712l2520
6321A823542l3825l2218q7469k6730k138l8205L421N808J4311M162k320J3958
6309A642297P1889P0610P692K0307M3440L0375N175P8408P4971Q1706J40281J40536
6297B407687R3907J59685J82489J99475L04896L80037L96191N30914Q47702J205382
6287F708365J682727J934808J925542J552714R52697K89620j89652p40438j124017
6278A2992366j250277j256157j048681o58078l28791P1573N97504J112878J672239
6269A1904576J762529J504851R21586K02094m43161j014304j418113j528770j496592
6260A0394696j397624j189933j016589p94659n97169l95334l21013k25795k20173
$$ plain form
6251 4236407 4039233 3889997 3777620 3637588 3655558 3707311 3685088 3607364 3546310 3552235 3623458
6240 3623458 3698624 3761735 3821493 3870713 3906538 3998154 4079836 4260813 4418656 4564395 4702834
6229 4702834 4881965 5142973 5388792 5764828 6143078 6623051 7162718 7815714 8739968 9920254
6219 9920254 11471835 13765771 17019681 21329389 26394948 31422091 35539947 38045061
6211 38045061 38826685 37975264 35837452 32900897 29568032 26356281 23738916 21858846
6203 21858846 20894069 21091386 22639322 25581629 29587109 33818357 37309552 39464420
6195 39464420 39886588 38600722 35942807 32387963 28306762 24223287 20505622 17334794
6187 17334794 14732473 12680139 11021844 9757482 8751003 7938811 7343544 6836178 6403152
$$ packed form
6251D236407j97174j49236j12377j40032J7970N1753k2223p7724o1054N925P1223
6240C623458P5166O3111N9758M9220L5825R1616Q1682J80977J57843J45739J38439
6229D702834J79131K61008K45819L76036L78250M79973N39667O52996R24254J180286
6219I920254J551581K293936L253910M309708N065559N027143M117856K505114
6211C8045061P81624q51421k137812k936555l332865l211751k617365j880070
6203B1858846r64777J97317J547936K942307M005480M231248L491195K154868
6195C9464420M22168j285866k657915l554844m081201m083475l717665l170828
6187A7334794k602321k052334j658295j264362j006479q12192n95267n07366m33026
$$ plain form
6178 6403152 6015411 5669186 5464568 5257795 5106857 4911917 4744848 4628621 4525484 4456543
6168 4456543 4420913 4327820 4287628 4249112 4164766 4099393 4064682 4056547 4133076 4119549 4128111 4147926
6156 4147926 4192256 4232348 4255318 4359585 4457737 4635227 4777297 4934758 5113213 5293945
6146 5293945 5578150 5925931 6288504 6789239 7393494 8096791 9075835 10474990 12402988
6137 12402988 15161780 18962145 23594255 28513429 32891425 35937795 37360762 37045544
6129 37045544 35273055 32400096 28855871 25123744 21812399 19030949 16875317 15261729
6121 15261729 14267400 13820692 14019213 14835566 16425021 19097032 22883137 27568485 32329728
6112 32329728 36206063 38563181 39125606 38035327 35588997 31993836 27851661 23787140
$$ packed form
6178F403152l87741l46225k04618k06773j50938j94940j67069j16227j03137o8941
6168D456543l5630r3093m0192l8516q4346o5373l4711q135P6529j3527Q562J9815
6156D147926M4330M0092K2970J04267R8152J77490J42070J57461J78455J80732
6146E293945K84205L47781L62573N00735O04255P03297R79044J399155J927998
6137A2402988K758792L800365M632110M919174M377996L046370J422967l15218
6129C7045544j772489k872959l544225l732127l311345k781450k155632j613588
6121A5261729r94329m46708J98521Q16353J589455K672011L786105M685348M761243
6112C2329728L876335K357118N62425j090279k446330l595161m142175m064521
$$ plain form
6104 23787140 20170596 17057179 14500000 12427288 10806082 9589427 8636777 7856323
6096 7856323 7263425 6750130 6287453 5939920 5578770 5337901 5134612 4894921 4748975 4605490
6086 4605490 4504820 4438123 4270703 4151014 4100152 4073376 4034029 3963311 3870337 3792816 3776194
6075 3776194 3801523 3904690 4003579 4124859 4310629 4550707 4856130 5306254 6013949 6999228
6065 6999228 8358553 10150675 12027613 13687416 14860339 15410685 15371579 14795524 13685957
6056 13685957 12314226 10934690 9673087 8650439 7855634 7278489 6976506 6815498 6856447
6047 6856447 7150773 7827276 8922912 10533152 12376019 14178010 15638903 16428017 16531961
6038 16531961 16037978 15079941 13615944 11868008 10248675 8853378 7572140 6480412
$$ packed form
6104B3787140l616544l113417k557179k072712j621206j216655r52650p80454
6096G856323n92898n13295m62677l47533l61150k40869k03289k39691j45946j43485
6086D605490j00670o6697j67420j19689n0862k6776l9347p0718r2974p7521j6622
6075C776194K5329J03167R8889J21280J85770K40078L05423M50124P07695R85279
6065F999228J359325J792122J876938J659803J172923N50346l9106n76055j109567
6056A3685957j371731j379536j261603j022648p94805n77145l01983j61008M0949
6047F856447K94326O76503J095636J610240J842867J801991J460893P89114J03944
6038A6531961m93983r58037j463997j747936j619333j395297j281238j091728
$$ plain form
6030 6480412 5645328 4950507 4394659 3960709 3612003 3377489 3171261 3036377 2931162 2809815
6020 2809815 2663301 2557892 2514299 2438852 2328925 2250325 2159520 2053723 1982331 1945576 1934085
6009 1934085 1912645 1825457 1818352 1799790 1791136 1732799 1683426 1685855 1642914 1618604 1560469 1508895
5997 1508895 1523832 1570492 1565938 1487894 1448735 1468238 1503506 1501120 1536174 1617537 1609174 1569229
5985 1569229 1627405 1675065 1776207 1896373 2023290 2139350 2240575 2289013 2288576 2275428 2229184
5974 2229184 2146670 2092931 2091717 2150850 2255397 2403213 2431319 2424049 2424939 2392190 2441555 2506133
5962 2506133 2542419 2508585 2388155 2262795 2131139 1992272 1912115 1811540 1744181 1711111
5952 1711111 1771567 1869898 1954707 2003224 2009709 1997937 1928012 1751857 1683913 1674087 1549847
$$ packed form
6030F480412q35084o94821n55848m33950l48706k34514k06228j34884j05215j21347
6020B809815j46514j05409m3593p5447j09927p8600r0805j05797p1392l6755j1491
6009A934085k1440q7188p105j8562q654n8337m9373K429m2941k4310n8135n1574
5997A508895J4937M6660m554p8044l9159J9503L5268k386L5054Q1363q363l9945
5985A569229N8176M7660J01142J20166J26917J16060J01225M8438m37j3148m6244
5974B229184q2514n3739j214N9133J04547J47816K8106p270Q90l2749M9365O4578
5962B506133L6286l3834j20430j25360j31656j38867q0157j00575o7359l3070
5952A711111O0456R8331Q4809M8517O485j1772o9925j76155o7944r826j24240
$$ plain form
5941 1549847 1437947 1320833 1210166 1182522 1114969 1077122 1097053 1045200 946385 886690 855172
5930 855172 894948 936875 897364 883253 836732 786292 803868 845362 903285 949075 912191 855998
5918 855998 830387 784669 841409 945774 947697 882608 861957 881676 875796 902838 898967 910929
5906 910929 901135 856971 870945 902939 948126 956375 905899 905397 852216 803251 813021 834518 925569
5893 925569 858805 821411 806278 844785 875408 910086 927346 941525 921058 891539 840898 891057
5881 891057 932974 901972 868373 817692 788172 768403 825195 866415 940871 1030347 1068328 1136901
5869 1136901 1167443 1161612 1163196 1155243 1114072 1018944 920672 846563 853868 852501 831890 796255
5857 796255 883300 879085 864022 1000242 1130796 1218992 1311655 1370346 1371689 1326943 1300202 1264330
$$ packed form
5941A549847j11900j17114j10667k7644o7553l7847J9931n1853r8815n9695l1518
5930H55172L9776M1927l9511j4111m6521n0440J7576M1494N7923M5790l6884n6193
5918H55998k5611m5718N6740J04365J923o5089k0651J9719n880K7042l871J1962
5906I10929r794m4164J3974L1994M5187Q249n0476n02n3181m8965R770K1497R1051
5893I25569o6764l7394j5133L8507L0623L4678J7260J4179k0467k9519n0641N0159
5881H91057M1917l1002l3599n0681k9520j9769N6792M1220P4456Q9476L7981O8573
5869A136901L0542n831J584p953m1171r5128r8272p4109P305j367k0611l5635
5857G96255Q7045m215j5063J36220J30554Q8196R2663N8691J343m4746k6741l5872
$$ plain form
5845 1264330 1321554 1402300 1435342 1467279 1553829 1529822 1408738 1355851 1262237 1203026 1155123
5834 1155123 1152898 1122671 1065963 1056510 1031296 1094656 1159985 1155350 1193642 1249400 1314681 1432855
5822 1432855 1587225 1746367 1781475 1715762 1661648 1586809 1475263 1313107 1277235 1262623 1207342
5811 1207342 1161557 1147302 1140814 1203506 1222880 1207274 1281534 1335782 1367064 1442931 1548503
5800 1548503 1607988 1646296 1672360 1707059 1738346 1705342 1776358 1917310 1944056 1969839 2019986
5789 2019986 2039800 1965254 1928361 1807127 1713877 1669132 1567741 1462222 1431312 1441171 1462888
5778 1462888 1417856 1398747 1525523 1672967 1742844 1935655 2156248 2229210 2179575 2097322 1957663
5767 1957663 1782648 1679090 1528522 1335758 1191610 1059507 981080 962981 945171 849844
$$ packed form
5845A264330N7224Q0746L3042L1937Q6550k4007j21084n2887r3614n9211m7903
5834A155123k225l0227n6708r453k5214O3360O5329m635L8292N5758O5281J18174
5822A432855J54370J59142L5108o5713n4114p4839j11546j62156l5872j4612n5281
5811A207342m5785j4255o488O2692J9374j5606P4260N4248L1282P5867J05572
5800A548503N9485L8308K6064L4699L1287l3004P1016J40952K6746K5783N0147
5789B019986J9814p4546l6893j21234r3250m4745j01391j05519l0910R859K1717
5778A462888m5032j9109J26776J47444O9877J92811K20593P2962m9635q2253j39659
5767A957663j75015j03558j50568j92764j44148j32103p8427j8099j7810r5327
$$ plain form
5757 849844 852340 827224 790519 805877 799918 848310 883077 888080 909982 900846 944170 951616 946519
5744 946519 992094 992942 926706 888440 975766 1010849 1032931 1054029 1056419 1042218 1020233 927792
5732 927792 953858 975094 892120 849786 871860 899572 894571 860502 879880 880273 836598 786522
5720 786522 882060 885122 890509 816651 790942 842358 867117 837352 819023 837086 810601 730800
5708 730800 726237 760065 743833 773751 815491 855546 838348 806673 785363 813125 871307 840754
5696 840754 796252 815014 809242 791879 824777 848982 836877 819601 804168 859918 847353 839918
5684 839918 880351 949805 886126 858944 844100 861939 932642 961528 942296 926215 948955 929456
5672 929456 961184 989011 1036430 1045718 1005716 1006379 954838 976459 994884 1017093 1043377 1008586
$$ packed form
5757H49844K496k5116l6705J5358n959M8392L4767N003K1902r136M3324P446n097
5744I46519M5575Q48o6236l8266Q7326L5083K2082K1098K390j4201k1985r2441
5732I27792K6066K1236q2974m2334K2074K7712n001l4069J9378L93m3675n0076
5720G86522R5538L062N387p3858k5709N1416K4759k9765j8329J8063k6485p9801
5708G30800m563L3828j6232K9918M1740M0055j7198l1675k1310K7762N8182l0553
5696H40754m4502J8762n772j7363L2898K4205j2105j7276j5433N5750j2565p435
5684H39918M0433O9454o3679k7182j4844J7839P0703K8886j9232j6081K2740j9499
5672I29456L1728K7827M7419R288m0002O63n1541K1621J8425K2209K6284l4791
$$ plain form
5660 1008586 983891 1004531 1067026 1050102 1052769 1071180 1078107 1042387 1049970 1024268 1007704 1015739
5648 1015739 939136 946204 997448 991689 978655 945107 1039679 1020125 937386 943238 970447 926758
5636 926758 889182 885079 883336 845824 795739 786665 769763 769029 689596 637392 648941 669066 588297
5623 588297 639837 721970 689263 730317 768811 757461 769447 797369 777078 737235 723607 685135
5611 685135 684932 691572 723409 646451 648378 655354 656014 648864 640768 632438 619647 622099 561881 565584
5597 565584 667893 725628 754837 755179 702250 658666 579845 599404 663575 665143 630316 679124
5585 679124 701854 686293 697812 720484 768746 783095 700773 627841 623867 646030 630913 663169
5573 663169 661892 634678 671902 699481 739518 725085 718110 746634 782328 739691 707270 733319
$$ packed form
5660A008586k4695K0640O2495j6924K667J8411O927l5720P583k5702j6564Q035
5648A015739p6603P068N1244n759j3034l3548R4572j9554q2739N852K7209m3689
5636I26758l7576m103j743l7512n0085r074j6902p34p9433n2204J1549K0125q0769
5623E88297N1540Q2133l2707M1054L8494j1350J1986K7922k0291l9843j3628l8472
5611F85135k03O640L1837p6958J927O976O60p150q096q330j2791K452o0218L703
5597E65584J02309N7735K9209L42n2929m3584p8821J9559O4171J568l4827M8808
5585F79124K2730j5561J1519K2672M8262J4349q2322p2932l974K2163j5117L2256
5573F63169j277k7214L7224K7579M0037j4433o975K8524L5694m2637l2421K6049
$$ plain form
5561 733319 758394 715127 691294 690239 630249 634854 632857 610031 609460 564197 578961 581535 605469
5548 605469 624262 592352 576830 589606 577681 577783 548946 566483 616260 671784 684891 691160
5536 691160 685212 606634 612773 620348 634328 624087 596135 597141 604911 552950 567942 617732 638398
5523 638398 583955 613849 641209 683120 661838 630666 679434 698720 700017 673934 691027 744527
5511 744527 769002 731838 711375 727044 659789 604023 625634 656937 673459 685999 615081 604446
5499 604446 627869 595803 604270 666228 682194 702002 708606 682381 746932 814473 870293 883007
5487 883007 907004 917598 895649 925453 880891 826770 819232 839159 810115 779809 772670 779552
5475 779552 857588 846052 792442 809812 789452 776442 791465 780118 846579 799190 876115 886190
$$ packed form
5561G33319K5075m3267k3833j055n9990M605j997k2826n71m5263J4764K574K3934
5548F05469J8793l1910j5522J2776j1925J02k8837J7537M9777N5524J3107O269
5536F91160n948p8578O139P575J3980j0241k7952J006P770n1961J4992M9790K0666
5523F38398n4443K9894K7360M1911k1282l1172M8768J9286J297k6083J7093N3500
5511G44527K4475l7164k0463J5669o7255n5766K1611L1303J6522J2540p0918j0635
5499F04446K3423l2066Q467O1958J5966J9808O604k6225O4551O7541N5820J2714
5487H83007K3997J0594k1949K9804m4562n4121p538J9927k9044l0306p139O882
5475G79552P8036j1536n3610J7370k0360j3010J5023j1347O6461m7389P6925J0075
$$ plain form
5463 886190 873378 891291 940438 957020 902574 931295 889892 930100 943622 943161 1000546 1016535
5451 1016535 968801 958417 1020724 1061478 1130257 1171331 1137997 1127992 1110397 1089665 1109950
5440 1109950 1183789 1185209 1182865 1196620 1216135 1235378 1208628 1192135 1208598 1169145 1134133 1129002
5428 1129002 1120584 1095223 1103070 1090020 1132931 1168392 1186515 1224015 1298762 1360553 1320751 1329646
5416 1329646 1357489 1388961 1383056 1390181 1399294 1439096 1423900 1455366 1520111 1525150 1539109 1542430
5404 1542430 1492915 1524284 1535149 1536693 1564823 1593938 1652219 1667325 1664728 1791067 1893495
5393 1893495 1904816 1924502 1974797 2040664 2110017 2153753 2136432 2145780 2233596 2287847 2310365 2358202
5381 2358202 2399489 2401901 2447881 2521514 2501432 2532601 2553520 2597712 2594920 2635231 2732190 2785522
$$ packed form
5463H86190j2812J7913M9147J6582n4446K8721m1403M0208J3522m61N7385J5989
5451A016535m7734j0384O2307M0754O8779M1074l3334j0005j7595k0732K0285
5440A109950P3839J420k344J3755J9515J9243k6750j6493J6463l9453l5012n131
5428A129002q418k5361P847j3050M2911L5461J8123L7500P4747O1791l9802Q895
5416A329646K7843L1472n905P125R113L9802j5196L1466O4745N039J3959L321
5404A542430m9515L1369J0865J544K8130K9115N8281J5106k597J26339J02428
5393A893495J1321J9686N0295O5867O9353M3736j7321R348Q7816N4251K2518M7837
5381B358202M1287K412M5980P3633k0082L1169K0919M4192k792M0311R6959N3332
$$ plain form
5369 2785522 2850743 2951971 3053670 3200045 3341408 3406852 3433108 3485244 3514989 3487510 3450284
5358 3450284 3432984 3388186 3324765 3280988 3326335 3493752 3642779 3878954 4081002 4285128
5348 4285128 4522154 4702712 4749756 4708692 4703169 4634817 4542312 4375916 4247060 4221472 4258177
5337 4258177 4296938 4349859 4478963 4556177 4593268 4673644 4776971 4936268 5205677 5631938
5327 5631938 6242637 6788802 7377090 7916800 8407631 8866467 9093263 9119248 9067631 8982595
5317 8982595 8843292 8578504 8113494 7726404 7355024 7061984 6945285 7077693 7366343 7708923
5307 7708923 8122058 8587592 9206399 9823576 10302804 10596830 10847852 11164961 11698552 12538334
5297 12538334 13529888 14711861 15893706 17219079 18527006 19494707 20200418 20570860 20489643
$$ packed form
5369B785522O5221J01228J01699J46375J41363O5444K6256N2136K9745k7479l7226
5358C450284j7300m4798o3421m3777M5347J67417J49027K36175K02048K04126
5348D285128K37026J80558M7044m1064n523o8352r2505j66396j28856k5588L6705
5337D258177L8761N2921J29104P7214L7091Q0376J03327J59297K69409M26261
5327E631938O10699N46165N88288N39710M90831M58836K26796K5985n1617q5036
5317H982595j39303k64788m65010l87090l71380k93040j16699J32408K88650L42580
5307G708923M13135M65534O18807O17177M79228K94026K51022L17109N33591Q39782
5297A2538334R91554J181973J181845J325373J307927R67701P05711L70442q1217
$$ plain form
5288 20489643 20121536 19304316 18118325 17014559 16144064 15693332 15724363 16333910 17267451
5279 17267451 18492951 19898502 21662464 23568728 25107944 26229969 27063608 27476747
5271 27476747 27352552 26613926 25515128 24615683 23983749 23676033 24126785 25243788 26624437
5262 26624437 28071508 29620572 31059426 32203919 32773692 32722004 32668105 32412671 31771732
5253 31771732 30540634 28910610 27150010 25532384 24193919 23248979 22893284 23045737 23570105
5244 23570105 24291464 25082935 25589434 25490392 24956465 24204242 23289157 21951290 20235546
5235 20235546 18376642 16660338 15098071 13609667 12318424 11402773 10934221 10818729 11056210
5226 11056210 11411498 11545014 11382103 11021223 10552991 9880435 8975588 8098397 7252438
$$ packed form
5288B0489643l68107q17220j185991j103766q70495m50732L1031O09547R33541
5279A7267451J225500J405551J763962J906264J539216J122025Q33639M13139
5271B7476747j24195p38626j098798q99445o31934l07716M50752J117003J380649
5262B6624437J447071J549064J438854J144493N69773n1688n3899k55434o40939
5253C1771732j231098j630024j760600j617626j338465r44940l55695J52453N24368
5244B3570105P21359P91471N06499r9042n33927p52223r15085j337867j715744
5235B0235546j858904j716304j562267j488404j291243r15651m68552j15492K37481
5226A1056210L55288J33516j62911l60880m68232o72556r04847q77191q45959
$$ plain form
5217 7252438 6573292 5959433 5489624 5189302 4945979 4727115 4491615 4373238 4268358 4232632
5207 4232632 4271560 4341189 4345545 4321584 4243535 4313273 4342848 4321643 4264051 4120186 4058863
5196 4058863 3992678 3970773 3976824 3948978 3905153 3902910 3822463 3776400 3728273 3732395 3687627 3640077
5184 3640077 3628853 3556350 3554321 3645645 3794514 4009517 4079067 4272774 4591274 5000261 5424921
5173 5424921 5945898 6560089 7131171 7649297 7823298 7796057 7642732 7236530 6720061 6208341
5163 6208341 5791500 5402287 5025730 4667089 4387077 4209180 4079494 3881906 3744588 3667900
5153 3667900 3529974 3478631 3479974 3505571 3529930 3623243 3725757 3826202 4030547 4352345 4625500
5142 4625500 4750528 4787575 4807109 4759842 4710455 4708947 4840281 5103593 5613391 6275366 7051422
$$ packed form
5217G252438o79146o13859m69809l00322k43323k18864k35500j18377j04880l5726
5207D232632L8928O9629M356k3961p8049O9738K9575k1205n7592j43865o1323
5196D058863o6185k1905O051k7846m3825k243q0447m6063m8127M122m4768m7550
5184C640077j1224p2503k029R1324J48869K15003O9550J93707L18500M08987M24660
5173E424921N20977O14191N71082N18126J74001k7241j53325m06202n16469n11720
5163F208341m16841l89213l76557l58641k80012j77897j29686j97588j37318p6688
5153C667900j37926n1343J343K5597K4359R3313J02514J00445K04345L21798K73155
5142D625500J25028L7047J9534m7267m9387j508J31334K63312N09798O61975P76056
$$ plain form
5131 7051422 7786990 8276457 8309463 8121108 7896036 7439360 6886670 6427841 6118576 5893933
5121 5893933 5737631 5737579 5961316 6476363 7136979 7827472 8238025 8280145 8234938 7971789 7443971
5110 7443971 6823297 6322971 5896754 5551092 5312064 5156849 5022620 4851113 4667554 4524564
5100 4524564 4425940 4319604 4199345 4076968 4005802 3964017 3877887 3813862 3815279 3786815 3782384
5089 3782384 3729413 3748238 3777279 3833942 3948891 4053415 4258060 4593763 5068828 5673803
5079 5673803 6402660 6990937 7481146 8056203 8627813 8955393 9076691 8944708 8620562 8196095
5069 8196095 7669366 7145780 6694602 6364162 6329070 6442083 6636690 6833069 7166151 7737694
5059 7737694 8409506 9169872 9722937 9974656 9989695 10065199 9946424 9592043 9164204 8759589
$$ packed form
5131G051422P35568M89467L3006j88355k25072m56676n52690m58829l09265k24643
5121E893933j56302n2K23737N15047O60616O90493M10553M2120m5207k63149n27818
5110G443971o20674n00326m26217l45662k39028j55215j34229j71507j83559j42990
5100D524564r8624j06336j20259j22377p1166m1785q6130o4025J417k8464m431
5089C782384n2971J8825K9041N6663J14949J04524K04645L35703M75065O04975
5079E673803P28857N88277M90209N75057N71610L27580J21298j31983l24146m24467
5069H196095n26729n23586m51178l30440l5092J13013J94607J96379L33082N71543
5059G737694O71812P60366N53065K51719J5039P5504j18775l54381m27839m04615
$$ plain form
5049 8759589 8450370 8086295 7760663 7580000 7425992 7301419 7157910 7036271 6996682 7033443
5039 7033443 7086427 7117275 7222017 7315465 7244827 6991169 6741588 6546651 6304697 6004057
5029 6004057 5792143 5570160 5394703 5183870 5044041 4918729 4772599 4679552 4585120 4500971
5019 4500971 4453023 4437557 4450681 4479323 4535424 4578833 4576878 4660936 4773871 4862795 4908220
5008 4908220 4935477 4969615 4975514 5052230 5070203 5076928 5169078 5209864 5312992 5330087 5288217 5333216
4996 5333216 5374624 5422383 5481621 5510909 5529494 5559106 5590241 5602648 5549085 5502909 5479961
4985 5479961 5512962 5491956 5448800 5396205 5332804 5309636 5373770 5383391 5425918 5439443 5418746 5495045
4973 5495045 5545443 5620394 5653923 5653636 5682145 5686046 5721757 5721450 5710033 5778720 5765156 5791124
$$ packed form
5049H759589l09219l64075l25632j80663j54008j24573j43509j21639l9589L6761
5039G033443N2984L0848J04742R3448p0638k53658k49581j94937k41954l00640
5029F004057k11914k21983j75457k10833j39829j25312j46130r3047r4432q4149
5019D500971m7948j5466J3124K8642N6101M3409j955Q4058J12935Q8924M5425
5008D908220K7257L4138N899P6716J7973O725R2150M0786J03128J7095m1870M4999
4996E333216M1408M7759N9238K9288J8585K9612L1135J2407n3563m6176k2948
4985E479961L3001k1006m3156n2595o3401k3168O4134R621M2527J3525k0697P6299
4973E495045N0398P4951L3529k87K8509L901L5711l07j1417O8687j3564K5968
$$ plain form
4961 5791124 5898855 5962877 6048939 6160347 6292916 6496400 6679848 6842073 6960728 7016640
4951 7016640 7020867 7035110 6974798 6929736 6864895 6828403 6835406 6870490 6897704 6962439 7033944 7150805
4939 7150805 7232715 7441955 7674367 7995321 8260063 8525038 8825081 9072532 9317115 9390522
4929 9390522 9423182 9365172 9294460 9216949 9142197 9140810 9182076 9177480 9199225 9319626 9463201
4918 9463201 9606248 9844307 10074013 10372146 10776554 11262851 11780513 12271233 12709804 13141829
4908 13141829 13547910 13885065 14225455 14556511 14872557 15002339 15047413 15057566 15088742 15121225
4898 15121225 15217757 15352597 15580388 15915274 16305430 16762412 17307251 17868562 18391484 18932172
4888 18932172 19276711 19588527 19881479 20312883 20776785 21235634 21880977 22536778 23300024
$$ packed form
4961E791124J07731O4022Q6062J11408J32569K03484J83448J62225J18655N5912
4951G016640M227J4243o0312m5062o4841l6492P003L5084K7214O4735P1505J16861
4939G150805Q1910K09240K32412L20954K64742K64975L00043K47451K44583P3407
4929I390522L2660n8010p0712p7511p4752j387M1266m596K1745J20401J43575
4918I463201J43047K38059K29706K98133M04408M86297N17662M90720M38571M32025
4908A3141829M06081L37155L40390L31056L16046J29782M5074J0153L1176L2483
4898A5121225R6532J34840K27791L34886L90156M56982N44839N61311N22922N40688
4888A8932172L44539L11816K92952M31404M63902M58849O45343O55801P63246
$$ plain form
4879 23300024 24252529 25553863 27491330 30458005 34416887 38866374 42865669 45551396
4871 45551396 46745339 46798939 46033636 44317119 42198322 40266738 38971757 38329115 38383816
4862 38383816 39206737 41095581 44111717 48441700 54537009 62346646 71542289 81405423
4854 81405423 91375757 101014563 109633123 115924679 118832638 118565478 115973102 111675152
4846 111675152 105866601 99517728 93587713 88557878 84572354 81650018 79950219 79355459
4838 79355459 79912845 81888996 85520911 90782437 97076270 103440563 109190755 114371125
4830 114371125 119640968 125123567 130859157 137479588 144773180 151785260 157182298 160011582
4822 160011582 159788785 156838374 151416580 143902277 135238589 126404303 118066771 110588799
$$ packed form
4879B3300024R52505J301334J937467K966675L958882M449487L999295K685727
4871D5551396J193943N3600p65303j716517k118797j931584j294981o42642N4701
4862C8383816Q22921J888844L016136M329983O095309P809637R195643R863134
4854H1405423R970334R638806Q618560O291556K907959k67160k592376m297950
4846A11675152n808551o348873n930015n029835l985524k922336j699799n94760
4838G9355459N57386J976151L631915N261526O293833O364293N750192N180370
4830A14371125N269843N482599N735590O620431P293592P012080N397038K829284
4822A60011582k22797k950411n421794p514303q663688q834286q337532p477972
$$ plain form
4814 110588799 104331131 99389406 95738954 93199153 91394507 90081812 89168546 88685433
4806 88685433 88541047 88722132 89275132 90279529 91737672 93570667 95816930 98320462 100710092
4797 100710092 102513908 103315059 102648968 100524569 97054901 92575368 87380483 81942136
4789 81942136 76506781 71317122 66512875 62114778 58098064 54564797 51498642 48726133
4781 48726133 46191410 43884164 41685255 39588006 37631982 35753336 34036454 32547140
4773 32547140 31205760 30054007 29047360 28217967 27488387 26833251 26325365 25881467 25405054
4764 25405054 24910316 24335745 23699413 23025315 22294090 21607236 20950952 20377998 19806970
4755 19806970 19255136 18864752 18489927 18124015 17712215 17434938 17378435 17584125 18003554 18525152
$$ packed form
4814A10588799o257668m941725l650452k539801j804646j312695r13266m83113
4806H8685433j44386J81085N53000J004397J458143J832995K246263K503532K389630
4797A00710092J803816Q01151o66091k124399l469668m479533n194885n438347
4789H1942136n435355n189659m804247m398097m016714l533267l066155k772509
4781D8726133k534723k307246k198909k097249j956024j878646j716882j489314
4773C2547140j341380j151753j006647q29393p29580o55136n07886m43898m76413
4764B5405054m94738n74571o36332o74098p31225o86854o56284n72954n71028
4755A9806970n51834l90384l74825l65912m11800k77277n6503K05690M19429N21598
$$ plain form
4745 18525152 18907710 18980687 18831369 18514541 18089676 17509193 17069975 16999315 17293046 17638212
4735 17638212 17821355 17673187 17352368 17112808 16515510 15752256 15070003 14514243 14194774
4726 14194774 14183979 14400744 14616369 14779244 14931353 14922773 14788635 14525493 14375087 14436860
4716 14436860 14672636 14939870 15188697 15349408 15282618 15067128 14709771 14297157 13770659 13268267
4706 13268267 12831391 12537079 12292222 12067663 11830069 11664257 11576861 11495204 11353128 11290350
4696 11290350 11282390 11321491 11398780 11569528 11919920 12329226 12733353 13147837 13498422 13703865
4686 13703865 13685393 13508003 13250526 12887666 12469348 12044960 11651529 11294988 10978084 10805827
4676 10805827 10728280 10761483 10853612 11055181 11302999 11486447 11657996 11807889 11890434 11965897
$$ packed form
4745A8525152L82558P2977j49318l16828m24865n80483m39218p0660K93731L45166
4735A7638212J83143j48168l20819k39560n97298p63254o82253n55760l19469
4726A4194774j0795K16765K15625J62875J52109q580j34138k63142j50406O1773
4716A4436860K35776K67234K48827J60711o6790k15490l57357m12614n26498n02392
4706A3268267m36876k94312k44857k24559k37594j65812q7396q1657j42076o2778
4696A1290350p960L9101P7289J70748L50392M09306M04127M14484L50585K05443
4686A3703865j8472j77390k57477l62860m18318m24388l93431l56541l16904j72257
4676A0805827p7547L3203R2129K01569K47818J83448J71549J49893Q2545P5463
$$ plain form
4666 11965897 11980920 12001852 12084504 12187802 12251916 12403035 12617803 12796581 12930079 13015092
4656 13015092 13182005 13351565 13507471 13584719 13727368 13950610 14062442 14232062 14450679 14700482
4646 14700482 14889639 15153608 15518411 15919704 16336680 16721849 17069446 17424232 17823466
4637 17823466 18216400 18599332 18995482 19346597 19674719 20094795 20661927 21279339 22019738
4628 22019738 22906790 23893217 25078289 26371985 27967792 29923823 32103356 34626378
4620 34626378 37502768 40840035 44831528 49785364 56173790 65063267 78017618 96496415
4612 96496415 121084866 150860693 183232960 215482708 244802736 267129706 279476424
4605 279476424 281363319 273629286 256981189 235261695 212822382 192345740 175616894
$$ packed form
4666A1965897J5023K0932Q2652J03298O4114J51119K14768J78778J33498Q5013
4656A3015092J66913J69560J55906P7248J42649K23242J11832J69620K18617K49803
4646A4700482J89157K63969L64803M01293M16976L85169L47597L54786L99234
4637A7823466L92934L82932L96150L51115L28122M20076N67132O17412P40399
4628B2019738Q87052R86427J185072J293696J595807J956031K179533K523022
4620C4626378K876390L337267L991493M953836O388426Q889477J2954351J8478797
4612I6496415K4588451K9775827L2372267L2249748K9320028K2326970J2346718
4605B79476424J886895p734033j6648097k1719494k2439313k0476642j6728846
$$ plain form
4598 175616894 163638900 155690293 150114449 145827975 141726132 136723551 130054618 121959080
4590 121959080 113047154 104074503 96170520 89933915 85075586 80782312 76394187 71749802
4582 71749802 67137374 62486227 57932602 54335340 52224110 51670886 52169810 52775347 52613772
4573 52613772 51555807 49933522 47761801 45079934 42466191 40399678 39428169 39835993
4565 39835993 41417218 43504546 45245026 45777177 44963786 43135248 40475860 37045870
4557 37045870 33488990 30096996 27159337 24738858 22714111 21118513 19869068 18922379
4549 18922379 18109663 17349193 16730099 16176879 15655073 15212828 14829470 14571571 14313465
4540 14313465 14217510 14054070 13937871 13936875 14007172 14130397 14459959 14943520 15580992 16532589
$$ packed form
4598A75616894j1977994p948607n575844m286474m101843n002581o668933q095538
4590A21959080q911926q972651p903983o236605m858329m293274m388125m644385
4582G1749802m612428m651147m553625l597262k111230n53224M98924O05537j61575
4573E2613772j057965j622285k171721k681867k613743k066513r71509M07824
4565C9835993J581225K087328J740480N32151q13391j828538k659388l429990
4557C7045870l556880l391994k937659k420479k024747j595598j249445r46689
4549A8922379q12716p60470o19094n53220n21806m42245l83358k57899k58106
4540A4313465r5955j63440j16199r96P0297J23225L29562M83561O37472R51597
$$ plain form
4530 16532589 17740072 19057932 20484033 21818635 22854667 23411152 23477244 23010318 22054910
4521 22054910 20802297 19325501 17912143 16579963 15372225 14295026 13445484 12745461
4513 12745461 12201145 11782395 11428694 11187841 10970177 10755720 10531898 10451337 10427246 10419183
4503 10419183 10383189 10432694 10546508 10784301 11064577 11419465 11851862 12422063 13198384 14317173
4493 14317173 15806889 17777882 20338441 23274039 26463075 29589565 32197861 34012797
4485 34012797 34982322 34988353 34159130 32702344 30859610 28849666 26773859 24718944 22935748
4476 22935748 21233205 19778186 18494651 17303187 16226759 15276892 14397432 13697841 13113040
4467 13113040 12662034 12221190 11857573 11616422 11417061 11201938 11116324 11108732 11182300 11351189
$$ packed form
4530A6532589J207483J317860J426101J334602J036032N56485O6092m66926r55408
4521B2054910j252613j476796j413358j332180j207738j077199q49542p00023
4513A2745461n44316m18750l53701k40853k17664k14457k23822q0561k4091q063
4503A0419183l5994M9505J13814K37793K80276L54888M32397N70201P76321J118789
4493A4317173J489716J970993K560559K935598L189036L126490K608296J814936
4485C4012797R69525O031q29223j456786j842734k009944k075807k054915j783196
4476B2935748j702543j455019j283535j191464j076428r49867q79460o99591n84801
4467A3113040m51006m40844l63617k41151j99361k15123q5614p592P3568J68889
$$ plain form
4457 11351189 11488798 11689684 11761129 11711664 11664344 11535170 11401336 11185932 10866441 10538380
4447 10538380 10218602 9888135 9559081 9301750 8971331 8630562 8321435 8040560 7817651
4438 7817651 7648066 7431049 7259284 7052431 6846086 6664617 6510913 6347281 6168620 6079063
4428 6079063 6026201 5922309 5821303 5767684 5728765 5735381 5759444 5805211 5809673 5800868 5782036 5715676
4416 5715676 5665627 5629544 5635350 5631906 5546831 5515537 5481674 5431295 5435800 5437476 5348720 5267179
4404 5267179 5161180 5092360 4982032 4986544 5002252 4993595 5018606 5032779 5061420 5031658 5059169
4393 5059169 5040161 5081700 5146764 5151235 5087497 5107349 5096520 5119185 5206843 5285186 5310785 5315291
4381 5315291 5334604 5375581 5394053 5395828 5440566 5483748 5505944 5575543 5598810 5644177 5744337
$$ packed form
4457A1351189J37609K00886P1445m9465m7320j29174j33834k15404l19491l28061
4447A0538380l19778l30467l29054k57331l30419l40769l09127k80875k22909
4438G817651j69585k17017j71765k06853k06345j81469j53704j63632j78661q9557
4428F079063n2862j03892j01006n3619l8919O616K4063M5767M462q805j8832o6360
4416E715676n0049l6083N806l444q5075l1294l3863n0379M505J676q8756q1541
4404E267179j05999o8820j10328M512J5708q657K5011J4173K8641k9762K7511
4393E059169j9008M1539O5064M471o3738J9852j0829K2665Q7658P8343K5599M506
4381E315291J9313M0977J8472J775M4738M3182K2196O9599K3267M5367J00160
$$ plain form
4370 5744337 5884704 5973491 5996524 6024010 6103440 6171825 6280599 6361509 6432286 6526740 6556411
4359 6556411 6596764 6613867 6665680 6720606 6779191 6816691 6842222 6871668 6865319 6834488 6835193 6913858
4347 6913858 7000267 7055140 7004749 7039532 7102085 7127884 7132521 7166922 7227627 7272252 7290825 7328180
4335 7328180 7403132 7477851 7614314 7703585 7742164 7803831 7827692 7841034 7855327 7953861 8027608
4324 8027608 8093648 8156264 8158410 8165566 8097987 8011994 7949716 7734659 7456679 7242165 7014974
4313 7014974 6862465 6726341 6664849 6594442 6475282 6396251 6372085 6292110 6273782 6232336 6174294
4302 6174294 6099366 6006135 5930158 5896869 5904041 5887068 5896478 5908267 5866750 5845923 5815911 5796426
4290 5796426 5768317 5772689 5707909 5686993 5672222 5619949 5581526 5565943 5551201 5511423 5455705 5437704
$$ packed form
4370E744337J40367Q8787K3033K7486P9430O8385J08774Q0910P0777R4454K9671
4359F556411M0353J7103N1813N4926N8585L7500K5531K9446o349l0831P05P8665
4347F913858Q6409N4873n0391L4783O2553K5799M637L4401O0705M4625J8573L7355
4335G328180P4952P4719J36463Q9271L8579O1667K3861J3342J4293R8534P3747
4324H027608O6040O2616K146P156o7579q5993o2278k15057k77980k14514k27191
4313G014974j52509j36124o1492p0407j19160p9031k4166p9975j8328m1446n8042
4302F174294p4928r3231p5977l3289P172j6973R410J1789m1517k0827l0012j9485
4290E796426k8109M372o4780k0916j4771n2273l8423j5583j4742l9778n5718j8001
$$ plain form
4278 5437704 5426230 5378266 5344861 5359129 5376789 5334203 5320436 5267158 5214194 5170342 5064200
4267 5064200 5046841 5139309 5196498 5187587 5187841 5140215 5103223 5099284 5114274 5169290 5139345 5062944
4255 5062944 5076607 5050612 5051642 5073841 5070391 5122753 5145019 5130658 5078855 5084763 5121818 5202260
4243 5202260 5238138 5304963 5331787 5322067 5375742 5380488 5407917 5475622 5445792 5391216 5340555 5329641
4231 5329641 5314455 5361660 5395821 5394359 5387300 5476415 5505208 5544536 5636716 5733225 5791587 5811500
4219 5811500 5869735 5946626 5954407 5955013 6101995 6143076 6199189 6277871 6381886 6494778 6586359
4208 6586359 6677881 6801531 6947716 7120944 7348747 7645815 7881779 8102802 8347434 8706665
4198 8706665 9033605 9322874 9653187 10016091 10371636 10738670 11247648 11706464 12207398 12728356
$$ packed form
4278E437704j1474m7964l3405J4268J7660m2586j3767n3278n2964m3852j06142
4267E064200j7359R2468N7189q911K54m7626l6992l939J4990N5016k9945p6401
4255E062944J3663k5995J030K2199l450N2362K2266j4361n1803N908L7055Q0442
4243E202260L5878O6825K6824r720N3675M746K7429O7705k9830n4576n0661j0914
4231E329641j5186M7205L4161j462p059Q9115K8793L9328R2180R6509N8362J9913
4219E811500N8235P6891P781O06J46982M1081N6113P8682J04015J12892R1581
4208F586359R1522J23650J46185J73228K27803K97068K35964K21023K44632L59231
4198H706665L26940K89269L30313L62904L55545L67034N08978M58816N00934N20958
$$ plain form
4188 12728356 13202476 13693807 14257968 14809225 15297955 15664283 15923508 16072353 16132418 16263465
4178 16263465 16551334 16892704 17357474 17941878 18444593 18900928 19298648 19701051 20120680
4169 20120680 20496842 20912565 21354064 21780978 22267370 22692981 23181307 23755818 24326716
4160 24326716 24946232 25545356 26304597 27082354 27856834 28431127 28939694 29420554 29825386
4151 29825386 30399829 31227494 32374393 33699197 35018669 36076758 36935437 37659411 38206022
4142 38206022 38692994 39075668 39316477 39561507 39819045 40099183 40491139 40977391 41536801
4133 41536801 42132747 42646208 43098371 43391650 43611444 43705598 43678967 43643229 43589748 43683441
4123 43683441 44050761 44813954 46004848 47498167 49048899 50526014 51920222 53251209
$$ packed form
4188A2728356M74120M91331N64161N51257M88730L66328K59225J48845O0065J31047
4178A6263465K87869L41370M64770N84404N02715M56335L97720M02403M19629
4169B0120680L76162M15723M41499M26914M86392M25611M88326N74511N70898
4160B4326716O19516N99124P59241P77757P74480N74293N08567M80860M04832
4151B9825386N74443Q27665J146899J324804J319472J058089Q58679P23974N46611
4142C8206022M86972L82674K40809K45030K57538K80138L91956M86252N59410
4133D1536801N95946N13461M52163K93279K19794R4154k6631l5738n3481R3693
4123D3683441L67320P63193J190894J493319J550732J477115J394208J330987
$$ plain form
4115 53251209 54554568 55947564 57535529 59050071 60494597 61940217 63337189 64705646
4107 64705646 65811921 66622713 67105610 67311553 67272364 67027506 66675382 66298658 66060331
4098 66060331 66065215 66419826 66982358 67780435 68699059 69727301 70610167 71376133 71981504 72297524
4088 72297524 72439347 72509867 72724195 73187062 73948677 75013396 76406384 77798512 79014008
4079 79014008 79788748 79956399 79804765 79464352 78965628 78337776 77609722 76696852 75735471
4070 75735471 74880249 74146715 73328653 72140977 70581489 68710463 66759919 64744229 62874132
4061 62874132 61267613 59889071 58741274 57897787 57241418 56691534 56160415 55614056 55023099
4052 55023099 54368608 53627417 52702526 51718130 50726765 49630875 48520535 47502235 46577212
$$ packed form
4115E3251209J303359J392996J587965J514542J444526J445620J396972J368457
4107F4705646J106275Q10792M82897K05943l9189k44858l52124l76724k38327
4098F6060331M884L54611N62532P98077R18624J028242Q82866P65966O05371L16020
4088G2297524J41823P0520K14328M62867P61615J064719J392988J392128J215496
4079G9014008P74740J67651j51634l40413m98724o27852p28054r12870r61381
4070G5735471q55222p33534q18062j187676j559488j871026j950544k015690j870097
4061F2874132j606519j378542j147797q43487o56369n49884n31119n46359n90957
4052E5023099o54491p41191r24891r84396r91365j095890j110340j018300r25023
$$ plain form
4043 46577212 45767866 45167516 44803018 44468909 43979261 43094742 41945671 40647294 39167994
4034 39167994 37664476 36338741 35249255 34474082 33861376 33289974 32689412 31996601 31167700
4025 31167700 30239647 29298511 28394441 27524364 26674783 25887839 25137187 24462343 23821721
4016 23821721 23282461 22850049 22473706 22067552 21692039 21285599 20727825 20144990 19560175
4007 19560175 18984606 18533052 18213366 17950072 17701655 17480795 17112689 16711877 16292864
3998 16292864 15769068 15177565 14611480 14119520 13707786 13244299 12832197 12468659 12107398
3989 12107398 11714461 11348564 11077913 10836894 10590641 10292518 10042573 9812825 9655251
3980 9655251 9486920 9386866 9225893 9116144 9029100 8926151 8840975 8801777 8797960 8767930 8721965
$$ packed form
4043D6577212q09346o00350l64498l34109m89648q84519j149071j298377j479300
4034C9167994j503518j325735j089486p75173o12706n71402o00562o92811q28901
4025C1167700r28053r41136r04070q70077q49581p86944p50652o74844o40622
4016B3821721n39260m32412l76343m06154l75513m06440n57774n82835n84815
4007A9560175n75569m51554l19686k63294k48417k20860l68106m00812m19013
3998A6292864n23796n91503n66085m91960m11734m63487m12102l63538l61261
3989A2107398l92937l65897k70651k41019k46253k98123k49945k29748j57574
3980I655251j68331j00054j60973j09749q7044j02949q5176l9198l817l0030m5965
$$ plain form
3969 8721965 8676682 8630372 8600194 8598820 8578621 8576928 8579814 8499108 8441787 8366310 8281265 8169697
3957 8169697 8093746 8000265 7856713 7759106 7694402 7596238 7455548 7357110 7200267 7062934 6960116
3946 6960116 6856541 6784782 6698751 6569623 6433322 6302410 6224278 6093959 5938035 5887946
3936 5887946 5787464 5637713 5581918 5577360 5554965 5448213 5340208 5272893 5217814 5120667 5091197
3925 5091197 5085621 5046678 4963292 4958547 4940499 4901049 4868492 4836480 4787062 4709593 4664208 4616249
3913 4616249 4578306 4527636 4476557 4433711 4342446 4288840 4229955 4235781 4224078 4216425 4186302 4151409
3901 4151409 4194156 4181212 4176227 4191093 4216725 4200288 4227190 4249008 4276458 4332749 4336924 4312543
3889 4312543 4345090 4429373 4465963 4442704 4567857 4634107 4585672 4564641 4613871 4660129 4731613
$$ packed form
3969H721965m5283m6310l0178j374k0199j693K886q0706n7321p5477q5045j11568
3957H169697p5951r3481j43552r7607o4704r8164j40690r8438j56843j37333j02818
3946F960116j03575p1759q6031j29128j36301j30912p8132j30319j55924n0089
3936E887946j00482j49751n5795m558k2395j06752j08005o7315n5079r7147k9470
3925E091197n576l8943q3386m745j8048l9450l2557l2012m9418p7469m5385m7959
3913D616249l7943n0670n1079m2846r1265n3606n8885N826j1703p653l0123l4893
3901D151409M2747j2944m985J4866K5632j6437K6902K1818K7450N6291M175k4381
3889D312543L2547Q4283L6590k3259J25153O6250m8435k1031M9230M6258P1484
$$ plain form
3878 4731613 4753710 4772464 4768773 4814784 4867378 4919233 4928352 4923057 4927438 4938988 4973735 4969693
3866 4969693 4988026 4983268 4991894 4979623 4999595 5004571 5065254 5108320 5114320 5101116 5025895 5004943
3854 5004943 5009284 4975187 4912501 4904082 4880360 4808871 4791893 4700678 4631931 4552145 4535120 4544995
3842 4544995 4477921 4366690 4298262 4315848 4323897 4334986 4265246 4186140 4105344 4072091 4041481
3831 4041481 4061626 4086155 4060954 4022506 3934689 3845497 3802834 3843412 3853559 3862591 3865253 3811685
3819 3811685 3771765 3842870 3899142 3926643 3942318 3968772 3917127 3920951 3927840 4015647 4039584 3968045
3807 3968045 3948842 3950379 3928715 3903100 3996034 3993818 3953915 3904391 3884306 3884752 3936986 3977907
3795 3977907 4009069 3979932 3901412 3828441 3789712 3785010 3810280 3814964 3777643 3690548 3595773 3523137
$$ packed form
3878D731613K2097J8754l691M6011N2594N1855R119n295M381J1550L4747m042
3866D969693J8333m758Q626j2271J9972M976O0683M3066O000j3204p5221k0952
3854E004943M341l4097o2686q419k3722p1489j6978r1215o8747p9786j7025R875
3842D544995o7074j11231o8428J7586Q049J1089o9740p9106q0796l3253l0610
3831D041481K0145K4529k5201l8448q7817q9192m2663M0578J0147R032K662n3568
3819C811685l9920P1105N6272K7501J5675K6454n1645L824O889Q7807K3937p1539
3807C968045j9203J537k1664k5615R2934k216l9903m9524k0085M46N2234M0921
3795C977907L1162k9137p8520p2971l8729m702K5270M684l7321q7095r4775p2636
$$ plain form
3783 3523137 3483996 3466485 3439522 3366509 3249446 3167467 3089813 3094179 3074493 3033211 3013158
3772 3013158 2890728 2817227 2767770 2721293 2725065 2738386 2726026 2686842 2655073 2636035 2633412 2613047
3760 2613047 2599390 2603993 2558428 2541392 2577635 2625340 2691961 2789755 2801996 2782087 2836943 2869517
3748 2869517 2874568 2829503 2815582 2785094 2729019 2708517 2732584 2756456 2750640 2697897 2725678 2798273
3736 2798273 2850643 2882111 2919683 2900099 2900346 2896063 2881644 2954587 2952324 2933357 2927442 2927449 2987331
3723 2987331 3012274 2962354 2946335 2888017 2806538 2752682 2716371 2638794 2560864 2540052 2532102 2568384
3711 2568384 2572578 2563885 2651460 2661709 2608791 2626676 2701480 2742050 2702427 2728521 2703866 2698184
3699 2698184 2743623 2735792 2754530 2779386 2777919 2828675 2915838 2904636 2918471 2945383 2900826 2932595
$$ packed form
3783C523137l9141j7511k6963p3013j17063q1979p7654M366j9686m1282k0053
3772C013158j22430p3501m9457m6477L772J3321j2360l9184l1769j9038k623k0365
3760B613047j3657M603m5565j7036L6243M7705O6621R7794J2241j9909N4856L2574
3748B869517N051m5065j3921l0488n6075k0502K4067K3872n816n2743K7781P2595
3736B798273N2370L1468L7572j9584K47m283j4419P2943k263j8967n915PN9882
3723B987331K4943m9920j6019n8318q1479n3856l6311p7577p7930k0812p950L6282
3711B568384M194q693Q7575J0249n2918J7885P4804M0570l9623K6094k4655n682
3699B698184M5439p831J8738K4856j467N0756Q7163j1202J3835K6912m4557L1769
$$ plain form
3687 2932595 2916042 2888999 2867659 2878994 2895401 2950087 2964547 2932550 2990225 3029857 3098359
3676 3098359 3121096 3113340 3212502 3268937 3286605 3315436 3304158 3333623 3351983 3301305 3292519 3327208
3664 3327208 3281131 3254803 3244707 3244377 3097050 2929131 2893404 2819591 2718244 2712810 2657293
3653 2657293 2648558 2694383 2654013 2618171 2694074 2764701 2821871 2940232 2990644 3033295 3081752
3642 3081752 3062677 3132522 3194353 3188281 3075071 3049496 3030473 2920481 2886226 2895526 2928336
3631 2928336 2947204 2944238 2940326 3028859 3066785 3123463 3226303 3317526 3324877 3342032 3410061 3476275
3619 3476275 3518469 3548315 3718485 3883254 3997392 4154136 4357222 4544655 4580014 4614544
3609 4614544 4631396 4542159 4487620 4304557 4196996 4137466 4005366 3933204 3829239 3782713 3786038
$$ packed form
3687B932595j6553k7043k1340J1335J6407N4686J4460l1997N7675L9632O8502
3676C098359K2737p756R9162N6435J7668K8831j1278K9465J8360n0678q786L4689
3664C327208m6077k6328j0096l30j47327j67919l5727p3813j01347n434n5517
3653B657293q735M5825m0370l5842P5903P0627N7170J18361N0412M2651M8457
3642C081752j9075O9845O1831o072j13210k5575j9023j09992l4255R300L2810
3631B928336J8868k966l912Q8533L7926N6678J02840R1223P351J7155O8029O6214
3619C476275M2194K9846J70170J64769J14138J56744K03086J87433L5359L4530
3609D614544J6852q9237n4539j83063j07561n9530j32100p2162j03965m6526L325
$$ plain form
3598 3786038 3851127 3954910 4059552 4212045 4370366 4472005 4497233 4462824 4376996 4295378
3588 4295378 4231365 4115520 3951270 3735323 3617247 3615225 3550149 3462503 3336067 3271690 3159703
3577 3159703 3082837 3090008 3040315 3037835 3000522 3015345 3016645 3023485 3041558 3115369 3227436 3274360
3565 3274360 3216232 3218570 3186652 3189625 3189013 3248601 3288739 3298643 3354251 3455136 3551954 3659445
3553 3659445 3874535 4100952 4292086 4451880 4669653 4919705 5105106 5213548 5238512 5257980
3543 5257980 5270432 5247363 5209903 5189571 5220412 5256038 5332082 5450060 5569628 5699922 5870167
3532 5870167 6016527 6167795 6258904 6302326 6215607 6176033 6093843 5869452 5640318 5381044
3522 5381044 5059399 4711243 4433807 4160915 3903597 3651970 3374881 3187001 3026579 2870500
$$ packed form
3598C786038O5089J03783J04642J52493J58321J01639K5228l4409q5828q1618
3588D295378o4013j15845j64250k15947j18076k022o5076q7646j26436o4377j11987
3577C159703p6866P171m9693k480l7313J4823J300O840J8073P3811J12067M6924
3565C274360n8128K338l1918K973o12N9588M0138R904N5608J00885R6818J07491
3553C659445K15090K26417J91134J59794K17773K50052J85401J08442K4964J9468
3543E257980J2452k3069l7460k0332L0841L5626P6044J17978J19568J30294J70245
3532E870167J46360J51268R1109M3422q6719l9574q2190k24391k29134k59274
3522E381044l21645l48156k77436k72892k57318k51627k77089j87880j60422j56079
$$ plain form
3512 2870500 2746849 2688947 2652237 2624566 2577155 2595339 2599351 2527350 2528914 2532161 2514648 2472863
3500 2472863 2407645 2397406 2384688 2307250 2223618 2159737 2136621 2109573 2110550 2081115 2054844 2041146
3488 2041146 1995904 2079502 2152695 2233195 2329182 2372348 2401542 2329016 2251133 2147659 2050378
3477 2050378 1960479 1796590 1742674 1651961 1645529 1636330 1657583 1733333 1775315 1845486 1879406 1951083
3465 1951083 2124609 2329785 2404338 2431779 2454624 2478902 2413917 2390113 2351548 2232373 2104682
3454 2104682 1987006 1931107 1840205 1793886 1771573 1714046 1635642 1536786 1507100 1534283 1582357
3443 1582357 1635981 1670687 1681284 1712747 1719852 1678722 1650656 1560554 1504742 1413027 1336155 1218542
3431 1218542 1167425 1165987 1069931 990799 970826 942354 941846 925947 835321 842814 891755 847575
$$ packed form
3512B870500j23651n7902l6710k7671m7411J8184M012p2001J564L247j7513m1785
3500B472863o5218j0239j2718p7438q3632o3881k3116k7048R77k9435k6271j3698
3488B041146m5242Q3598P3193Q0500R5987M3166K9194p2526p7883j03474r7281
3477B050378q9899j63889n3916r0713o432r199K1253P5750M1982P0171L3920P1677
3465A951083J73526K05176P4553K7441K2845K4278o4985k3804l8565j19175j27691
3454B104682j17676n5899r0902m6319k2313n7527p8404r8856k9686K7183M8074
3443A582357N3624L4706J0597L1463P105m1130k8066r0102n5812r1715p6872j17613
3431A218542n1117j438r6056p9132j9973k8472n08j5899r0626P493M8941m4180
$$ plain form
3419 847575 814494 842443 877786 906520 850117 847022 876892 838823 836656 833541 844835 852214
3407 852214 804384 810524 826580 929186 911283 880207 906683 1000242 1033536 1039677 1068623 1129170
3395 1129170 1135161 1158593 1124416 1067707 1101352 1081197 988519 936226 963677 973071 941781 937292
3383 937292 972680 973041 961401 945107 996860 1051575 986512 961380 1007429 976780 949015 853805
3371 853805 783408 749238 754378 743230 752767 740549 672873 656718 646619 650781 717108 700925
3359 700925 673395 708887 706062 667438 645887 654788 663825 645939 603087 570672 583828 546818
3347 546818 508373 504809 482715 522908 518959 511571 499797 471025 455271 475750 484891 487060 483976
3334 483976 456872 482095 473777 417887 492610 478238 427741 423724 384974 426344 448546 440209
$$ packed form
3419H47575l3081K7949L5343K8734n6403l095K9870l8069k167l115J1294P379
3407H52214m7830O140J6056J02606j7903l1076K6476R3559L3294O141K8946O0547
3395A129170N991K3432l4177n6709L3645k0155r2678n2293K7451R394l1290m489
3383I37292L5388L61j1640j6294N1753N4715o5063k5132M6049l0649k7765r5210
3371H53805p0397l4170N140j1148R537j2218o7676j6155j0099M162O6327j6183
3359G00925k7530L5492k825l8624k1551Q901R037j7886m2852l2415J3156l7010
3347E46818l8445l564k2094M0193l949p388j1774k8772j5754K0479R141K169l084
3334D83976k7104K5223q318n5890P4723j4372n0497m017l8750M1370K2202q337
$$ plain form
3322 440209 428797 400883 388544 380594 356139 370055 351367 357141 337760 396956 374855 341818
3310 341818 347737 355492 389039 400602 396486 435898 380160 347931 378682 455897 445574 395418
3298 395418 404281 418950 464766 433356 425188 386529 406459 364403 405085 380460 372495 386090
3286 386090 335557 360211 403660 366005 323712 343404 387137 409371 472873 420064 433316 464792
3274 464792 451845 462126 497024 560992 519546 500940 503118 509746 515840 553294 586458 606851
3262 606851 646086 638470 640267 727050 756207 706305 717549 701181 659388 618372 609604 589598
3250 589598 578224 559085 481291 464145 456177 442256 409243 469619 473239 511301 574146 571400
3238 571400 524950 570708 635689 648964 666411 693139 693250 725232 752418 865320 950308 1083338
$$ packed form
3322D40209j1412k7914j2339p950k4455J3916j8688N774j9381N9196k2101l3037
3310C41818N919P755L3547J1563m116L9412n5738l2229L0751P7215j0323n0156
3298C95418Q863J4669M5816l1410q168l8659J9930m2056M0682k4625p965J3595
3286C86090n0533K4654M3449l7655m2293J9692M3733K2234O3502n2809J3252L1476
3274D64792j2947J0281L4898O3968m1446j8606K178O628O094L7454L3164K0393
3262F06851L9235p616J797Q6783K9157m9902J1244j6368m1793m1016q768k0006
3250E89598j1374j9139p7794j7146p968j3921l3013O0376L620L8062O2845k746
3238E71400m6450M5758O4981J3275J7447K6728J11L1982K7186J12902Q4988J33030
$$ plain form
3226 1083338 1141195 1176236 1211450 1204146 1179193 1117675 1120045 1051544 962480 905632 921173 937302
3214 937302 886568 835786 861721 868699 944026 908859 951683 1047819 1115001 1126793 1102956 1049119
3202 1049119 1022327 1002116 996351 1060749 1105724 1144112 1162437 1243458 1292013 1267708 1262477 1250207
3190 1250207 1125500 1035780 992295 981177 905221 861586 829066 807208 826783 783908 767911
3179 767911 749230 707044 760518 799361 792704 801805 772454 784939 775460 771331 786936 767705
3167 767705 747266 756121 711614 678897 672788 659498 591457 593188 602168 583147 586122 501839 492983
3154 492983 489907 507366 464025 392319 404083 412970 420983 401459 439154 461026 402450 354539
3142 354539 377698 417792 444944 392841 346661 343176 299120 250783 237428 219186 189709 184691
$$ packed form
3226A083338N7857L5041L5214p304k4953o1518K370o8501q9064n6848J5541J6129
3214I37302n0734n0782K5935O978P5327l5167M2824R6136O7182J1792k3837n3837
3202A049119k6792k0211n765O4398M4975L8388J8325Q1021M8555k4305n231j2270
3190A250207j24707q9720m3485j1118p5956m3635l2520k1858J9575m2875j5997
3179G67911j8681m2186N3474L8843o657R101k9351J2485r479m129J5605j9231
3167G67705k0439Q855m4507l2717o109j3290o8041J731Q980j9021K975q4283q856
3154D92983l076J7459m3341p1706J1764Q887Q013j9524L7695K1872n8576m7911
3142C54539K3159M0094K7152n2103m6180l485m4056m8337j3355j8242k9477n018
$$ plain form
3130 184691 199886 251743 184664 164103 164594 194328 203524 131404 151323 126618 79730 103664
3118 103664 131056 85473 122546 77492 55016 37492 17139 17860 75018 76785 21529 -16432
3106 -16432 19368 43412 44752 45707 4051 -29789 16755 69817 22162 12813 14415 7239 -19849
3093 -19849 14949 9706 -4219 14895 -8834 -3181 17944 39229 -16384 -57610 -35697 -72969
3081 -72969 -74712 -41963 25494 23708 5538 3395 6257 -52977 -63895 -59745 -19126 506 -674
3068 -674 -33432 -115764 -87873 -7455 -38572 -68096 -86559 -94441 -77469 -56035 -42814 -40916 -39267
3055 -39267 -62821 -63603 -52649 -61561 27267 67806 36154 -32133 -53124 -48125 -43888 405 -52635
3042 -52635 -63957 -87641 -105218 -98075 -112943 -125883 -113368 -97009 -121474 -153670 -171120 -193371
$$ packed form
3130A84691J5195N1857o7079k0561M91K9734R196p2120J9919k4705m6888K3934
3118A03664K7392m5583L7073m5054k2476j7524k0353P21N7158J767n5256l7961
3106a6432L5800K4044J340R55m1656l3840M6544N3062m7655r349J602p176k7088
3093a9849L4798n243j3925J9114k3729N653K1125K1285n5613m1226K1913l7272
3081g2969j743L2749O7457j786j8170k143K862n9234j0918M150M0619J9632j180
3068f74l2758q2332K7891Q0418l1117k9524j8463p882J6972K1434J3221J898J649
3055c9267k3554p82J0954q912Q8828M0539l1652o8287k0991M999M237M4293n3040
3042e2635j1322k3684j7577P143j4868j2940J2515J6359k4465l2196j7450k2251
$$ plain form
3030 -193371 -118829 -87570 -78690 -103538 -86813 -80741 -87439 -79707 -110984 -104294 -109372 -96203 -44531
3017 -44531 -49377 -91648 -68676 -43817 -48150 -132326 -102069 -48755 -32392 -62072 -154607 -134755
3005 -134755 -100683 -55024 -69262 -67051 -76656 -48752 -62173 -85587 -95231 -109781 -100247 -84465
2993 -84465 -87104 -132774 -164195 -134498 -107717 -94665 -111069 -145548 -116450 -112252 -121006 -171621
2981 -171621 -131110 -146632 -155927 -153957 -159278 -100696 -31226 -59985 -82761 -115694 -189825 -163081
2969 -163081 -124408 -93142 -84019 -115050 -90982 -127974 -133284 -92482 -59672 -82030 -118873 -96598
2957 -96598 -106193 -186057 -172268 -119770 -75556 -85957 -156362 -169547 -141011 -75309 -60301 -59517
2945 -59517 -109419 -160718 -170932 -147576 -158383 -98357 -59670 -83848 -113835 -88401 -99768 -91418
$$ packed form
3030a93371P4542L1259Q880k4848J6725O072o698P732l1277O690n078J3169N1672
3017d4531m846m2271K2972K4859m333q4176L0257N3314J6363k9680r2535J9852
3005a34755L4072M5659j4238K211r605K7904j3421k3414r644j4550R534J5782
2993h4465k639m5670l1421K9697K6781J3052j6404l4479K9098M198q754n0615
2981a71621M0511j5522r295J970n321N8582O9470k8759k2776l2933p4131K6744
2969a63081L8673L1266R123l1031K4068l6992n310M0802L2810k2358l6843K2275
2957i6598r595p9864J3789N2498M4214j0401p0405j3185K8536O5702J5008P84
2945e9517m9902n1299j0214K3356j0807O0026L8687k4178k9987K5434j1367Q350
$$ plain form
2933 -91418 -76339 -54976 -80877 -127714 -127273 -142180 -131633 -105651 -108798 -90819 -149834 -131511
2921 -131511 -169812 -163190 -31205 -49731 -95854 -58146 -85433 -109704 -88198 -112042 -110645 -123565
2909 -123565 -118121 -114948 -119070 -126717 -58782 -48256 -138809 -145396 -126950 -122535 -90488 -84956 -74949
2896 -74949 -95116 -82294 -126373 -116390 -99162 -107315 -105915 -87999 -177852 -184534 -163941 -178672 -161447
2883 -161447 -123603 -104171 -116913 -82810 -90414 -90538 -52498 -106431 -120886 -137527 -135637 -106644
2871 -106644 -148568 -149208 -155033 -160484 -165702 -112768 -121387 -117763 -104012 -109680 -115728 -189348 -194644 -151225
2857 -151225 -130797 -141918 -162573 -130617 -119483 -168197 -201987 -113303 -120503 -127430 -130513 -145171
2845 -145171 -86199 -51008 -70016 -126793 -141830 -101714 -101632 -116626 -101074 -75590 -101521 -141644
$$ packed form
2933i1418J5079K1363k5901m6837M41j4907J0547K5982l147J7979n9015J8323
2921a31511l8301O622J31985j8526m6123L7708k7287k4271K1506k3844J397j2920
2909a23565N444L173m122p647O7935J0526r0553o587J8446M415L2047N532J0007
2896g4949k0167J2822m4079R983J7228q153J400J7916q9853o682K0593j4731J7225
2883a61447L7844J9432j2742L4103p604j24L8040n3933j4455j6641J890K8993
2871a06644m1924o40n825n451n218N2934q619L624J3751n668o048p3620n296M3419
2857a51225K0428j1121k0655L1956J1134m8714l3790Q8684p200o927l083j4658
2845a45171N8972L5191j9008n6777j5037M0116Q2j4994J5552K5484k5931m0123
$$ plain form
2833 -141644 -127537 -69071 -90614 -128741 -144028 -148726 -134607 -111275 -123050 -117854 -132782 -109785
2821 -109785 -69614 -116743 -116801 -119146 -146815 -135456 -90734 -111151 -142997 -128653 -185591 -206961
2809 -206961 -205935 -151224 -183886 -208958 -207227 -225721 -215804 -166620 -160010 -173021 -115660 -187101
2797 -187101 -191553 -156721 -126915 -125190 -80774 -94524 -148686 -126266 -176910 -202507 -139438 -60194
2785 -60194 -110933 -137655 -106038 -140346 -147050 -115199 -115881 -103795 -91482 -129776 -136311 -194619 -144691
2772 -144691 -157904 -154407 -144641 -210894 -165780 -140592 -155208 -114384 -84463 -64935 -143864 -168543
2760 -168543 -191012 -194910 -184150 -153348 -145280 -185733 -221201 -152137 -120306 -82891 -85662 -127341
2748 -127341 -218113 -240455 -132707 -161436 -107185 -98740 -157760 -211470 -170642 -159999 -220495 -201419
$$ packed form
2833a41644J4107N8466k1543l8127j5287m698J4119K3332j1775N196j4928K2997
2821a09785M0171m7129n8k345k7669J1359M4722k0417l1846J4344n6938k1370
2809b06961J026N4711l2662k5072J731j8494R917M9184O610j3011N7361p1441
2797a87101m452L4832K9806J725M4416j3750n4162K2420n0644k5597O3069P9244
2785f0194n0739k6722L1617l4308o704L1851o82J2086J2313l8294o535n8308M9928
2772a44691j3213L497R766o6253M5114K5188j4616M0824K9921J9528p8929k4679
2760a68543k2469l898J0760L0802Q068m0453l5468O9064L1831L7415k771m1679
2748a27341r0772k2342J07748k8729N4251Q445n9020n3710M0828J0643o0496J9076
$$ plain form
2736 -201419 -137954 -156848 -202824 -179834 -199361 -177613 -122828 -120376 -190411 -231235 -186565 -145225
2724 -145225 -163671 -181822 -202880 -197448 -242842 -237533 -162187 -161954 -183210 -176420 -140050 -138885 -188443
2711 -188443 -207208 -160751 -153242 -155560 -194408 -142907 -110084 -109540 -113309 -93844 -109771 -88847 -140729
2698 -140729 -161604 -100924 -126012 -155107 -199589 -148357 -108716 -176411 -109032 -65376 -126750 -183261
2686 -183261 -208475 -189992 -186815 -183160 -136856 -95719 -144677 -183594 -165827 -130002 -90451 -136961
2674 -136961 -144968 -128555 -151639 -200255 -202093 -103600 -79254 -55883 -39349 -25321 -13303 25157
2662 25157 68397 24617 -38194 -91289 -77311 -119171 -105281 -70469 -34401 -32094 -67236 -110268
2650 -110268 -164395 -174539 -151457 -119212 -123169 -112460 -118445 -146814 -115085 -93477 -60242 -81726
$$ packed form
2736b01419O3465j8894m5976K2990j9527K1748N4785K452p0035m0824M4670M1340
2724a45225j8446j8151k1058N432m5394N309P5346K33k1256O790L6370J165m9558
2711a88443j8765M6457P509k318l8848N1501L2823N44l769J9465j5927K0924n1882
2698a40729k0875O0680k5088k9095m4482N1232L9641o7695O7379M3656o1374n6511
2686a83261k5214J8483L177L655M6304M1137m8958l8917J7767L5825L9551m6510
2674a36961q007J6413k3084m8616j838R8493K4346K3371J6534J4028J2018L8460
2662B5157M3240m3780o2811n3095J3978m1860J3890L4812L6068K307l5142m3032
2650a10268n4127j0144K3082L2245l957J0709n985k8369L1729K1608L3235k1484
$$ plain form
2638 -81726 -109518 -114604 -96296 -87032 -129225 -137788 -93221 -135634 -165896 -132266 -154402 -153847 -149689
2625 -149689 -178992 -150731 -154171 -178834 -138520 -154282 -125059 -108428 -174814 -157327 -152327 -146964
2613 -146964 -186043 -174867 -158718 -178957 -166871 -155382 -98900 -128648 -146927 -138489 -155385 -176931
2601 -176931 -163420 -179838 -107489 -110667 -124343 -100635 -84876 -167169 -191944 -164610 -166489 -130856
2589 -130856 -135668 -95143 -58663 -81184 -121628 -159151 -144508 -140280 -118482 -116664 -117972 -132053
2577 -132053 -117207 -48465 3438 -4038 -29412 -81333 -82848 -110328 -118663 -145289 -101349 -131443
2565 -131443 -123111 -88218 -24833 -53746 -75842 -113915 -124633 -105622 -150944 -135673 -86740 -33004
2553 -33004 -97488 -90271 -45273 -27613 -75938 -84660 -63501 -92388 -114762 -137265 -109207 -84101
$$ packed form
2638h1726k7792n086J8308R264m2193q563M4567m2413l0262L3630k2136N55M158
2625a49689k9303K8261l440k4663M0314j5762K9223J6631o6386J7487N000N363
2613a46964l9079J1176J6149k0239J2086J1489N6482k9748j8279Q438j6896k1546
2601a76931J3511j6418P2349l178j3676K3708J5759q2293k4775K7334j879L5633
2589a30856m812M0525L6480k2521m0444l7523J4643M228K1798J818j308j4081
2577a32053J4846O8742N1903p476k5374n1921j515k7480q335k6626M3940l0094
2565a31443Q332L4893O3385k8913k2096l8073j0718J9011m5322J5271M8933N3736
2553c3004o4484P217M4998J7660m8325q722K1159k8887k2374k2503K8058K5106
$$ plain form
2541 -84101 -133942 -160595 -153167 -84637 -85039 -74430 -77704 -83743 -110892 -150578 -160836 -88130 -62595
2528 -62595 -114414 -98384 -19759 -38997 -56325 -99974 -90848 -105074 -87964 -87447 -37134 -69155
2516 -69155 -82950 -125444 -73310 -63748 -129313 -75968 -30686 -5474 -40093 -26008 49 -37639
2504 -37639 -93861 -107326 -39383 9762 -448 -16161 19982 27996 -29186 -34198 -8387 58102
2492 58102 29250 -47282 -20966 31165 -1864 -29443 -45509 8678 20868 9760 47972 104250
2480 104250 56604 28089 20056 58854 38177 26394 68852 104052 58701 73667 77600 168488
2468 168488 163422 111961 140230 104119 84598 74773 70024 137651 210564 158439 109363 88325
2456 88325 153287 137777 264633 311952 260794 201243 171764 195394 281257 330291 268735 338484
$$ packed form
2541h4101m9841k6653P428O8530m02J0609l274o039k7149l9686j0258P2706K5535
2528f2595n1819J6030P8625j9238j7328m3649R126j4226J7110N17N0313l2021
2516f9155j3795m2494N2134R562o5565N3345M5282K5212l4619J4085K6057l7688
2504c7639n6222j3465O7943M9145j0210j5713L6143Q014n7182n012K5811O6489
2492E8102k8852p6532K6316N2131l3029k7579j6066N4187J2190j1108L8212N6278
2480A04250m7646k8515q033L8798k0677j1783M2458L5200m5351J4966L933R0888
2468A68488n066n1461K8269l6111j9521r825m749O7627P2913n2125m9076k1038
2456H8325O4962j5510J26856M7319n1158n9551k9479K3630Q5863M9034o1556O9749
$$ plain form
2444 338484 300699 294166 280237 298408 365986 350716 350927 360598 388625 368867 337320 432362
2432 432362 499574 445098 352151 433057 505445 531618 556302 603938 669808 640549 683829 691518
2420 691518 771387 799593 859079 921552 1012367 1193393 1400711 1685336 1966294 2106829 2159848
2409 2159848 2336257 2546653 2711651 3009280 3371542 3920229 4541121 5552614 7172558
2400 7172558 10374686 15185313 21251044 26586172 29159241 28601412 27452072 25812104
2392 25812104 21913980 17985343 14392719 11527401 9128810 7034554 5402619 4432025
2384 4432025 3901534 3562033 3305030 2981045 2683585 2429444 2182576 1991337 1754303 1530162
2374 1530162 1388292 1232527 1208943 1131308 936609 869240 877389 860764 788417 810725 739336
$$ packed form
2444C38484l7785o533j3929J8171O7578j5270K11R671K8027j9758l1547R5042
2432D32362O7212n4476r2947Q0906P2388K6173K4684M7636O5870k9259M3280P689
2420F91518P9869K8206N9486O2473R0815J81026K07318K84625K80958J40535N3019
2409B159848J76409K10396J64998K97629L62262N48687O20892J011493J619944
2400G172558L202128M810627O065731N335128K573069n57829j149340j639968
2392B5812104l898124l928637l592624k865318k398591k094256j631935r70594
2384D432025n30491l39501k57003l23985k97460k54141k46868j91239k37034k24141
2374A530162j41870j55765k3584p7635j94699o7369Q149j6625p2347K2308p1389
$$ plain form
2363 739336 752697 720306 628173 623893 597612 575875 530456 481000 510639 546712 500140 482349
2351 482349 464348 460522 370087 329584 344694 341221 316175 291918 291033 284605 280095 258944 268565
2338 268565 236120 204674 213320 161805 150584 184727 188088 145548 123354 131591 99633 70819
2326 70819 85619 89551 132812 135370 105754 23248 -5148 13281 250 15209 53862 78228
2314 78228 18294 16375 8655 5966 55712 45811 -4736 -45404 -47873 -51660 8171 2548 4888
2301 4888 -45540 -113208 -64101 -43258 -62817 -43946 -6235 -9786 -63202 -116748 -102312 -76800
2289 -76800 -67523 -98049 -69530 -85569 -31770 -12347 -39319 -65560 -85098 -103349 -156576 -114660
2277 -114660 -121152 -67426 -48411 -72016 -119270 -147682 -160496 -149424 -125551 -119403 -93838 -102114
$$ packed form
2363G39336J3361l2391r2133m280k6281k1737m5419m9456K9639L6073m6572j7791
2351D82349j8001l826r0435m0503J5110l473k5046k4257q85o428m510k1151R621
2338B68565l2445l1446Q646n1515j1221L4143L361m2540k2194Q237l1958k8814
2326G0819J4800L932M3261K558k9616q2506k8396J8429j3031J4959L8653K4366
2314G8228n9934j919p720k689M9746r901n0547m0668k469l787N9831n623K340
2301D888n0428o7668M9107K0843j9559J8871L7711l551n3416n3546J4436K5512
2289g6800R277l0526K8519j6039N3799J9423k6972k6241j9538j8251n3227M1916
2277a14660o492N3726J9015k3605m7254k8412j2814J1072K3873O148K5565q276
$$ plain form
2265 -102114 -77842 -92590 -114035 -91203 -56266 -84939 -89385 653 -52775 -130798 -114219 -73651
2253 -73651 -126460 -169999 -140749 -96384 -108193 -97838 -188684 -154666 -118224 -138151 -135755 -133910
2241 -133910 -147169 -131634 -114086 -89309 -77545 -91794 -89083 -93384 -103536 -98612 -81863 -119124
2229 -119124 -140877 -160798 -140209 -153291 -114139 -197747 -218589 -186492 -154093 -176961 -146204 -142481
2217 -142481 -160902 -215943 -211494 -179298 -177662 -142582 -175253 -186517 -183468 -200843 -169255 -151739
2205 -151739 -161935 -151468 -196477 -228606 -237305 -221511 -177949 -144895 -111552 -113732 -133777 -157100
2193 -157100 -147538 -114552 -111189 -96458 -165559 -175959 -161972 -117509 -101799 -114110 -102302 -98624
2181 -98624 -114518 -143516 -122143 -130154 -110589 -83160 -72976 -119135 -103887 -115792 -156988 -114560
$$ packed form
2265a02114K4272j4748k1445K2832L4937k8673m446R0038n3428p8023J6579M0568
2253g3651n2809m3539K9250M4365j1809J0355r0846L4018L6442j9927K396J845
2241a33910j3259J5535J7548K4777J1764j4249K711m301j0152M924J6749l7261
2229a19124k1753j9921K0589j3082L9152q3608k0842L2097L2399k2868L0757L723
2217a42481j8421n5041M449L2196J636L5080l2671j1264L049j7375L1588J7516
2205a51739j0196J0467m5009l2129q699J5794M3562L3054L3343k180k0045k3323
2193a57100R562L2986L363J4731o9101j0400J3987M4463J5710j2311J1808L678
2181i8624j5894k8998K1373q011J9565K7429J0184m6159J5248j1905m1196M2428
$$ plain form
2169 -114560 -126898 -136457 -131503 -135256 -135284 -124441 -165513 -175620 -170343 -178606 -181854 -185174 -149258 -112112
2155 -112112 -126703 -150565 -119265 -128223 -141923 -194886 -196291 -130877 -137007 -127733 -94105 -101243 -175804
2142 -175804 -134627 -111636 -82257 -85912 -122362 -84385 -88326 -118670 -87335 -74008 -39841 -45106
2130 -45106 -72809 -49999 -56187 -59385 -103480 -62386 -45456 -83380 -85154 -101714 -130327 -105369
2118 -105369 -112588 -131278 -118642 -181859 -219064 -199674 -153768 -108635 -118174 -118044 -128478 -101981
2106 -101981 -156585 -180019 -137203 -123671 -120088 -92717 -104033 -161441 -212677 -276386 -192016 -136906
2094 -136906 -132713 -115363 -108921 -140070 -179149 -178004 -155623 -171377 -192757 -179653 -221718 -192131
2082 -192131 -211717 -163571 -169763 -156675 -149207 -158374 -170136 -164728 -145043 -160916 -144704 -156182
$$ packed form
2169a14560j2338r559M954l753k8J0843m1072j0107N277q263l248l320L5916L7146
2155a12112j4591k3862L1300q958j3700n2963j405O5414o130R274L3628p138p4561
2142a75804M1177K2991K9379l655l6450L7977l941l0344L1335J3327L4167n265
2130d5106k7703K2810o188l198m4095M1094J6930l7924j774j6560k8613K4958
2118a05369p219j8690J2636o3217l7205J9390M5906M5133r539J30j0434K6497
2106a01981n4604k3434M2816J3532L583K7371j1316n7408n1236o3709Q4370N5110
2094a36906M193J7350O442l1149l9079J145K2381j5754k1380J3104m2065K9587
2082a92131j9586M8146o192J3088P468r167j1762N408J9685j5873J6212j1478
$$ plain form
2070 -156182 -171715 -222424 -190721 -152844 -171037 -199499 -184451 -145402 -176510 -187292 -151602 -99728
2058 -99728 -99673 -186336 -150264 -131373 -165724 -194886 -201936 -189907 -190386 -183821 -170573 -205723 -215659
2045 -215659 -188241 -172402 -153596 -139187 -107671 -58560 -125122 -184506 -155769 -119778 -150341 -198126
2033 -198126 -186276 -220667 -213899 -116352 -149720 -150312 -95199 -151998 -179450 -179691 -170425 -188591 -104868
2020 -104868 -110913 -177827 -184218 -193139 -155513 -174537 -125134 -116548 -197807 -219153 -184756 -170040
2008 -170040 -156991 -96085 -73170 -114307 -152375 -199310 -123544 -103026 -56829 -29361 -84415 -104348
1996 -104348 -138743 -174679 -97308 -83972 -178313 -201188 -128335 -109380 -155225 -191306 -162521 -110321
1984 -110321 -134758 -108801 -124226 -153357 -173730 -165283 -137817 -141362 -181652 -210156 -191516 -119881
$$ packed form
2070a56182j5533n0709L1703L7877j8193k8462J5048L9049l1108j0782L5690N1874
2058i9728N5q6663L6072J8891l4351k9162p050J2029m79O565J3248l5150r936
2045b15659K7418J5839J8806J4409L1516M9111o6562n9384K8737L5991l0563m7785
2033a98126J1850l4391O768R7547l3368n92N5113n6799k7452k41R266j8166Q3723
2020a04868o045o6914o391q921L7626j9024M9403Q586q1259k1346L4397J4716
2008a70040J3049O0906K2915m1137l8068m6935P5766K0518M6197K7468n5054j9933
1996a04348l4395l5936P7371J3336r4341k2875P2853J8955m5845l6081K8785N2200
1984a10321k4437K5957j5425k9131k0373Q447K7466l545m0290k8504J8640P1635
$$ plain form
1972 -119881 -115801 -133082 -156133 -147251 -177303 -192963 -175487 -143795 -132174 -152184 -162480 -210819
1960 -210819 -221024 -168671 -123446 -104357 -117785 -167837 -152692 -162583 -165988 -175789 -249981 -178969
1948 -178969 -162384 -174699 -197817 -175859 -194850 -226577 -241315 -189632 -191186 -194845 -182927 -237450
1936 -237450 -204601 -213288 -200341 -172468 -133514 -135741 -126993 -163660 -157140 -255226 -260613 -185430 -181046
1923 -181046 -153680 -136762 -143815 -200875 -170719 -170609 -238753 -164378 -117239 -135771 -162658 -164423
1911 -164423 -182387 -119483 -105604 -136180 -150800 -161330 -166015 -138849 -135774 -142204 -113306 -143405
1899 -143405 -155844 -183960 -144352 -155353 -203922 -179633 -218154 -212770 -182950 -197261 -124214 -123487
1887 -123487 -123298 -99590 -133274 -135790 -157665 -167141 -173784 -219548 -172477 -175731 -190514 -214570 -133590
$$ packed form
1972a19881M080j7281k3051Q882l0052j5660J7476L1692J1621k0010j0296m8339
1960b10819j0205N2353M5225J9089j3428n0052J5145r891l405r801p4192P1012
1948a78969J6585j2315k3118K1958j8991l1727j4738N1683j554l659J1918n4523
1936b37450L2849q687J2947K7873L8954k227Q748l6667O520r8086n387P5183M384
1923a81046K7366J6918p053n7060L0156J10o8144P4375M7139j8532k6887j765
1911a64423j7964O2904J3879l0576j4620j0530m685K7166L075o430K8898l0099
1899a43405j2439k8116L9608j1001m8569K4289l8521N384K9820j4311P3047P27
1887a23487J89K3708l3684k516k1875r476o643m5764M7071l254j4783k4056Q0980
$$ plain form
1874 -133590 -131339 -165157 -173875 -156914 -132644 -209268 -213265 -146470 -134912 -139414 -144941 -146064 -133022
1861 -133022 -112280 -146928 -137978 -147531 -143981 -139878 -144559 -144951 -198669 -200784 -105136 -122327 -131458
1848 -131458 -118946 -193840 -224456 -194263 -183906 -167905 -130690 -153163 -189789 -192389 -197952 -215650
1836 -215650 -169119 -182727 -109817 -134377 -173940 -200671 -208688 -147988 -103758 -59640 -72763 -96483
1824 -96483 -128868 -189544 -199622 -141861 -89078 -74349 -108106 -169702 -189633 -177042 -162962 -157031
1812 -157031 -118084 -171990 -200613 -206187 -183342 -161380 -85346 -89816 -173139 -175581 -185457 -170706
1800 -170706 -132764 -110355 -76592 -97886 -175301 -232608 -162716 -128267 -157791 -112024 -110794 -62483
1788 -62483 -134393 -169428 -118609 -76185 -96593 -135502 -128756 -160948 -187006 -216567 -181249 -105621
$$ packed form
1874a33590K251l3818q718J6961K4270p6624l997O6795J1558m502n527j123J3042
1861a33022K0742l4648Q950r553L550M103m681l92n3718k115R5648j7191r131
1848a31458J2512p4894l0616L0193J0357J6001L7215k2473l6626k600n563j7698
1836b15650M6531j3608P2910k4560l9563k6731q017O0700M4230M4118j3123k3720
1824i6483l2385o0676j0078N7761N2783J4729l3757o1596j9931J2591J4080N931
1812a57031L8947n3906k8623n574K2845K1962P6034m470q3323k442r876J4751
1800a70706L7942K2409L3763k1294p7415n7307O9892L4449k9524M5767J230M8311
1788f2483p1910l5035N0819M2424k0408l8909O746l2192k6058k9561L5318P5628
$$ plain form
1776 -105621 -100865 -154043 -185077 -186194 -159756 -179009 -172052 -150880 -111108 -144453 -174623 -142043
1764 -142043 -109606 -140858 -150436 -179015 -215791 -231806 -219416 -184138 -157082 -105811 -58672 -85169
1752 -85169 -152272 -218967 -243824 -186274 -142615 -127242 -147471 -176234 -180325 -205991 -194862 -100739
1740 -100739 -99599 -127147 -162889 -163826 -189947 -207990 -182991 -123721 -129672 -130177 -164303 -196455 -153962
1727 -153962 -144070 -176795 -126615 -116792 -160281 -221858 -164743 -102747 -115372 -110926 -90596 -138708
1715 -138708 -166776 -101444 -105862 -86587 -90581 -98058 -123418 -159669 -93702 -96692 -167947 -207711
1703 -207711 -173572 -156232 -164462 -149845 -147498 -180758 -190519 -158756 -125510 -109402 -149552 -155427
1691 -155427 -154885 -165288 -186034 -107727 -75822 -102446 -154076 -164983 -180193 -162529 -108985 -142238
$$ packed form
1776a05621M756n3178l1034j117K6438j9253O957K1172L9772l3345l0170L2580
1764a42043L2437l1252r578k8579l6776j6015J2390L5278K7056N1271M7139k6497
1752h5169o7103o6695k4857N7550M3659J5373k0229k8763m091k5666J1129R4123
1740a00739J140k7548l5742r37k6121j8043K4999N9270n951n05l4126l2152M2493
1727a53962R892l2725N0180R823m3489o1577N7115O1996j2625M446K0330m8112
1715a38708k8068O5332m418J9275l994p477k5360l6251O5967k990p1255l9764
1703b07711L4139J7340q230J4617K347l3260r761L1763L3246J6108m0150n875
1691a55427N42j0403k0746P8307L1905k6624n1630j0907j5210J7664N3544l3253
$$ plain form
1679 -142238 -153739 -171220 -171913 -149689 -129678 -144589 -171023 -202670 -219008 -225086 -213290 -164250
1667 -164250 -157078 -150417 -134489 -131547 -170635 -176141 -144558 -154548 -148735 -149971 -167672 -130532 -145450
1654 -145450 -136105 -114873 -119440 -124335 -158278 -181819 -159097 -130401 -117988 -140879 -162137 -120664
1642 -120664 -123005 -152607 -156727 -178492 -160912 -198734 -219672 -163422 -152156 -127800 -147240 -183138
1630 -183138 -149058 -149742 -111668 -129332 -130580 -183763 -165325 -137012 -137363 -101611 -166247 -167682 -144232
1617 -144232 -132378 -159554 -102036 -130187 -116566 -130506 -84757 -96493 -110557 -156148 -204667 -166724
1605 -166724 -137362 -155162 -175497 -155507 -170649 -188164 -171162 -130963 -131329 -172356 -138252 -141231
1593 -141231 -119399 -105968 -145319 -184629 -193127 -141265 -165155 -164655 -195675 -181217 -155626 -114483
$$ packed form
1679a42238j1501j7481o93K2224K0011j4911k6434l1647j6338o078J1796M9040
1667a64250P172O661J5928K942l9088n506L1583r990N813j236j7701L7140j4918
1654a45450R345K1232m567m895l3943k3541K2722K8696J2413k2891k1258M1473
1642a20664k341k9602m120k1765J7580l7822k0938N6250J1266K4356j9440l5898
1630a83138L4080o84L8074j7664j248n3183J8438K8313l51L5752o4636j435K3450
1617a44232J1854k7176N7518k8151J3621j3940M5749j1736j4064m5591m8519L7943
1605a66724K9362j7800k0335J9990j5142j7515J7002M0199l66m1027L4104k979
1593a41231K1832J3431l9351l9310q498N1862k3890N00l1020J4458K5591M1143
$$ plain form
1581 -114483 -125046 -156027 -172099 -166416 -114298 -88428 -98015 -69201 -103644 -134178 -194620 -196331
1569 -196331 -169513 -143128 -162449 -164545 -181449 -173774 -153720 -156334 -177581 -164846 -157265 -167993
1557 -167993 -109751 -158492 -159000 -140487 -113931 -151420 -182660 -186470 -168352 -165077 -129678 -149200
1545 -149200 -126770 -155750 -189634 -108961 -71826 -71460 -110435 -128105 -154356 -100955 -162266 -158622
1533 -158622 -161667 -154740 -153384 -143887 -153131 -165851 -156311 -158245 -131881 -130086 -88130 -55779 -96621
1520 -96621 -136237 -168699 -145918 -129131 -119839 -142334 -168222 -115256 -150858 -122238 -110451 -89382
1508 -89382 -115217 -127879 -96372 -70160 -105909 -141358 -143879 -139872 -129017 -125749 -222164 -211856
1496 -211856 -140438 -145107 -121027 -80760 -70312 -127989 -170200 -213826 -191761 -134259 -93833 -123084
$$ packed form
1581a14483j0563l0981j6072N683N2118K5870r587K8814l4443l0534o0442j711
1569a96331K6818K6385j9321k096j6904P675K0054k614k1247J2735P581j0728
1557a67993N8242m8741n08J8513K6556l7489l1240l810J8118L275L5399j9522
1545a49200K2430k8980l3884Q0673L7135L66l8975j7670k6251N3401o1311L644
1533a58622l045O927J356R497r244j2720R540j934K6364J795M1956L2351m0842
1520i6621l9616l2462K2781J6787R292k2495k5888N2966l5602K8620J1787K1069
1508h9382k5835j2662L1507K6212l5749l5449k521M007J0855L268r6415J0308
1496b11856P1418m669K4080M0267J0448n7677m2211m3626K2065N7502M0426k9251
$$ plain form
1484 -123084 -100295 -147390 -166036 -148471 -150862 -102373 -114919 -170283 -174970 -159966 -160258 -138378
1472 -138378 -67042 -52656 -121315 -204812 -206607 -208714 -148132 -110281 -144011 -84733 -154049 -227962
1460 -227962 -204491 -139702 -133992 -100516 -102524 -178793 -214632 -224689 -159927 -104387 -103687 -104380 -155203
1447 -155203 -150721 -180040 -134722 -83637 -122011 -156299 -184902 -198285 -189674 -159888 -104666 -117430
1435 -117430 -143802 -206135 -198567 -163743 -174760 -170465 -162459 -152546 -260859 -233744 -131438 -118733
1423 -118733 -133398 -126605 -110796 -90022 -128164 -130372 -109408 -118691 -157361 -216441 -175565 -171394
1411 -171394 -188978 -157530 -108343 -102795 -140582 -174361 -226300 -213347 -154835 -150396 -111354 -140789
1399 -140789 -179425 -211204 -154272 -144254 -135557 -157516 -181914 -163765 -128330 -116622 -100560 -138113
$$ packed form
1484a23084K2789m7095j8646J7565k391M8489j2546n5364m687J5004k92K1880
1472a38378P1336J4386o8659q3497j795k107O0582L7851l3730N9278o9316p3913
1460b27962K3471O4789N710L3476k008p6269l5839j0057O4762N5540P00o93n0823
1447a55203M482k9319M5318N1085l8374l4288k8603j3383Q611K9786N5222j2764
1435a17430k6372o2333P568L4824j1017M295Q006R913j08313K7115J02306J2705
1423a18733j4665O793J5809K0774l8142k208K0964r283l8670n9080M0876M171
1411a71394j7584L1448M9187N548l7787l3779n1939J2953N8512M439L9042k9435
1399a40789l8636l1779N6932J0018Q697k1959k4398J8149L5435J1708J6062l7553
$$ [...]
##END NTUPLES=NMR SPECTRUM
##END=
