##TITLE=1H_DE-80H_X3
 200.13MHz, d2o
 8 sc
 
 19ns.26.2.2025
##JCAMPDX= 6.0         $$ Bruker NMR JCAMP-DX V2.0
##DATA TYPE= NMR SPECTRUM
##DATA CLASS= NTUPLES
##ORIGIN= UXNMR, Bruker Analytische Messtechnik GmbH
##OWNER= pz
$$ XWIN-NMR		Version 3.5
$$ Thu Jun  4 10:49:36 2026 Russian Standard Time (UT+4h)  Yarkov@DPX200
##.OBSERVE FREQUENCY= 200.1313
##.OBSERVE NUCLEUS= ^1H
##.ACQUISITION MODE= SIMULTANEOUS
##.ACQUISITION SCHEME= undefined
##.AVERAGES= 8
##.DIGITISER RES= 18
##SPECTROMETER/DATA SYSTEM= spect
##.PULSE SEQUENCE= zg30
##.SOLVENT NAME= CDCl3
##.SHIFT REFERENCE= (INTERNAL, CDCl3, 0, 15.5464)
##AUDIT TRAIL= $$ (NUMBER, WHEN, WHO, WHERE, WHAT)
$$ ##TITLE= Audit trail, XWIN-NMR		Version 3.5
$$ ##JCAMPDX= 5.01
$$ ##ORIGIN= Bruker BioSpin GmbH
$$ ##OWNER= Yarkov
$$ C:/Bruker/XWIN-NMR/data/yarkov2/nmr/H-C/1/pdata/1/auditp.txt
$$ ##AUDIT TRAIL=  $$ (NUMBER, WHEN, WHO, WHERE, WHAT)
(   1,<2026-06-04 10:48:09.95 +0400>,<Yarkov>,<DPX200>,
      <created by zg, POWCHK disabled, PULCHK disabled
       configuration hash MD5:
       00 E9 B6 7A A2 85 ED C7 34 08 36 98 17 FE 4E 26
       data hash MD5: 16K
       74 C5 E7 BA 9E A8 65 75 87 70 55 55 D7 91 55 C2>)
(   2,<2026-06-04 10:48:13.73 +0400>,<Yarkov>,<DPX200>,
      <Start of raw data processing
       efp BC_mod = 2 LB = 0.25 FT_mod = 6 PKNL = 1 PHC0 = -6378.843 PHC1 = 8.221958 SI = 16K 
       data hash MD5: 16K
       8E 8E AE 22 7E B5 AD B0 C9 CD DC 8A EC 1A 56 D5>)
(   3,<2026-06-04 10:49:15.90 +0400>,<Yarkov>,<DPX200>,
      <pk PHC0 = 2.4 PHC1 = 0 
       data hash MD5: 16K
       FC D6 7C 14 36 8B C8 00 2D E0 69 58 DF 33 15 5D>)
$$ ##END=
$$ 
$$ hash MD5
$$ 1D 2E 9A BF 24 30 F3 7F 2A 60 5D 64 56 41 5F E9
##$RELAX= 
##$RELAX= 
##$RELAX= 
##$RELAX= 
##$RELAX= 
##$RELAX= 
$$ Bruker specific parameters
$$ --------------------------
##$DU= <C:/Bruker/XWIN-NMR>
##$EXPNO= 1
##$NAME= <H-C>
##$PROCNO= 1
##$TYPE= <nmr>
##$USER= <yarkov2>
##$AMP= (0..31)
100 100 100 100 100 100 100 100 100 100 100 100 100 100 100 100 100 100 
100 100 100 100 100 100 100 100 100 100 100 100 100 100 
##$AQSEQ= 0
##$AQ_mod= 1
##$AUNM= <au_zg>
##$AUTOPOS= <>
##$BF1= 200.13
##$BF2= 200.13
##$BF3= 200.13
##$BF4= 200.13
##$BF5= 200.13
##$BF6= 200.13
##$BF7= 200.13
##$BF8= 200.13
##$BYTORDA= 1
##$CFDGTYP= 0
##$CFRGTYP= 5
##$CHEMSTR= <none>
##$CNST= (0..31)
1 1 145 1 1 1 1 1 1 1 1 1 1 1 1 1 1 1 1 1 1 1 1 1 1 1 1 1 1 1 1 1 
##$CPDPRG= <>
##$CPDPRG1= <>
##$CPDPRG2= <>
##$CPDPRG3= <>
##$CPDPRG4= <mlev>
##$CPDPRG5= <mlev>
##$CPDPRG6= <mlev>
##$CPDPRG7= <mlev>
##$CPDPRG8= <mlev>
##$CPDPRGB= <>
##$CPDPRGT= <>
##$D= (0..31)
0 0.7 0 0 0 0 0 0 0 0 0 0.03 0 0 0 0 0 0 0 0 0 0 0 0 0 0 0 0 0 0 0 0 
##$DATE= 1780555689
##$DBL= (0..7)
120 120 120 120 120 120 120 120 
##$DBP= (0..7)
150 150 150 150 150 150 150 150 
##$DBP07= 0
##$DBPNAM0= <>
##$DBPNAM1= <>
##$DBPNAM2= <>
##$DBPNAM3= <>
##$DBPNAM4= <>
##$DBPNAM5= <>
##$DBPNAM6= <>
##$DBPNAM7= <>
##$DBPOAL= (0..7)
0.5 0.5 0.5 0.5 0.5 0.5 0.5 0.5 
##$DBPOFFS= (0..7)
0 0 0 0 0 0 0 0 
$$ [...]
##$SUBNAM2= <"">
##$SUBNAM3= <"">
##$SUBNAM4= <"">
##$SUBNAM5= <"">
##$SUBNAM6= <"">
##$SUBNAM7= <"">
##$SUBNAM8= <"">
##$SUBNAM9= <"">
##$SW= 18.0517328524113
##$SWIBOX= (0..15)
0 0 2 0 0 0 0 0 0 0 0 0 0 0 0 0 
##$SW_h= 3612.71676300578
##$TD= 16384
##$TD0= 1
##$TE= 0
##$TE2= 300
##$TE3= 300
##$TEG= 300
##$TL= (0..7)
0 120 120 120 120 120 120 120 
##$TP= (0..7)
150 150 150 150 150 150 150 150 
##$TP07= 0
##$TPNAME0= <>
##$TPNAME1= <>
##$TPNAME2= <>
##$TPNAME3= <>
##$TPNAME4= <>
##$TPNAME5= <>
##$TPNAME6= <>
##$TPNAME7= <>
##$TPOAL= (0..7)
0.5 0.5 0.5 0.5 0.5 0.5 0.5 0.5 
##$TPOFFS= (0..7)
0 0 0 0 0 0 0 0 
##$TUNHIN= 0
##$TUNHOUT= 0
##$TUNXOUT= 0
##$USERA1= <user>
##$USERA2= <user>
##$USERA3= <user>
##$USERA4= <user>
##$USERA5= <user>
##$V9= 5
##$VALIST= <valist>
##$VCLIST= <CCCCCCCCCCCCCCC>
##$VD= 0
##$VDLIST= <DDDDDDDDDDDDDDD>
##$VPLIST= <PPPPPPPPPPPPPPP>
##$VTLIST= <TTTTTTTTTTTTTTT>
##$WBST= 1024
##$WBSW= 4
##$XGAIN= (0..3)
0 0 0 0 
##$XL= 0
##$YL= 0
##$YMAX_a= 551534
##$YMIN_a= -511210
##$ZGOPTNS= <>
##$ZL1= 120
##$ZL2= 120
##$ZL3= 120
##$ZL4= 120
##$ABSF1= 0
##$ABSF2= 0
##$ABSG= 0
##$ABSL= 0
##$ALPHA= 0
##$AQORDER= 0
##$ASSFAC= 0
##$ASSFACI= 0
##$ASSFACX= 0
##$ASSWID= 0
##$AUNMP= <proc_1d>
##$AZFE= 0.1
##$AZFW= 0.1
##$BCFW= 0
##$BC_mod= 2
##$BYTORDP= 0
##$COROFFS= 0
##$CY= -3
##$DATMOD= 1
##$DC= 0
##$DFILT= <>
##$DTYPP= 0
##$F1P= 0
##$F2P= 0
##$FCOR= 1
##$FTSIZE= 16384
##$FT_mod= 6
##$GAMMA= 0
##$GB= 0
##$INTBC= 1
##$INTSCL= 3.241238e-09
##$ISEN= 128
##$LB= 0.25
##$LEV0= 0
##$LPBIN= 0
##$MAXI= 10000
##$MC2= 0
##$MEAN= 0
##$ME_mod= 0
##$MI= 1.114404
##$NCOEF= 0
##$NC_proc= -6
##$NLEV= 6
##$NOISF1= 3.799351
##$NOISF2= 2.8
##$NSP= 0
##$NTH_PI= 0
##$NZP= 0
##$OFFSET= 15.54637
##$PC= 1
##$PHC0= -6376.443
##$PHC1= 8.221958
##$PH_mod= 1
##$PKNL= yes
##$PPARMOD= 0
##$PSCAL= 0
##$PSIGN= 0
##$REVERSE= no
##$SF= 200.129995064368
##$SI= 16384
##$SIGF1= 3
##$SIGF2= 2
##$SINO= 0.751879
##$SIOLD= 32768
##$SREGLST= <19F.Aceton>
##$SSB= 0
##$STSI= 16384
##$STSR= 0
##$SW_p= 3612.71676300578
##$SYMM= 0
##$S_DEV= 0
##$TDeff= 16384
##$TDoff= 0
##$TI= <>
##$TILT= no
##$TM1= 0
##$TM2= 0
##$TOPLEV= 0
##$USERP1= <user>
##$USERP2= <user>
##$USERP3= <user>
##$USERP4= <user>
##$USERP5= <user>
##$WDW= 1
##$XDIM= 16384
##$YMAX_p= 487179847
##$YMIN_p= -1037411
$$ End of Bruker specific parameters
$$ ---------------------------------
##NTUPLES= NMR SPECTRUM
##VAR_NAME=  FREQUENCY,     SPECTRUM/REAL,   SPECTRUM/IMAG
##SYMBOL=    X,             R,               I
##VAR_TYPE=  INDEPENDENT,   DEPENDENT,       DEPENDENT
##VAR_FORM=  AFFN,          ASDF,            ASDF
##VAR_DIM=   16384,         16384,           16384
##UNITS=     HZ,            ARBITRARY UNITS, ARBITRARY UNITS
##FACTOR=    0.220516191357247, 1,           1
##FIRST=     3111.29486183314, 0,            0
##LAST=      -501.421901172639, 0,           0
##MIN=       -501.421901172639, -1037411,    0
##MAX=       3111.29486183314, 487179847,    0
$$ Real data points
##PAGE= N=1
##DATA TABLE= (X++(R..R)), XYDATA
$$ [...]
$$ plain form
7454 418375 345202 265880 265890 400174 326404 328160 345984 277150 207886 238964 354673 370283
7442 370283 376292 356458 277103 287692 388102 465120 405347 353796 337088 279820 433121
7431 433121 361568 356854 389297 445114 488281 467339 551496 528276 469726 442753 345974 373136
7419 373136 396260 376031 324161 231939 319139 375413 502444 658257 662995 712061 634028
7408 634028 507103 478285 452788 473323 399680 474645 513879 452056 500501 452025 479466
7397 479466 538903 513451 454214 406431 385976 351098 447698 400867 360855 380240 448788 562637
7385 562637 383274 380925 454616 425442 528032 530520 456256 419351 479023 512419 545008 640870
7373 640870 759430 751593 630795 648366 559107 604267 578258 526258 500214 325677 245227
$$ packed form
7454D18375p3173p9322J0J34284p3770J756J7824o8834o9264L1078J15709J5610
7442C70283O009j9834p9355J0589J00410P7018n9773n1551j6708n7268J53301
7431D33121p1553m714L2443N5817M3167k0942Q4157k3220n8550k6973r6779K7162
7419C73136K3124k0229n1870r2222Q7200N6274J27031J55813M738M9066p8033
7408F34028j26925k8818k5497K0535p3643P4965L9234o1823M8445m8476K7441
7397D79466N9437k5452n9237m7783k0455l4878R6600m6831m0012J9385O8548J13849
7385E62637j79363k349P3691k9174J02590K488p4264l6905N9672L3396L2589R5862
7373F40870J18560p837j20798J7571q9259M5160k6009n2000k6044j74537q0450
$$ plain form
7362 245227 153639 197359 311345 297509 305459 275917 307648 324779 346039 303159 376606 447069
7350 447069 366236 315743 287187 416453 394477 434042 390067 322062 360942 255263 191466
7339 191466 272276 347191 320113 308946 372027 256434 301968 264861 285453 349009 279775
7328 279775 306883 316356 322233 405803 344177 240217 299209 252782 255990 259245 248256 129236
7316 129236 172906 245158 299323 324466 258553 284447 342528 282253 234829 305284 282545 324076
7304 324076 385677 350065 311537 335897 307842 409118 407689 341352 464653 539638 512413
7293 512413 451928 439324 528013 423745 317060 310762 298849 226329 265594 225779 317094
7282 317094 340702 330929 287135 212827 218553 235519 280199 268125 333877 318592 351705 416894
$$ packed form
7362B45227r1588M3720J13986j3836P950k9542L1731J7131K1260m2880P3447P0463
7350D47069q0833n0493k8556J29266k1976L9565m3975o8005L8880j05679o3797
7339A91466Q0810P4915k7078j1167O3081j15593M5534l7107K0592O3556o9234
7328B79775K7108R473N877Q3570o1626j03960N8992m6427L208L255j0989j19020
7316A29236M3670P2252N4165K5143o5913K5894N8081o0275m7424P0455k2739M1531
7304C24076O1601l5612l8528K4360k8055J01276j429o6337J23301P4985k7225
7293E12413o0485j2604Q8689j04268j06685o298j1913p2520L9265l9815R1315
7282C17094K3608r773m3794p4308N726J6966M4680j2074O5752j5285L3113O5189
$$ plain form
7270 416894 499496 360256 319289 309264 305099 262082 347063 445473 442621 351618 309703 253033
7258 253033 256443 228740 208006 182569 248339 209726 227029 291631 306763 261092 270321 382649
7246 382649 503993 372462 354749 384595 388091 381218 351985 364661 348076 341586 353342 374543
7234 374543 347935 428619 321178 371218 371962 329144 377115 382035 442479 476617 497514 500574
7222 500574 494587 532425 516956 491578 439749 440394 469382 481881 422678 424168 472735 564534
7210 564534 443743 381130 421022 332955 249332 310619 367023 421493 461140 459242 464873 343325
7198 343325 240012 307150 124870 229950 268133 254750 288788 294671 244083 158398 231977
7187 231977 280463 326703 301205 241386 315004 318522 307821 295006 338403 395413 356279 304575
$$ packed form
7270D16894Q2602j39240m0967j0025m165m3017Q4981R8410k852r1003m1915n6670
7258B53033L410k7703k0734k5437O5770l8613J7303O4602J5132m5671R229J12328
7246C82649J21344j31531j7713K9846L496o873k9233J2676j6585o490J1756K1201
7234C74543k6608Q0684j07441N0040P44m2818M7971M920O0444L4138K0897L060
7222E00574n987L7838j5469k5378n1829O45K8988J2499n9203J490M8567R1799
7210E64534j20791o2613L9892q8067q3623O1287N6404N4470L9647j898N631j21548
7198C43325j03313O7138j82280J05080L8183j3383L4038N883n0588q5685P3579
7187B31977M8486M6240k5498n9819P3618L518j0701j2815M3397N7010l9134n1704
$$ plain form
7175 304575 379241 389650 339215 377616 397001 404961 411881 374829 275419 360070 312158 413891
7163 413891 266226 145408 275053 334156 340506 292741 280060 283441 255545 315136 326127
7152 326127 361048 258760 215643 281711 285961 387789 347930 286198 252733 122797 232658
7141 232658 309855 354460 332581 328677 364887 350879 422916 413331 428879 375111 319376 329968
7129 329968 429283 397376 436368 387226 345028 361622 277658 307634 348242 395727 292674
7118 292674 329772 332320 351726 319681 192333 286912 404666 390898 430436 444142 448195 369024
7106 369024 362021 398270 399734 473119 506448 480770 419065 531749 548795 555074 495201 519593
7094 519593 449439 440878 475836 477600 339670 475373 632984 517728 527627 530737 747178
$$ packed form
7175C04575P4666J0409n0435L8401J9385P960O920l7052r9410Q4651m7912J01733
7163D13891j47665j20818J29645N9103O350m7765j2681L381k7896N9591J0991
7152C26127L4921j02288m3117O6068M250J01828l9859o1732l3465j29936J09861
7141B32658P7197M4605k1879l904L6210j4008P2037r585J5548n3768n5735J0592
7129C29968R9315l1907L8992m9142m2198J6594q3964K9976M0608M7485j03053
7118B92674L7098K548J9406l2045j27348R4579J17754j3768L9538J3706M053p9171
7106C69024p003L6249J464P3385L3329k5678o1705J12684J7046O279n9873K4392
7094E19593p0154q561L4958J764j37930J35703J57611j15256R899L110K16441
$$ plain form
7083 747178 700633 602853 596306 510766 527076 494346 514320 530285 607145 623438 565062 531410
7071 531410 551868 531358 509249 529478 496283 539575 470154 391236 445479 547344 422532
7060 422532 429034 423330 423684 565145 528204 433847 343160 306698 371171 425982 558355 536156
7048 536156 554693 530591 438859 464600 558467 586550 484900 477290 362948 314980 276895
7037 276895 276837 316080 249621 297867 191597 265309 308548 337688 373601 300493 264724 209683
7025 209683 221777 271321 268997 259984 342627 354768 377382 335965 341868 372803 356898 391896
7013 391896 337376 243698 298546 263442 355387 407569 383205 371754 336700 318940 393126 271249
7001 271249 178605 305637 323707 354710 424112 367818 427872 423386 388364 401505 365848 407929
$$ packed form
7083G47178m6545r7780o547q5540J6310l2730J9974J5965P6860J6293n8376l3652
7071E31410K0458k0510k2109K0229l3195M3292o9421p8918N4243J01865j24812
7060D22532O502n704L54J41461l6941r4357r0687l6462O4473N4811J32373k2199
7048E36156J8537k4102r1732K5741R3867K8083j01650p610j14342m7968l8085
7037B76895n8L9243o6459M8246j06270P3712M3239K9140L5913p3108l5769n5041
7025B09683J2094M9544k324r013Q2643J2141K2614m1417N903L0935j5905L4998
7013C91896n4520r3678N4848l5104R1945N2182k4364j1451l5054j7760P4186j21877
7001B71249r2644J27032J8070L1003O9402n6294O0054m486l5022J3141l5657M2081
$$ plain form
6989 407929 402151 342227 325002 367137 429787 353543 342731 380488 315736 282105 313760 409738
6977 409738 509411 467365 364331 408430 363919 213933 350038 359115 367971 424071 419306 515418
6965 515418 460255 426899 440353 314564 338998 403681 295946 186816 231954 379372 334864
6954 334864 309086 348152 454007 491939 369333 231213 297443 384921 404567 480954 416146
6943 416146 197527 212232 222651 188717 300607 287793 252902 331150 360109 360649 251415
6932 251415 310855 321897 438461 433127 257702 312718 279354 235314 334493 250794 257716 251181
6920 251181 249952 340187 333559 330849 329137 306787 314072 369701 433175 481381 501578 455212 414687
6907 414687 328720 270012 359407 334842 352099 364585 273027 271973 284303 325458 299733 371367
$$ packed form
6989D07929n778n9924j7225M2135O2650p6244j0812L7757o4752l3631L1655R5978
6977D09738R9673m2046j03034M4099m4511j49986J36105R077Q856N6100m765R6112
6965E15418n5163l3356J3454j25789K4434O4683j07735j09130M5138J47418m4508
6954C34864k5778L9066J05855L7932j22606j38120O6230Q7478J9646P6387o4808
6943D16146k18619J4705J0419l3934J11890j2814l4891P8248K8959N40j09234
6932B51415N9440J1042J16564n334j75425N5016l3364m4040R9179q3699O922o535
6920B51181j229R0235o628k710j712k2350P285N5629O3474M8206K0197m6366m0525
6907D14687q5967n8708Q9395k4565J7257J2486r1558j054J2330M1155k5725P1634
$$ plain form
6895 371367 466540 464217 442684 428025 440940 350931 284392 332040 353011 315358 278480 364391
6883 364391 405369 464752 551943 426532 406146 378417 429100 489696 444358 338558 417958
6872 417958 475111 390442 329104 382471 362409 343052 316505 501610 475838 364531 450380
6861 450380 367322 353952 364130 306846 346606 329257 319082 333277 398589 382487 401428 446618
6849 446618 374961 391505 431644 375383 288463 318929 286977 405166 402254 392670 469885 376742
6837 376742 458335 340836 243631 260980 326432 355333 313766 403208 403205 420587 368896 365219
6825 365219 438241 468169 481923 319441 368521 294068 370301 425933 390872 395077 327449 361384
6813 361384 428816 432182 543455 525840 367057 464979 420211 474030 410186 436632 353452
$$ packed form
6895C71367R5173k323k1533j4659J2915r0009o6539M7648K0971l7653l6878Q5911
6883C64391M0978N9383Q7191j25411k0386k7729N0683O0596m5338j05800P9400
6872D17958N7153q4669o1338N3367k0062j9357k6547J85105k5772j11307Q5849
6861D50380q3058j3370J0178n7284L9760j7349j0175J4195O5312j6102J8941M5190
6849D46618p1657J6544M0139n6261q6920L0466l1952J18189k912r584P7215r3143
6837C76742Q1593j17499r7205J7349O5452K8901m1567Q9442lJ7382n1691l677
6825C65219P3022K9928J3754j62482M9080p4453P6233N5632l5061M205o7628L3935
6813C61384O7432L366J11273j7615j58783R7922m4768N3819o3844K6446q3180
$$ plain form
6802 353452 373081 376344 381944 495383 517853 416926 428911 449177 522167 485111 346149
6791 346149 444566 456377 456837 399436 588733 604247 578557 515115 469323 476351 432396 478033
6779 478033 448123 438400 408106 494478 573560 546822 563560 589415 572171 596870 470919 544526
6767 544526 523356 464744 506998 509967 484519 398771 345101 513877 602388 591338 557560 501857
6755 501857 514514 461037 509330 544352 577407 630199 569839 512092 494864 507579 484847 510131
6743 510131 498136 566517 644124 699063 590894 559457 511532 456332 399600 410772 516251
6732 516251 479369 406050 495690 515199 503910 568109 485075 485872 574309 574306 518315 453138 524453
6719 524453 539591 462215 451196 495599 552650 482777 529444 619924 644310 592279 514664 543203
$$ packed form
6802C53452J9629L263N600J13439K2470j00927J1985K0266P2990l7056j38962
6791C46149R8417J1811M60n7401J89297J5514k5690o3442m5792P028m3955M5637
6779D78033k9910r723l0294Q6372P9082k6738J6738K5855j7244K4699j25951P3607
6767E44526k1170n8612M2254K969k5448q5748n3670J68776Q8511j1050l3778n5703
6755E01857J2657n3477M8293L5022L3055N2792o0360n7747j7228J2715k2732K5284
6743E10131j1995O8381P7607N4939j08169l1437m7925n5200n6732J1172J05479
6732E16251l6882p3319Q9640J9509j1289O4199q3034P97Q8437ln5991o5177P1315
6719E24453J5138p7376j1019M4403N7051o9873M6667R0480K4386n2031p7615K8539
$$ plain form
6707 543203 565025 606896 656126 568346 635441 659149 632056 652039 688318 610211 625756 744646
6695 744646 879056 838142 829324 830279 785765 730433 637565 529623 536311 597359 569748 439572
6683 439572 484134 505697 542763 580692 566164 437494 370033 434190 457039 484614 602285
6672 602285 479898 491252 623516 613464 562575 583944 518408 531448 501455 491151 458731
6661 458731 536537 513950 565002 546450 465647 535216 565207 521796 470266 476698 463406 491863
6649 491863 564899 521010 454829 659062 692425 662774 537286 625484 575982 603117 577057
6638 577057 546313 546563 624756 606666 528588 467382 483185 549271 651428 646818 612572 597408
6626 597408 572045 538976 453751 483107 570741 651688 700549 800671 756225 839239 937490
$$ packed form
6707E43203K1822M1871M9230q7780O7095K3708k7093J9983L6279p8107J5545J18890
6695G44646J34410m0914q818R55m4514n5332r2868j07942O688O1048k7611j30176
6683D39572M4562K1563L7066L7929j4528j28670o7461O4157K2849K7575J17671
6672F02285j22387J1354J32264j0052n0889K1369o5536J3040k9993j0304l2420
6661D58731P7806k2587N1052j8552q0803O9569K9991m3411n1530O432j3292K8457
6649D91863P3036m3889o6181K04233L3363k9651j25488Q8198m9502K7135k6060
6638E77057l0744K50P8193j8090p8078o1206J5803O6086J02157m610l4246j5164
6626E97408k5363l3069q5225K9356Q7634Q0947M8861J00122m4446Q3014R8251
$$ plain form
6615 937490 839963 792500 749489 832107 826046 830693 787761 822655 787804 800864 683661 691265
6603 691265 785900 753469 801096 817493 828373 705164 683165 757837 684315 692403 672385 642465
6591 642465 781393 793521 830232 774210 757334 823736 928804 965136 916879 915428 968288
6580 968288 911387 916342 870650 899257 916683 886629 923404 944019 1043621 996194 925472 906302
6568 906302 833418 829071 813175 794393 949889 1068380 1051780 873769 763764 812559 1021852
6557 1021852 1174166 1036238 977883 892036 925633 912421 937279 1028897 909534 914606 894085
6546 894085 837998 876792 930736 966695 944496 999446 1060451 907495 917083 926659 989614 858918
6534 858918 823671 863729 793440 826786 799832 858966 917276 907289 890467 796117 906766 1006653
$$ packed form
6615I37490r7527m7463m3011Q2618o061M647m2932L4894l4851J3060j17203P604
6603F91265R4635l2431M7627J6397J0880j23209k1999P4672p3522Q088k0018k9920
6591F42465J38928J2128L6711n6022j6876O6402J05068L6332m8257j451N2860
6580I68288n6901M955m5692K8607J7426l0054L6775K0615R9602m7427p0722j9170
6568I06302p2884m347j5896j8782J55496J18491j6600j78011j10005M8795K09293
6557A021852J52314j37928n8355q5847L3597j3212K4858R1618j19363N072k0521
6546H94085n6087L8794N3944L5959k2199N4950O1005j52956R588R576O2955j30696
6534H58918l5247M0058p0289L3346k6954N9134N8310r987j6822r4350J10649R9887
$$ plain form
6522 1006653 918253 813471 714454 796114 881865 927334 937764 977328 1018238 943926 1075289
6511 1075289 1204783 1172707 1141508 1101874 1016619 990803 1069205 1082878 1147142 1122486 1143339
6500 1143339 1120786 1117561 1128336 1266229 1318256 1257249 1210482 1180372 1283680 1335344 1356507
6489 1356507 1255557 1220380 1244401 1202857 1311566 1305994 1196924 1111927 1066706 1075086 1063027
6478 1063027 1115021 1121225 1119426 1100416 1085438 1202065 1099305 1198807 1306887 1243053 1225694
6467 1225694 1142118 1219870 1275703 1151167 1038631 1018588 1095277 993741 1007404 1031231 937148
6456 937148 931396 868361 922236 994928 964783 911312 995731 997128 931407 1008378 1145741 1194321
6444 1194321 1279893 1282916 1305755 1334424 1311136 1317408 1251127 1305680 1268208 1160193 1155886 1260164
$$ packed form
6522A006653q8400j04782r9017Q1660Q5751M5469J0430L9564M0910p4312J31363
6511A075289J29494l2076l1199l9634q5255k5816P8402J3673O4264k4656K0853
6500A143339k2553l225J0775J37893N2027o1007m6767l0110J03308N1664K1163
6489A356507j00950l5177K4021m1544J08709n572j09070q4997m5221Q380j2059
6478A063027N1994O204j799j9010j4978J16627j02760R9502J08080o3834j7359
6467A225694q3576P7752N5833j24536j12536k0043P6689j01536J3663K3827r4083
6456I37148n752o3035N3875P2692l0145n3471Q4419J397o5721P6971J37363M8580
6444A194321Q5572L023K2839K8669k3288O272o6281N4553l7472j08015m307J04278
$$ plain form
6432 1260164 1383796 1469231 1478905 1535393 1390090 1496867 1543406 1463375 1496755 1490955 1549318
6421 1549318 1524135 1430436 1446953 1439844 1390941 1316798 1313378 1362502 1357983 1436056 1398978 1418839
6409 1418839 1474550 1497842 1660271 1711769 1659627 1595927 1508362 1478537 1490443 1415859 1395014
6398 1395014 1394290 1239172 1327268 1258693 1221745 1274893 1226901 1293308 1210719 1160378 1169262 1162201
6386 1162201 1253200 1347157 1271762 1235383 1344609 1248007 1307613 1399338 1397990 1392784 1527308
6375 1527308 1538829 1492234 1382753 1397575 1367807 1287711 1329161 1413403 1468846 1485219 1513053
6364 1513053 1473975 1411971 1426733 1471566 1455926 1511260 1513345 1460176 1452507 1556597 1640231 1636334
6352 1636334 1719697 1646742 1749420 1741307 1821923 1923219 2011772 2017927 1932249 2020668 2089080
$$ packed form
6432A260164J23632Q5435R674N6488j45303J06777M6539q0031L3380n800N8363
6421A549318k5183r3699J6517p109m8903p4143l420M9124m519P8073l7078J9861
6409A418839N5711K3292J62429N1498n2142o3700q7565k9825J1906p4584k0845
6398A395014p24j55118Q8096o8575l6948N3148m7992O6407q2589n0341Q884p061
6386A162201R0999R3957p5395l6379J09226r6602N9606R1725j348n206J34524
6375A527308J1521m6595j09481J4822k9768q0096M1450Q4242N5443J6373K7834
6364A513053l9078o2004J4762M4833j5640N5334K085n3169p669J04090Q3634l897
6352A636334Q3363p2955J02678q113Q0616J01296Q8553O155q5678Q8419O8412
$$ plain form
6341 2089080 2138723 2185080 2250866 2242909 2183739 2253951 2420987 2412092 2495952 2605330 2654635
6330 2654635 2717968 2710298 2637693 2615432 2651804 2667596 2688779 2699442 2674009 2823458 2996034
6319 2996034 3040938 2922561 2795769 2785206 2867609 2898686 2905368 2879911 2852725 2960254 3048326
6308 3048326 3036989 3060072 3066534 3147773 3152795 3232146 3243560 3328749 3275738 3164672 3251535 3385242
6296 3385242 3460559 3612470 3759537 3747135 3763922 3731629 3907308 4170226 4348477 4578612
6286 4578612 4841641 5022690 5267209 5848320 6425782 6946232 7698664 8652418 9935828
6277 9935828 11826314 14408542 17651221 20892143 23478598 25039464 25126639 24118002 22509474
6268 22509474 20505186 18388145 16330604 14935970 14040180 13527039 13780955 14750321 16703266
$$ packed form
6341B089080M9643M6357O5786p957n9170P0212J67036q895Q3860J09378M9305
6330B654635O3333p670p2605k2261L6372J5792K1183J0663k5433J49449J72576
6319B996034M4904j18377j26792j0563Q2403L1077O682k5457k7186J07529Q8072
6308C048326j1337K3083O462Q1239N022P9351J1414Q5189n3011j11066Q6863J33707
6296C385242P5317J51911J47067j2402J6787l2293J75679K62918J78251K30135
6286D578612K63029J81049K44519N81111N77462N20450P52432R53754J283410
6277I935828J890486K582228L242679L240922K586455J560866Q7175j008637j608528
6268B2509474k004288k117041k057541j394634q95790n13141K53916R69366J952945
$$ plain form
6259 16703266 19444265 22516127 24895769 26378035 26475584 25194457 23128086 20510920
6251 20510920 17845144 15354944 13260648 11480306 9989155 8773480 8000307 7380257
6243 7380257 6965136 6577373 6340741 6180929 6081023 5978784 5851991 5946913 5907228 5889807
6233 5889807 5852063 5883383 5970346 6055178 6202456 6386626 6547305 6573985 6746302 7004419
6223 7004419 7208045 7477423 7767828 8022157 8379529 8763143 9197712 9814187 10472876 11222465
6213 11222465 12146396 13262680 14566396 16154732 18015874 20559585 24251432 29234931
6205 29234931 36007906 44039033 52122478 58581612 62206647 62444734 59770442 55404924
6197 55404924 50164693 44757997 39867420 36116207 33570651 32347174 32789618 35486383
$$ packed form
6259A6703266K740999L071862K379642J482266R7549j281127k066371k617166
6251B0510920k665776k490200k094296j780342j491151j215675p73173o20050
6243G380257m15121l87763k36632j59812r9906j02239j26793R4922l9685j7421
6233E889807l7744L1320Q6963Q4832J47278J84170J60679K6680J72317K58117
6223G004419K03626K69378K90405K54329L57372L83614M34569O16475O58689P49589
6213A1222465R23931J116284J303716J588336J861142K543711L691847M983499
6205B9234931O772975Q031127Q083445O459134L625035K38087k674292m365518
6197E5404924n240231n406696m890577l751213k545556j223477M42444K696765
$$ plain form
6189 35486383 40369978 46990612 54017510 59766125 62970342 62855576 59779255 54517850
6181 54517850 48105903 41358402 34849003 29229196 24515520 20750469 17709013 15318576
6173 15318576 13511834 12118857 10937495 10041577 9328589 8770758 8380408 7952145 7641538
6164 7641538 7402969 7139071 7047088 6810955 6574878 6603852 6631262 6551259 6396476 6357559
6154 6357559 6303818 6359803 6233430 6178836 6201649 6355036 6332890 6408590 6542522 6664564 6866995
6143 6866995 7024200 7140825 7309471 7498406 7669926 7854267 8091404 8344564 8581312 9035003
6133 9035003 9370787 9949002 10551324 11491624 12567043 13758791 15175212 16929049 19450169
6124 19450169 22918540 27758466 34189529 42001424 49921169 56204741 59835418 60112024
$$ packed form
6189C5486383M883595O620634P026898N748615L204217j14766l076321n261405
6181E4517850o411947o747501o509399n619807m713676l765051l041456k390437
6173A5318576j806742j392977j181362q95918p12988n57831l90350m28263l10607
6164G641538k38569k63898r1983k36133k36077K8974K7410q0003j54783l8917
6154F357559n3741N5985j26373n4594K2813J53387k2146P5700J33932J22042K02431
6143F866995J57205J16625J68646J88935J71520J84341K37137K53160K36748M53691
6133I035003L35784N78215O02322R40300J075419J191748J416421J753837K521120
6124A9450169L468371M839926O431063P811895P919745O283572L630677K76606
$$ plain form
6116 60112024 57536857 52936486 47115869 41046503 35468655 30734168 26986820 24317799
6108 24317799 22686392 21785995 21692396 22447242 24193440 27227317 31976036 38640577 46562269
6099 46562269 53989103 59463798 61802260 60720095 56890716 51140074 44495552 37835184
6091 37835184 31795909 26511645 22161491 18667369 15890828 13811294 12339646 11147830
6083 11147830 10157387 9439972 8791591 8229358 7823839 7433325 7106336 6824490 6577057
6074 6577057 6379650 6257346 6178532 6105321 5919108 5907768 5846530 5675229 5569724 5590988
6064 5590988 5588796 5626232 5730482 5915978 6134032 6208917 6530895 6974014 7451342 8271480
6054 8271480 9106394 10394384 12274010 14836096 17860552 20856419 23412864 24669390
$$ packed form
6116F0112024k575167m600371n820617o069366n577848m734487l747348k669021
6108B4317799j631407r00397r3599P54846J746198L033877M748719O664541P921692
6099D6562269P426834N474695K338462j082165l829379n750642o644522o660368
6091C7835184o039275n284264m350154l494122k776541k079534j471648j191816
6083A1147830r90443p17415o48381n62233m05519l90514l26989k81846k47433
6074F577057j97407j22304p8814p3211j86213j1340o1238j71301j05505K1264
6064E590988k192L7436J04250J85496K18054P4885L21978M43119M77328Q20138
6054H271480Q34914J287990J879626K562086L024456K995867K556445J256526
$$ plain form
6046 24669390 24669659 23627072 21814451 19549385 17119749 15105063 13308542 11864534 10930889
6037 10930889 10313036 9974076 9994702 10362145 11073768 12243703 14304183 16962431 20006515
6028 20006515 23043169 25189620 26035137 25480474 23755469 21328781 18661152 16078766
6020 16078766 13686440 11534624 9797654 8495137 7450279 6642595 6056063 5597287 5078228
6011 5078228 4832647 4485593 4201587 4182170 4013141 3839291 3683316 3504482 3389034 3276764
6001 3276764 3131958 3026918 2897741 2927777 2750998 2682061 2647954 2696517 2667860 2604417 2627402
5990 2627402 2611389 2546724 2412295 2440120 2524835 2380370 2315576 2352829 2317873 2251189 2252781
5979 2252781 2286345 2225227 2257855 2332093 2307015 2346398 2383027 2343687 2247251 2294226 2246532
$$ packed form
6046B4669390K69j042587j812621k265066k429636k014686j796521j444008r33645
6037A0930889o17853l38960K0626L67443P11623J169935K060480K658248L044084
6028B0006515L036654K146451Q45517n54663j725005k426688k667629k582386
6020A6078766k392326k151816j736970j302517j044858q07684n86532m58776n19059
6011E078228k45581l47054k84006j9417j69029j73850j55975j78834j15448j12270
6001C276764j44806j05040j29177L0036j76779o8937l4107M8563k8657o3443K2985
5990B627402j6013o4665j34429K7825Q4715j44465o4794L7253l4956o6684J592
5979B252781L3564o1118L2628P4238k5078L9383L6629l9340r6436M6975m7694
$$ plain form
5968 2246532 2299825 2287248 2359938 2431703 2452848 2411509 2524517 2540819 2472951 2494424 2368015
5957 2368015 2321353 2268863 2194406 2272758 2375044 2427748 2511599 2438083 2497525 2435847 2368731
5946 2368731 2378162 2475659 2390760 2366617 2388595 2373417 2191472 2163718 2159089 2179704 2149138 2160084
5934 2160084 2275805 2230248 2127468 2076020 1990544 1834985 1778540 1784911 1843992 1786750 1772159
5923 1772159 1791194 1786155 1729388 1657182 1639184 1587853 1503079 1421159 1438956 1429582 1369754 1490878
5911 1490878 1440820 1454191 1468682 1468428 1386046 1347915 1392218 1392929 1481224 1399921 1323780 1313916
5899 1313916 1278967 1412897 1437455 1349463 1364577 1399968 1484351 1545483 1537779 1549801 1575787
5888 1575787 1685823 1698540 1680786 1615396 1573561 1577891 1497317 1561093 1543077 1539655 1545129 1524330
$$ packed form
5968B246532N3293j2577P2690P1765K1145m1339J13008J6302o7868K1473j26409
5957B368015m6662n2490p4457P8352J02286N2704Q3851p3516N9442o1678o7116
5946B368731R431R7497q4899k4143K1978j5178j81945k7754m629K0615l0566J0946
5934B160084J15721m5557j02780n1448q5476j55559n6445O371N9081n7242j4591
5923A772159J9035n039n6767p2206j7998n1331q4774q1920J7797r374n9828J21124
5911A490878n0058J3371J4491k54q2382l8131M4303P11Q8295q1303p6141r864
5899A313916l4949J33930K4558q7992J5114L5391Q4383O1132p704J2022K5986
5888A575787J10036J2717j7754o5390m1835M330q0574O3776j8016l422N474k0799
$$ plain form
5876 1524330 1546005 1596233 1627723 1727928 1763036 1762195 1663658 1661146 1656777 1594269 1626901 1613101
5864 1613101 1556363 1565713 1655007 1628962 1613685 1604986 1608130 1544999 1526887 1599533 1731641 1683136
5852 1683136 1728974 1730622 1624252 1629497 1561958 1579615 1639394 1634681 1581939 1634247 1620026 1500621
5840 1500621 1575420 1620350 1673448 1790291 1847211 1846042 1944842 1967347 1889656 1832919 1951245
5829 1951245 2020066 1972514 1985453 1879088 1961017 1886044 1851335 1950259 1947606 1949277 1826018
5818 1826018 1758215 1872820 1971435 1870620 1889758 1984345 1918845 1973172 1957682 1966507 2103439
5807 2103439 2186589 2228727 2319384 2264842 2203363 2170579 2122173 2120366 2019544 2055989 1981950
5796 1981950 1947708 1855785 1901364 1963418 1843469 1867082 2004178 2081939 2029536 2101254 2204722
$$ packed form
5876A524330K1675N0228L1490J00205L5108q41r8537k512m369o2508L2632j3800
5864A613101n6738R350Q9294k6045j5277q699L144o3131j8112P2646J32108m8505
5852A683136M5838J648j06370N245o7539J7657N9779m713n2742N2308j4221j19405
5840A500621P4799M4930N3098J16843N6920j169R8800K2505p7691n6737J18326
5829A951245O8821m7552J2939j06365Q1929p4973l4709R8924k653J671j23259
5818A826018o7803J14605R8615j00815J9138R4587o5500N4327j5490Q825J36932
5807B103439Q3150M2138R0657n4542o1479l2784m8406j807j00822L6445p4039
5796A981950l4242r1923M5579O2054j19949K3613J37096P7761n2403P1718J03468
$$ plain form
5785 2204722 2218738 2301913 2438929 2424591 2453712 2380074 2332276 2304849 2427732 2486161 2466040
5774 2466040 2452586 2285975 2294823 2294472 2406964 2424677 2350749 2348106 2312048 2419762 2358990 2407178
5762 2407178 2406041 2301658 2298730 2255964 2195301 2164083 2184634 2088404 2037590 2020864 2162860
5751 2162860 2117053 2037231 1987838 1900662 1906560 1877437 1890881 1743111 1801246 1834742 1879917
5740 1879917 1882995 1872637 1871860 1827513 1873325 1862057 1941191 2097850 2055399 2011381 2010368 2009164
5728 2009164 1999625 1901106 1887839 1929968 1917446 1921518 2035357 1913519 1857108 2004911 2010080
5717 2010080 1979855 1986452 1961000 2061090 2013681 1998704 2056046 2085217 2193769 2195055 2272293
5706 2272293 2229057 2190624 2162983 2175271 2186713 2126614 2079650 2042838 2072236 2116589 2140953
$$ packed form
5785B204722J4016Q3175J37016j4338K9121p3638m7798k7427J22883N8429k0121
5774B466040j3454j66611Q848l51J12492J7713p3928k643l6058J07714o0772M8188
5762B407178j137j04383k928m2766o0663l1218K0551r6230n0814j6726J41996
5751B162860m5807p9822m9393q7176N898k9123J3444j47770N8135L3496M5175
5740A879917L078j0358p77m4347M5812j1268P9134J56659m2451m4018j013j204
5728B009164r539r8519j3267M2129j2522M072J13839j21838n6411J47803N169
5717B010080l0225O597k5452J00090m7409j4977N7342K9171J08552J286P7238
5706B272293m3236l8433k7641J2288J1442o0099m6964l6812K9398M4353K4364
$$ plain form
5695 2140953 2162720 2116921 2166817 2125833 2146753 2161616 2166035 2268356 2280129 2186441 2262097
5684 2262097 2263993 2203158 2136945 2143981 2136216 2119283 2329118 2327586 2335005 2361718 2302860 2275669
5672 2275669 2220295 2105462 2095444 2079312 2113022 2206657 2313194 2276333 2397182 2433721 2398878
5661 2398878 2244474 2304693 2306155 2311676 2318716 2426358 2468357 2551043 2582131 2473542 2477505 2465515
5649 2465515 2387889 2485084 2502151 2336043 2391413 2465618 2450607 2393429 2444534 2454164 2485075
5638 2485075 2485563 2541735 2578097 2485453 2647677 2646045 2570333 2469506 2427450 2398140 2336875 2266079
5626 2266079 2187291 2300833 2293301 2306818 2272318 2262913 2168090 2007126 1968879 1965338 1963918 1981035
5614 1981035 1906810 1900256 2108409 2078008 2165289 2362433 2420805 2463090 2454089 2566507 2626610
$$ packed form
5695B140953K1767m5799M9896m0984K0920J4863M419J02321J1773r3688P5656
5684B262097J896o0835o6213P036p765j6933K09835j532P419K6713n8858k7191
5672B275669n5374j14833j0018j6132L3710R3635J06537l6861J20849L6539l4843
5661B398878j54404O0219J462N521P040J07642M1999Q2686L1088j08589L963j1990
5649B465515p7626R7195J7067j66108N5370P4205j5011n7178N1105R630L0911
5638B485075M88N6172L6362r2644J62224j632p5712j00827m2056k9310o1265p0796
5626B266079p8788J13542p532J3517l4500r405r4823j60964l8247l541j420J7117
5614A981035p4225o554K08153l0401Q7281J97144N8372M2285r001J12418O0103
$$ plain form
5603 2626610 2624280 2542234 2487819 2449591 2571726 2523711 2480854 2390526 2371359 2266665 2257282
5592 2257282 2099479 1997616 1906957 1870623 1972163 2006210 2026758 1921865 2021655 2118625 2014664
5581 2014664 1950866 2064290 2048675 2062227 2200652 2246641 2278812 2231637 2255067 2267840 2292874
5570 2292874 2289268 2152440 2166810 2204979 2216714 2185874 2177916 2139563 2124232 2077042 2073414 2177524
5558 2177524 2159246 2131228 2110005 2081568 1985958 2047644 2152588 2183076 2190222 2043946 2072521
5547 2072521 2139237 2192962 2344162 2352254 2264826 2264044 2140043 2102102 2210677 2264081 2222868
5536 2222868 2131923 2194996 2143777 2205377 2286034 2282075 2259143 2215774 2258871 2242352 2212818 2188762
5524 2188762 2168699 2247280 2312268 2345374 2334285 2253169 2216582 2310934 2316556 2301990 2264710 2327378
$$ packed form
5603B626610k330q2046n4415l8228J22135m8015m2857r0328j9167j04694r383
5592B257282j57803j01863r0659l6334J01540L4047K0548j04893R9790R6970j03961
5581B014664o3798J13424j5615J3552J38425M5989L2171m7175K3430J2773K5034
5570B292874l606j36828J4370L8169J1735l0840p958l8353j5331m7190l628J04110
5558B177524j8278k8018k1223k8437r5610O1686J04944L0488P146j46276K8575
5547B072521O6716N3725J51200Q092q7428p82j24001l7941J08575N3404m1213
5536B222868r0945O3073n1219O1600Q0657l959k2932m3369M3097j6519k9534k4056
5524B188762k0063P8581O4988L3106j1089q1116l6587R4352N622j4566l7280O2668
$$ plain form
5512 2327378 2352994 2424706 2512103 2460726 2502237 2439001 2517727 2556496 2592128 2546324 2672099
5501 2672099 2663010 2685180 2731394 2693660 2699736 2799262 2921336 2987288 2889479 2964953 2911684 2855888
5489 2855888 2755998 2687553 2674775 2671608 2759848 2653866 2537286 2662766 2820717 2917104 3017877
5478 3017877 2961706 2948143 2885218 3005891 2977367 3054022 3156769 3206751 3244561 3376154 3490088
5467 3490088 3586256 3647970 3739696 3698545 3626237 3627165 3506485 3475546 3442548 3369084 3374739 3382984
5455 3382984 3417524 3562784 3556003 3652002 3734256 3717140 3882122 4005945 4043801 4114073 4061669
5444 4061669 3968077 4002566 3929345 3902163 3904145 3973792 3956881 3887954 3900808 3886208 3900889 3986838
5432 3986838 3997689 4089381 4196576 4403972 4482999 4442869 4472214 4580603 4605670 4786038 4986453
$$ packed form
5512B327378K5616P1712Q7397n1377M1511o3236P8726L8769L5632m5804J25775
5501B672099r089K2170M6214l7734O076R9526J22074O5952r7809P5474n3269n5796
5489B855888r9890o8445j2778l167Q8240j05982j16580J25480J57951R6387J00773
5478C017877n6171j3563o2925J20673k8524P6655J02747M9982L7810J31593J13934
5467C490088R6168O1714R1726m1151p2308R28j20680l0939l2998p3464N655Q245
5455C382984L4540J45260o781R5999Q2254j7116J64982J23823L7856P0272n2404
5444D061669r3592L4489p3221k7182J982O9647j6911o8927J2854j4600J4681Q5949
5432C986838J0851R1692J07195K07396P9027m0130K9345J08389K5067J80368K00415
$$ plain form
5421 4986453 5004587 4997618 5015444 4939444 4809975 4771380 4681462 4746826 4701635 4754577 4733949
5410 4733949 4757104 4812761 4896768 4965010 5002958 5081905 5110028 5212096 5184446 5112661 5254356
5399 5254356 5204667 5321619 5439380 5511314 5586880 5742226 5823617 5872667 5936526 5984044 6105081
5388 6105081 6159647 6304038 6407428 6469239 6636078 6702604 6822622 6895570 6950235 7054894
5378 7054894 7186588 7238752 7162076 7273968 7346709 7451616 7688507 7825014 7917126 8052580
5368 8052580 8306515 8431482 8620505 8850655 9042800 9374376 9685147 9901741 10091765 10279641
5358 10279641 10473307 10765934 10978206 11087485 11405977 11676776 11865831 12225944 12726334
5349 12726334 13205717 13694340 14271036 15057113 16184060 17528766 19643360 22728628 26547471
$$ packed form
5421D986453J8134o969J7826p6000j29469l8595q9918O5364m5191N2942k0628
5410D733949K3155N5657Q4007O8242L7948P8947K8123J02068k7650p1785J41695
5399E254356m9689J16952J17761P1934P5566J55346Q1391M9050O3859M7518J21037
5388F105081N4566J44391J03390O1811J66839O6526J20018P2948N4665J04659
5378G054894J31694N2164p6676J11892P2741J04907K36891J36507R2112J35454
5368H052580K53935J24967J89023K30150J92145L31576L10771K16594J90024J87876
5358A0279641J93666K92627K12272J09279L18492K70799J89055L60113N00390
5349A2726334M79383M88623N76696P86077J126947J344706K114594L085268L818843
$$ plain form
5340 26547471 30169648 32949660 35515252 38028985 40070514 41181882 40872698 39572512
5332 39572512 37735483 35536684 33255858 30934607 29170707 27912966 27004470 26699307
5324 26699307 26974096 27849309 29043714 30640966 32657957 35560163 40101886 47163171
5316 47163171 57003901 67622647 76498798 83633104 89978106 95585036 98512368 98347869
5308 98347869 96557634 94440925 91302875 86566372 80844942 74944431 69632308 65491239
5300 65491239 63646776 64751452 69325916 74877770 80265610 85852991 92845287 101079405
5292 101079405 108946274 114341356 117203839 120545305 126726656 138230656 151153564 163402363
5284 163402363 172531056 178331488 180691607 182087093 182919848 183582270 182833955 178263756
$$ packed form
5340B6547471L622177K780012K565592K513733K041529J111368l09184j300186
5332C9572512j837029k198799k280826k321251j763900j257741r08496l05163
5324B6699307K74789Q75213J194405J597252K016991K902206M541723P061285
5316D7163171R840730J0618746Q876151P134306O345002N606930K927332j64499
5308I8347869j790235k116709l138050m736503n721430n900511n312123m141069
5300F5491239j844463J104676M574464N551854N387840N587381O992296Q234118
5292A01079405P866869N395082K862483L341466O181351J1504000J2922908J2248799
5284A63402363R128693N800432K360119J395486Q32755O62422p48315m570199
$$ plain form
5276 178263756 169047187 155188800 139046120 122294570 107072290 94029214 84944005
5269 84944005 79902193 79736203 83019581 88132668 91979509 94485424 95734081 97263551
5261 97263551 98349589 98487515 97750201 96739948 94994810 92203437 88563538 84942077
5253 84942077 82580608 82057383 82699817 83081460 82582894 81164906 79722524 78168736 76639419
5244 76639419 74997022 74120273 74484119 76157357 76848702 75294435 71619711 66679195 61269714
5235 61269714 56293787 52546637 50034703 48664333 48184598 48164899 48490521 48108193 47076710
5226 47076710 45514881 43637926 41687494 39219174 36376287 33440497 30573867 27914361
5218 27914361 25539789 23680552 22454413 21807311 21757558 22199899 22853350 23155077 22952448
$$ packed form
5276A78263756r216569j3858387j6142680j6751550j5222280j3043076r085209
5269H4944005n041812j65990L283378N113087L846841K505915J248657J529470
5261I7263551J086038J37926p37314j010253j745138k791373l639899l621461
5253H4942077k361469n23225O42434L81643m98566j417988j442382j553788j529317
5244G6639419j642397q76749L63846J673238O91345j554267l674724m940516n409481
5235F1269714m975927l747150k511934j370370m79735j9699L25622l82328j031483
5226D7076710j561829j876955j950432k468320k842887k935790k866630k659506
5218B7914361k374572j859237j226139o47102m9753M42341O53451L01727k02629
$$ plain form
5209 22952448 22100602 20861200 19536541 18012153 16645148 15472048 14508024 13653962 13034443
5200 13034443 12599396 12368128 12121338 11875800 11834798 11721467 11616422 11649758 11819590 11894768
5190 11894768 12073066 12125518 12302681 12370792 12346876 12439493 12582092 12639866 12772567 12860856
5180 12860856 13075761 13510764 13938763 14410197 14897391 15372517 16082021 17044594 18411214
5171 18411214 20114130 22609020 26295532 31764956 38103996 45252018 53703003 63673388
5163 63673388 73199173 80016508 82099787 79260746 73035096 64621520 55523834 46745850
5155 46745850 39250290 33088357 28353609 24824852 22293770 20627594 19524934 18846392
5147 18846392 18635575 18373644 18336992 18398937 18562825 18706529 18981582 19615758 20706280 22595906
$$ packed form
5209B2952448q51846j239402j324659j524388j367005j173100r64024q54062o19519
5200A3034443m35047k31268k46790k45538m1002j13331j05045L3336J69832P5178
5190A1894768J78298N2452J77163O8111k3916R2617J42599N7774J32701Q8289
5180A2860856K14905M35003M27999M71434M87194M75126P09504R62573J366620
5171A8411214J702916K494890L686512N469424O339040P148022Q450985R970385
5163F3673388R525785O817335K083279k839041o225650q413576r097686q777984
5155D6745850p495560o161933m734748l528757k531082j666176j102660o78542
5147A8846392k10817k61931l6652O1945J63888J43704K75053O34176J090522J889626
$$ plain form
5137 22595906 25531770 28847692 31603389 33347950 34281208 34734727 35025471 35878403 38032415
5128 38032415 42200103 48177359 55894368 66805851 80877863 94101599 101623008 102242184
5120 102242184 97484691 89642917 80547777 72211561 65247078 60122708 56184097 53484232
5112 53484232 52649972 55035530 62379161 73535490 84183662 90650578 91961145 89094011
5104 89094011 82945701 74491829 65273261 56478824 48793073 42522767 37967502 35039444
5096 35039444 33057668 31488853 29821142 27992661 26315242 24754183 23366002 22210263
5088 22210263 21283359 20454268 20004448 19619447 19440564 19344663 19465671 19539362 19789438 20287726
5078 20287726 20984545 21837841 22906674 24249964 26060640 28426246 31935590 36896674
$$ packed form
5137B2595906K935864L315922K755697J744561R33258M53519K90744Q52932K154012
5128C8032415M167688N977256P717009J0911483J4072012J3223736P521409O19176
5120A02242184m757493p841774r095140q336216o964483n124370l938611k699865
5112E3484232q34260K385558P343631J1156329J0648172O466916J310567k867134
5104H9094011o148310q453872r218568q794437p685751o270306m555265k928058
5096C5039444j981776j568815j667711j828481j677419j561059j388181j155739
5088B2210263r26904q29091m49820l85001j78883r5901J21008P3691K50076M98288
5078B0287726O96819Q53296J068833J343290J810676K365606L509344M961084
$$ plain form
5070 36896674 44875228 55674073 68084371 79125551 85805732 88581907 88890305 88850018
5062 88850018 88217233 86191702 81968859 76422247 69538447 62966704 57323703 53813704
5054 53813704 52620825 54494584 58647734 63872005 68895717 73294938 79186949 88521939
5046 88521939 100347440 109258052 112881724 111447908 107680336 102657344 96575016 90467001
5038 90467001 85221103 80158042 74353374 68796297 64412785 61988727 60854893 60103233
5030 60103233 59984032 60894385 61815917 62519778 63665456 66437221 68926548 68460244 65012241
5021 65012241 59322760 52674192 45466854 38681474 32538511 27755038 23785643 20833078
5013 20833078 18429021 16704655 15464051 14534237 13803738 13254514 12736781 12346962 11961245
$$ packed form
5070C6896674P978554J0798845J2410298J1041180O680181K776175L08398m0287
5062H8850018o32785k025531m222843n546612o883800o571743n643001l509999
5054E3813704j192879J873759M153150N224271N023712M399221N892011R334990
5046H8521939J1825501Q910612L623672j433816l767572n022992o082328o108015
5038I0467001n245898n063061n804668n557077m383512k424058j133834p51660
5030F0103233j19201R10353R21532P03861J145678K771765K489327m66304l448003
5021F5012241n689481o648568p207338o785380o142963m783473l969395k952565
5013B0833078k404057j724366j240604r29814p30499n49224n17733l89819l85717
$$ plain form
5004 11961245 11646050 11533674 11455680 11338256 11323868 11115042 10983130 10822678 10658451 10462394
4994 10462394 10264552 10026659 9893991 9883743 9811427 9829053 9853754 9867284 9812181 9655871
4984 9655871 9597087 9589521 9533953 9641043 9703890 9722713 9705200 9678521 9664587 9684669 9633861
4973 9633861 9626207 9513925 9412572 9534767 9584334 9609197 9622092 9479368 9583532 9683066 9673829
4962 9673829 9700380 9865423 9969809 10026540 10036402 10065236 10157908 10263515 10302343 10393870 10399996
4951 10399996 10384845 10353731 10381077 10555605 10519221 10667588 10953928 11186008 11397501 11571852
4941 11571852 11824147 12002674 12185477 12243710 12364132 12309701 12282606 12218062 12064856 11887843
4931 11887843 11829672 11899236 12033349 12017050 11965439 12121003 12301707 12415913 12643900 13066370
$$ packed form
5004A1961245l15195j12376p7994j17424j4388k08826j31912j60452j64227j96057
4994A0462394j97842k37893j32668j0248p2316J7626K4701J3530n5103j56310
4984I655871n8784p566n5568J07090O2847J8823j7513k6679j3934K0082n0808
4973I633861p654j12282j01353J22195M9567K4863J2895j42724J04164R9534r237
4962I673829K6551J65043J04386N6731R862K8834R2672J05607L8828R1527O126
4951A0399996j5151l1114K7346J74528l6384J48367K86340K32080K11493J74351
4941A1571852K52295J78527J82803N8233J20422n4431k7095o4544j53206j77013
4931A1887843n8171O9564J34113j6299n1611J55564J80704J14206K27987M22470
$$ plain form
4921 13066370 13396394 13789509 14177964 14452882 14919858 15176658 15409078 15563824 15624266 15592317
4911 15592317 15578456 15758891 16010859 16363781 16664594 16983635 17471642 17874136 18301677 18762181
4901 18762181 18949917 19149712 19246278 19183027 19421557 19569911 19666798 19850537 19961849 20111641
4891 20111641 20228614 20488644 20738650 20935341 21237408 21532430 21973784 22513477 23098807
4882 23098807 23606926 24259084 24852359 25353707 25896462 26315606 26848102 27172428 27659449
4873 27659449 28243911 28853113 29627287 30440151 31404845 32310716 33317719 34644694 36315177
4864 36315177 38634413 42242972 47570683 54686389 62362678 68973551 72731161 73526276
4856 73526276 72319201 69449541 66047064 62804575 60308422 58666127 58087938 58591930
$$ packed form
4921A3066370L30024L93115L88455K74918M66976K56800K32420J54746O0442l1949
4911A5592317j3861J80435K51968L52922L00813L19041M88007M02494M27541M60504
4901A8762181J87736J99795R6566o3251K38530J48354R6887J83739J11312J49792
4891B0111641J16973K60030K50006J96691L02067K95022M41354N39693N85330
4882B3098807N08119O52158N93275N01348N42755M19144N32496L24326M87021
4873B7659449N84462O09202P74174Q12864R64694R05871J007003J326975J670483
4864C6315177K319236L608559N327711P115706P676289O610873L757610P95115
4856G3526276j207075k869660l402477l242489k496153j642295n78189N03992
$$ plain form
4848 58591930 60176607 63066615 67248043 73148836 81411001 92191080 104665954 117453656
4840 117453656 130238088 143030032 154657447 163126348 167785223 168755133 166770156 162758456
4832 162758456 157889510 152967241 148440765 144502656 141048375 138347395 136543327 135917640
4824 135917640 136915437 140292003 146582224 155361782 164749478 172497618 177501824 179907257
4816 179907257 180570688 180550920 181165189 183485519 187943471 194230831 202270517 211240569 220297764
4807 220297764 228469220 234577646 238101022 238567355 236291936 231498653 224731693 216569784
4799 216569784 207586246 198508410 190002246 182589325 176576314 172282306 169244371 167013838
4791 167013838 165631213 164806550 164366578 164526569 165523137 167527026 170563085 174439215 178133434
$$ packed form
4848E8591930J584677K890008M181428N900793Q262165J0780079J2474874J2787702
4840A17453656J2784432J2791944J1627415Q468901M658875R69910j984977m011700
4832A62758456m868946m922269m526476l938109l454281k700980j804068o25687
4824A35917640R97797L376566O290221Q779558R387696P748140N004206K405433
4816A79907257O63431j9768O14269K320330M457952O287360Q039686Q970052R057195
4807B20297764Q171456O108426L523376M66333k275419m793283o766960q161909
4799B16569784q983538r077836q506164p412921o013011m294008l037935k230533
4791A67013838j382625q24663m39972J59991R96568K003889L036059L876130L694219
$$ plain form
4782 178133434 181006094 182818295 183214944 182309328 179969127 176356396 171566621 165579820
4774 165579820 158463220 150288608 141463776 132406061 123541568 115175041 107545068 100839344
4766 100839344 94893876 89756945 85310262 81417671 78022218 74907962 72229270 69966086
4758 69966086 67949736 66305535 64836975 63477574 61973210 60342764 58624951 56926427
4750 56926427 55131658 53442594 51951363 50747287 49770957 49071588 48803439 48988604 49735312
4741 49735312 51023225 53227101 57202621 64210062 75305245 89484230 103302120 112761300
4733 112761300 115922880 113754342 108181944 101451685 95239580 93155769 97278059 106838544
4725 106838544 115706716 119405312 117272775 110915833 102000273 92089078 82641050 75347814
$$ packed form
4782A78133434K872660J812201L96649r05616k340201l612731m789775n986801
4774A65579820p116600q174612q824832r057715q864493q366527p629973o705724
4766A00839344n945468n136931m446683l892591l395453l114256k678692k263184
4758F9966086k016350j644201j468560j359401j504364j630446j717813j698524
4750E6926427j794769j689064j491231j204076r76330o99369k68149J85165P46708
4741D9735312J287913K203876L975520P007441J1095183J4178985J3817890R459180
4733A12761300L161580k168538n572398o730259o212105k083811M122290R560485
4725A06838544Q868172L698596k132537o356942q915560r911195r448028p293236
$$ plain form
4717 75347814 71212734 71107927 75540466 82550152 89759777 94986635 97607392 96746282
4709 96746282 93610329 89337877 85978097 85870788 89359320 94733896 98427392 98000110
4701 98000110 93325634 85527096 76242968 66166265 56861041 48850908 42160832 37123230
4693 37123230 33092342 30003154 27766321 26144727 24993623 23913344 23060766 22262651
4685 22262651 21669468 21150961 20732979 20320014 19941078 19627839 19334691 19077368 18672887
4676 18672887 18354883 18350142 18458370 18636232 18801449 19035620 19241176 19297523 19230912 19023955
4666 19023955 18739606 18342353 17921942 17439666 17071717 16816289 16741865 16677559 16711481 16888546
4656 16888546 16852398 16919027 17038038 17108383 17047434 17061599 17035669 17218742 17367042 17636333
$$ packed form
4717G5347814m135080j04807M432539P009686P209625N226858K620757q61110
4709I6746282l135953m272452l359780j07309L488532N374576L693496m27282
4701I8000110m674476p798538r284128j0076703r305224q010133o690076n037602
4693C7123230m030888l089188k236833j621594j151104j080279q52578p98115
4685B2262651n93183n18507m17982m12965l78936l13239k93148k57323m04481
4676A8672887l18004m741J08228J77862J65217K34171K05556N6347o6611k06957
4666A9023955k84349l97253m20411m82276l67949k55428p4424o4306L3922J77065
4656A6888546l6148O6629J19011P0345o0949J4165k5930J83073J48300K69291
$$ plain form
4646 17636333 18010446 18199396 18531856 18902668 19306995 19754267 20050090 20352755 20676166
4637 20676166 21002509 21300862 21555570 21823902 22118626 22541444 23085609 23512278 23853051
4628 23853051 24299544 24823917 25500972 26233264 26892856 27684549 28638596 29589611 30573565
4619 30573565 31513203 32411118 33474310 34518651 35412817 36385910 37493846 38767846 39977607
4610 39977607 41336025 42750041 44387831 46193054 48146962 50426862 52953352 55730407
4602 55730407 59075373 63008834 67547592 72808183 79140378 86497144 95478758 106981433
4594 106981433 122517230 144376150 175352845 216269794 265695925 319637672 373542826
4587 373542826 421772733 458825404 481331437 487179847 475533049 448470242 411616595
$$ packed form
4646A7636333L74113J88950L32460L70812M04327M47272K95823L02665L23411
4637B0676166L26343K98353K54708K68332K94724M22818N44165M26669L40773
4628B3853051M46493N24373O77055P32292O59592P91693R54047R51015R83954
4619C0573565R39638Q97915J063192J044341Q94166R73093J107936J274000J209761
4610C9977607J358418J414016J637790J805223J953908K279900K526490K777055
4602E5730407L344966L933461M538758N260591O332195P356766Q981614J1502675
4594A06981433J5535797K1858920L0976695M0916949M9426131N3941747N3905154
4587C73542826M8229907L7052671K2506033N848410j1646798k7062807l6853647
$$ plain form
4580 411616595 371858845 335438905 306105976 285434184 273067224 267738091 266539633
4573 266539633 266892483 265518978 259311422 246312159 226891098 203551252 179067622 155859857
4565 155859857 135898536 120744528 110739589 104744197 100908974 97203150 92583133 86890066
4557 86890066 80400674 74020845 68201367 63574493 60934194 60591728 62551173 65870909
4549 65870909 68818594 69907604 68415030 64976489 60017697 54305280 48541266 43350960
4541 43350960 38760319 35041433 32029297 29448718 27624258 26220248 25067183 24151229
4533 24151229 23294144 22566354 22041459 21530331 21134751 20978239 20707963 20527260 20478022 20498776
4523 20498776 20707330 21266081 22116238 23221800 24578347 25943766 27173721 28296085 29098058
$$ packed form
4580D11616595l9757750l6419940k9332929k0671792j2366960n329133j198458
4573B66539633L52850j373505o207556j2999263j9421061k3339846k4483630k3207765
4565A55859857j9961321j5154008j0004939n995392l835223l705824m620017n693067
4557H6890066o489392o379829n819478m626874k640299l42466J959445L319736
4549F5870909K947685J089010j492574l438541m958792n712417n764014n190306
4541D3350960m590641l718886l012136k580579j824460j404010j153065r15954
4533B4151229q57085p27790n24895n11128l95580j56512k70276j80703m9238K0754
4523B0498776K08554N58751Q50157J105562J356547J365419J229955J122364Q01973
$$ plain form
4514 29098058 29376797 29491069 29014761 28309686 27392249 26345800 25343275 24488206 23783160
4505 23783160 23481897 23611421 24443144 26120885 28361532 31030481 33960514 36581995 38415771
4496 38415771 39131235 38604110 37071565 34715879 31819675 28569632 25507716 22722285
4488 22722285 20301222 18231909 16707562 15459900 14334282 13545273 13077086 12659642 12170070
4479 12170070 12027058 11993937 12011047 12239303 12407210 12590962 12768271 12811940 12757883 12747108
4469 12747108 12786433 12924430 13074630 13108018 13210547 13589974 13940114 14258284 14772122 15209360
4459 15209360 15297899 15231497 15239999 14910005 14329892 13860967 13271960 12691779 12316545 11933839
4449 11933839 11682476 11352928 11063861 10788250 10736625 10863765 11035441 11262492 11419645 11672205
$$ packed form
4514B9098058K78739J14272m76308p05075r17437j046449j002525q55069p05046
4505B3783160l01263J29524Q31723J677741K240647K668949K930033K621481J833776
4496C8415771P15464n27125j532545k355686k896204l250043l061916k785431
4488B2722285k421063k069313j524347j247662j125618p89009m68187m17444m89572
4479A2170070j43012l3121J7110K28256J67907J83752J77309M3669n4057j0775
4469A2747108L9325J37997J50200L3388J02529L79427L50140L18170N13838M37238
4459A5209360Q8539o6402Q502l29994n80113m68925n89007n80181l75234l82706
4449A1933839k51363l29548k89067k75611n1625J27140J71676K27051J57153K52560
$$ plain form
4439 11672205 11998315 12256396 12407767 12327672 12198036 11903626 11478188 11071145 10636872 10159505
4429 10159505 9746026 9452102 9125791 8737187 8436837 8403594 8396491 8410702 8684142 8980879
4419 8980879 9162877 9274436 9018596 8790008 8552678 8255728 7917909 7510546 7157506 6889697
4409 6889697 6730219 6588879 6468636 6327748 6322557 6267530 6162240 6293215 6280441 6159741
4399 6159741 6182426 6224377 6238022 6165523 6182459 6191489 6113244 6052842 5943845 5912052 5855434
4388 5855434 5810773 5699575 5718038 5810601 5868128 5911535 5827544 5789248 5850071 5886990 5902676
4377 5902676 6017422 6017606 6030575 6144261 6184133 6200134 6348296 6336766 6401653 6430620 6468833
4366 6468833 6401455 6389127 6451974 6552821 6732094 6772805 6736948 6754057 6909494 7027482 7085970
$$ packed form
4439A1672205L26110K58081J51371q0095j29636k94410m25438m07043m34273m77367
4429A0159505m13479k93924l26311l88604l00350l3243p103J4211K73440K96737
4419H980879J81998J11559k55840k28588k37330k96950l37819m07363l53040k67809
4409F889697j59478j41340j20243j40888n191n5027j05290J30975j2774j20700
4399F159741K2685M1951J3645p2499J6936R030p8245o0402j08997l1793n6618
4388E855434m4661j11198J8463R2563N7527M3407q3991l8296O0823L6919J5686
4377E902676J14746J84J2969J13686L9872J6001J48162j1530O4887K8967L8213
4366F468833o7378j2328O2847J00847J79273M0711l5857J7109J55437J17988N8488
$$ plain form
4355 7085970 7108163 7145137 7120953 7239907 7319839 7334486 7584772 7916259 8310457 8791860
4345 8791860 9441319 9937997 10298674 10521077 10506957 10224373 9839994 9575987 9165181 8766722
4335 8766722 8467179 8396044 8129874 7960670 7780054 7625105 7595627 7585232 7522346 7658353
4325 7658353 7746542 7887460 7891545 7759093 7664035 7729313 7781821 7617875 7774349 7926810 8066428
4314 8066428 8266449 8447271 8519107 8639700 8767523 8899968 8889109 8934508 8974486 9073725
4304 9073725 9354953 9620260 9875430 10115053 10220207 10218139 10071991 9715454 9399703 9129618
4294 9129618 8810360 8412373 8177337 8008600 7858803 7753285 7675547 7696649 7644783 7477950
4284 7477950 7321128 7078857 6946566 6699381 6518569 6412280 6241496 6115365 6004034 5954015
$$ packed form
4355G085970K2193L6974k4184J18954P9932J4647K50286L31487L94198M81403
4345H791860O49459M96678L60677K22403j4120k82584l84379k64007m10806l98459
4335H766722k99543p1135k66170j69204j80616j54949k9478j0395o2886J36007
4325G658353Q8189J40918M085j32452r5058O5278N2508j63946J56474J52461J39618
4314H066428K00021J80822P1836J20593J27823J32445j0859M5399L9978R9239
4304I073725K81228K65307K55170K39623J05154k068j46148l56537l15751k70085
4294I129618l19258l97987k35036j68737j49797j05518p7738K1102n1866j66833
4284G477950j56822k42271j32291k47185j80812j06289j70784j26131j11331n0019
$$ plain form
4274 5954015 5895546 5815056 5834356 5867997 5715573 5637309 5589694 5529004 5397706 5349049 5389659
4263 5389659 5424736 5426749 5505760 5419003 5377842 5501147 5497325 5458434 5505095 5454293 5423583 5456120
4251 5456120 5625090 5844435 5956222 6036858 6140073 6325104 6409132 6590762 6600221 6608113 6566389
4240 6566389 6466051 6376472 6192564 6145229 6144783 6133643 6070839 6119952 6231865 6172903 6275020
4229 6275020 6411597 6354309 6439828 6497401 6443246 6613021 6649785 6585401 6504386 6528531 6682956
4218 6682956 6704771 6690563 6662598 6701470 6787443 6961694 7034585 7102498 7259530 7335529 7437759
4207 7437759 7596446 7749110 7876368 7892387 7909497 7995556 8208269 8359403 8436011 8520354
4197 8520354 8714439 8832469 8955444 8987328 9086934 9306140 9498117 9741405 9914486 10147543
$$ packed form
4274E954015n8469q0490J9300L3641j52424p8264m7615o0690j31298m8657M0610
4263E389659L5077K013P9011q6757m1161J23305l822l8891M6661n0802l0710L2537
4251E456120J68970K19345J11787Q0636J03215J85031Q4028J81630R459P892m1724
4240F566389j00338q9579j83908m7335m46j1140o2804M9113J11913n8962J02117
4229F275020J36577n7288Q5519N7573n4155J69775L6764o4384q1015K4145J54425
4218F682956K1815j4208k7965L8872Q5973J74251P2891O7913J57032P5999J02230
4207G437759J58687J52664J27258J6019J7110Q6059K12713J51134P6608Q4343
4197H520354J94085J18030J22975L1884R9606K19206J91977K43288J73081K33057
$$ plain form
4187 10147543 10437918 10863773 11292298 11661652 12087666 12537155 12947317 13470245 13923601
4178 13923601 14347113 14732698 15227747 15821992 16572218 17416813 17999769 18679036 19441393
4169 19441393 20205611 21066426 22017758 22915275 23633419 24178041 24652156 24849430 25115259
4160 25115259 25428519 25643904 26112371 26856924 27743492 28737110 29609782 30572433 31572452
4151 31572452 32350597 33198142 34140772 34999222 35848594 36645330 37342040 38005177 38649884
4142 38649884 39264702 40092010 41197281 42384221 43559988 44716737 45693003 46641373 47753349
4133 47753349 48946748 50549723 52478260 54693468 57141789 59319304 60991650 62188789
4125 62188789 63005973 63517309 64052698 64425983 64715394 64940242 65063629 65522025 66285134
$$ packed form
4187A0147543K90375M25855M28525L69354M26014M49489M10162N22928M53356
4178A3923601M23512L85585M95049N94245P50226Q44595N82956O79267P62357
4169A9441393P64218Q60815R51332Q97517P18144N44622M74115J97274K65829
4160B5115259L13260K15385M68467P44553Q86568R93618Q72672R62651J000019
4151C1572452P78145Q47545R42630Q58450Q49372P96736O96710O63137O44707
4142C8649884O14818Q27308J105271J186940J175767J156749R76266R48370J111976
4133D7753349J193399J602975J928537K215208K448321K177515J672346J197139
4125F2188789Q17184N11336N35389L73285K89411K24848J23387M58396P63109
$$ plain form
4116 66285134 67194720 68423207 69745710 70825109 71697427 72130920 72139745 71822148 71418510
4107 71418510 71324831 71366367 71860167 73068604 74997909 77575825 80500554 83681553 86765249
4098 86765249 89556757 92247168 95008538 97871282 100516010 102825436 104687719 106352511
4090 106352511 108079468 109681945 111277146 112484396 113343227 113897044 114325164 114600784 114808164
4081 114808164 115218456 115857417 116750052 118029437 119784778 122081017 124575453 127303453
4073 127303453 129616913 131270509 132180451 132311376 132001686 131692696 131887415 132571483 133937607
4064 133937607 136001575 138277947 140487478 142076556 142671123 142418313 141633626 140863090 140208968
4055 140208968 139314957 138291672 136832194 134998521 133039479 131219025 129117291 126549137
$$ packed form
4116F6285134R09586J228487J322503J079399Q72318M33493Q825l17597m03638
4107G1418510r3679M1536M93800J208437J929305K577916K924729L180999L083696
4098H6765249K791508K690411K761370K862744K644728K309426J862283J664792
4090A06352511J726957J602477J595201J207250Q58831N53817M28120K75620K07380
4081A14808164M10292O38961Q92635J279385J755341K296239K494436K728000
4073A27303453K313460J653596R09942J30925l09690l08990J94719O84068J366124
4064A33937607K063968K276372K209531J589078N94567k52810p84687p70536o54122
4055A40208968q94011j023285j459478j833673j959042j820454k101734k568154
$$ plain form
4047 126549137 123750795 120487599 116909561 113091938 109161849 105394893 101988499 98978196
4039 98978196 96543679 94768969 93654062 92925233 92361826 91769114 90732711 89147828 87136544
4030 87136544 85067373 82776058 80504194 78219332 76207257 74405482 72926367 71861021
4022 71861021 71250471 70710592 69655054 68134258 66037684 63590045 61057798 58629564
4014 58629564 56347021 54554895 52958933 51762487 50485238 49169925 47892312 46409061
4006 46409061 44847650 43364452 42108467 41011597 39956247 38800752 37690058 36642612
3998 36642612 35644016 34909880 34251856 33548068 32850890 32108995 31161646 30178880 29226361
3989 29226361 28305305 27486691 26995062 26460392 25868551 25343139 24610971 23906885 23039245
$$ packed form
4047A26549137k798342l263196l578038l817623l930089l766956l406394l010303
4039I8978196k434517j774710j114907p28829n63407n92712j036403j584883k011284
4030H7136544k069171k291315k271864k284862k012075j801775j479115j065346
4022G1861021o10550n39879j055538j520796k096574k447639k532247k428234
4014E8629564k282543j792126j595962j196446j277249j315313j277613j483251
4006D6409061j561411j483198j255985j096870j055350j155495j110694j047446
3998C6642612r98596p34136o58024p03788o97178p41895r47349r82766r52519
3989B9226361r21056q18614m91629n34670n91841n25412p32168p04086q67640
$$ plain form
3980 23039245 22048861 21269142 20274854 19230459 18418796 17818435 17232459 16590007 15991562
3971 15991562 15359511 14788884 14235544 13671780 13239687 12783600 12280560 11803493 11505889
3962 11505889 11234264 10946593 10687977 10451446 10270750 10238043 10132298 10080320 10109146 10061221
3952 10061221 9915711 9965374 10016385 10097920 10200352 10286516 10312544 10405303 10568340 10817663
3942 10817663 11014079 11244201 11569556 11895170 12114767 12375263 12807408 13221671 13740484
3933 13740484 14359308 14994427 15689180 16317508 17027783 17668653 18212641 18676569 18955243
3924 18955243 19070850 18964087 18704175 18393678 17950752 17372432 16650079 15784431 14842303
3915 14842303 13958807 13227598 12452725 11870102 11381637 10963356 10479920 10023415 9503789
$$ packed form
3980B3039245r90384p79719r94288j044395q11663o00361n85976o42452n98445
3971A5991562o32051n70627n53340n63764m32093m56087n03040m77067k97604
3962A1505889k71625k87671k58616k36531j80696l2707j05745n1978K8826m7925
3952A0061221j45510M9663N1011Q1535J02432Q6164K6028R2759J63037K49323
3942A0817663J96416K30122L25355L25614K19597K60496M32145M14263N18813
3933A3740484O18824O35119O94753O28328P10275O40870N43988M63928K78674
3924A8955243J15607j06763k59912l10497m42926n78320p22353q65648r42128
3915A4842303q83496p31209p74873n82623m88465m18281m83436m56505n19626
$$ plain form
3906 9503789 9175776 8814208 8580561 8273305 7988929 7777785 7477957 7358448 7350202 7390245
3896 7390245 7239033 6998754 6838373 6723414 6675470 6609066 6602328 6439049 6365473 6249713
3886 6249713 6272845 6292209 6148328 6034761 6014786 5951011 5966205 5988113 5917563 5947736 5851736
3875 5851736 5778073 5782592 5876212 5950579 5980348 5838426 5792509 5833400 5799361 5861123 5883025
3864 5883025 5764820 5663436 5603011 5625463 5629369 5686526 5817825 5768910 5735151 5586934 5544230
3853 5544230 5540533 5594624 5634973 5544387 5461857 5358402 5282990 5360766 5269553 5358552 5388320
3842 5388320 5404135 5310166 5211752 5132393 5069130 5156512 5060394 5034719 5072428 4928551 4858570
3831 4858570 4800021 4633228 4574870 4648065 4609270 4464499 4514485 4442753 4374203 4457114 4524663
$$ packed form
3906I503789l28013l61568k33647l07256k84376k11144k99828j19509q246M0043
3896G390245j51212k40279j60381j14959m7944o6404o738j63279p3576j15760
3886F249713K3132J9364j43881j13567j9975o3775J5194K1908p0550L0173r6000
3875E851736p3663M519R3620P4367K9769j41922m5917M0891l4039O1762K1902
3864E883025j18205j01384o0425K2452L906N7157J31299m8915l3759j48217m2704
3853E544230l697N4091M0349r0586q2530j03455p5412P7776r1213Q8999K9768
3842E388320J5815r3969r8414p9359o3263Q7382r6118k5675L7709j43877o9981
3831D858570n8549j66793n8358P3195l8795j44771M9986p1732o8550Q2911O7549
$$ plain form
3820 4524663 4455297 4357786 4448800 4524789 4526199 4505067 4505670 4409436 4399953 4285411 4299147 4259721
3808 4259721 4284030 4339328 4291861 4342685 4396175 4518813 4513919 4508546 4591930 4783171 4834588
3797 4834588 4747333 4773863 4790332 4731987 4758524 4747463 4652790 4544452 4608847 4421140 4294439
3786 4294439 4185965 4192334 4166324 4211586 4082548 4037293 4087215 3961556 3848669 3894117 3957732
3775 3957732 3892314 3840659 3954695 3971405 4080508 4112812 3978472 3934703 3783745 3714905 3739526
3764 3739526 3590285 3364288 3317380 3350050 3411839 3421112 3311413 3303932 3311269 3383424 3297140
3753 3297140 3279801 3269881 3099549 3127250 3258705 3221544 3194905 3070409 3071202 2954455 3078640
3742 3078640 3232953 3162038 3150457 3227767 3427564 3445487 3514276 3513227 3495080 3614994 3647178
$$ packed form
3820D524663o9366r7511R1014P5989J410k1132O03r6234r483j14542J3736l9426
3808D259721K4309N5298m7467N0824N3490J22638m894n373Q3384J91241N1417
3797D834588q7255K6530J6469n8345K6537j1061r4673j08338O4395j87707j26701
3786D294439j08474O369k6010M5262j29038m5255M9922j25659j12887M5448O3615
3775C957732o5418n1655J14036J6710J09103L2304j34340m3769j50958o8840K4621
3764C739526j49241k25997m6908L2670O1789R273j09699p481P337P2155q6284
3753C297140j7339r920j70332K7701J31455l7161k6639j24496P93j16747J24185
3742C078640J54313p0915j1581P7310J99797J7923O8789j049j8147J19914L2184
$$ plain form
3731 3647178 3639212 3544932 3420265 3314855 3330545 3306907 3304264 3288952 3308557 3324801 3273365
3720 3273365 3274158 3241686 3295138 3259441 3421265 3500124 3547420 3561802 3564459 3538018 3453765 3484188
3708 3484188 3504778 3530200 3506549 3423991 3402879 3461019 3513892 3589074 3732305 3818765 3793318
3697 3793318 3827306 3906141 3884684 3901342 3703582 3619102 3556082 3488680 3425262 3481426 3450200
3686 3450200 3461260 3478246 3634850 3974508 4084952 4084294 4032928 4011683 4065524 4081300 3986484
3675 3986484 3931054 3891959 3859900 3930324 3829666 3754961 3758213 3670301 3601310 3469158 3405803
3664 3405803 3414049 3421702 3469859 3512427 3617088 3651713 3682289 3716206 3796939 3969090 4024148
3653 4024148 4033479 4002321 3984905 3994080 3870344 3821299 3733029 3574938 3541645 3598811 3611482
$$ packed form
3731C647178p966r4280j24667j05410J5690k3638k643j5312J9605J6244n1436
3720C273365P93l2472N3452l5697J61824P8859M7296J4382K657k6441q4253L0423
3708C484188K0590K5422k3651q2558k1112N8140N2873P5182J43231Q6460k5447
3697C793318L3988P8835k1457J6658j97760q4480o3020o7402o3418N6164l1226
3686C450200J1060J6986J56604L39658J10444o58n1366k1245N3841J5776r4816
3675C986484n5430l9095l2059P0424j00658p4705L252q7912o8991j32152o3355
3664C405803Q246P653M8157M2568J04661L4625L0576L3917Q0733J72151N5058
3653D024148R331l1158j7416R175j23736m9045q8270j58091l3293N7166J2671
$$ plain form
3642 3611482 3610918 3668758 3645370 3534937 3537675 3562946 3440610 3467560 3504496 3518910 3567244 3519558
3630 3519558 3495398 3514155 3609127 3751266 3846227 3884264 4040062 4064409 4191057 4273800 4396903
3619 4396903 4429783 4585757 4608703 4705007 4655791 4767024 4843274 4878790 5126127 5298815 5415583
3608 5415583 5316948 5105658 4975736 4961804 4922953 4811228 4710920 4670924 4591734 4638046 4589558
3597 4589558 4684747 4767017 4849518 4904871 5018116 5196647 5421837 5686997 5804612 5786605
3587 5786605 5789976 5569997 5444530 5366049 5238236 5089154 5072276 4910670 4867356 4797923 4777107
3576 4777107 4810835 4906502 4972326 5011046 5155549 5281030 5230810 5198995 5257148 5300961 5308330
3565 5308330 5222535 5280569 5150424 5060102 5103230 5128085 5216799 5221245 5326424 5366688 5446086
$$ packed form
3642C611482n64N7840k3388j10433K738K5271j22336K6950L6936J4414M8334m7686
3630C519558k4160J8757R4972J42139R4961L8037J55798K4347J26648Q2743J23103
3619D396903L2880J55974K2946R6304m9216J11233P6250L5516K47337J72688J16768
3608E415583r8635k11290j29922j3932l8851j11725j00308l9996p9190M6312m8488
3597D589558R5189Q2270Q2501N5353J13245J78531K25190K65160J17615j8007
3587E786605L371k19979j25467p8481j27813j49082j6878j61606m3314o9433k0816
3576D777107L3728R5667O5824L8720J44503J25481n0220l1815N8153M3813P369
3565E308330q5795N8034j30145r0322M3128K4855Q8714M446J05179M0264P9398
$$ plain form
3554 5446086 5531266 5635285 5900638 6201919 6382189 6505152 6724806 6986092 7186217 7372522
3544 7372522 7486610 7571613 7562324 7460456 7472684 7403992 7265496 7252702 7171567 7157163 7193746
3533 7193746 7176724 7175157 7344899 7635449 7946521 8273232 8648110 9044449 9490457 9969863
3523 9969863 10483452 10756033 11066016 11363112 11568467 11812217 11970935 12224335 12479547 12857628
3513 12857628 13196173 13162992 13090044 12882780 12532098 11973480 11335362 10742089 10127891 9576380
3503 9576380 9023679 8495519 8004484 7425694 7007485 6683420 6352267 5983363 5676169 5521233
3493 5521233 5193461 5119798 5072817 5001230 4930764 4919363 4851984 4795092 4764082 4826218 4851376
3482 4851376 4885989 4941692 4905019 4812761 4759846 4529134 4328299 4198501 4063891 3950830
$$ packed form
3554E446086Q5180J04019K65353L01281J80270J22963K19654K61286K00125J86305
3544G372522J14088Q5003r289j01868J2228o8692j38496j2794q1135j4404L6583
3533G193746j7022j567J69742K90550L11072L26711L74878L96339M46008M79406
3523I969863N13589K72581L09983K97096K05355K43750J58718K53400K55212L78081
3513A2857628L38545l3181p2948k07264l50682n58618o38118n93273o14198n51511
3503I576380n52701n28160m91035n78790m18209l24065l31153l68904l07194j54936
3493E521233l27772p3663m6981p1587p0466j1401o7379n6892l1010O2136K5158
3482D851376L4613N5703l6673r2258n2915k30712k00835j29798j34610j13061
$$ plain form
3472 3950830 3843342 3682008 3637526 3621165 3523235 3453180 3589270 3562606 3672754 3835888
3462 3835888 3916558 4098526 4125429 4063725 4015124 3857104 3691536 3539035 3422701 3295332
3452 3295332 3162631 2999259 2832982 2743481 2620662 2553432 2611804 2678276 2618099 2656232 2709526
3441 2709526 2773723 2777847 2718076 2705776 2631355 2620559 2575180 2399776 2269848 2212887 2159069
3430 2159069 2047643 1912181 1930099 1933762 1762492 1733057 1800661 1856933 1797898 1683832 1650115
3419 1650115 1698514 1668376 1648561 1540481 1553855 1603672 1541617 1564521 1420779 1381538 1419086
3408 1419086 1510079 1446220 1474370 1438979 1400648 1477711 1442063 1466139 1485597 1587498 1596061
3397 1596061 1593877 1618435 1734209 1710617 1695070 1626404 1497482 1336514 1290408 1336886 1354812
$$ packed form
3472C950830j07488j61334m4482j6361r7930p0055J36090k6664J10148J63134
3462C835888Q0670J81968K6903o1704m8601j58020j65568j52501j16334j27369
3452C295332j32701j63372j66277q9501j22819o7230N8372O6472o0177L8133N3294
3441B709526O4197M124n9771j2300p4421j0796m5379j75404j29928n6961n3818
3430B159069j11426j35462J7918L663j71270k9435O7604N6272n9035j14066l3717
3419A650115M8399l0138j9815j08080J3374M9817o2055K2904j43742l9241L7548
3408A419086R0993o3859K8150l5391l8331P7063l5648K4076J9458J01901Q563
3397A596061k184K4558J15774k3592j5547o8666j28922j60968m6106M6478J7926
$$ plain form
3386 1354812 1347229 1239210 1390738 1288716 1319251 1350672 1340289 1473708 1454730 1409372 1469122
3375 1469122 1400648 1345560 1265431 1344217 1325723 1115086 1135349 1125209 1040499 899221 949592
3364 949592 971566 981759 923986 1007840 1007166 997696 871117 851015 873322 874026 948275 950982 855088
3351 855088 787145 826146 879056 835061 769758 784603 884848 873092 801231 720150 739938
3340 739938 808504 712321 605447 648998 731316 699451 737250 777138 738166 820032 725389
3329 725389 695055 718321 783638 742377 728328 684903 626250 587142 573427 671124 585063 658946
3317 658946 735211 700197 604915 647484 671123 620222 685476 706763 657855 691206 615238 606662
3305 606662 479689 544749 647554 644939 593665 508943 433565 395703 442611 590645 653923
$$ packed form
3386A354812p583j08019J51528j02022L0535L1421j0383J33419j8978m5358N9750
3375A469122o8474n5088q0129P8786j8494k10637K0263j0140q4710j41278N0371
3364I49592K1974J0193n7773Q3854o74r470j26579k0102K2307P04P4249K707r5894
3351H55088o7943L9001N2910m3995o5303J4845J00245j1756p1861q1081J9788
3340G39938O8566r6183j06874M3551Q2318l1865L7799L9888l8972Q1866r4643
3329G25389l0334K3266O5317m1261j4049m3425n8653l9108j3715R7697q6061P3883
3317F58946P6265l5014r5282M2569K3639n0901O5254K1287m8908L3351p5968q576
3305F06662j26973O5060J02805k615n1274q4722p5378l7862M6908J48034O3278
$$ plain form
3294 653923 591343 623671 506750 500015 492603 651761 655348 618471 548854 448510 499312 508392
3282 508392 564983 528022 543715 677360 700970 676977 626558 596755 566414 564653 645741 588490
3270 588490 696014 719161 680912 591008 591358 779212 753875 736619 654713 635815 730056 730510
3258 730510 780179 849786 815735 873368 837922 791662 841423 899018 974347 931891 953775 1004891
3246 1004891 1008915 956236 1099979 1228526 1323681 1376128 1468769 1656169 1682739 1585939 1647392
3235 1647392 1668134 1522180 1358409 1269006 1271404 1314668 1290490 1234170 1177103 1226020 1286025
3224 1286025 1339506 1472052 1539000 1500077 1527629 1477312 1502949 1565948 1599134 1748674 1824734
3213 1824734 1852352 1976909 2058655 2129665 2301526 2502527 2744816 2963819 3190113 3345363
$$ packed form
3294F53923o2580L2328j16921o735p412J59158L587l6877o9617j00344N0802R080
3282E08392N6591l6961J5693J33645K3610k3993n0419k9803l0341j761Q1088n7251
3270E88490J07524K3147l8249q9904L50J87854k5337j7256q1906j8898R4241M54
3258G30510M9669O9607l4051N7633l5446m6260M9761N7595P5329m2456K1884N1116
3246A004891M024n2679J43743J28547R5155N2447R2641J87400K6570r6800O1453
3235A647392K0742j45954j63771q9403K398M3264k4178n6320n7067M8917O0005
3224A286025N3481J32546O6948l8923K7552n0317K5637O2999L3186J49540P6060
3213A824734K7618J24557Q1746P1010J71861K01001K42289K19003K26294J55250
$$ plain form
3203 3345363 3428343 3409968 3273373 3028486 3018086 2951394 2807971 2699049 2687867 2652729 2581168
3192 2581168 2738963 2869025 2864839 2896225 2883902 2972394 3138273 3285287 3482540 3453364 3418242
3181 3418242 3366080 3473543 3679924 3857389 4082243 4435686 4588720 4719609 4883988 4905066
3171 4905066 4914898 4749920 4674354 4335116 4001607 3784750 3572060 3445625 3404537 3310137
3161 3310137 3208429 3151629 3132109 3288217 3229422 3244701 3246953 3347957 3451471 3431077 3534835
3150 3534835 3600361 3615138 3772165 3743250 3743573 3870930 3866122 3815914 3609390 3340942 3205434
3139 3205434 3105947 3103660 2958629 2698182 2535297 2396727 2424757 2288284 2213371 2216560 2223699
3128 2223699 2087885 2048383 2137596 2152285 2166162 2068541 2045314 1959771 1881993 1929215 1825740
$$ packed form
3203C345363Q2980j8375j36595k44887j0400o6692j43423j08922j1182l5138p1561
3192B581168J57795J30062m186L1386j2323Q8492J65879J47014J97253k9176l5122
3181C418242n2162J07463K06381J77465K24854L53443J53034J30889J64379K1078
3171D905066R832j64978p5566l39238l33509k16857k12690j26435m1088r4400
3161C310137j01708n6800j9520J56108n8795J5279K252J01004J03514k0394J03758
3150C534835O5526J4777J57027k8915L23J27357m808n0208k06524k68448j35508
3139C205434r9487k287j45031k60447j62885j38570K8030j36473p4913L189P139
3128B223699j35814l9502Q9213J4689J3877r7621k3227q5543p7778M7222j03475
$$ plain form
3117 1825740 1665360 1604092 1550013 1399543 1355191 1280528 1164896 1093206 1039683 980602 970571
3106 970571 1001270 989594 880036 826263 837503 797248 622191 547365 528356 696787 677142
3095 677142 589704 573474 489153 548754 483743 396749 440988 447755 334408 243261 365427
3084 365427 347029 271667 212697 215771 302860 417782 439806 351131 261468 100698 58719
3073 58719 137165 145823 114288 226406 217790 95979 109850 139883 70363 65503 62513 12034
3061 12034 13770 153667 123669 119134 81454 54498 -42027 -13481 57806 3595 31808 -54072
3049 -54072 -135050 -225146 -115572 -128899 -225412 -113162 -213457 -263790 -230529 -202233 -200438
3038 -200438 -275930 -246219 -214542 -83041 -32293 -188810 -230540 -297782 -289799 -215904 -181276
$$ packed form
3117A825740j60380o1268n4079j50470m4352p4663j15632p1690n3523n9081j0031
3106I70571L0699j1676j09558n3773J1240m0255j75057p4826j9009J68431j9645
3095F77142q7438j6230q4321N9601o5011q6994M4239O767j13347r1147J22166
3084C65427j8398p5362n8970L074Q7089J14922K2024q8675q9663j60770m1979
3073E8719P8446Q658l1535J12118q616j21811J3871L0033o9520m860k990n0479
3061A2034J736J39897k9998m535l7680k6956r6525K8546P1287n4211K8213q5880
3049e4072q0978r0096J09574j3327r6513J12250j00295n0333L3261K8296J795
3038b00438p5492K9711L1677J31501N0748j56517m1730o7242P983P3895L4628
$$ plain form
3027 -181276 -134261 -195700 -244246 -272017 -266544 -288071 -315550 -271659 -283281 -265178 -245529 -306820
3015 -306820 -344839 -364896 -352710 -237433 -323830 -272675 -250722 -347273 -383656 -446555 -384636
3004 -384636 -392545 -406858 -395170 -436629 -409168 -475664 -496580 -480351 -464599 -466482 -479356 -486424
2992 -486424 -514920 -562906 -570365 -436364 -425782 -405423 -358456 -442811 -492792 -474876 -465519 -477423
2980 -477423 -480878 -376495 -527722 -574061 -372585 -438903 -415654 -500518 -428598 -365516 -411224
2969 -411224 -348098 -456262 -517622 -408512 -509350 -493274 -453981 -415759 -401804 -444509 -377651
2958 -377651 -473094 -564237 -567489 -613354 -480038 -492339 -530343 -438761 -461226 -422868 -494233 -608662
2946 -608662 -569445 -551021 -598102 -455308 -561897 -452163 -457163 -449594 -432325 -410030 -409156 -451348
$$ packed form
3027a81276M7015o1439m8546k7771N473k1527k7479M3891j1622J8103J9649o1291
3015c06820l8019k0057J2186J15277q6397N1155K1953r6551l6383o2899O1919
3004c84636p909j4313J1688m1459K7461o6496k0916J6229J5752j883j2874p068
2992d86424k8496m7986p459J34001J0582K0359M6967q4355m9981J7916R357j1904
2980d77423l455J04383j51227m6339K01476o6318K3249q4864P1920O3082m5708
2969d11224O3126j08164o1360J09110j00838J6076L9293L8222J3955m2705O6858
2958c77651r5443r1143l252m5865J33316j2301l8004R1582k2465L8358p1365j14429
2946f08662L9217J8424m7081J42794j06589J09734n000P569J7269K2295Q74m2192
$$ plain form
2934 -451348 -434153 -404684 -525636 -448536 -401357 -419148 -373252 -489459 -542253 -579062 -611189
2923 -611189 -615650 -527896 -431184 -519122 -588674 -558050 -637657 -549345 -548277 -536994 -489444 -491837
2911 -491837 -375283 -464933 -474416 -469123 -564370 -531702 -434138 -504866 -687194 -607626 -569436 -589349
2899 -589349 -586000 -585183 -579541 -631456 -683595 -627860 -605469 -581805 -622037 -703893 -622649 -511238
2887 -511238 -508685 -586584 -580103 -523148 -602559 -630631 -633989 -574902 -580643 -555497 -528892 -519550 -521973
2874 -521973 -449620 -434839 -459425 -409871 -436553 -526804 -496136 -600914 -649944 -601236 -567637
2863 -567637 -506218 -585386 -659317 -543727 -560709 -521624 -581374 -605481 -384865 -450270 -554483
2852 -554483 -663743 -656522 -651015 -695956 -728048 -692166 -584975 -609963 -644449 -545126 -632006 -614049
$$ packed form
2934d51348J7195K9469j20952P7100M7179j7791M5896j16207n2794l6809l2127
2923f11189m461Q7754R6712q7938o9552L0624p9607Q8312J068J1283M7550k393
2911d91837J16554q9650r483N293r5247L2668R7564p0728j82328P9568L8190j9913
2899e89349L349Q17N642n1915n2139N5735K2391K3664m0232q1856Q1244J11411
2887e11238K553p7899O481N6955p9411k8072l358N9087n741K5146K6605R342k423
2874e21973P2353J4781k4586M9554k6682r0251L0668j04778m9030M8708L3599
2863e67637O1419p9168p3931J15590j6982L9085n9750k4107K20616o5405j04213
2852e54483j09260P221N507m4941l2092L5882J07191k4988l4486R9323q6880J7957
$$ plain form
2840 -614049 -691297 -620298 -567823 -709534 -630314 -551514 -576891 -552670 -583764 -450162 -392738
2829 -392738 -465425 -553521 -575867 -558367 -677672 -710308 -590770 -528512 -538585 -553287 -621149
2818 -621149 -621028 -530062 -609319 -661475 -545826 -578488 -562224 -497744 -526634 -588267 -588222 -571983
2806 -571983 -522915 -456244 -568015 -634064 -495578 -488346 -440434 -438365 -623083 -520712 -525329
2795 -525329 -465866 -406933 -518783 -485455 -539284 -591126 -592309 -563643 -486864 -515023 -510461 -483261
2783 -483261 -439800 -448623 -581943 -512754 -683253 -656326 -608861 -600925 -463726 -546149 -625549
2772 -625549 -556895 -561975 -502744 -627848 -579112 -522757 -475288 -540308 -541616 -466739 -519538 -503007
2760 -503007 -549746 -599849 -492283 -482911 -453387 -449620 -465442 -514903 -530309 -596486 -663722 -498540
$$ packed form
2840f14049p7248P0999N2475j41711P9220P8800k5377K4221l1094J33602N7424
2829c92738p2687q8096k2346J7500j19305l2636J19538O2258j0073j4702o7862
2818f21149J21R0966p9257n2156J15649l2662J6264O4480k8890o1633M5J6239
2806e71983M9068O6671j11771o6049J38486P232M7912K069j84718J02371m617
2795e25329N9463N8933j11850L3328n3829n1842j183K8666P6779k8159M562K7200
2783d83261M3461q823j33320O9189j70499K6927M7465P936J37199q2423p9400
2772f25549O8654n080N9231j25104M8736N6355M7469o5020j308P4877n2799J6531
2760e03007m6739n0103J07566R372K9524L767j5822m9461j5406o6177o7236J65182
$$ plain form
2748 -498540 -475655 -491628 -585574 -631613 -599593 -540966 -582036 -615023 -670762 -663202 -724081 -606511
2736 -606511 -575602 -617344 -522469 -524600 -629373 -555252 -571131 -598120 -657887 -753322 -578190
2725 -578190 -561244 -608512 -589997 -553774 -536215 -471813 -487452 -607011 -616430 -649810 -542203
2714 -542203 -527921 -595429 -575737 -612899 -602016 -550447 -569423 -605089 -610571 -628251 -586739 -501702
2702 -501702 -557574 -606098 -589275 -538025 -563356 -558901 -606554 -644226 -706919 -690048 -544422 -487111
2690 -487111 -611546 -656701 -580961 -558219 -507889 -648847 -631628 -547052 -601114 -529663 -514888
2679 -514888 -431102 -512075 -503231 -480210 -579873 -619566 -546926 -597875 -549827 -475698 -418344 -419017
2667 -419017 -478873 -479222 -519770 -528612 -621932 -601538 -522851 -532312 -510599 -549380 -553734 -597027 -695003
$$ packed form
2748d98540K2885j5973r3946m6039L2020N8627m1070l2987n5739P560o0879J17570
2736f06511L0909m1742R4875k131j04773P4121j5879k6989n9767r5435J75132
2725e78190J6946m7268J8515L6223J7559O4402j5639j19559r419l3380J07607
2714e42203J4282o7508J9692l7162J0883N1569j8976l5666n482j7680M1512Q5037
2702e01702n5872m8524J6823N1250k5331M455m7653l7672o2693J6871J45626N7311
2690d87111j24435m5155P5740K2742N0330j40958J7219Q4576n4062P1451J4775
2679e14888Q3786q0973Q844K3021r9663l9693P2640n0949M8048P4129N7354o73
2667d19017n9856l49m0548q842r3320K0394P8687r461K1713l8781m354m3293r7976
$$ plain form
2654 -695003 -601059 -587583 -487568 -512178 -518816 -588375 -619894 -492207 -453063 -362261 -257111
2643 -257111 -325685 -215696 -327980 -312357 -220159 -296542 -330307 -463138 -380513 -325264 -305905
2632 -305905 -438694 -497609 -386784 -417065 -387355 -448744 -490480 -441669 -446477 -458584 -360269
2621 -360269 -415503 -382385 -496698 -500054 -509120 -559991 -522429 -565611 -558058 -494196 -452957 -343706
2609 -343706 -379186 -556688 -617142 -582667 -543236 -492221 -507541 -590237 -614380 -548723 -514748
2598 -514748 -465136 -444680 -379114 -385795 -376309 -417495 -445907 -431950 -511808 -658356 -657351 -534274
2586 -534274 -435005 -499073 -563152 -507185 -575424 -489414 -423414 -322825 -377096 -444856 -389174
2575 -389174 -479699 -487262 -440172 -552234 -463397 -447872 -458033 -359604 -337130 -418088 -445448 -499419
$$ packed form
2654f95003R3944J3476J00015k4610o638o9559l1519J27687L9144R0802J05150
2643b57111o8574J09989j12284J5623R2198p6383l3765j32831Q2625N5249J9359
2632c05905j32789n8915J10825l0281K9710o1389m1736M8811m808j2107R8315
2621c60269n5234L3118j14313l356r066n0871L7562m3182P553O3862M1239J09251
2609c43706l5480j77502o0454L4475L9431N1015j5320q2696k4143O5657L3975
2598e14748M9612K0456O5566o681R486m1186k8412J3957p9858j46548J005J23077
2586e34274R9269o4068o4079N5967o8239Q6010O6000J00589n4271o7760N5682
2575c89174r0525p563M7090j12062Q8837J5525j0161R8429K2474q0958k7360n3971
$$ plain form
2563 -499419 -576981 -546782 -518099 -495492 -398032 -504404 -449872 -434984 -440492 -391129 -397441 -427873
2551 -427873 -361450 -375107 -400623 -332526 -352761 -388019 -437414 -379371 -373175 -371732 -389230 -467765
2539 -467765 -418970 -438880 -445801 -512352 -396451 -417751 -417657 -535216 -526682 -527790 -524051 -432448 -387954
2526 -387954 -409710 -444225 -411353 -374332 -434102 -384249 -362514 -404328 -469687 -414997 -392352 -431962
2514 -431962 -370732 -351420 -355488 -359553 -399346 -365831 -357062 -368727 -264370 -258067 -247595 -375560
2502 -375560 -470498 -474835 -339831 -330568 -283783 -223072 -248451 -237141 -285644 -318962 -275598 -381063
2490 -381063 -390441 -340936 -274585 -279197 -342294 -297847 -245058 -210428 -115522 -160167 -195755 -184789
2478 -184789 -114997 -183372 -131006 -103116 -100888 -152413 -189250 -211852 -263158 -309569 -233736 -148278
$$ packed form
2563d99419p7562L0199K8683K2607R7460j06372N4532J4888n508M9363o312l0432
2551d27873O6423j3657k5516O8097k0235l5258m9395N8043O196J443j7498p8535
2539d67765M8795j9910o921o6551J15901k1300R4j17559Q534j108L739R1603M4494
2526c87954k1756l4515L2872L7021n9770M9853K1735m1814o5359N4690K2645l9610
2514d31962O1230J9312m068m065l9793L3515Q769j1665J04357O303J0472j27965
2502c75560r4938m337J35004R263M6785O0711k5379J1310m8503l3318M3364j05465
2490c81063r378M9505O6351m612o3097M4447N2789L4630R4906m4645l5588J0966
2478a84789O9792o8375N2366K7890K228n1525l6837k2602n1306m6411P5833Q5458
$$ plain form
2466 -148278 -147266 -172869 -198761 -229467 -97053 -54064 -128420 -69353 -58551 -65248 -17594 -60265
2454 -60265 -27220 -116848 -95328 -97996 -130449 -203023 -61285 -48496 -36036 -72191 -70816 87253
2442 87253 123649 102158 69611 8122 3248 14028 163513 284964 289991 241222 196132 233771
2430 233771 312053 321394 399467 379950 442324 411404 409108 578332 629364 599788 550965 582897
2418 582897 484611 509611 570123 678417 748461 903172 856253 870083 978855 1047756 1204380
2407 1204380 1381314 1375544 1450502 1596461 1776847 1952673 2122861 2107525 2242860 2476149
2397 2476149 2616199 2748484 3072272 3377667 3846690 4278294 4891397 5323224 5581944 5875810
2387 5875810 6281024 6820153 7554164 8412014 9613689 11162628 13566501 16754868 22430877
$$ packed form
2466a48278J012k5603k5892l0706J32414M2989p4356N9067J0802o697M7654m2671
2454f0265L3045q9628K1520k668l2453p2574J41738J2789J2460l6155J375J58069
2442H7253L6396k1491l2547o1489m874J0780J49485J21451N027m8769m5090L7639
2430B33771P8282R341P8073j9517O2374l0920k296J69224N1032k9576m8823L1932
2418E82897r8286K5000O0512J08294P0044J54711m6919J3830J08772O8901J56624
2407A204380J76934n770P4958J45959J80386J75826J70188j5336J35335K33289
2397B476149J40050J32285L23788L05395M69023M31604O13103M31827K58720K93866
2387E875810M05214N39129P34011Q57850J201675J548939K403873L188367N676009
$$ plain form
2378 22430877 31914326 45763236 58328591 65154470 65430488 61134091 54209934 45640267
2370 45640267 37094747 29183996 22755945 17268978 13193914 10134719 8159901 6989385
2362 6989385 6406661 5841334 5330249 4782605 4407856 3982572 3472594 3028713 2627568 2177230
2352 2177230 1896916 1623075 1486956 1387332 1295832 1074468 968144 854533 800726 710117
2342 710117 681850 618414 601733 638863 579934 515278 639314 635218 536748 380147 408129
2331 408129 414364 355801 370827 320758 149815 92537 57759 80137 155372 166938 120731 -33482
2319 -33482 37326 -533 -80777 -88168 -79901 21128 52495 -13613 48175 -10580 -76505 -170624
2307 -170624 -178460 -140815 -43687 25621 -57770 -243220 -231900 -258375 -376568 -411291 -541110
$$ packed form
2378B2430877R483449J3848910J2565355O825879K76018m296397o924157q569667
2370D5640267q545520p910751o428051n486967m075064l059195j974818j170516
2362F989385n82724n65327n11085n47644l74749m25284n09978m43881m01145m50338
2352B177230k80314k73841j36119r9624r1500k21364j06324j13611n3807r0609
2342G10117k8267o3436j6681L7130n8929o4656J24036m096r8470j56601K7982
2331D08129O235n8563J5026n0069j70943n7278l4778K2378P5235J1566m6207j54213
2319c3482P0808l7859q0244p391Q267J01029L1367o6108O1788n8755o5925r4119
2307a70624p836L7645R7128O9308q3391j85450J1320k6475j18193l4723j29819
$$ plain form
2296 -541110 -393604 -258881 -339711 -403105 -406392 -412418 -389725 -383947 -463792 -436651 -316054 -269967
2284 -269967 -331544 -383996 -447563 -456463 -399350 -366289 -374449 -373137 -376064 -484304 -370279 -419797
2272 -419797 -519203 -417284 -475781 -443745 -429461 -436295 -363130 -403400 -345479 -442629 -491680 -518756
2260 -518756 -483458 -451468 -446534 -417437 -493494 -498639 -504742 -498202 -507575 -537988 -553982 -448881
2248 -448881 -474936 -506680 -512914 -465078 -571253 -581515 -539407 -564198 -500495 -441369 -459411 -557032
2236 -557032 -629571 -641990 -610916 -595941 -587951 -513606 -504329 -499511 -607115 -586395 -566845 -605798
2224 -605798 -608323 -574515 -587235 -478330 -335943 -355667 -457103 -528329 -505159 -617961 -582103
2213 -582103 -553389 -578485 -599911 -514872 -482176 -454932 -494245 -501954 -514974 -620414 -681737 -687745
$$ packed form
2296e41110J47506J34723q0830o3394l287o026K2693N778p9845K7141J20597M6087
2284b69967o1577n2452o3567q900N7113L3061q160J312k927j08240J14025m9518
2272d19797r9406J01919n8497L2036J4284o834P3165m0270N7921r7150m9051k7076
2260e18756L5298L1990M934K9097p6057n145o103O540r373l0413j5994J05101
2248d48881k6055l1744o234M7836j06175j0262M2108k4791O3703N9126j8042r7621
2236e57032p2539j2419L1074J4975P990P4345R277M818j07604K0720J9550l8953
2224f05798k525L3808j2720J08905J42387j9724j01436p1226K3170j12802L5858
2213e82103K8714k5096k1426Q5039L2696K7244l9313p709j3020j05440o1323o008
$$ plain form
2201 -687745 -565518 -488244 -464658 -418275 -491942 -492490 -504002 -585963 -525462 -411720 -407355 -504055
2189 -504055 -532713 -517004 -488951 -491966 -472724 -550573 -638886 -476044 -538277 -486346 -421791 -538923
2177 -538923 -528199 -482698 -476007 -475328 -510577 -548457 -465661 -503649 -495923 -555676 -492316 -671764
2165 -671764 -604253 -563430 -539412 -491171 -520763 -497708 -482592 -475535 -558721 -579673 -561064 -526039
2153 -526039 -568688 -526034 -653603 -576540 -531363 -560302 -564274 -548183 -577176 -644363 -561294 -530122
2141 -530122 -505495 -409563 -495185 -501807 -460255 -510304 -595525 -623275 -591581 -553167 -558918 -594409
2129 -594409 -587333 -539816 -669911 -706485 -530714 -370042 -508349 -665480 -615548 -675505 -573918
2118 -573918 -584237 -640763 -632620 -575458 -503489 -518552 -512934 -426091 -430310 -408356 -343990 -209751
$$ packed form
2201f87745J22227P7274K3586M6383p3667n48j1512q1961O0501J13742M365r6700
2189e04055k8658J5709K8053l015J9242p7849q8313J62842o2233N1931O4555j17132
2177e38923J0724M5501O691O79l5249l7880Q2796l7988P726n9753O3360j79448
2165f71764O7511M0823K4018M8241k9592K3055J5116P057q3186k0952J8609L5025
2153e26039m2649M2654j27569P7063M5177k8939l972J6091k8993o7187Q3069L1172
2141e30122K4627R5932q5622o622M1552n0049q5221k7750L1694L8414n751l5491
2129e94409P076M7517j30095l6574J75771J60672j38307j57131M9932n9957J01587
2118e73918j0319n6526Q143N7162P1969j5063N618Q6843m219K1954O4366J34239
$$ plain form
2106 -209751 -190727 -225103 -227417 -213521 -217933 -289593 -352733 -441309 -463278 -470901 -485022 -495607
2094 -495607 -424865 -490216 -519828 -503900 -465479 -466072 -546078 -439089 -455832 -487453 -531808 -533086
2082 -533086 -532573 -545816 -560371 -542965 -582128 -622382 -642735 -496202 -460576 -613934 -638665 -623437
2070 -623437 -608612 -581292 -486644 -601616 -599014 -608719 -562641 -577296 -460191 -423695 -536267
2059 -536267 -563705 -588273 -674689 -647481 -507655 -524847 -525635 -471739 -512603 -541190 -627181 -658834
2047 -658834 -543610 -459358 -462548 -565495 -489535 -464479 -529060 -516260 -596120 -586776 -587602 -540717
2035 -540717 -490844 -573218 -543630 -565564 -528194 -515750 -447713 -494794 -463733 -407043 -484361 -498721
2023 -498721 -531344 -489124 -455770 -402940 -500117 -573006 -484801 -527427 -501661 -346688 -436192
$$ packed form
2106b09751J9024l4376k314J3896m412p1660o3140q8576k1969p623j4121j0585
2094d95607P0742o5351k9612J5928L8421n93q0006J06989j6743l1621m4355j278
2082e33086N13j3243j4555J7406l9163m0254k0353J46533L5626j53358k4731J5228
2070f23437J4825K7320R4648j14972K602r705M6078j4655J17105L6496j12572
2059e36267k7438k4568q6416K7208J39826j7192p88N3896m0864k8587q5991l1653
2047f58834J15224Q4252l190j02947P5960K5056o4581J2800p9860R344q26M6885
2035e40717M9873q2374K9588k1934L7370J2444O8037m7081L1061N6690p7318j4360
2023d98721l2623M2220L3354N2830r7177p2889Q8205m2626K5766J54973q9504
$$ plain form
2012 -436192 -439565 -595650 -629452 -602527 -514464 -458157 -581760 -553260 -528676 -502088 -462241
2001 -462241 -421218 -598366 -581758 -573190 -588614 -598703 -582411 -530664 -429570 -479280 -406929
1990 -406929 -520392 -622968 -555585 -480709 -505284 -629183 -611544 -590650 -619382 -565327 -500010
1979 -500010 -562078 -566698 -630427 -526957 -585751 -597238 -463422 -479012 -572857 -598073 -641902
1968 -641902 -674942 -694638 -633796 -619696 -581603 -591411 -603632 -560097 -495690 -610165 -669997 -626874
1956 -626874 -548776 -617675 -680667 -538583 -580663 -552244 -521162 -458932 -485204 -580443 -664474
1945 -664474 -563405 -493230 -484336 -455163 -479219 -637357 -594130 -566331 -620240 -657727 -678126
1934 -678126 -472667 -511806 -606916 -642656 -639124 -513297 -481995 -458201 -534075 -629998 -560626
$$ packed form
2012d36192l373j56085l3802K6925Q8063N6307j23603K8500K4584K6588L9847
2001d62241M1023j77148J6608Q568j5424j0089J6292N1747J01094m9710P2351
1990d06929j13463j02576O7383P4876k4575j23899J7639K0894k8732N4055O5317
1979e00010o2068m620o3729J03470n8794j1487J33816j5590r3845k5216m3829
1968f41902l3040j9696O0842J4100L8093r808j2221M3535O4407j14475n9832M3123
1956f26874P8098o8899o2992J42084m2080K8419L1082O2230k6272r5239q4031
1945f64474J01069P0175Q894K9173k4056j58138M3227K7799n3909l7487k0399
1934f78126K05459l9139r5110l5740L532J25827L1302K3794p5874r5923O9372
$$ plain form
1923 -560626 -482358 -453626 -486141 -506321 -486916 -459811 -529829 -564043 -574950 -580833 -524252 -559441
1911 -559441 -557146 -583885 -573069 -473523 -546378 -597283 -574358 -598210 -567244 -465667 -417538 -504391
1899 -504391 -672150 -622338 -634010 -660895 -545238 -493623 -548128 -585503 -692437 -583533 -507638
1888 -507638 -500285 -472334 -528162 -591583 -586644 -556066 -581918 -518505 -521923 -456271 -516946 -517351 -534818
1875 -534818 -449844 -404485 -436443 -532829 -540641 -501035 -515831 -554408 -587596 -581343 -551806 -420977
1863 -420977 -468292 -430049 -479210 -554154 -488633 -539124 -486239 -471216 -540213 -647803 -579663
1852 -579663 -486456 -511619 -511884 -494874 -471048 -471934 -523017 -562427 -545204 -518237 -489433 -473831
1840 -473831 -443538 -471080 -450546 -449378 -432696 -455017 -524546 -528949 -482836 -531381 -455789 -397579
$$ packed form
1923e60626P8268K8732l2515k0180J9405K7105p0018l4214j0907n883N6581l5189
1911e59441K295k6739J0816R9546p2855n0905K2925k3852L0966J01577M8129q6853
1899e04391j67759M9812j1672k6885J15657N1615n4505l7375j06934J08904P5895
1888e07638P353K7951n5828o3421M939L0578k5852O3413l418O5652o0675m05j7467
1875e34818Q4974M5359l1958r6386p812L9606j4796l8577l3188O253K9537J30829
1863d20977m7315L8243m9161p4944O5521n0491N2885J5023o8997j07590O8140
1852e79663R3207k5163k65J7010K3826q86n1083l9410J7223K6967K8804J5602
1840d73831L0293k7542K0534J168J6682k2321o9529m403M6113m8545P5592N8210
$$ plain form
1828 -397579 -532056 -508491 -582044 -517234 -543984 -452172 -413254 -502673 -483441 -496575 -485997
1817 -485997 -464805 -414666 -495446 -507542 -477939 -472776 -481178 -469431 -466668 -440303 -466346 -418566
1805 -418566 -440581 -494446 -470727 -429689 -452982 -461874 -556353 -459733 -478298 -413674 -377176 -414550
1793 -414550 -472430 -520844 -459134 -428523 -505342 -580847 -543721 -595897 -544237 -477926 -511775 -574634
1781 -574634 -589051 -546876 -495708 -540982 -581871 -635142 -515767 -547644 -528212 -514275 -588876
1770 -588876 -508128 -495593 -537150 -509036 -488586 -479620 -589284 -578015 -497069 -605276 -535235
1759 -535235 -453509 -441077 -496895 -433852 -377164 -469604 -508873 -421774 -519199 -583231 -575386 -513909
1747 -513909 -530824 -612088 -637977 -577609 -544321 -618254 -604177 -565041 -534129 -437708 -386087 -429202
$$ packed form
1828c97579j34477K3565p3553O4810k6750R1812L8918q9419J9232j3134J0578
1817d85997K1192N0139q0780j2096K9603N163q402J1747K763K6365k6043M7780
1805d18566k2015n3865K3719M1038k3293q892r4479R6620j8565O4624L6498l7374
1793d14550n7880m8414O1710L0611p6819p5505L7126n2176N1660O6311l3849o2859
1781e74634j4417M2175N1168m5274m0889n3271J19375l1877J9432J3937p4601
1770e88876Q0748J2535m1557K8114K0450Q966j09664J1269Q0946j08207P0041
1759e35235Q1726J2432n5818O3043N6688r2440l9269Q7099r7425o4032P845O1477
1747e13909j6915q1264k5889O0368L3288p3933J4077L9136L0912R6421N1621m3115
$$ plain form
1735 -429202 -555754 -526586 -461424 -421101 -470951 -514979 -420416 -377719 -388358 -467029 -552630
1724 -552630 -621796 -600991 -587983 -524404 -578220 -541069 -571594 -536630 -541683 -494446 -513725 -488350
1712 -488350 -574384 -539664 -494307 -394421 -402837 -511094 -536797 -514106 -463527 -529128 -568975 -591713
1700 -591713 -615889 -445529 -419948 -507518 -474370 -456018 -446868 -386083 -341334 -455216 -468548
1689 -468548 -533896 -474792 -433474 -453903 -429577 -454615 -478666 -588385 -539741 -461298 -417633
1678 -417633 -270973 -358241 -427106 -514974 -557152 -536215 -532731 -487054 -470404 -452823 -451816 -408692
1666 -408692 -378133 -338982 -389196 -466035 -454025 -560104 -555559 -525898 -405294 -534968 -476438
1655 -476438 -511388 -436521 -406493 -535740 -541827 -506572 -442751 -508971 -496756 -461440 -426676 -481223
$$ packed form
1735d29202j26552K9168O5162M0323m9850m4028R4563M2697j0639p8671q5601
1724e52630o9166K0805J3008O3579n3816L7151l0525L4964n053M7237j9279K5375
1712d88350q6034L4720M5357R9886q416j08257k5703K2691N0579o5601l9847k2738
1700e91713k4176J70360K5581q7570L3148J8352R150O0785M4749j13882j3332
1689d68548o5348N9104M1318k0429K4326k5038k4051j09719M8644P8443M3665
1678d17633J46660q7268o8865q7868m2178K0937L484M5677J6650J7581J007M3124
1666d08692L0559L9151n0214p6839J2010j06079M545K9661J20604j29674N8530
1655d76438l4950P4867L0028j29247o087L5255O3821o6220J2215L5316L4764n4547
$$ plain form
1643 -481223 -396162 -408982 -472653 -518287 -494646 -454261 -429111 -530875 -512623 -527577 -605955
1632 -605955 -510956 -530527 -549005 -560046 -553582 -583060 -570488 -586594 -545227 -443966 -496874 -599431
1620 -599431 -593859 -624679 -639451 -536046 -587883 -484393 -397438 -352974 -391903 -472705 -405855
1609 -405855 -453539 -499975 -456755 -445494 -484852 -566823 -564174 -470456 -551608 -598304 -555799 -587269
1597 -587269 -572423 -584509 -586584 -489979 -488284 -454697 -527227 -650595 -642033 -506802 -571514 -503472
1585 -503472 -362209 -515908 -535561 -543277 -471186 -466341 -518868 -591842 -617418 -557960 -518811 -406515
1573 -406515 -317859 -439843 -467324 -423846 -540686 -628992 -541624 -449191 -474361 -496375 -474246
1562 -474246 -431147 -393784 -459547 -532333 -592496 -546304 -470088 -507193 -484524 -481429 -434379 -513692
$$ packed form
1643d81223Q5061j2820o3671m5634K3641M0385K5150j01764J8252j4954p8378
1632f05955R4999j9571j8478j1041O464k9478J2572j6106M1367J01261n2908j02557
1620e99431N572l0820j4772J03405n1837J03490Q6955M4464l8929q0802O6850
1609d05855m7684m6436M3220J1261l9358q1971K649R3718q1152m6696M2505l1470
1597e87269J4846j2086k075R6605J695L3587p2530j23368Q562J35231o4712O8042
1585e03472J41263j53699j9653p716P2091M845n2527p2974k5576N9458L9149J12296
1573d06515Q8656j21984k7481M3478j16840q8306Q7368R2433k5170k2014K2129
1562d74246M3099L7363o5763p2786o0163M6192P6216l7105K2669L095M7050p9313
$$ plain form
1550 -513692 -528584 -569571 -536015 -572680 -539980 -425010 -526332 -552834 -566823 -463264 -437822
1539 -437822 -400354 -509943 -671858 -628228 -563571 -455408 -441154 -463714 -567708 -608213 -484375
$$ packed form
1550e13692j4892m0987L3556l6665L2700J14970j01322k6502j3989J03559K5442
1539d37822L7468j09589j61915M3630O4657J08163J4254k2560j03994m0505J23838
$$ [...]
##END NTUPLES=NMR SPECTRUM
##END=
