##TITLE=1H_DE-80H_X3
 200.13MHz, d2o
 8 sc
 
 19ns.26.2.2025
##JCAMPDX= 6.0         $$ Bruker NMR JCAMP-DX V2.0
##DATA TYPE= NMR SPECTRUM
##DATA CLASS= NTUPLES
##ORIGIN= UXNMR, Bruker Analytische Messtechnik GmbH
##OWNER= pz
$$ XWIN-NMR		Version 3.5
$$ Wed Jun  3 10:15:42 2026 Russian Standard Time (UT+4h)  Yarkov@DPX200
##.OBSERVE FREQUENCY= 200.1313
##.OBSERVE NUCLEUS= ^1H
##.ACQUISITION MODE= SIMULTANEOUS
##.ACQUISITION SCHEME= undefined
##.AVERAGES= 8
##.DIGITISER RES= 18
##SPECTROMETER/DATA SYSTEM= spect
##.PULSE SEQUENCE= zg30
##.SOLVENT NAME= CDCl3
##.SHIFT REFERENCE= (INTERNAL, CDCl3, 0, 15.4351)
##AUDIT TRAIL= $$ (NUMBER, WHEN, WHO, WHERE, WHAT)
$$ ##TITLE= Audit trail, XWIN-NMR		Version 3.5
$$ ##JCAMPDX= 5.01
$$ ##ORIGIN= Bruker BioSpin GmbH
$$ ##OWNER= Yarkov
$$ C:/Bruker/XWIN-NMR/data/yarkov2/nmr/H-C/1/pdata/1/auditp.txt
$$ ##AUDIT TRAIL=  $$ (NUMBER, WHEN, WHO, WHERE, WHAT)
(   1,<2026-06-03 10:14:39.28 +0400>,<Yarkov>,<DPX200>,
      <created by zg, POWCHK disabled, PULCHK disabled
       configuration hash MD5:
       00 E9 B6 7A A2 85 ED C7 34 08 36 98 17 FE 4E 26
       data hash MD5: 16K
       3C 09 F9 11 6B 7E 77 B9 95 8C 54 93 FD 28 BC 95>)
(   2,<2026-06-03 10:14:50.59 +0400>,<Yarkov>,<DPX200>,
      <Start of raw data processing
       efp BC_mod = 2 LB = 0.25 FT_mod = 6 PKNL = 1 PHC0 = -6382.496 PHC1 = 21.22195 SI = 16K 
       data hash MD5: 16K
       89 46 CE 2C BD 9E 98 7E F0 28 F6 23 DB B7 93 12>)
(   3,<2026-06-03 10:15:05.15 +0400>,<Yarkov>,<DPX200>,
      <pk PHC0 = -2.4 PHC1 = 0 
       data hash MD5: 16K
       B1 9A 18 19 62 9C 24 06 44 61 68 2E 7E A6 5C 58>)
(   4,<2026-06-03 10:15:08.76 +0400>,<Yarkov>,<DPX200>,
      <abs ABSG = 5 
       data hash MD5: 16K
       7A 36 7B F8 D7 D4 23 0C 9C 5A 6B 40 48 58 85 0D>)
$$ ##END=
$$ 
$$ hash MD5
$$ E0 D2 FF 14 92 9A 00 68 9D 3E FF 9A C2 A9 4D 89
##$RELAX= 
##$RELAX= 
##$RELAX= 
##$RELAX= 
##$RELAX= 
##$RELAX= 
$$ Bruker specific parameters
$$ --------------------------
##$DU= <C:/Bruker/XWIN-NMR>
##$EXPNO= 1
##$NAME= <H-C>
##$PROCNO= 1
##$TYPE= <nmr>
##$USER= <yarkov2>
##$AMP= (0..31)
100 100 100 100 100 100 100 100 100 100 100 100 100 100 100 100 100 100 
100 100 100 100 100 100 100 100 100 100 100 100 100 100 
##$AQSEQ= 0
##$AQ_mod= 1
##$AUNM= <au_zg>
##$AUTOPOS= <>
##$BF1= 200.13
##$BF2= 200.13
##$BF3= 200.13
##$BF4= 200.13
##$BF5= 200.13
##$BF6= 200.13
##$BF7= 200.13
##$BF8= 200.13
##$BYTORDA= 1
##$CFDGTYP= 0
##$CFRGTYP= 5
##$CHEMSTR= <none>
##$CNST= (0..31)
1 1 145 1 1 1 1 1 1 1 1 1 1 1 1 1 1 1 1 1 1 1 1 1 1 1 1 1 1 1 1 1 
##$CPDPRG= <>
##$CPDPRG1= <>
##$CPDPRG2= <>
##$CPDPRG3= <>
##$CPDPRG4= <mlev>
##$CPDPRG5= <mlev>
##$CPDPRG6= <mlev>
##$CPDPRG7= <mlev>
##$CPDPRG8= <mlev>
##$CPDPRGB= <>
##$CPDPRGT= <>
##$D= (0..31)
0 0.7 0 0 0 0 0 0 0 0 0 0.03 0 0 0 0 0 0 0 0 0 0 0 0 0 0 0 0 0 0 0 0 
##$DATE= 1780467278
##$DBL= (0..7)
120 120 120 120 120 120 120 120 
##$DBP= (0..7)
150 150 150 150 150 150 150 150 
##$DBP07= 0
##$DBPNAM0= <>
##$DBPNAM1= <>
##$DBPNAM2= <>
$$ [...]
##$SUBNAM3= <"">
##$SUBNAM4= <"">
##$SUBNAM5= <"">
##$SUBNAM6= <"">
##$SUBNAM7= <"">
##$SUBNAM8= <"">
##$SUBNAM9= <"">
##$SW= 18.0517328524113
##$SWIBOX= (0..15)
0 0 2 0 0 0 0 0 0 0 0 0 0 0 0 0 
##$SW_h= 3612.71676300578
##$TD= 16384
##$TD0= 1
##$TE= 0
##$TE2= 300
##$TE3= 300
##$TEG= 300
##$TL= (0..7)
0 120 120 120 120 120 120 120 
##$TP= (0..7)
150 150 150 150 150 150 150 150 
##$TP07= 0
##$TPNAME0= <>
##$TPNAME1= <>
##$TPNAME2= <>
##$TPNAME3= <>
##$TPNAME4= <>
##$TPNAME5= <>
##$TPNAME6= <>
##$TPNAME7= <>
##$TPOAL= (0..7)
0.5 0.5 0.5 0.5 0.5 0.5 0.5 0.5 
##$TPOFFS= (0..7)
0 0 0 0 0 0 0 0 
##$TUNHIN= 0
##$TUNHOUT= 0
##$TUNXOUT= 0
##$USERA1= <user>
##$USERA2= <user>
##$USERA3= <user>
##$USERA4= <user>
##$USERA5= <user>
##$V9= 5
##$VALIST= <valist>
##$VCLIST= <CCCCCCCCCCCCCCC>
##$VD= 0
##$VDLIST= <DDDDDDDDDDDDDDD>
##$VPLIST= <PPPPPPPPPPPPPPP>
##$VTLIST= <TTTTTTTTTTTTTTT>
##$WBST= 1024
##$WBSW= 4
##$XGAIN= (0..3)
0 0 0 0 
##$XL= 0
##$YL= 0
##$YMAX_a= 443601
##$YMIN_a= -422657
##$ZGOPTNS= <>
##$ZL1= 120
##$ZL2= 120
##$ZL3= 120
##$ZL4= 120
##$ABSF1= 15.40973
##$ABSF2= -2.642118
##$ABSG= 5
##$ABSL= 3
##$ALPHA= 0
##$AQORDER= 0
##$ASSFAC= 0
##$ASSFACI= 0
##$ASSFACX= 0
##$ASSWID= 0
##$AUNMP= <proc_1d>
##$AZFE= 0.1
##$AZFW= 0.1
##$BCFW= 0
##$BC_mod= 2
##$BYTORDP= 0
##$COROFFS= 0
##$CY= -3
##$DATMOD= 1
##$DC= 0
##$DFILT= <>
##$DTYPP= 0
##$F1P= 0
##$F2P= 0
##$FCOR= 1
##$FTSIZE= 16384
##$FT_mod= 6
##$GAMMA= 0
##$GB= 0
##$INTBC= 1
##$INTSCL= 3.241238e-09
##$ISEN= 128
##$LB= 0.25
##$LEV0= 0
##$LPBIN= 0
##$MAXI= 10000
##$MC2= 0
##$MEAN= 0
##$ME_mod= 0
##$MI= 1.114404
##$NCOEF= 0
##$NC_proc= -6
##$NLEV= 6
##$NOISF1= 3.799351
##$NOISF2= 2.8
##$NSP= 0
##$NTH_PI= 0
##$NZP= 0
##$OFFSET= 15.43508
##$PC= 1
##$PHC0= -6384.896
##$PHC1= 21.22195
##$PH_mod= 1
##$PKNL= yes
##$PPARMOD= 0
##$PSCAL= 0
##$PSIGN= 0
##$REVERSE= no
##$SF= 200.130017334696
##$SI= 16384
##$SIGF1= 3
##$SIGF2= 2
##$SINO= 0.751879
##$SIOLD= 32768
##$SREGLST= <19F.Aceton>
##$SSB= 0
##$STSI= 16384
##$STSR= 0
##$SW_p= 3612.71676300578
##$SYMM= 0
##$S_DEV= 0
##$TDeff= 16384
##$TDoff= 0
##$TI= <>
##$TILT= no
##$TM1= 0
##$TM2= 0
##$TOPLEV= 0
##$USERP1= <user>
##$USERP2= <user>
##$USERP3= <user>
##$USERP4= <user>
##$USERP5= <user>
##$WDW= 1
##$XDIM= 16384
##$YMAX_p= 302780209
##$YMIN_p= -347243
$$ End of Bruker specific parameters
$$ ---------------------------------
##NTUPLES= NMR SPECTRUM
##VAR_NAME=  FREQUENCY,     SPECTRUM/REAL,   SPECTRUM/IMAG
##SYMBOL=    X,             R,               I
##VAR_TYPE=  INDEPENDENT,   DEPENDENT,       DEPENDENT
##VAR_FORM=  AFFN,          ASDF,            ASDF
##VAR_DIM=   16384,         16384,           16384
##UNITS=     HZ,            ARBITRARY UNITS, ARBITRARY UNITS
##FACTOR=    0.220516191357247, 1,           1
##FIRST=     3089.0227428241, 0,             0
##LAST=      -523.69402018168, 0,            0
##MIN=       -523.69402018168, -347243,      0
##MAX=       3089.0227428241, 302780209,     0
$$ Real data points
##PAGE= N=1
##DATA TABLE= (X++(R..R)), XYDATA
$$ [...]
9858 295069 390458 606874 407621 401167 593473 494264 512598 679494 746639 475403 542139
9847 542139 548003 489631 541719 574758 377950 321915 413711 416402 326535 449436 414568 259499
9835 259499 264062 278903 319464 278387 283091 399131 453928 275363 379810 401691 381759
9824 381759 522882 682024 488436 515636 658572 479323 529918 423934 277243 437736
9814 437736 462578 493602 431072 411635 466733 494899 561198 567463 443622 362027 299716 300594
9802 300594 397797 363058 356223 401008 249493 347466 436537 345492 282010 381043 260202
9791 260202 224730 291873 275595 217318 237717 204341 181410 197250 359657 369610 198955
9780 198955 195383 343205 283143 217968 269145 259982 258842 304660 350836 289790 266995 358107
9768 358107 301427 102665 171539 150254 161543 241852 182872 199550 196739 159334 237082 181807
9756 181807 308212 322128 230674 233441 283890 304865 353114 334924 225055 284752 260783
9745 260783 271612 433872 283292 268772 285317 40861 232608 238438 216117 352818 248822
9734 248822 187025 204897 192113 339657 416298 269331 138524 31829 174101 298762
9724 298762 394445 425029 357690 484032 423184 406956 442181 383532 306926 241965 268736
9713 268736 278448 263146 410570 380035 380706 406904 338944 435181 499581 490634 426538 424343
9701 424343 377788 281069 403385 475371 365269 540225 594388 551268 591216 441928 397163
9690 397163 530824 512702 622953 541826 413394 372835 389312 482691 426888 359378 411936
9679 411936 435271 511106 355143 266689 355942 426988 456383 500811 518676 457142 462190 452270
9667 452270 523403 531110 573610 567519 515329 745654 681698 601416 692932 613505 584758 684416
9655 684416 707442 750338 789428 643880 576391 576120 490457 511355 404705 310435 320163 342470
9643 342470 450889 445192 315725 368047 447811 318459 370908 481386 459380 543246 421480
9632 421480 425247 589380 469408 588316 554128 408929 327569 415817 576800 527546 458200
9621 458200 478889 458817 561873 481323 416492 398826 425490 476651 395818 374440 398292
9610 398292 479742 570964 688347 589720 500386 608589 578017 494672 485198 473305 529672
9599 529672 497740 549974 724467 617720 479086 557806 537047 581962 645812 517381 503122
9588 503122 605986 451554 448385 505739 428618 388422 418310 426121 477827 491422 514283 527260
9576 527260 328725 469222 509309 420776 482026 494185 400355 416575 458415 618909 656847
9565 656847 479725 549109 588677 477426 617340 553656 405129 454647 624650 588406 374354
9554 374354 438942 571119 551778 536519 517974 488966 407396 504115 557735 594250 614851
9543 614851 531474 545389 646792 753772 711440 612553 642274 774937 809715 753690 802291
9532 802291 868601 823631 867700 947779 1029954 1018603 1115092 1009985 922156 1068661 977052
9521 977052 883610 1011334 993080 828357 870986 950234 982131 828334 688311 786623 643222
9510 643222 675026 801405 680515 602191 681145 594144 663199 617946 690856 740438 650619
9499 650619 748492 787035 717632 709457 892132 777897 698912 836103 740665 783491 824301
9488 824301 849195 836159 731517 768743 780218 764873 772051 827434 764830 894434 998570
9477 998570 945819 883718 787301 726997 792250 851174 982351 1074517 972689 993416 1134265
9466 1134265 974667 1037325 1120262 1016210 1068450 1162022 1147764 1205767 1270239 1289257 1179439
9455 1179439 1177356 1221095 1201387 1382783 1279525 1253257 1293695 1219899 1306941 1355944 1254299
9444 1254299 1184637 1185771 1205318 1249486 1253602 1194103 1164284 1221290 1257619 1235366 1230468 1387356
9432 1387356 1333209 1251676 1395984 1338357 1225999 1387285 1395256 1432657 1455291 1412233 1602760
9421 1602760 1616102 1691198 1765314 1751031 1694599 1764323 1699659 1677066 1766157 1675302 1572780
9410 1572780 1595476 1563654 1612885 1587961 1546671 1398682 1376838 1448232 1520509 1357447 1443144
9399 1443144 1635619 1573831 1602421 1620951 1557765 1724264 1785616 1508076 1568151 1641392 1638626
9388 1638626 1725760 1643998 1548125 1554652 1608862 1807707 1925479 1891240 1846505 1985066 2092316
9377 2092316 1975797 2057208 2143336 2024040 1968884 2063399 2089285 2086697 2097728 1994555 1961758
9366 1961758 1931724 1975149 1927160 1853650 1883380 1900887 1900532 1929802 1950307 1853078 1883128 1821593
9354 1821593 1875303 2008435 1787952 1991072 2063406 1820201 1990856 2164381 2068175 2188741
9344 2188741 2072237 2181866 2332317 2274126 2458865 2627786 2565255 2719966 2636983 2649499
9334 2649499 2876885 2922085 2766449 2662866 2716778 2765840 2805516 2624556 2722931 2697699 2629849
9323 2629849 2821574 2700316 2719759 2888011 2779942 2744270 2666238 2689381 2835690 2980676
9313 2980676 3117011 3028502 3012334 3005545 3160273 3275079 3263930 3346783 3470474 3468491 3593216
9302 3593216 3766030 3666051 3664670 3796836 3773490 3850688 3908881 3966956 4035024 4207355 4310575
9291 4310575 4170544 4232245 4495520 4586600 4549247 4812597 4800442 4891717 5085004 5301505
9281 5301505 5375347 5326920 5458087 5662017 5652292 5752630 6065347 6127989 6187020 6589071 6602072
9270 6602072 6592922 6794134 7067014 7284408 7280172 7666778 7804863 7901578 8294800 8637091
9260 8637091 8870359 9055081 9374609 9723131 10076293 10436545 10837574 11061133 11409157 12048891
9250 12048891 12449691 12872896 13301458 13722078 14277191 14650877 15033609 15250626 15625288
9241 15625288 16158380 16515180 16718115 17023921 17197571 17422430 17866629 17967777 17839095
9232 17839095 17934519 18003065 18001981 17858400 17626381 17313930 16974901 16781578 16532128 16129692
9222 16129692 15619137 15321263 14835537 14432434 14100006 13678225 13198595 12746235 12601069
9213 12601069 12173012 11782117 11343870 10920677 10700149 10498573 10200957 9747426 9381453
9204 9381453 9192153 8936538 8547464 8210529 7824073 7544014 7537207 7428353 7178727 6985028
9194 6985028 6808911 6845827 6617494 6400584 6219808 6100552 6077075 5985018 5734112 5536762
9184 5536762 5340162 5202616 5067217 4926086 4920991 4787115 4694069 4707706 4507037 4378665
9174 4378665 4328137 4314966 4395041 4229770 4246331 4183188 4197242 4197853 4177788 3974302 3928733
9163 3928733 4075014 4217106 4169160 4053814 3968840 4035732 4064108 4110776 4192497 4031097 4027406
9152 4027406 3984588 3852823 3800856 3749813 3640039 3676992 3501340 3514663 3437691 3426953 3374242
9141 3374242 3452507 3281881 3200491 3304256 3229012 3310580 3311698 3070746 3188898 3205073 3162477
9130 3162477 3191196 3108311 3186133 3237096 3237232 3121547 3190589 3274182 3324807 3316908 3342141 3269799
9118 3269799 3297134 3162228 3165089 3472307 3499089 3505230 3614115 3568435 3781406 3660876 3594074
9107 3594074 3886342 3783611 4022665 4057011 4035740 4037046 3971027 3900199 3967818 3858879 3669201
9096 3669201 3714274 3701000 3765943 3753567 3680031 3722687 3774660 3779074 3809476 3945909 3997142
9085 3997142 4017524 4179246 4161341 4329372 4387809 4648300 4760182 4884113 5182136 5556059
9075 5556059 6032447 6364312 6490771 6480380 6331935 6154749 5831720 5603745 5335359 5024201
9065 5024201 4929228 4729895 4625180 4414952 4463188 4432006 4376598 4313282 4314899 4507767 4648539
9054 4648539 4680059 4789129 4803344 4923856 5013164 4972297 5024766 5203201 5364107 5553346
9044 5553346 5958108 6256479 6629235 7103833 7743693 8255056 8519111 8605127 8520053 8283422
9034 8283422 8105848 7693240 7125916 7007772 6929770 6755966 6789899 6793147 6824486 7012909
9024 7012909 7431942 7709715 7998536 8217342 8504043 8995682 9265238 9562559 9599369 9613292
9014 9613292 9696319 9515272 9221689 8772490 8515154 8364025 8209218 8056613 7894903 7918660
9004 7918660 7833503 8049936 8160654 8169941 8321231 8416832 8666499 8815936 8972550 9071731
8994 9071731 9463758 9899694 10332507 10913251 11329081 11632042 12320731 13023573 13295591 13719683
8984 13719683 14024513 14399116 14808100 15023635 15149021 15031870 14903927 14878976 14626484 14461479
8974 14461479 14354322 14329319 14527022 15112341 15758937 16537452 17624177 18930906 20903693
8965 20903693 23083472 25708532 28776567 32127976 35918223 39619634 43034109 46780415
8957 46780415 50071545 52881330 55384520 57770711 59085563 59589711 60186553 60250581 59205677
8948 59205677 57934699 56752887 55235823 53814499 52810874 52311412 52133069 52239510 53192234
8939 53192234 54539880 56121349 57824228 59492207 61112546 62723353 63882796 64774708
8931 64774708 65692331 66681570 68026325 69728742 72334203 76610863 79764209 77634236
8923 77634236 74017067 69989838 63276898 54631537 46856839 40344908 34973254 30338312
8915 30338312 26831055 24462563 23157559 22216302 21342172 20762344 20337520 20084458 20019016
8906 20019016 20079445 20167973 20381664 20624739 20909508 21469463 22145144 23010032 24511252 26863270
8896 26863270 30045811 33770914 38186682 42244817 45521765 47574383 47711945 46255606
8888 46255606 43434842 39715268 35657093 31716432 28110877 25138076 22457752 20274616
8880 20274616 18772348 17386833 16488283 15792875 15517705 15429222 15116483 15141755 14982227
8871 14982227 14815668 14966554 15138182 15096769 15239613 15678579 15867169 16360999 17197873 18345723
8861 18345723 20183069 22890378 26847387 32337432 38632539 45492675 51808613 56293676
8853 56293676 58577207 58581075 56414467 52590361 47998931 43431557 39267198 35976112 33701887
8844 33701887 32221384 31762374 32124681 33247584 35129831 37280935 39069863 40659881
8836 40659881 41836000 41832386 40837550 38853456 36205507 32760669 29042006 25330583 21772795
8827 21772795 18997317 16725504 14890477 13846685 12962462 12403680 12174231 11639965 11304036
8818 11304036 11249601 11313581 11452974 11666316 11937682 12279139 12864185 13665973 14601613 15814001
8808 15814001 17632638 19869302 22776071 26435432 30465091 35009940 39729488 43584966
8800 43584966 46903561 49398370 50313890 49621919 47414400 43856901 39563884 34540032
8792 34540032 29126668 24132828 20208515 16999472 14621536 12928805 11426520 10631335
8784 10631335 9981249 9348933 8825414 8311151 8017504 7674678 7369205 7240784 6965855
8775 6965855 6792431 6695880 6558851 6405321 6119597 6021925 6165054 6059284 5768209 5852447
8765 5852447 5926979 5882868 5993087 5879682 5643433 5792556 5809982 5717061 5639978 5589042 5624911
8754 5624911 5607865 5838008 5678821 5657886 5643237 5613494 5757921 5813920 5779869 5939220 6080465
8743 6080465 6225526 6238203 6315062 6427001 6663486 6845989 6956659 7266181 7419427 7642752
8733 7642752 7855446 8159727 8312544 8557266 9072821 9590440 10250601 11266960 12464836
8724 12464836 14004498 16338386 18916742 21701982 24812020 27930888 30567721 32626721
8716 32626721 34270660 35461588 36362614 37109545 37543267 37690377 37004225 36060869 34430955
8707 34430955 32074220 29463299 26734861 23989528 21674449 19630286 17713210 16119744
8699 16119744 14665264 13540479 12773397 12070353 11654738 11225359 11115755 11154455 11163262 11391565
8689 11391565 11469083 11982125 12830151 13966706 15317654 17086456 18958694 21006345 23161215
8680 23161215 24656193 25854023 27017128 27859704 28684116 29528898 30252670 30839805 31428450
8671 31428450 32158152 33011054 34099758 35418183 36960124 38579940 39770014 40391543 40581779
8662 40581779 40248578 39867965 39540687 39213647 38843692 37798507 36356778 33955966 30876366
8653 30876366 27427363 24105026 21182427 18528507 16172887 14286133 12529308 11178762
8645 11178762 10101699 9377094 8786966 8333330 7954772 7757132 7804832 7761406 7908924 8236971
8635 8236971 8664587 9287986 10392268 11917712 13935287 15986612 18085635 19947543 21300696
8626 21300696 22260102 22660920 23010561 23308017 23463923 23585268 23195914 22337966 21040005
8617 21040005 19250659 17207136 15032765 13198062 11328305 9741056 8450248 7326609
8609 7326609 6381445 5536038 5108673 4643554 4365328 4149328 3879964 3744778 3516101 3348596
8599 3348596 3280987 3224673 3144547 3003531 3071052 2950630 2735010 2762300 2764632 2604806 2570171
8588 2570171 2508920 2530662 2563654 2471632 2444133 2330608 2093012 2093673 2178388 2029705 1945882
8577 1945882 2008682 1956385 1790791 1505656 1459579 1517958 1375760 1348273 1100023 1086090 1216873
8566 1216873 1081026 1061201 1074634 1045230 1043936 1078469 1071581 991820 1013610 1030443 890880
8555 890880 990151 1061306 1102450 1069881 1028716 891234 961098 958606 908756 735954 731249 745608
8543 745608 664002 800358 730052 627521 609886 662087 585134 594892 603382 639047 639946 572679
8531 572679 617893 820502 606629 639428 633883 602636 652175 812522 868026 752138 836413
8520 836413 788550 874536 974767 957555 796729 779009 582300 588675 577438 608055 556536
8509 556536 420454 363276 428242 258201 174223 340558 414214 320277 134184 151886 199438
8498 199438 118478 300690 458298 219405 271964 495450 480363 563568 684023 512442
8488 512442 704232 859041 831266 1001294 1204634 1188861 1210901 1185303 1213627 1344295 1232479
8477 1232479 1235284 1421175 1355475 1158085 1098026 953000 892485 812924 651860 598014 390726
8466 390726 485365 592280 412792 296923 114083 98094 279235 282570 327626 316624 343169
8455 343169 257597 366150 341536 364407 411093 522491 788208 909848 821263 1007870 1073633
8444 1073633 1043227 1380011 1318334 1197112 1243898 1283761 1276748 1183744 1025409 917965 882648
8433 882648 921735 787580 679241 445882 596904 510174 366664 374973 347321 359612 400032
8422 400032 311158 396715 292278 202555 295742 199142 308640 247531 297129 304351 321177
8411 321177 138225 159018 260541 297678 235386 365209 249001 148286 258717 341564
8401 341564 417625 398477 344628 346307 435712 338779 440600 358203 329998 271543 233812 261240
8389 261240 371839 235936 297082 319090 160562 186124 187493 167108 262724 196333 107696
8378 107696 286702 263250 325193 435694 326110 294519 386336 227590 407840 439143 469044
8367 469044 459577 392285 338515 387440 453403 449927 506360 501713 693177 606899 519433 574401
8355 574401 644787 539172 616183 589465 665853 644252 552471 664350 716361 743163 844614
8344 844614 732995 579466 628258 643111 597554 773580 857760 647747 746542 703855 587310
8333 587310 700830 677684 593196 546536 585136 621935 627110 689820 614187 744600 685781
8322 685781 754383 896711 923180 1103572 1153721 1058390 1038474 959050 982593 990838 860584
8311 860584 758651 665117 783130 918997 921116 705463 747162 734730 694846 850851 653298
8300 653298 786078 854986 756990 642900 528879 478203 604049 626260 528753 555833 516094
8289 516094 520581 639495 630651 623130 544956 343784 305104 409619 481983 528242 496995 357714
8277 357714 569932 562433 386889 450816 482505 435279 453866 498787 558448 460642 437986
8266 437986 320498 407018 391433 303325 431373 204014 147938 249644 223374 267610 278984
8255 278984 213733 225506 53617 3414 -26997 -76566 65920 48866 -55310 -8357 9452
8244 9452 28792 232329 191498 -23681 25632 127506 42078 125960 69630 27890 60246
8233 60246 53628 76465 147511 14392 -48512 3366 -25994 -66328 14278 39740 -62717 -26795
8221 -26795 -33772 -85920 -115480 -84711 -95773 -83909 -60413 -54216 -67480 110879 153257 -54353
8209 -54353 37721 31087 96113 153862 250347 313242 346374 434691 506796 644840 508240 605377
8197 605377 791545 820541 925332 1023312 963510 1347456 1489788 1143743 1054541 1055600 835845
8186 835845 923929 972101 955888 935117 880669 939040 920282 895806 617831 674115 617832
8175 617832 546685 647836 434484 519638 507044 430063 424971 276470 323388 366122 239536
8164 239536 310158 374184 235187 315012 299481 68200 226212 97548 -55300 227978
8154 227978 190511 124222 184839 70341 59979 238246 179532 44100 27963 97661 47775
8143 47775 36648 11773 -43796 30337 -68954 -104394 -89963 -224545 -103136 -213921 -189286
8132 -189286 12313 -124084 -13174 -21531 -120442 -83403 -147267 -101565 -85437 -34800 -161587
8121 -161587 -115229 -157035 -221917 -4311 -69428 -103805 -73925 -134081 -157551 -140683 -157837
8110 -157837 -200519 -229725 -221578 -258364 -253248 -307832 -271703 -224358 -194542 -193484 -262645 -188945
8098 -188945 -152251 -239646 -287951 -201291 -218721 -252111 -309402 -327859 -283221 -287663 -167092 -212925
8086 -212925 -311532 -281882 -194602 -250799 -180124 -46453 -81627 -135877 -56836 -186123 -308929
8075 -308929 -189017 -313320 -298049 -173480 -299573 -226976 -150867 -131787 -130231 -265968 -295157
8064 -295157 -250130 -285107 -293962 -203011 -229841 -114006 -56341 -255250 -189405 -255305 -87908
8053 -87908 59419 -256425 -171155 -111876 -197141 -22254 -94533 -199489 -233629 -252525 -250502
8042 -250502 -140597 -161567 -104623 -18629 -121800 -82295 -28545 -130818 -152783 -113325 -276430
8031 -276430 -101181 -182227 -128887 60392 -121922 -200024 -187069 -157393 -104312 -143590 -76376
8020 -76376 -123792 -114716 -146263 -80284 93585 -23099 -62505 -28583 -5121 65556 68087 163407
8008 163407 180941 314799 308007 321955 255943 333128 335224 206655 251192 240869 53391
7997 53391 43131 65105 69834 163612 22006 4340 -28432 4301 5847 65 -120317 -139036
7985 -139036 -1594 -51424 -122794 -87772 -92762 -40893 -107434 -113681 67571 117050 128452 125222
7973 125222 153591 165251 76950 93296 128648 123051 297341 200625 87045 125739 65827
7962 65827 -3931 -27240 -32702 -175877 -228843 -289321 -147162 -116390 8450 42494 -14264
7951 -14264 -35827 -149799 -194775 -105332 -172687 -289749 -159958 -165269 -195798 -224179 -347243
7940 -347243 -167660 -105962 -208190 -216378 -275088 -238168 -207267 -189166 -134511 -232837 -219374
7929 -219374 -176427 -216819 -179875 -74518 -192708 -158028 -26281 -97804 -211890 -201150 -238103
7918 -238103 -221917 -301436 -207307 -120510 -102530 -81058 -161040 -83479 -182875 -194682 -214188 -205023
7906 -205023 -225363 -127748 -232454 -259087 -121003 -90237 -131687 -137114 -134681 -183967 -87518 -141483
7894 -141483 -224635 -199549 -271991 -222770 -266575 -273732 -186749 -62704 -36771 -148573 -89568
7883 -89568 -115654 -224804 -135485 -153110 -204508 -219853 -23193 51781 -21341 12581 -192227
7872 -192227 -319826 -209593 -242037 -129470 -99687 -297149 -260024 -85708 -107672 -76913 -63657
7861 -63657 -178967 -115205 -63523 -172377 -4338 -80359 -304661 -84689 -75722 -161050 -87429
7850 -87429 -80950 -180234 -208434 -205890 -208700 -258843 -130901 -38382 -70090 -95127 -27906 -200683
7838 -200683 -64350 9430 -155958 -196634 -177454 -197859 -69221 -111034 -169325 -101179 -143809
7827 -143809 -29472 -49343 -34039 -87268 -59603 7208 -59535 -32938 35971 -12767 16609
7816 16609 36376 -63142 -152508 -142972 -109218 -19941 13630 -78535 2522 7089 29190 -12147
7804 -12147 -15836 36250 -87774 -122287 -93911 -56716 -109999 -78449 -136244 -151339 -96135 -129737
7792 -129737 -145218 -71577 -85734 28794 -63604 -103874 12354 57129 69065 -8725 -64208
7781 -64208 -25233 18548 9956 43862 49406 -14063 89324 89588 -48022 -19517 -39797 34932
7769 34932 84089 8452 27775 63796 -62371 124129 73110 27160 39418 -24377 150333
7758 150333 105800 -8208 18418 56551 56193 64298 97562 53748 45910 134548 -24864 147657
7746 147657 123105 89165 164379 217967 189129 47211 -67878 -44937 79273 -2360 51982
7735 51982 16768 -69603 33849 30803 -88497 26102 147271 256102 194552 162613 36270
7724 36270 22126 32134 105014 140266 -11204 113982 120408 188203 287206 51514 -28375
7713 -28375 -4847 70751 137546 -34372 83465 163726 31443 39771 26320 -17426 -12485 28737
7701 28737 52213 -204637 -236352 38848 13769 73423 75178 74591 30952 152913 205737 -55286
7689 -55286 -76484 -15326 -129990 29609 127682 -31215 -156956 -66612 70044 73319 -2640
7678 -2640 -124399 -130468 -83144 791 145439 -41483 -77236 182872 118236 -61174 61171
7667 61171 82974 -90948 60392 45302 -138785 -216235 -81700 -6890 -142016 -23915 -40992
7656 -40992 -180554 33853 -73902 -248567 -190861 -239954 -64150 -18114 -40388 -481 -48400
7645 -48400 -49154 115581 47281 -161793 -163255 -96304 -75446 -122142 -56699 66014 -39828 -67150
7633 -67150 -49119 -150503 -104227 27390 -29175 -11411 143637 -75008 -25597 50593 -3925
7622 -3925 -53596 10396 -149296 -233692 -201187 -101572 -95794 -142428 -168316 -34558 -61717 -115603
7610 -115603 -35757 -58668 -60171 -59887 53652 -141460 -175148 18409 18614 29836 -20301 23394
7598 23394 -17455 8666 115718 -58704 -45494 4935 -53810 48334 -49768 -129137 -31562
7587 -31562 45194 -34052 -101687 -127017 -179556 -47338 27358 -94924 -185154 -142915 -109247
7576 -109247 3662 -5418 -248275 -209882 -148673 -53973 44903 -60117 -27341 -64292 -54049
7565 -54049 88202 -69294 -95787 -71584 -69563 135759 30930 -199002 -78359 -130559 -138825
7554 -138825 90274 -131420 -146318 90091 -60001 -104675 -42134 -110793 5297 -93166 -103662
7543 -103662 -67514 -92987 -39082 43419 -59092 -106287 -197867 -206473 -144128 -43123 -80399
7532 -80399 -82235 -92322 -125261 -114126 -153260 -53722 -104568 -308707 -11337 -5076 -214921 -33626
7520 -33626 84421 41713 -52533 -7594 -3383 -58192 57387 72575 -148103 -188217 -94513
7509 -94513 -52838 -27527 -74748 -96664 -103352 -85060 -76617 22424 -26571 71713 55972 -24889
7497 -24889 126866 82904 106101 100481 -52543 -24389 15897 -55900 101050 45395 14390
7486 14390 22876 -70546 28107 180434 126586 -59395 -158732 -162957 -57029 -34589 -52803 134512
7474 134512 3301 57132 182887 -84522 -100398 -19573 -205846 32421 57067 57346 275429
7463 275429 212404 154712 196634 10262 291 124428 73168 140337 122069 104411 815
7452 815 52731 116495 137219 165258 109369 138666 -95744 -22966 110671 53709 204363 113921
7440 113921 72550 201846 106075 66520 53267 167483 130496 -39738 42521 -9391 6210
7429 6210 -43164 -65057 119395 81277 89703 159756 174647 73572 48040 102570 83689 113254
7417 113254 175112 67460 9110 70419 204859 111512 217694 296399 118039 104638 145961
7406 145961 130944 54980 -10530 -86485 311 -22369 -25126 21983 31744 42672 139263 20918
7394 20918 31798 114635 89817 14519 -85896 -3177 -107811 -55461 103358 -50192 -3735
7383 -3735 4944 -108418 -39838 -114112 -219897 45828 171764 323655 287593 104872 144235
7372 144235 152997 170696 174300 188621 115929 -65818 -1322 -25992 -111560 9292 69428 -128393
7360 -128393 -90268 8107 -261677 -157556 -10148 -77074 81746 15939 -66313 35662 67088
7349 67088 70679 -19519 -19404 66518 87040 87174 -27529 33500 -30647 -160631 -15125 83207
7337 83207 -74469 -50141 4806 1230 -46572 -23738 -45694 -88633 -125465 -159361 -106174 -159328
7325 -159328 -156084 -30292 -19525 -59043 -169197 -141131 -94252 -109599 10906 -78669 -103761
7314 -103761 11273 -43093 -86905 53443 -81256 -7799 4491 -7738 70897 81115 -18794
7303 -18794 -65087 -73900 130475 213284 200353 265175 415229 320594 319090 299539 133397 156536
7291 156536 107202 26594 18697 -165888 -108229 -35474 -83008 -81620 -68112 -65893 2345 26379
7279 26379 56404 29509 35814 106479 40468 -45474 -96825 -28331 9710 11660 62040 133845
7267 133845 -37413 -4093 -6570 -62762 45569 106064 88404 110557 65754 95676 -12094
7256 -12094 128940 203080 53636 65040 56233 181497 360574 273928 177173 153449 135689
7245 135689 189166 179832 124412 91995 111716 7350 -28748 38932 -34771 -21221 61452 51781
7233 51781 -119384 -77167 -91197 -126420 12116 -4440 -172792 -165344 44001 116465 -6193
7222 -6193 -4576 -34424 27076 86329 220900 171174 71236 56362 67800 48353 92096 94810
7210 94810 47173 259309 254030 237724 76369 118811 202474 111495 51471 -55270 -196861
7199 -196861 -84930 88336 61624 -140860 -140760 -107079 -135462 43500 -8136 -204921 -229701
7188 -229701 -27080 16993 -107776 -170802 -168333 -202062 -185594 -73138 -149917 -93550 -9156
7177 -9156 -65572 -165251 -151615 -73488 -111955 4649 -5705 -212890 -222395 -112377 -67685 -88623
7165 -88623 -32686 -91810 -120800 -133949 42696 86024 -75569 -166002 -54428 -71851 -9433
7154 -9433 39665 -99762 -74326 -32211 24703 -96237 3239 58970 86181 97030 -40235
7143 -40235 -51842 -128729 -74098 -32093 -78864 -39661 -26170 -84819 -48377 -8385 -78066 -44176
7131 -44176 -24971 -20766 69600 144824 78964 159539 187193 167599 229366 186456 165942 194385
7119 194385 89855 60319 92720 146696 107282 52024 104628 21434 5906 85406 68364
7108 68364 5811 29307 91195 52926 137196 161076 23774 64561 146059 -18172 6879
7097 6879 -94178 -51347 26780 -46211 40742 13936 -144145 -49377 46087 14879 -16027 -65155
7085 -65155 -3775 4851 70001 -69374 519 46946 -112415 -53326 -75756 -161215 -74106 46775
7073 46775 77424 53053 132760 47530 -16487 -112676 11039 72416 132225 158067 85138 38192
7061 38192 86971 126731 44044 76172 8736 16164 68697 152087 112129 169654 12132 -35617
7049 -35617 74727 -65880 -99697 -93869 -125615 -62307 -86723 -92834 8689 -109753 -87399
7038 -87399 -18991 75488 2488 -109025 8510 31844 -113877 -120389 -202549 -90894 125486
7027 125486 81363 -130435 -107867 -94900 -111513 3987 -2503 -73947 -50641 -56525 61881
7016 61881 105423 -103198 37827 70499 17558 -81838 -78470 -87760 -59036 -585 59850 10491
7004 10491 20301 11736 57071 12170 -124449 -148219 -172934 -113919 -58552 -30346 -116455 -112736
6992 -112736 -80980 -57048 -49339 -107033 -91443 -128615 -1571 -25862 -140898 -136717 -94518 -174726
6980 -174726 -128935 -58712 -30777 -2551 -44090 -86485 -111100 -222877 -122389 27366 -59348
6969 -59348 21186 -37925 -132995 8211 46876 20888 21229 -158630 -110181 -87880 -112894 -1651
6957 -1651 -131269 -243133 -9229 -63281 -108033 -138359 -139789 -80737 -156712 -75697 -87129 -10783
6945 -10783 2449 -54357 -10385 -185837 -166734 -56335 26783 -107818 -121906 47427 -23469
6934 -23469 43562 -37272 -98851 -101481 -64306 -97001 -83972 96486 -57966 21353 97099 -100319
6922 -100319 -45007 26481 2950 91763 23288 -15105 -85580 -148980 -109684 61064 -51898
6911 -51898 -125833 -9643 1242 117142 57580 21094 -100099 -90551 36601 -29351 -155054
6900 -155054 50367 74944 -30043 52606 46170 -68863 -59967 -19908 -28572 -20946 -6438 -9246
6888 -9246 52757 120395 92570 41174 103683 74353 66180 -135223 -62455 14304 -147557 -22475
6876 -22475 -57324 -29757 -109707 44899 148412 -40630 -14020 13581 -124949 -43178 76795
6865 76795 35355 74338 60020 16573 61360 139287 81350 -156157 -125994 -55611 -14113 30896
6853 30896 -2363 -150459 -89244 -50861 64690 4449 -67364 44959 102110 -33907 -221170
6842 -221170 -101422 -161451 -39710 79095 51693 -24982 -30901 -26694 -162809 -42584 -109275
6831 -109275 -160146 -25270 -11753 -29524 -40101 -101141 -36236 -41975 -52626 -68317 -209244
6820 -209244 -82224 -92800 66934 55555 13930 -142474 -121331 6881 87331 108618 -67524
6809 -67524 -16575 147591 82847 -169802 -60128 -31469 -21331 59603 86226 94197 77942
6798 77942 13209 -14371 -55983 -55329 -7128 37886 -9365 112231 97982 -28172 107661 -29331
6786 -29331 -31658 112188 45656 74175 150895 87779 40779 -31677 -13048 -31090 5661 91570
6774 91570 137266 85716 5640 45987 -36844 -31559 2699 -57580 20623 -3755 48495 112586
6762 112586 -35250 28681 81162 -43633 92330 71150 -84846 -11214 80735 11483 20895
6751 20895 111919 131334 133919 74720 43261 59952 10406 -32897 -74637 3615 -6058 54377
6739 54377 66994 52473 152712 185325 120123 109881 100005 91240 172061 138054 225951 159056
6727 159056 168530 182136 73627 20840 -29648 3586 69592 84290 51656 69700 97913 35806
6715 35806 93411 24889 59407 208341 168963 170801 288263 136032 119377 141702 -33028
6704 -33028 132363 210833 226218 178751 217068 217231 148960 196010 230062 160996 124588 222327
6692 222327 151795 121886 189044 154216 106212 251086 111142 123185 56259 -97964 53424
6681 53424 158836 135223 139248 60647 61496 100404 26904 80555 128115 126093 129782 169517 110201
6668 110201 101394 157665 147325 165543 105273 124792 87034 61417 61855 181745 81946 96570
6656 96570 219569 50753 82663 119081 113214 78122 128592 51974 77261 60122 117511 175020
6644 175020 204043 166788 -2926 7941 182862 128537 136250 186203 97549 175809 161810
6633 161810 153473 68754 56387 -160 1597 86211 87161 134446 102748 251542 204860 114329
6621 114329 124882 34902 155247 243943 163370 253900 190679 204062 216820 306965 257171
6610 257171 294117 306019 187174 332002 228388 182490 259048 370032 312661 283310 285234
6599 285234 182923 114275 230331 234228 151321 200739 341801 232688 305968 228446 161790
6588 161790 395272 326169 242972 238396 251035 334331 426172 423930 508103 516210 310781 318767
6576 318767 356387 307389 270614 297576 294823 139795 379530 452423 276455 482745 469035
6565 469035 424981 448327 381709 324605 346983 524232 498691 446008 484738 408338 409563 466275
6553 466275 423018 228116 330006 561189 388979 425098 476558 582181 598096 469544
6543 469544 466033 577066 554070 569939 599506 471971 505482 609645 513037 492245 492763 497145
6531 497145 489571 555330 501668 349787 462317 441399 403429 558019 530644 483892 373385
6520 373385 400684 449608 430652 449347 427855 533522 578427 539696 504180 444388 459939
6509 459939 450571 488812 388285 433018 486694 424880 430508 404003 468703 525252 605617 585459
6497 585459 549068 462780 432145 390076 497661 604504 688265 734022 742186 554823 560054
6486 560054 585947 598268 575062 605161 534665 524056 598728 543382 492928 472794 556172 538089
6474 538089 503613 589988 691681 707199 839268 766904 709414 644729 619532 520097 484054
6463 484054 473487 452529 469385 441189 404693 420045 275746 337275 451625 372514 358344
6452 358344 318634 341073 373731 560378 342924 324529 500799 422482 442418 541284 472389
6441 472389 460545 573441 597885 480039 531423 561224 570859 674124 660948 622163 615638
6430 615638 643044 683224 723033 674515 594028 709362 646633 589107 727250 674093 563915
6419 563915 639982 645699 654622 661631 906476 878910 918106 971791 866746 830231 980912 874079
6407 874079 831107 899861 852653 971505 946104 837019 676566 660744 620665 669632 761376
6396 761376 763207 670492 667692 661224 752303 672376 693020 698042 747870 715794 620017 463068
6384 463068 525860 589649 556488 672406 674807 592124 659637 624728 634386 713992 596252 521379
6372 521379 569521 556684 515528 610471 642822 648473 788241 797544 752010 865706 867937 820691
6360 820691 836333 905012 861308 777037 942986 911688 892816 920980 1041842 993160 1158584
6349 1158584 1173156 1141135 1208301 1255133 1330653 1392208 1346241 1498135 1590362 1483098 1576749
6338 1576749 1524763 1414146 1470374 1616993 1494271 1492117 1551759 1549941 1573960 1718668 1713762
6327 1713762 1694439 1688986 1779213 1805965 1867489 1941148 1763585 1712473 1826349 1755379 1629291
6316 1629291 1705130 1740371 1785431 1812240 1668712 1757138 1917940 1843609 1943993 1922960 1877037
6305 1877037 1982736 2055470 1940863 1869535 1811097 1784869 1891369 1807909 1747276 1851116 1847670
6294 1847670 1905487 2052090 2139896 2197769 2154622 2366372 2464141 2651023 2846188 3214486
6284 3214486 3421262 3736972 4070557 4517356 5337840 6366222 7814823 9782158 11865174
6275 11865174 13649392 14955321 15391424 14727896 13608446 12363904 10937988 9712652
6267 9712652 8700884 8004906 7756724 7747292 8213540 9431956 11047972 12923604 14770584
6258 14770584 15935980 16454284 15869281 14488560 12952877 11481417 9986056 8604756
6250 8604756 7366082 6326492 5671635 5116728 4745507 4460891 4132526 4001267 3941301
6241 3941301 3803019 3820874 3763707 3609992 3677094 3698514 3601978 3651868 3586679 3535545 3639388
6230 3639388 3761410 3707377 3701122 3789627 3898987 3955239 3898740 4030109 4292017 4334661 4610408
6219 4610408 4868346 5012731 5429859 5865478 6204505 6751384 7463874 8222904 9284124
6210 9284124 10514981 12415732 15305379 19211734 24316051 29877241 34662884 37641489
6202 37641489 38376805 37052658 34387932 30909365 27369699 24218119 21590306 19642260
6194 19642260 18650119 18495316 19951538 22789709 26874278 31698045 36040634 38880439
6186 38880439 39615655 38183318 35114876 31052644 26753038 22618451 19072279 15993749
6178 15993749 13459800 11520821 9944541 8744853 7908170 7482284 6673185 6180274 5863039
6169 5863039 5502644 5443076 5213944 5026134 4879635 4620047 4585118 4559491 4485686 4322318
6159 4322318 4198586 4225122 4138155 3946945 3994782 4119562 4099888 4071888 3880720 3770021
6149 3770021 3971874 4021609 4129369 4129146 4043976 3908438 4092661 4260409 4331783 4622766 4658864
6138 4658864 4874131 5258115 5530481 5919321 6334048 6994315 7752956 8776235 10133788
6129 10133788 11771327 14272519 17585825 21531528 25895476 30262383 33542207 35443939
6121 35443939 35743760 34245472 31712613 28337415 24528493 21240068 18265973 15869124
6113 15869124 14331948 13473324 13017283 13211012 14068195 15473238 17882712 21114973 25078596
6104 25078596 29444307 33316978 35935579 37069680 36648528 34538067 31216263 27286667
6096 27286667 23210217 19582917 16295772 13637240 11553711 10040753 8921961 7836668
6088 7836668 7183476 6528280 5842721 5609161 5317516 5039124 4903207 4679400 4424543 4414986
6078 4414986 4206744 3975896 4019022 3908052 3736113 3790444 3836478 3616632 3496144 3483333
6068 3483333 3432702 3462339 3578160 3437082 3619810 3744373 3799678 4129635 4507054 4930175
6058 4930175 5572753 6351716 7485256 9037491 10805780 12467700 13582135 14270226 14371620
6049 14371620 13882122 13055297 11772175 10216080 9196421 8091636 7139411 6630960 6289262
6040 6289262 6223773 6466415 6631893 7104506 8087831 9215543 11035098 12931314 14370140
6031 14370140 15436061 15851877 15564396 14735725 13379071 11650737 10017407 8589705 7296884
6022 7296884 6247327 5362255 4644036 4264184 3871678 3740045 3319065 3063644 2901246
6013 2901246 2708326 2705779 2468683 2477125 2388673 2384195 2268535 2116102 2121549 2005433 1889259
6002 1889259 1822098 1704778 1609435 1650828 1678156 1775539 1846744 1614191 1562818 1643354 1706291
5991 1706291 1806594 1704818 1602419 1577528 1504760 1561886 1631611 1533753 1501896 1561758 1509815
5980 1509815 1490770 1555401 1507893 1544342 1624020 1579882 1531867 1505855 1621277 1627719 1623019 1666361
5968 1666361 1817648 2107100 2204406 2190079 2118935 2072384 1977163 1772961 1733706 1585296 1547828
5957 1547828 1673858 1754047 1911663 2031008 1912307 1927995 1937798 1845424 1843538 1813949 1905387
5946 1905387 1894916 1872169 1706854 1617258 1541663 1413145 1346328 1498960 1616707 1528344 1561607
5935 1561607 1594443 1454873 1406938 1345730 1160183 1220489 1239979 1125112 1021707 934626 865153
5924 865153 1137668 1100920 1023638 1095553 1025619 975209 894084 828846 881635 950682 940234
5913 940234 876502 831601 960940 903215 841049 946027 887936 820756 778095 595848 766039
5902 766039 898903 787350 775458 892033 763276 844734 846885 863779 970487 947144 1002577
5891 1002577 877344 937035 999576 1051968 1015883 969796 813304 829714 853143 868093 894143
5880 894143 926251 856311 895050 868309 873878 971316 923147 908017 871876 759283 692229 911012
5868 911012 874518 660884 761452 722990 779329 969931 783487 783417 708700 799718 1028236
5857 1028236 1071670 1018510 1037551 874131 941517 1174509 906970 842640 765663 730955 804028
5846 804028 819292 877791 938928 982312 922792 1058102 1119074 1208557 1337460 1236089 1375862
5835 1375862 1359858 1269428 1336649 1319733 1406612 1384721 1467991 1312944 1428879 1412771 1262896
5824 1262896 1242136 1104433 1169497 1311043 1186030 1185769 1189106 1030740 1053707 1208649 1195556
5813 1195556 1209615 1262109 1245924 1411842 1452514 1469880 1454308 1457304 1380694 1327184 1266123
5802 1266123 1155151 1147156 1116121 1231253 1201981 1101812 1317096 1352586 1434899 1381112 1353003
5791 1353003 1424806 1462684 1567935 1606134 1710250 1722816 1793928 1748308 1574147 1664437 1628438
5780 1628438 1627564 1709462 1816922 1804968 1818642 1801553 1853046 1883048 1879202 1858927 1914705 2005493
5768 2005493 1951285 1960604 2020824 1777402 1891615 1911153 1786837 1915395 1713652 1627795 1564115
5757 1564115 1700086 1704549 1598497 1569879 1478372 1453678 1439081 1308833 1207901 1130256 1122643
5746 1122643 1143145 1105093 1018073 1037747 1114507 1196264 1105752 1101675 1220577 1167601 1194575
5735 1194575 1192650 1310051 1422578 1420093 1452506 1412555 1360558 1163941 1122606 1166206 1311311
5724 1311311 1382179 1223275 1244846 1378385 1312185 1257163 1393025 1593376 1661372 1563796 1453894
5713 1453894 1516200 1364649 1415878 1424746 1326575 1365829 1424845 1474961 1546513 1497677 1540381
5702 1540381 1538648 1562753 1515485 1285485 1146306 1236922 1315040 1097016 1381851 1301619 1353635
5691 1353635 1453431 1405242 1511184 1492852 1201380 1317044 1424099 1379752 1493399 1489327 1290453
5680 1290453 1483610 1536828 1479385 1372721 1219516 1265477 1318043 1437824 1513385 1452148 1392854
5669 1392854 1613472 1534051 1522041 1529706 1336864 1365534 1497565 1417043 1429416 1518627 1503661
5658 1503661 1552835 1467391 1359306 1428705 1416329 1363880 1631156 1572743 1406707 1600366 1508323
5647 1508323 1531922 1628183 1461121 1375162 1511041 1605243 1707818 1733719 1543261 1661296
5637 1661296 1621188 1555666 1782721 1550364 1544975 1596211 1435024 1467766 1501219 1465233 1619880
5626 1619880 1636766 1579688 1554365 1313585 1406189 1529597 1313234 1306983 1339571 1296046 1445931
5615 1445931 1626543 1688199 1696527 1774322 1776589 1824906 1875891 2011701 2148583 2381020 2691762
5604 2691762 2804318 3054410 3177384 3284652 3196983 3063228 2894523 2574790 2302951 2106791
5594 2106791 1960173 1894932 1699820 1587424 1589150 1629287 1623641 1618339 1664074 1780318 2057747
5583 2057747 2189924 2420841 2730353 3044705 3216351 3324289 3265365 3140768 2963191 2849634
5573 2849634 2588274 2388546 2185418 2017204 1931078 1853032 1743166 1605085 1517401 1404924
5563 1404924 1395934 1384367 1237217 1277026 1351387 1345051 1451643 1314252 1212986 1153166 1217084
5552 1217084 1266942 1202556 1149084 1203063 1176404 1245640 1208434 1138232 1067452 1111257 1252008
5541 1252008 1242347 1273166 1335226 1177523 1161002 1207071 1128034 1081104 1156302 1211117 1224725
5530 1224725 1160847 1145541 1171369 1142211 1241489 1267626 1157860 1181082 1263258 1159276 1089079
5519 1089079 1024701 1056625 1185089 1106917 1255487 1384913 1168095 1211530 1368224 1115457
5509 1115457 1100458 1208117 1094179 1203510 1293314 1278763 1266008 1341741 1422483 1538951 1488301
5498 1488301 1459949 1483628 1455283 1633049 1685707 1508332 1563927 1579553 1515937 1578030 1573843
5487 1573843 1423589 1430119 1447425 1489873 1637390 1657945 1737741 1873545 1803124 1786814 1722528
5476 1722528 1553285 1606487 1623065 1687676 1889518 1892632 1929815 2117259 2120191 2165532 2356389
5465 2356389 2180101 2209368 2260761 2106503 2261414 2271812 2150208 2286760 2282154 2257708 2228562
5454 2228562 2230199 2305274 2471242 2472369 2640675 2658914 2462579 2590066 2468535 2458402 2453781
5443 2453781 2218320 2294276 2387473 2441455 2517544 2649190 2614969 2818740 2928043 2857247 2996593
5432 2996593 3062863 2968483 2909782 2933479 3054748 3080308 3062035 3036927 2923077 2954806 3107172
5421 3107172 3010868 2914730 3025624 2982750 2910113 2995816 2944855 3026028 3086184 3005668 3268272
5410 3268272 3370028 3261584 3522365 3609157 3542543 3743255 3765946 3819513 3926176 4021669
5400 4021669 4025843 4133029 4198708 4299810 4373278 4568524 4739328 4675623 4694705 4722605 4714990
5389 4714990 4767373 4924101 5002649 5008249 5095780 5211831 5240758 5307321 5259795 5149623 5003191
5378 5003191 4958631 5050709 4927102 4885748 4971458 5140308 5243565 5519931 5627637 5634496 5854116
5367 5854116 6122628 6213219 6492512 6642766 6869591 7042485 7176325 7367326 7512322 7601511
5357 7601511 7796525 7899357 8116718 8381637 8556800 8774261 9242623 9829039 10497812 11468272
5347 11468272 12937300 14722978 17132335 19328888 20975053 22549734 24311733 25829466
5339 25829466 25962630 25219246 24821126 24239754 22988196 21488974 20099232 18894481 17853524
5330 17853524 17175551 16885013 17025635 17471494 18281286 19495629 21278417 23913298 27124807
5321 27124807 31336595 37440285 44185653 49374070 53433790 57828855 61935857 63481196
5313 63481196 62603974 61361855 60896345 59913620 56779820 52276719 48709307 44924941 41582639
5304 41582639 39751193 40042845 42571242 46842707 49967100 53343853 58806241 65300495
5296 65300495 71018251 75400596 78609117 80935119 84910968 90595431 97852361 102715471
5288 102715471 109656122 116587811 120701332 121819987 122140933 120413977 119057511 116183928
5280 116183928 111537668 104664105 94821607 84287188 73387308 63943918 56188215 51606270
5272 51606270 50136369 51643009 54483993 58590106 60686660 61261243 61766798 62080902 61687468
5263 61687468 61096759 61630848 62378539 61785221 59531855 57169759 54911280 53200408 52410117
5254 52410117 51578938 50322040 49627410 48786280 47758145 46761850 46322112 46796998 47349108
5245 47349108 48739110 50363741 50469468 48979586 46846431 43239783 39287500 35384859
5237 35384859 32514320 30780355 29721155 29526038 29629668 30042895 30736915 30855264 30192241
5228 30192241 28995988 27759700 26534232 25008011 23201511 21283329 19356926 17785369
5220 17785369 16399276 15414060 14673506 14376715 14499997 14869745 15373482 15691494 15277427
5211 15277427 14688310 13923186 12976218 12105115 11235190 10503328 10020766 9570292 9218492
5202 9218492 8952921 8732141 8664510 8551302 8398699 8436049 8367521 8375874 8313336 8459071 8441171
5191 8441171 8374942 8337839 8299258 8335104 8444213 8391637 8272257 8283543 8341974 8479209 8566848
5180 8566848 8773250 9086027 9295052 9500794 9819614 10266970 10698365 11555079 12588035
5171 12588035 14039915 16626575 20116906 24933058 30175925 35801374 42680993 49588464
5163 49588464 54429367 55967225 53324176 48035871 41705447 35641392 30203179 25775071
5155 25775071 21896609 18811989 16545954 14842365 13713315 12999340 12575191 12434989 12272148
5146 12272148 11946664 11812067 11765373 11827180 12155317 12576857 13356854 14871233 16707791
5137 16707791 19184632 21050144 21572312 22039834 22023540 21952306 22488187 23781386 26334638
5128 26334638 30385183 35837352 43344193 53167799 63028500 69460872 69619899 64291958
5120 64291958 56978638 50818616 46362221 42979710 39564295 36484161 34848508 34431707
5112 34431707 36360452 41763218 49859663 58096621 63341979 63548001 59511641 54185060
5104 54185060 48894221 43740418 38168672 32917474 28870892 26138207 24511566 23365254
5096 23365254 22366676 21347986 19859065 18267412 17200264 16337772 15635948 15251618 14687925
5087 14687925 14162144 13812157 13666270 13589261 13541180 13740939 13942251 14357005 14838018 15682192
5077 15682192 16547851 17771687 19971857 23060863 28106169 36097328 45408317 52951268
5069 52951268 57418413 61226268 63018872 63581164 62451953 59915510 55812334 50541306
5061 50541306 45274007 40325812 37109841 35808031 36390228 38514883 41682335 45089841
5053 45089841 48926448 53084406 59334075 67418538 74969447 76913148 75687518 74170578
5045 74170578 70874238 66806347 61638439 58120640 55503419 51335150 46989155 44231702
5037 44231702 42613231 42197088 41841753 41113836 41834830 43358002 43944480 44374798 46347061
5028 46347061 48963869 49087641 45617341 42299077 38181719 33072939 28101039 24109240
5020 24109240 20889290 18110782 15890658 14371253 13346716 12669802 11834633 11057929 10617379
5011 10617379 10225046 10021531 9795444 9498123 9410059 9286665 9156064 8992245 8871342 8683190
5001 8683190 8524100 8517195 8283499 8362147 8324922 8195993 8249944 8072933 7869684 7860231 7899394
4990 7899394 8036757 8105197 8101064 7958523 7785963 7769669 7871345 7747605 7657271 7759348
4980 7759348 7990594 8147209 8142682 8269091 8531553 8554834 8545173 8530607 8473977 8353851 8281244
4969 8281244 8191176 7945181 7963799 7886264 7885114 8083042 7958329 7865936 7939862 7956484 8188583
4958 8188583 8520815 8489571 8625779 8721486 8587574 8622546 8676709 8591239 8514736 8631582 8647281
4947 8647281 8706372 8914817 8884939 9078840 9349774 9364852 9434374 9349451 9288441 9510435 9471930
4936 9471930 9334232 9338706 9287754 9330904 9296600 9261464 9320609 9198581 9415196 9723971 9810451
4925 9810451 10297740 10609785 10876275 11262851 11696190 11802615 11891148 12076426 11993545 12054339
4915 12054339 12078139 12067083 12065966 12175281 12404686 12552104 12740092 13078450 13475458 13935127
4905 13935127 14233432 14534091 14862067 14991022 15129523 15367949 15261531 15262627 15218704 15190995
4895 15190995 15228241 15384716 15446066 15350366 15443261 15825548 16111598 16456296 16894666 17201877
4885 17201877 17674849 18203410 18519307 18764963 19113548 19311354 19533615 19674073 19929383
4876 19929383 20266389 20531123 20655918 20848594 21152300 21577761 21970790 22463460 23204680
4867 23204680 24319746 25747769 27907518 31345489 36113522 41217502 45624663 48264547
4859 48264547 48811285 47899270 45950327 43754548 41412361 39570770 38371481 37638096 37768676
4850 37768676 38609608 40101015 42464722 45959931 51262363 58216379 66504759 75374010
4842 75374010 83964124 92367796 100011237 106043962 108993018 109380607 108067689 105241445
4834 105241445 101916643 98566351 95561901 93004563 90906187 89637737 88981343 89299413
4826 89299413 91026535 94228678 99270934 105931004 113313226 119797698 124791865 128522047
4818 128522047 131548476 134948961 139041039 143741058 149059940 154529230 160330602 165949359
4810 165949359 170951732 175073755 177875690 179116118 178800138 177004546 173992617 170424200
4802 170424200 166499878 162733597 159499090 156751453 154855516 153705120 153073484 152965935
4794 152965935 153275339 154094524 156175375 159516506 164880548 172758615 181969144 190750808
4786 190750808 196231525 197420164 195292810 190924248 185595078 179875295 174093919 168271733
4778 168271733 162322767 156060470 149805377 143453501 136941210 130656345 124561885 119145418
4770 119145418 114401736 109829262 105751038 101753187 97603257 93860082 90683644 88072552
4762 88072552 86270727 85167043 84428213 83554594 81845218 79174073 75673762 71717331
4754 71717331 67796298 63951071 60215484 56839012 53754660 51334645 49229934 47710448
4746 47710448 46581774 46043886 46252574 47587581 50648981 56301077 64603095 74134853
4738 74134853 82039544 86317162 85839544 82764088 77803921 72529307 69516374 69461608 73777512
4729 73777512 81115361 86312846 85409409 82846676 78223269 71025660 63598424 57421304
4721 57421304 53603195 52170522 53599075 58047775 63634818 68134452 70717732 71483520
4713 71483520 70325075 67017375 64214892 62688998 63726090 67078737 70489811 72246576
4705 72246576 70405969 66117507 60497281 53455309 46521300 40215000 35180068 31011322
4697 31011322 27777315 25542145 23934793 22863959 22001637 21180824 20496002 19772293 19206824
4688 19206824 18806789 18369959 18133902 17932385 17474159 17154958 17037593 16854401 16918086 16884943
4678 16884943 17086921 17416485 17669453 17964903 18246536 18374794 18491539 18630190 18324078
4669 18324078 18021358 17708226 17073066 16818214 16466740 16060567 15885258 15703405 15700411 15812620
4659 15812620 15760191 15727707 15928860 16066815 16093908 16163731 16162333 16192485 16330799 16429194 16628159
4648 16628159 16970338 17063130 17434350 17778450 18037806 18320934 18401710 18630189 18858571 18837530
4638 18837530 19065947 19276824 19434005 19642532 19834586 20093653 20375980 20694739 21022625
4629 21022625 21381729 21765176 22106554 22391442 22796394 23310609 23911815 24562893 25156471
4620 25156471 25567171 26013324 26511968 27017135 27630296 28094059 28609078 29266929 30157252
4611 30157252 31046214 31735346 32973896 34214287 35829097 37609665 39393850 41719972
4603 41719972 44106315 46843732 50119386 54083372 59519225 67388049 78557362 93844200
4595 93844200 112717219 135362046 160788604 186671958 210709571 232136561 248933064
4588 248933064 260101053 266836784 270380711 270625243 269233261 268508284 269955905 274914120
4580 274914120 282536242 290724928 297985385 302780209 302512473 296867282 286743459 271101438
4572 271101438 250118104 227097814 203621948 180493410 159672031 142353371 128102077
4565 128102077 117181863 108486776 100873984 93643204 86407957 79744340 73479091 67829431
4557 67829431 63273203 59879330 58157719 58136988 59462893 61276776 62409148 61729646 59259698
4548 59259698 55641611 51550615 47324658 43340563 39738561 36579655 33977089 32086905
4540 32086905 30598622 29348940 28247233 27322935 26494005 25780440 25208229 24521294 23712564
4531 23712564 23264017 22941101 22613264 22511865 22364084 22257197 22368302 22554432 23358897
4522 23358897 24466630 26104769 28382458 31053942 33737521 36268822 38294569 39272142
4514 39272142 39376777 38380228 36459740 34161947 31696635 29196954 27066501 25213682
4506 25213682 23388028 22002288 20968467 20267176 19872567 19638864 19666260 19897727 20583509
4497 20583509 21576931 22672377 23998394 25697278 27435304 28918048 29885503 30066576 29768849
4488 29768849 28981616 27436717 25710970 23704558 21821799 20251985 18787540 17567318
4480 17567318 16729666 16170744 15753153 15488218 15203309 15021154 14882066 14983200 15135597
4471 15135597 15202504 15373944 15551029 15767517 16425011 16959103 17418606 18009452 18273690 18306485
4461 18306485 18456447 18443993 18068893 17728321 17123517 16638428 16146315 15310183 14812422 14359001
4451 14359001 13966927 13832284 13495756 13190108 13027596 13019755 13033025 13174015 13425787 13604361
4441 13604361 13686611 13880018 13879483 13838317 13519830 13248665 12622042 12069008 11766048 11307565
4431 11307565 10904822 10739379 10300277 9971590 9938544 9813719 9681115 9670702 9557183 9550296
4421 9550296 9638075 9543278 9412328 9179823 8894635 8839991 8724185 8550773 8500681 8366818
4411 8366818 8148236 8211904 8086848 7930469 7909189 7708668 7694613 7641164 7669939 7744471 7595960
4400 7595960 7610989 7828527 7768186 7739710 7881625 7722827 7685350 7726040 7534588 7740017
4390 7740017 7641245 7593623 7532218 7434384 7527692 7390596 7259647 7268529 7196543 7399215 7311645
4379 7311645 7146805 7107708 7351701 7642671 7684138 7738164 7769022 7806920 7869243 7966087 7962641
4368 7962641 7947997 7969560 7939752 8001579 7878959 7908409 7864121 7969146 8037078 7907776 7883981
4357 7883981 7875658 7953647 7886992 7910306 7879387 7962388 8101134 8330141 8546191 8803224 9200299
4346 9200299 9740341 10265734 10722157 10899774 10914231 10755659 10664198 10575942 10227767 9993538
4336 9993538 9768672 9693219 9569682 9304128 9123235 8878415 8898066 8988812 8745325 8769094
4326 8769094 8808221 8771347 8851076 8826624 8691618 8604820 8614079 8625240 8714547 8868591 8864503
4315 8864503 8962460 9149095 9411282 9504807 9450660 9550583 9706248 9903765 10109022 10336135
4305 10336135 10442563 10421833 10538216 10417022 10137383 9952500 9883803 9738607 9523044 9262599
4295 9262599 9037255 9015088 9038412 9020389 8859515 8761047 8777711 8726711 8709209 8592495 8220266
4284 8220266 8097129 7962254 7787720 7829030 7562012 7385136 7250336 7027090 6877811 6932815
4274 6932815 6816976 6853192 7021000 6809514 6833757 6758870 6603438 6622877 6576741 6514327 6408584
4263 6408584 6428984 6464598 6364360 6290339 6257876 6206955 6259926 6314436 6189005 6186041 6182674
4252 6182674 6249967 6456392 6469402 6241967 6444543 6514247 6589865 6634637 6603997 6481739 6493673
4241 6493673 6662245 6588363 6366652 6237794 6274927 6262152 6464571 6441876 6335251 6399212
4231 6399212 6500045 6652454 6710150 6640303 6683593 6825676 6633166 6731908 6713688 6659483 6704925
4220 6704925 6703802 6603495 6639168 6641373 6614265 6644989 6742860 6858055 6778604 6899910 6924061
4209 6924061 7059398 7103623 7122578 7267874 7341810 7426744 7506181 7474234 7578912 7781139 7966942
4198 7966942 8117911 8011512 8110081 8241918 8312899 8615199 8821563 8746614 9009133 9309720
4188 9309720 9446449 9724969 9966386 10248594 10547670 10907789 11184157 11520019 11733074 12035383
4178 12035383 12374718 12755899 13091039 13369617 13836482 14393721 14900222 15472702 15936131
4169 15936131 16474711 17091991 17631486 17947737 18087963 18071886 18216658 18527802 18648130 18892953
4159 18892953 19430082 20002899 20450381 21017466 21366386 21803536 22632041 23308712 23853660
4150 23853660 24408280 24900551 25365844 25940794 26672761 27256340 27828125 28513682 29422054
4141 29422054 30218451 31009606 31836574 32692897 33572961 34654438 35764904 37061553 38402503
4132 38402503 39772231 41205712 42330853 43302253 44165314 44866074 45462303 46221161 46356775
4123 46356775 46755417 47363578 47619621 48100236 48661447 49428915 50503610 51423929 52232279
4114 52232279 52857625 53232701 53635830 53931511 54216469 54866369 55660589 56702593 57938459
4105 57938459 59398593 60999284 62756954 64794685 67035257 69541378 72053198 74534691
4097 74534691 76873270 79068605 81101746 83019963 84619248 86191778 87677452 88978273
4089 88978273 90382895 91772607 93332709 95166512 96961707 98444611 99897831 101158436
4081 101158436 102760921 105063425 108094410 111750737 115660470 119191859 122181264 124119906
4073 124119906 124527478 124697636 125337939 126204923 127766867 129511676 131327557 133571448 135471682
4064 135471682 136801725 137665970 137705343 137459319 137505952 137884498 138540767 138761381 138024712
4055 138024712 136443975 134325822 131743529 129192546 126952480 125067903 123570848 121967080
4047 121967080 119859842 117125933 113506980 109497204 105785021 102511734 99828180 97571551
4039 97571551 95469440 93694770 91804634 89636127 87273889 84697356 82088957 79857852
4031 79857852 77871648 75955148 74235229 72661439 71044079 69657929 68218559 66874276
4023 66874276 65239823 63324754 61425080 59461672 57258996 55470783 53773702 52228512
4015 52228512 50842345 49469332 48085957 46613247 45227253 43764349 42577362 41283393
4007 41283393 39941808 38636361 37490577 36403243 35574161 34675925 33912599 33162906 32499294
3998 32499294 32050090 31521185 30939970 30457895 29940122 29315957 28682962 27883752 27286654
3989 27286654 26723617 26097248 25484525 24747080 23900887 23225116 22499438 21700128 20925927
3980 20925927 20099675 19398835 18916293 18348147 17615567 17238822 16662203 15929207 15513823
3971 15513823 14932544 14432353 14098696 13615396 13425601 13091258 12644739 12380089 12091599
3962 12091599 11849873 11678235 11378320 11324641 11133584 10965893 10913142 10656594 10556336 10429980
3952 10429980 10468718 10437688 10443968 10226852 10166454 10215867 10039040 10091440 10099745 10020033 10112170
3941 10112170 10108156 10219491 10254344 10269258 10369649 10408269 10590631 10668097 10806976 11114083
3931 11114083 11258980 11494062 11895084 12036054 12357738 12710816 12997703 13348727 13450572
3922 13450572 13477411 13451303 13214061 12993098 12642781 12235712 11924734 11819993 11722931 11509301
3912 11509301 11274191 11221702 11212474 10985025 11070752 11108332 10972176 11057643 11064864 11008145 11082197
3901 11082197 10874563 10919316 10959039 10855637 10902779 10871756 10931612 10988533 11050041 11057677 11069539
3890 11069539 10917017 11025636 11008679 11012332 11044722 10879628 10892933 10922283 10882557 10761860 10646745
3879 10646745 10449419 10245139 10145318 9946873 9855985 9634794 9497335 9419060 9155462 9088007
3869 9088007 9034346 8947994 8908880 8707178 8458771 8311595 8187462 8061988 8063599 7893673
3859 7893673 7827829 7614014 7431692 7528169 7303542 7072893 7101902 6974552 7011616 7002328 6870140
3848 6870140 6898363 6807186 6663486 6689055 6575106 6392177 6535106 6460489 6393239 6416714 6341346
3837 6341346 6268495 6278774 6185193 6241273 6296564 6203959 6124038 6157862 6109992 6120438 5956977
3826 5956977 5861225 5888267 5798839 5871683 5916012 5815822 5878106 6066976 6058098 5991545 6031700
3815 6031700 5959056 6007132 5937255 5945163 5955741 5956236 5905190 5873139 5754221 5810225 5880945 5779483
3803 5779483 5920373 5829498 5890267 6065053 5972224 5970424 5892349 5802267 5778357 5692485 5587319
3792 5587319 5660198 5647734 5488981 5426090 5495329 5483045 5469982 5477830 5422054 5324982 5343346
3781 5343346 5458446 5360708 5220700 5165117 5178364 5085916 5214200 5049692 5147104 5124108 4937839
3770 4937839 4949455 4754197 4823711 4817964 4719647 4624923 4677237 4524228 4497029 4638787 4531704
3759 4531704 4787322 4547972 4529640 4505714 4394417 4544733 4327837 4251562 4210091 4264849
3749 4264849 4166478 4098667 4142673 4105790 4190108 4083315 4135754 4208505 4287095 4366639 4373594
3738 4373594 4355949 4219992 4302171 4296398 4240043 4289166 4112316 4203358 4228794 4137790 4174692
3727 4174692 4288138 4261936 4105187 4373752 4328671 4337085 4335042 4232703 4315481 4098325 4187140
3716 4187140 4182090 4004120 3963883 3982963 3970075 3948723 4102844 4145077 4196447 4212681 4268597
3705 4268597 4285472 4117839 4329090 4261134 4090024 4118523 3990685 3981250 3893129 3961035 3885795
3694 3885795 3809710 3773850 3865800 3877088 3865517 4006485 4000977 4080295 4104529 4121587 4228302
3683 4228302 4102134 4331103 4254310 4178930 4265271 4117311 4174016 4043477 4051037 3954390 4063220
3672 4063220 4119221 4000242 4016759 4045077 4021678 4086728 4046002 4202225 4314490 4125786 4133104
3661 4133104 3975465 3863628 3961001 4000690 4005731 4028277 3852688 3852234 3798994 3843863 4006823
3650 4006823 3977506 4055735 4212713 4174675 4112546 4121008 3952815 3973584 3939310 3822549 3632213
3639 3632213 3592138 3619530 3616151 3651383 3662626 3754887 3827922 4006099 4003008 4137065 4378907
3628 4378907 4490375 4655730 4585106 4505335 4560470 4582590 4623180 4654993 4759619 4731649 4666029
3617 4666029 4812387 4937757 5072534 5183527 5175075 5148302 5157256 5127815 5112501 5208906 5005229
3606 5005229 5001235 4842792 4597268 4614521 4674857 4753466 4668235 4626731 4655567 4705790 4982881
3595 4982881 5073456 5133418 5120508 5149667 5193201 5278895 5295174 5108957 5110269 5022185 4964914
3584 4964914 4873333 4800834 4710592 4852272 4825879 4542781 4503095 4607997 4782366 5052682
3574 5052682 4972809 5060567 5246785 5458808 5673299 5651549 5642788 5712454 5773644 5699302 5721870
3563 5721870 5700992 5600263 5589287 5557108 5728907 5724045 5898507 6205195 6345578 6583982
3553 6583982 6743408 6828885 7181810 7434344 7540499 7607604 7506018 7356331 7450666 7367913
3543 7367913 7205668 7131223 7146348 7313291 7387038 7669269 7718190 7771522 8078765 8379219
3533 8379219 8854205 9395531 9852064 10395039 10944102 11563739 12001651 12551099 12883057 13210495
3523 13210495 13572459 13832736 13975801 14114211 13978143 13933459 13766474 13590305 13437435 13200788
3513 13200788 13133446 12946554 12612480 12322985 12030662 11736570 11338030 10796378 10438598 9938995
3503 9938995 9592408 9193373 8779618 8350407 8058147 7639268 7217363 7045808 6741304 6445525
3493 6445525 6254514 6008074 5947980 5754700 5701285 5764461 5761212 5771816 5777975 5699661 5574780
3482 5574780 5702943 5776768 5850694 5914339 5868431 5651193 5526317 5376257 5040712 5000218
3472 5000218 4972573 4810710 4830889 4768535 4728618 4568063 4555665 4625490 4744061 4775865 4793566
3461 4793566 4904632 4704357 4718127 4807379 4781282 4695783 4628568 4584026 4353648 4231709 4229475
3450 4229475 4169563 4093974 4127643 4264010 4255112 4341600 4327190 4227600 4336319 4190439 4068377
3439 4068377 3936301 3993604 3943064 3717662 3588267 3343353 3186559 3098679 3033930 2906434
3429 2906434 2731532 2502891 2533132 2559520 2326226 2149958 2159145 2124842 2109609 2151912 2078424
3418 2078424 2074010 2167387 2079769 2050208 1953033 1930730 1885924 1857916 1819094 1780664 1736491 1962684
3406 1962684 1961984 2027380 2068222 1831399 2106178 2206259 2205509 2226743 2170764 2110188 2221051
3395 2221051 2341991 2304468 2211494 2158530 2201193 2147413 1890796 1883242 1971842 1930014 2011919
3384 2011919 1960927 1947910 1933237 1986138 2131264 2063576 2063741 2010782 1898404 2072531 2084270
3373 2084270 1877823 1838018 1739143 1589307 1660586 1599870 1481710 1476581 1472191 1452805 1460060
3362 1460060 1325322 1401258 1361123 1199926 1349395 1272349 1308829 1508042 1303398 1272739
3352 1272739 1293588 984872 1161377 1287848 1240681 1257467 1153613 964606 1135553 1063465
3342 1063465 979073 1084620 1045318 1032663 1166092 1112049 1119226 1188326 1121976 1144459 1089099
3331 1089099 1036639 1030523 1028905 1083273 920593 895783 898763 945516 987345 927474 956488 1085803
3319 1085803 1088594 1174718 1172289 1078569 1080004 1013532 939111 1030749 1018263 1010290 1106489 952533
3307 952533 974243 885780 858507 961012 977792 883212 926000 937617 870125 987942 989730
3296 989730 933693 854231 671875 858403 887604 825824 878380 872686 922160 935677 941383 1017149
3284 1017149 976247 968385 974605 1027108 993481 1014788 1135844 1136929 1117982 1041973 1027965 934017
3272 934017 983115 1094845 1054276 1166757 1217035 1158639 1061101 1014949 954219 997399 1048857
3261 1048857 1178585 1062661 1080406 1146538 1089082 1099766 977367 952974 1076036 1091219 1123144
3250 1123144 1218210 1192506 1263720 1384562 1532775 1530904 1455901 1329290 1459116 1537476 1517600
3239 1517600 1564397 1421340 1428842 1537037 1585872 1580966 1472761 1505753 1675306 1651755 1614431
3228 1614431 1605965 1601517 1549143 1588759 1450086 1538449 1637235 1734973 1922843 1906869 1913580 2005234
3216 2005234 2197232 2424516 2423929 2451717 2624500 2774258 3010151 3229907 3454332 3684855
3206 3684855 3819903 3934415 4020218 4155197 4237756 4127730 4044859 3961857 3968316 4031383 4104629
3195 4104629 4064726 4062206 4002408 4077864 4106828 4166031 4091633 4241148 4251685 4273172 4453071
3184 4453071 4444271 4595066 4909118 5210096 5832875 6330576 6611120 6895100 7214009 7334871
3174 7334871 7261858 7173592 7056331 6582141 6335538 6091513 5638199 5361570 5180296 4926741
3164 4926741 4646246 4440715 4182003 3993732 3836568 3753521 3705363 3699437 3744524 3781177 3854345
3153 3854345 3843666 3825201 3966481 3914986 4113674 4137955 4057832 4096009 4136085 4035939 4065483
3142 4065483 4014453 3831279 3776067 3664614 3483473 3262808 3004741 3029303 2903997 2686344
3132 2686344 2700456 2556309 2372549 2395284 2312987 2276125 2068888 1981997 2054008 1991811 1976940
3121 1976940 1985330 1871155 1731865 1654708 1498522 1551305 1566281 1294513 1299419 1315225 1258561
3110 1258561 1286118 1221470 1202488 1142093 1148533 1089207 1084593 1036530 1036035 985026 925994 891418
3098 891418 927767 1063747 1106983 1024933 1060825 989217 867180 979167 843215 764799 866299
3087 866299 881395 858055 754085 796233 842866 818224 697485 584259 662192 699873 797896
3076 797896 701287 619039 660691 586315 620981 586395 586565 539845 469925 460094 484962 526592
3064 526592 550455 473709 398455 467292 400627 406098 467660 469926 473704 522212 546878 442352
3052 442352 435182 552254 470331 486837 415123 374965 342277 380436 424328 360404 538331
3041 538331 462109 445086 430261 297951 363452 317234 296471 296685 386017 314434 354799 406624
3029 406624 304092 387952 349044 340259 280720 354935 392254 347382 416155 308207 179700
3018 179700 239785 270933 256389 265099 281675 242947 264543 242981 242964 241769 261308 276066 292172
3005 292172 170559 79157 240773 311864 248185 321826 182538 109081 182785 147765 220750
2994 220750 163778 221584 191053 316313 410258 231531 305806 327412 269430 357954 124345
2983 124345 222611 379440 169973 105673 149493 165689 215682 280951 246010 242175 156757
2972 156757 129974 120608 91959 215651 84942 158348 368280 333828 163351 121257 110025
2961 110025 194045 222364 229090 221952 204999 155990 195603 262687 138021 147796 144641 224205
2949 224205 106414 139592 87893 10430 146747 136867 33460 69811 100382 168018 292945
2938 292945 307400 130891 123118 182922 182027 167625 59076 68539 171143 165363 195833 168361
2926 168361 115289 203385 199925 182649 222200 28845 116299 112068 31683 118355 38697 5186
2914 5186 236525 199565 172327 269091 135370 79360 214821 229750 197471 50157 -70156
2903 -70156 17761 -108625 -34816 -26788 -49718 125281 184202 100263 11568 19978 -26284 3928
2891 3928 -3482 -12734 98772 157192 220924 231500 59103 184389 172005 -4009 122527
2880 122527 -17600 -31116 33942 222118 187010 83091 95891 -63868 1891 214753 238573
2869 238573 104938 2820 13350 78715 113128 160321 37045 13266 189098 169288 148691
2858 148691 58741 57654 109592 52943 -7599 -19442 58491 92147 207305 202267 -40154 46417
2846 46417 -100791 -121630 27782 77467 -12172 8243 42318 109583 16824 66112 13737
2835 13737 72046 180440 117497 145646 8511 63825 97596 113826 158847 21047 79901
2824 79901 81228 30204 168979 129675 199487 182503 71800 -30904 57632 91951 -111616
2813 -111616 -142840 -31778 -100379 78031 -10505 -74535 -14651 1771 6973 52479 5636
2802 5636 -1198 133212 -49015 35774 157877 -66807 4739 64193 65295 99182 -63751
2791 -63751 -85840 -57496 -54904 27914 74204 85092 133322 87676 150701 41067 -45381 113507
2779 113507 108386 97723 133446 140179 -3666 -8161 66351 7541 46727 138090 229410 140761
2767 140761 145259 84987 131142 129954 -47472 82563 48724 -31276 -21685 -60672 94127 220560
2755 220560 99023 53604 12264 77174 105011 1205 -28409 608 72253 114219 67013
2744 67013 71710 27148 32031 -102278 -82944 69916 63999 42963 10147 20368 17867 30490
2732 30490 118506 102818 57641 2966 2658 49746 28651 93114 64849 1421 5991 -69548
2720 -69548 -56999 135101 78949 11032 31611 32167 37356 31528 10329 -157745 -34870 -77907
2708 -77907 87125 128016 -30863 16455 17934 -19595 -47515 -60 72663 88295 128263 56574
2696 56574 -23544 18259 34762 22253 -67022 61528 -72448 38280 150155 93784 165236
2685 165236 174260 36350 44246 183686 189291 78016 8401 -84643 18391 22495 28242 -565
2673 -565 -28896 35421 5606 145408 104177 162201 196567 126936 65044 113956 91203 -68352
2661 -68352 106210 -55353 -155338 17881 -39467 139630 128740 174600 128717 104781 180089
2650 180089 -72943 43108 36149 -54823 5368 45735 251457 315777 267689 333950 392133
2639 392133 298254 170522 132190 44188 77151 170194 151100 130002 94385 119196 76500
2628 76500 150609 87004 5287 -8800 -36904 62481 72060 125562 29944 -109745 -99699 117584
2616 117584 194871 144959 92402 -497 45775 47843 17496 112392 -137104 -162080 133735
2605 133735 266792 125996 78710 40428 1154 103574 42269 -132810 924 -47546 -4756
2594 -4756 -18260 -81916 44090 106971 33052 56105 15026 -65438 5602 -56535 44522 86612
2582 86612 38277 47761 136074 73451 143671 27417 -88298 95523 96117 97762 139724 44324
2570 44324 -7211 219849 211220 -3688 115648 -53656 12694 13239 8270 -33265 -24642 -24726 -144807
2557 -144807 -12475 4381 -20185 55443 -31794 110118 109069 197655 109305 -7554 77841
2546 77841 62391 30258 42916 69791 78123 163434 132453 126261 157575 123620 31597 40583
2534 40583 52753 61818 97325 53095 -21213 143242 65491 151898 115599 3506 233102
2523 233102 145915 85513 69602 65835 172965 111124 112988 113632 122742 106686 148012 281819
2511 281819 190921 232281 217448 201525 144789 23721 88621 83217 74596 269397 269326 214244
2499 214244 196992 161739 182480 167381 82110 199939 198839 94559 74083 22908 113869
2488 113869 227258 364354 180501 137135 191781 194335 292423 254901 175387 174825 258907 177658
2476 177658 127022 167993 126089 190096 175109 247658 385947 197037 192241 246193 117952
2465 117952 158877 130230 145611 402951 297251 227779 375783 221684 327795 284156 157452
2454 157452 179357 353312 340525 438422 329399 271521 454981 315830 262559 378564 269611
2443 269611 447254 416643 309595 562059 501657 399080 608524 416610 317362 577254
2433 577254 505325 635877 639381 613497 661885 634523 693666 860136 756362 726986 731623
2422 731623 715605 829935 915207 827387 852544 803554 907501 1065413 909009 974316 943449
2411 943449 1088720 1254895 1282768 1249961 1190541 1322984 1369974 1411586 1607621 1544673 1569745
2400 1569745 1767728 1879870 1891797 2019206 2343923 2612552 2898649 3216305 3417624 3520111
2390 3520111 3908198 4361102 4815523 5190466 5807917 6649435 7726507 9889894 14015909
2381 14015909 21398110 28301653 32386263 37367691 39675650 39701324 40442231 40158927 40271205
2372 40271205 38229180 33991032 30790747 27949646 24742036 22150448 20001581 18060565
2364 18060565 16035343 13264174 11095977 9599759 8672498 7995314 7476812 7025468 6612090
2355 6612090 6328007 5926518 5529486 5129233 4695092 4497102 4256080 4079415 3927665 3661065
2345 3661065 3467309 3305855 3300079 3177583 3010006 2800347 2726844 2537559 2558855 2628447
2335 2628447 2374334 2232496 2174001 2109579 2118001 2039877 2065563 1927243 1832588 1713861 1613587
2324 1613587 1613357 1670879 1610890 1577405 1559295 1406679 1571553 1453530 1446322 1430167 1267490
2313 1267490 1327902 1335103 1259075 1311663 1326564 1209551 1261593 1193954 1088387 1057922 955485
2302 955485 976537 989433 1009383 1027042 1053262 784131 861064 1010349 835341 892465 775326
2291 775326 722892 884526 702470 752931 879175 699857 758273 744037 661236 751706 671477
2280 671477 743946 866960 709414 567925 633774 460010 444504 417302 480416 438693 433685
2269 433685 562573 534455 558140 475407 600885 573203 514712 339462 396533 483259 376897
2258 376897 343599 373544 326587 352347 468638 453732 266713 299015 273339 291030 369976
2247 369976 237940 235687 205953 229115 284379 310297 332309 314041 335119 309132 323380 288336
2235 288336 300823 322441 232649 237572 138140 167327 71434 129318 239864 39517 -12426
2224 -12426 216354 378843 343567 313569 169642 122215 274483 274440 340936 280243 223635 353064
2212 353064 149935 182869 42801 59058 137593 40233 128213 25320 120879 191596 127712
2201 127712 54085 -1278 -65714 11599 321357 302420 222141 246777 287141 193626 197244 163069
2189 163069 13301 11482 135845 134350 29136 140010 210382 70924 231240 144124 95300
2178 95300 176546 78172 170010 88200 2795 45404 58694 40023 99117 132471 -23587 -17383
2166 -17383 153322 212848 253854 161529 37619 56405 193728 29693 -44406 8656 39242
2155 39242 77754 30926 146877 61480 12236 92431 71834 91378 18812 137719 190539
2144 190539 40568 26092 -42643 -28784 78890 199816 6509 -9953 -18357 -118258 109277
2133 109277 116471 57791 44351 51031 74727 149931 106844 160250 99317 70370 124676 85162
2121 85162 68223 71738 76547 142402 22523 -36003 6980 32282 166411 117348 154585 141757
2109 141757 151077 267885 313764 137336 129245 22090 159214 358749 267499 195501 155367
2098 155367 -4691 68949 145180 112432 85182 -3617 98723 71350 -19547 48687 156942
2087 156942 -59949 96436 21407 46766 83800 61063 -26659 -32621 -91407 15892 167156
2076 167156 254624 155023 68632 14462 -64046 21464 86335 81955 5272 75445 27204 10599
2064 10599 113911 69201 -96656 -50752 -80579 20573 67295 117579 2150 -99558 -7211
2053 -7211 -81157 -33103 57623 84265 21368 -112909 -88628 -30847 -1253 93749 15768 -25355
2041 -25355 -169742 -32553 3850 47672 154966 46217 22147 50148 97785 109618 101343
2030 101343 21203 31282 -54154 -20279 38575 26413 20979 77423 -112020 -37110 -10335 20268
2018 20268 -64933 -64217 -110796 -90291 24757 401 28441 39268 -54647 -5491 -101592 -65908
2006 -65908 144482 45666 -117653 -97051 -53593 33969 76085 -49863 -9301 -71429 14167
1995 14167 125983 4795 37221 36664 -85233 -45977 42122 78421 106346 55926 -11321 -17856
1983 -17856 34744 126039 179672 48935 5409 29906 -94502 -34405 63215 -9659 -85007
1972 -85007 37943 48330 54723 77867 -139794 -97409 -62281 -22155 -28948 -9918 146725 91126
1960 91126 61606 69409 83268 9357 66027 -42221 -118702 -130809 -131234 4606 159267 122605
1948 122605 -9037 -7052 -94382 9113 -58032 -98125 -15756 4156 57681 64006 128841 129504
1936 129504 -41912 -42021 41286 -8433 44166 19098 -62568 -68595 -119494 -213730 -99527 -80459
1924 -80459 -33771 -11073 65195 -1721 26084 43770 16962 -31166 -89998 -3259 52859 102652
1912 102652 37288 -132156 -87883 -174652 -108716 5690 46136 98643 -3652 116079 22576
1901 22576 -23558 49083 26945 165753 41148 13966 -67149 -40376 19624 -103853 -69618
1890 -69618 -223346 -113967 405 -4301 24871 -91543 -162725 -23608 -19761 -4125 51147
1879 51147 -6721 55827 -18553 -7949 -115115 -125440 158074 63116 -72852 -81852 11424
1868 11424 85233 11071 87870 59020 42308 131583 176626 143707 33826 94784 46989 104659
1856 104659 116921 9998 -48255 -32618 48465 143268 68268 133312 123623 32977 56002 -15157
1844 -15157 -78387 115534 153902 99637 2503 -74301 -22486 100742 105914 105632 -67750 -215688
1832 -215688 -81807 -24252 -6062 -3141 -85897 -86198 -52973 12952 57414 40709 51197 -36341
1820 -36341 -11946 -176681 -159284 -85394 -140979 -14609 8769 -135130 -114422 55106 111091
1809 111091 -61473 -92578 -213919 -156125 -6348 71734 -31376 -81174 -61732 -16584 161900
1798 161900 101830 -20905 -48702 -25937 -45926 41642 69575 -11179 96950 123907 -118142
1787 -118142 -146602 -103274 -110148 -40803 54633 -41118 -110291 26852 -66509 124243 57861
1776 57861 -112509 -173542 -16787 56481 -6324 -124747 -65553 -29252 -3093 77965 -25436
1765 -25436 62081 60665 -50015 86402 69393 -80896 33525 90700 56017 25854 -5512
1754 -5512 -42996 148259 117238 18791 16549 -78831 -123199 62666 -139415 -160077 -121121 -199120
1742 -199120 -61570 78565 -116117 -74729 -116085 -45884 136795 382 -81396 -107038 -104044
1731 -104044 65734 50436 -3273 61103 51582 28747 116990 -57013 -51597 101947 75172
1720 75172 58575 75566 -80507 -105699 122026 117878 57064 -45051 -82245 25721 61174
1709 61174 -19844 -116053 -176789 -103322 -37040 70020 6338 -14258 -71814 -107213 41231
1698 41231 12729 -58014 -39964 -59143 54463 -57000 -107061 -1188 68148 166 -11764
1687 -11764 -54285 -37193 65862 92720 229512 -19493 -241360 -123067 -30220 -44500 -35498
1676 -35498 -102340 -140276 -80901 87579 75322 -29049 -4050 -43334 -112324 -115959 -19187 7140
1664 7140 91547 30992 7521 -48578 -9605 -48520 1770 -21358 37064 -9825 -75 292966
1652 292966 211437 -45855 -134902 -61917 -5605 46763 28682 18229 5678 -26328 938
1641 938 -24750 33252 75844 -6961 -16987 -73412 -19004 90109 75122 99334 -61512 -106062
1629 -106062 -104446 43056 -43414 -133921 -168367 -114602 -26555 12127 114 -102000 -68914
1618 -68914 -69695 -104109 -20440 -69736 66432 48586 -87312 -107077 -154753 -102548 -32962 91449
1606 91449 78347 64543 -7252 -14944 29720 -75657 -180017 -104895 -57255 68849 -93782
1595 -93782 -10919 -60108 -65434 -51119 106250 148769 -62150 48448 -23667 304 82136
1584 82136 37982 72178 96910 42889 -6057 37051 -10027 27739 63572 -38003 -78030 -78952
1572 -78952 -137414 -5592 -2400 -42284 -24843 59138 56759 64538 76390 -2804 -124565 11014
1560 11014 34571 1893 -56953 32887 -22545 3592 99866 -88036 -98009 2356 -124060
1549 -124060 -34175 89003 -122474 99137 116103 -58406 37384 53619 -30810 16347 -127046
1538 -127046 -31129 -84743 -184635 -115413 5320 -27838 206988 194774 -46353 -43830 -27387
1527 -27387 66177 81005 -39980 -50938 50646 -13812 -41299 -72567 -74304 -17226 -95884 -253247
1515 -253247 -7294 16804 -118766 98432 74510 36954 33633 -34427 13844 -61698 39527
1504 39527 12582 -23315 -60915 8842 90347 42827 17074 -124840 -130111 70324 57738 -25178
1492 -25178 -70184 -68564 42626 54972 -54582 28235 91459 -47131 100000 66009 -164046
1481 -164046 -52282 44576 -58702 93835 15178 -132006 103707 105244 104506 115144 -104811
1470 -104811 7298 7245 34953 44339 -2782 -103402 19305 88493 -8961 65877 -16657 -14475
1458 -14475 85487 -134887 -147263 -239088 -217813 47508 101203 -42951 191 38915 -136297
1447 -136297 59768 57090 -138619 -14687 -34825 -72667 -135342 -126309 -59569 43344 48472
1436 48472 -51122 -30406 -190681 42900 57222 -48557 6869 -18516 -48427 13563 41282
1425 41282 -33732 113949 6954 -66455 -28269 -80930 56492 66024 13376 115028 -36969
1414 -36969 -47955 121696 -7500 -120499 -87734 -90403 -224385 -132429 -85981 2137 61301
1403 61301 72592 22541 66076 99672 -40817 -74258 -169859 -99190 -20926 -114976 -4265
1392 -4265 68313 6436 5952 54846 -66615 -41069 -4444 36876 64663 -38046 76564 91751
1380 91751 -20141 79447 77157 -54197 82147 -13936 -41633 122487 24996 92731 159802
1369 159802 46129 -65428 -233379 -215068 10684 -6851 -49549 -61131 -69637 -83755 -65518
1358 -65518 34283 2711 -69457 5480 -15922 -121995 -151059 -152291 -180684 -247023 -37256 4538
1346 4538 -54358 19637 19464 -34487 -44201 -133984 -6284 24262 -14695 -51008 -73424 -28629
1334 -28629 36169 -32741 -38884 47380 -64052 63822 58528 17626 72441 12042 -21259 -14757
1322 -14757 8734 35962 60912 -12883 -109681 -88517 -15794 34348 -60052 -28518 -51122 -60568
1310 -60568 -21054 -48431 -113330 -57966 12697 6595 -11107 -9011 -87455 -62927 43862 35208
1298 35208 -18432 -69919 -125024 -85141 -126 -64363 -27117 -21818 -60697 126102 105217 -8666
1286 -8666 -2945 -66384 -28542 54621 1129 -103955 22334 1044 -68896 -114282 -99212 -12392
1274 -12392 34252 100697 63559 -195205 -90509 51149 -84633 41170 73714 47858 -17707
1263 -17707 -42127 36385 -92702 69040 179458 68175 26588 -34677 -59525 -96102 -98264
1252 -98264 -46506 -29838 -152376 50013 152349 11592 23383 19400 -54529 36580 71944
1241 71944 -35811 -29022 -23225 -29508 -13051 99884 38523 -94307 100934 161550 -28373
1230 -28373 -21113 -32242 -20431 35573 46570 11310 -152062 -134769 -4518 15621 47672 -42339
1218 -42339 -17322 96231 79419 19331 -57919 -148049 47810 68847 -97614 30945 -84168
1207 -84168 -130352 35090 -67519 -106539 -44393 -96851 39934 -77380 -131827 -177267 -120064
1196 -120064 44886 176488 -19931 -191724 -122448 -126754 -34190 664 -117857 -79215 -7341
1185 -7341 29986 -20622 -78537 -20452 31718 128021 10854 61716 -73114 -42659 87192
1174 87192 80280 -54841 -48665 -43292 -61719 -23446 -66884 -209522 -37681 -2637 21561 -4502
1162 -4502 -101549 -46859 89939 76824 10141 -47604 -162037 35791 66145 114262 93578
1151 93578 -176142 -105652 84115 40829 -47772 -78684 -93236 10593 6327 -142308 -73993
1140 -73993 -160494 -133452 -64560 -209792 -261376 -188717 -124493 -77112 -77197 -91775 -169345 -24102
1128 -24102 99973 6523 -109558 -68041 -29604 59014 42360 -60428 -92488 -81618 39834
1117 39834 110549 -20589 15564 -118065 -144771 -39918 61850 -32130 -152702 25789 -83308
1106 -83308 -142071 -180267 16168 74289 32862 169378 -43232 -177285 -156424 -91776 -29949
1095 -29949 -18616 -75158 -109170 5571 81793 92917 -4426 -60061 114029 72145 17103
1084 17103 52577 61419 97134 166638 68367 3564 89803 -36113 108391 82572 -53130
1073 -53130 -64364 -115124 -32172 58456 29840 105384 139744 39663 44945 106836 -27113 -43746
1061 -43746 -40680 -11935 17268 -170485 -13819 -23981 -135559 4944 16583 -88094 -860
1050 -860 112646 21299 -61183 -66831 6531 -2283 -10910 -23381 20461 93001 122539 -4750
1038 -4750 -100015 47818 -38819 -18242 52100 56865 133664 131523 131707 93039 5466 -37615 -51982
1025 -51982 73271 -24000 27115 84733 -70749 -1884 84253 -17734 -105780 69566 147801
1014 147801 46055 41718 -111598 -92761 -90961 -94056 30014 -28060 50652 33476 2400 57328
1002 57328 52796 -58591 -10348 135790 64352 -59922 -222373 -153508 69016 5430 101356
991 101356 49614 -62029 71892 137309 -114725 -42114 8636 -90296 68611 118626 33622
980 33622 43874 65996 6859 -17008 -22986 -128229 -6187 -5348 -3595 20903 -125112 -51401
968 -51401 8997 16986 -72313 -55151 112363 127810 45526 -38103 28906 -167231 -48103 45823
956 45823 -208809 -61452 51325 -204049 -46778 148722 -48143 158550 76917 -120544
946 -120544 59642 -17985 -62204 49259 -16478 47820 43314 -29230 -61666 4144 32854 -65871
934 -65871 -137197 -65132 -18519 -54582 70612 127963 -167465 -104048 7257 -18899 24383
923 24383 -19180 -68419 -52011 5170 -473 -11534 -82313 -90858 -13411 76131 41833 3419
911 3419 -12754 35000 78169 -38726 -9901 54471 32488 1039 -86775 -2806 -68402 -77206
899 -77206 60110 -21252 -48045 -28913 11524 -232958 -99315 -108788 -276012 -30085 9380
888 9380 -76116 46823 -16527 -30631 7962 -209016 -97003 56719 -80633 -23305 87026
877 87026 36803 130026 140043 60016 31583 61663 94945 100680 21657 -8299 -22603 -116026
865 -116026 -5888 -2303 -114228 67250 -16782 -92180 82719 -43722 6737 -22803 -166060
854 -166060 24350 30537 -93984 40077 -10332 -41258 -37018 -34739 -41007 -21038 -29133 -39173
842 -39173 -78689 -144465 -54378 -37574 83228 96270 19209 -52222 -120780 -42641 38800 -173782
830 -173782 -28629 24475 -54570 -54794 -18991 -31867 -80132 89024 141072 15261 -81538 46653
818 46653 -38121 -35200 110838 -78018 -213874 -44312 -11758 -67995 3599 78259 104020
807 104020 -17835 -39329 -33752 -245135 -96299 43618 -60711 -115467 -77927 55442 19877
796 19877 11779 -32697 -113712 -56928 53301 33693 -67014 7905 56414 -71830 -33025 -14267
784 -14267 -98421 -165348 -80250 -46527 -98885 -16756 -72159 -142194 -39275 16586 -49419 2531
772 2531 72626 64140 -66546 -24195 116227 -43627 -137107 194651 111407 -151086 -36486
761 -36486 -20391 82900 43014 32757 57795 -41850 -115367 64929 -76333 -183055 -17081
750 -17081 -71876 5809 109517 -16381 571 172447 80695 -4048 -124162 -156730 -63152
739 -63152 -57497 58053 67028 -61017 -178252 -144403 -72148 -17251 26876 22498 -61062 49431
727 49431 96949 46723 82718 26073 241 -74610 -104389 -62305 -168473 -110700 128192 -91133
715 -91133 -93664 59745 -36721 -37618 -38998 22527 -2740 -56758 -44575 -44330 -14851 -44655 -9579
702 -9579 -30442 54901 110194 68904 161666 206039 120364 13183 -28714 -8776 22108 22670
690 22670 35031 134864 -95544 -203130 -23222 -18593 -74187 5434 53982 -49336 1661
679 1661 15404 70037 117822 76716 130337 -18491 -144639 -27765 -120036 25155 62172
668 62172 -61896 -28041 -98039 -77001 70480 10082 -79034 -63050 -130808 -59979 108211
657 108211 69299 -44931 22137 -10084 -88264 -29302 68721 -157605 -45436 14040 -23719
646 -23719 21806 21300 -23061 -114504 -107204 79926 -11537 -110524 31659 76291 -64548 -96566
634 -96566 -122565 -3223 26248 -78748 121604 -65380 -56869 6813 -121138 -132506 -80007
623 -80007 -155892 -20859 121355 27995 29548 37864 -109253 47237 102694 -56436 7948
612 7948 -27034 -35308 -11574 77324 -8191 87038 66967 -21248 -34240 820 -30300 -132882
600 -132882 -128411 -98760 -111530 -140687 -59714 -34153 26073 88200 -110133 -205518 29083 -93234
588 -93234 -26601 4122 -25625 9585 -24500 -155305 -25352 -54240 -170230 6639 51162
577 51162 -99869 -34672 -39376 -65939 121903 102512 -1339 75262 113281 -9716 -32018
566 -32018 -112929 -48160 -35231 -53569 80315 -10953 -49124 137830 55151 2514 54187 44929
554 44929 82942 -19949 -55168 49548 82933 -41332 69842 46854 -80150 69393 -121537
543 -121537 -170079 18997 -110086 -124490 -71635 11944 146136 54631 32973 33359 -70007
532 -70007 -10400 106866 -19819 -13073 -25032 -81429 -51275 -4936 34572 137095 135709 -13575
520 -13575 -81443 -128057 -17412 104661 56620 -31557 35339 -110271 47593 32173 -70785
509 -70785 -88205 -155758 -35644 13973 -8020 -58546 -104393 -11337 46721 172217 113487 9425
497 9425 27653 130727 150148 83222 82540 -44153 25421 20658 -27678 -77752 -55274 53487
485 53487 -39886 -36325 10694 -148830 -17419 44056 82162 -5422 -4803 -28996 20236 76933
473 76933 -3006 -79915 -154208 -111698 102015 24482 32988 96118 135065 162175 223822 119862
461 119862 46039 92502 123976 43903 43522 68399 81553 45148 -14041 -31464 -67460 48033
449 48033 -1895 -9295 -157081 -40967 26139 -53778 7246 130874 16838 -72277 31530
438 31530 30763 156 -13402 2765 -60599 -8206 99253 -20089 -10917 37895 35328 -17709
426 -17709 -16222 -29505 -70339 118323 29113 -45601 73707 22785 89674 59722 87833 111119
414 111119 34103 131067 149134 9828 -94215 -17474 -1628 -120599 -88000 -67446 85262
403 85262 105617 79828 -14396 -159115 -95074 19736 -23698 -12966 59260 7568 107155 83305
391 83305 65475 117208 -24798 173 25884 -50177 43492 25133 9306 69233 36509 -7660
379 -7660 -53242 -80436 -78317 -157140 -87814 -69994 -54683 -77188 144759 114609 28178 22231
367 22231 -58863 -19015 -35770 -15591 -83467 -17670 -3546 186478 175304 74835 -95135
356 -95135 -195124 -114013 -96085 7561 698 -42227 92352 34998 -76867 33699 -6179
345 -6179 -6012 53463 97893 7643 52578 99697 95579 103059 -61373 -116050 30299 -5384 41344
332 41344 74939 14509 39140 -33841 87766 21717 85300 61167 -76138 -63721 -62368 -96805
320 -96805 17697 85902 31559 -34084 -18697 -10668 129514 129157 115671 114941 121259 162402 131986
307 131986 139002 11420 -1523 -42819 29976 29575 -57821 -88757 -83026 -20077 -19199 -18656 -17294
294 -17294 -181148 -31068 17243 -55232 -10938 2785 12660 -22839 47358 -516 24003 63717
282 63717 -3055 401 -82227 -71078 -85259 -27014 33392 -122357 18825 3920 759 -14669
270 -14669 -70671 -207445 -76092 70367 -21487 68774 75390 55470 9879 -124325 -97399
259 -97399 -21685 -24095 92589 40950 108819 -16571 42735 105494 125231 37838 72897 78725
247 78725 -28698 168250 126588 -77630 -48412 -106043 -35259 -41970 -71517 -120505 30130
236 30130 -6199 -37472 95170 -55789 30118 216279 172372 -20535 -118979 -102397 61546
225 61546 86599 57530 70317 39652 92220 40741 125760 14463 -101225 66684 193343
214 193343 143126 96129 30513 -109263 18058 44604 51222 -5899 129810 56726 -1036
203 -1036 37643 97304 92401 179158 103534 14978 5490 -42305 -130067 -48537 36666 -113619
191 -113619 -107872 -89443 -44759 33312 -18932 94141 103439 -61409 -78385 -35166 -36542 -73535
179 -73535 -330 -42289 -9457 40025 161931 95504 -422 89921 21847 62837 84097 13159
167 13159 -100484 -49480 43833 82569 67002 -126845 -61848 69802 75551 119978 85809 186562
155 186562 182602 153939 29849 16752 113274 132493 142476 135344 41532 -59284 51040 110839
143 110839 -45403 -54388 -97967 -105192 74600 75173 50426 -38205 44043 10392 56890 139040
131 139040 38257 5944 65294 158207 80465 94147 -5143 98443 125912 -9601 -28558
120 -28558 -11479 37192 29213 155888 -8210 -77383 -26225 -98553 15014 99505 -20145
109 -20145 60330 89833 77907 33581 -47418 -70555 -59298 37155 132700 8414 18133 60176
97 60176 -44554 15079 79309 11107 101595 57454 26741 31803 17823 21793 -17740 -50034
85 -50034 -44247 31511 -1309 22775 72486 146977 48910 -39946 100941 -12689 -7952 -17238
73 -17238 2770 124111 137911 102198 102519 117692 34134 19889 -76478 -15627 -28856 -43012
61 -43012 46159 -10578 39721 38785 -16990 96948 58557 -30505 -53259 -48069 26716 127732
49 127732 160296 126773 97474 -48149 21013 95387 87750 84664 -30155 -23223 53632 103037
37 103037 -20990 -47123 85496 130628 81435 86052 38274 -6313 68394 112789 77057 23461
25 23461 36154 136891 131632 90009 -9441 2841 86553 48636 101484 26121 5531 25088
13 25088 38955 108577 70242 18718 -111046 -28618 18698 54105 62249 -54143 56692 148341
1 148341 95955
0 95955
$$ Imaginary data points
##PAGE= N=2
##DATA TABLE= (X++(I..I)), XYDATA
16383 -1244914 -1171744 -1100765 -1118355 -1106202 -1072891 -1011114 -928706 -944463 -1040374 -919776 -874913
16372 -874913 -860155 -779551 -819042 -856330 -718829 -652132 -688866 -778011 -813013 -803753 -663467
16361 -663467 -637063 -695615 -613106 -536937 -488279 -452526 -456016 -504680 -450229 -409021 -421907 -324131
16349 -324131 -319634 -317691 -186170 -273270 -249952 -207023 -309400 -175387 -81151 -111680 -125073
16338 -125073 -185410 -221073 -57061 -59385 -2974 -80475 -92294 36285 129331 70313 165500
16327 165500 195257 154498 234832 207079 232111 155250 127200 279510 276799 215834 341073
16316 341073 386108 296572 455788 515957 464504 489109 524061 564250 495508 603385 564482
16305 564482 538253 539354 551438 598857 639986 639671 667419 755955 785455 791806 767722 794283
16293 794283 867614 799324 821011 775339 797018 882062 891731 1033743 966651 940271 978412
16282 978412 906340 881508 995724 1010944 985020 1022079 1080167 1083722 1171591 1212733 1247767
16271 1247767 1294059 1195690 1201982 1223903 1230128 1302507 1291890 1222428 1388407 1285775 1246854
16260 1246854 1272835 1321793 1406360 1395589 1455322 1505795 1384072 1479734 1588918 1582554 1562346
16249 1562346 1574752 1558173 1513011 1662196 1652388 1729497 1730600 1612892 1587477 1592543 1661716
16238 1661716 1751977 1778028 1692397 1709405 1762015 1637364 1695413 1693954 1661099 1801586 1774627
16227 1774627 1815170 1912569 1866660 1880689 1924004 1894354 1867442 1848221 1918570 1908752 1922730
16216 1922730 1858607 1907504 1847364 1871404 1945300 1836491 1891671 2042626 1987974 2026345 2065189
16205 2065189 2050817 2109571 1969556 1917948 2017251 2062621 2011959 2031699 2122276 2199104 2110706
16194 2110706 2103597 2157207 2230103 2208398 2178315 2187577 2174383 2296775 2219149 2245108 2260420
16183 2260420 2156455 2342856 2279045 2126598 2169522 2222968 2216546 2306561 2267028 2295512 2361188
16172 2361188 2334479 2157537 2264752 2388954 2333386 2289476 2332952 2332360 2391789 2383823 2358899
16161 2358899 2450155 2402178 2392485 2415376 2419553 2414100 2316748 2354561 2322167 2377927 2330289 2346229
16149 2346229 2466640 2353820 2357568 2369340 2551462 2517411 2451529 2499221 2414142 2539977 2639386
16138 2639386 2476684 2462672 2627160 2604514 2615844 2644429 2397902 2442354 2441625 2507337 2470484
16127 2470484 2404665 2459260 2561735 2588994 2518142 2502403 2447921 2399339 2493986 2478973 2536758
16116 2536758 2570979 2539710 2548187 2471727 2470818 2442084 2349126 2470891 2505531 2365934 2474233
16105 2474233 2542432 2604423 2682452 2635324 2660929 2667456 2599259 2606234 2583033 2567360 2562349 2526009
16093 2526009 2542054 2531285 2599901 2599045 2596011 2728957 2667840 2639707 2575008 2560323 2646092 2622813
16081 2622813 2570895 2620142 2575555 2573193 2579787 2468739 2511524 2542374 2508602 2585613 2521652
16070 2521652 2522397 2563156 2503613 2542861 2570128 2548568 2577419 2630257 2641283 2524071 2518814 2539296
16058 2539296 2568646 2673152 2678518 2684301 2640831 2592799 2566911 2598601 2582487 2623388 2615149 2611234
16046 2611234 2698300 2533310 2502169 2658824 2666867 2698728 2705782 2749172 2776221 2706895 2754586
16035 2754586 2531108 2398847 2537024 2629812 2571238 2642212 2675018 2587891 2617309 2711028 2736767
16024 2736767 2579330 2654844 2620108 2641777 2730545 2712419 2642385 2618327 2722560 2682015 2583444
16013 2583444 2590785 2670318 2640999 2602791 2605294 2624393 2563659 2623901 2697731 2677830 2646103 2567612
16001 2567612 2699398 2625454 2645129 2624735 2471589 2644926 2725889 2640733 2670409 2655328 2603908
15990 2603908 2689277 2613115 2468760 2524338 2597887 2752631 2720000 2542806 2551934 2567546 2582653
15979 2582653 2689056 2699780 2635599 2621843 2675636 2772978 2715543 2582566 2521345 2541597 2553963
15968 2553963 2745181 2666473 2618866 2790130 2637498 2651195 2636623 2606300 2691055 2701963 2688502
15957 2688502 2694145 2535501 2555297 2617206 2580914 2620111 2655591 2626667 2579708 2533612 2644881
15946 2644881 2606669 2554712 2619109 2675339 2719292 2634937 2692887 2654841 2573584 2734025 2607884
15935 2607884 2572833 2609342 2568192 2594571 2609407 2637863 2593935 2653285 2538776 2653926 2656815
15924 2656815 2646185 2744088 2697750 2655372 2706288 2602147 2503061 2510644 2633522 2660699 2653730
15913 2653730 2647232 2632310 2607394 2633290 2647015 2550693 2604454 2761121 2576169 2616955 2696566
15902 2696566 2611954 2620660 2642654 2657220 2662404 2583055 2785223 2652599 2526249 2653315 2605913
15891 2605913 2767176 2644308 2705463 2613744 2539148 2593572 2649367 2704674 2646275 2668559 2709629
15880 2709629 2678996 2739489 2586999 2573510 2619506 2582677 2737418 2683181 2666784 2688983 2504162
15869 2504162 2609728 2666769 2577185 2593763 2603121 2682361 2703123 2753721 2662345 2609231 2544084
15858 2544084 2625389 2630935 2495919 2567789 2690499 2618743 2605385 2506122 2537392 2691420 2630955
15847 2630955 2664448 2603317 2537347 2636696 2689709 2560503 2568467 2666220 2526037 2560690 2671171
15836 2671171 2528553 2599412 2642977 2680799 2649276 2627947 2667702 2732684 2661469 2746224 2708560
15825 2708560 2678011 2665490 2616788 2748526 2647836 2627270 2603022 2752051 2752955 2637548 2698836
15814 2698836 2572103 2634119 2659860 2574370 2689570 2780349 2684539 2813636 2856542 2628857
15804 2628857 2605178 2763280 2771191 2750083 2554505 2494678 2581167 2636096 2731640 2720650 2642522
15793 2642522 2733199 2753343 2703225 2750392 2635769 2615719 2750270 2669506 2821254 2809735 2650143
15782 2650143 2901175 2671412 2657682 2648589 2564318 2647949 2741175 2709752 2688919 2537235 2572431
15771 2572431 2684069 2659513 2686010 2547977 2536582 2737856 2751505 2686281 2743966 2645185 2751578
15760 2751578 2727869 2596072 2638658 2617492 2574161 2764291 2691655 2608832 2731311 2607635
15750 2607635 2587708 2684416 2598886 2590449 2731586 2666356 2739867 2773892 2804255 2679238 2701618
15739 2701618 2895562 2696832 2602766 2822484 2735716 2781376 2817652 2672614 2741610 2758104
15729 2758104 2813247 2789382 2648131 2703959 2676270 2681879 2823230 2692254 2666598 2656285 2798209
15718 2798209 2810174 2728815 2778186 2907711 2883217 2803642 2809408 2542367 2558860 2751475 2748904
15707 2748904 2784319 2709056 2627425 2703672 2791488 2755393 2629651 2700601 2848238 2784996 2672772
15696 2672772 2776547 2758470 2727499 2781094 2719061 2637566 2686455 2771921 2675465 2577748 2507650
15685 2507650 2604525 2733407 2717045 2697629 2696743 2677978 2653606 2782774 2852267 2673782 2718503
15674 2718503 2702298 2540755 2689748 2698378 2660559 2761309 2774261 2762326 2671192 2662551 2714966
15663 2714966 2627158 2656650 2628632 2575458 2717463 2883939 2745888 2824897 2790595 2631241
15653 2631241 2741764 2677910 2661779 2823068 2708644 2617249 2832468 2665187 2563119 2789087
15643 2789087 2721792 2946534 2918927 2633443 2822294 2756298 2808115 2819193 2618388 2662481
15633 2662481 2743997 2745246 2818842 2778722 2740754 2688654 2664729 2679605 2778062 2626212 2709427
15622 2709427 2822695 2606663 2683038 2731258 2761679 2870778 2829574 2774679 2770795 2687899 2707463
15611 2707463 2768636 2682884 2731876 2678351 2605643 2737417 2784865 2670050 2561746 2667738
15601 2667738 2792497 2740633 2765224 2736564 2667711 2687219 2769162 2696141 2696169 2773906 2775278 2898529
15589 2898529 2740920 2675785 2776311 2715414 2736704 2584793 2595345 2696355 2641717 2765620
15579 2765620 2861267 2826188 2701880 2788377 2688019 2794727 2746573 2721441 2873593 2726595
15569 2726595 2770520 2704674 2621211 2754691 2804402 2742647 2838985 2712455 2714629 2836716 2757746
15558 2757746 2720919 2710823 2698304 2803490 2851560 2768961 2773442 2636934 2720102 2857367 2864112
15547 2864112 2898705 2809943 2728141 2800351 2802939 2762981 2615408 2696092 2854285 2915060 2906061
15536 2906061 2912343 2932791 2822310 2850709 2755218 2834574 2862689 2801777 2839480 2806353 2930093
15525 2930093 2849485 2713007 2950373 2971148 2862852 2732633 2671088 2702349 2643156 2796453
15515 2796453 2793069 2674571 2721103 2767622 2655714 2676833 2625054 2578393 2700358 2776213 2792648
15504 2792648 2689509 2623447 2752409 2851741 2702282 2703452 2844084 2811470 2838306 2792045 2725903
15493 2725903 2855272 2727333 2809113 2683797 2592588 2838118 2696913 2783759 2766222 2696187
15483 2696187 2753729 2745290 2642981 2696804 2858048 2795196 2752890 2657279 2747921 2840616 2697316
15472 2697316 2780616 2730568 2602369 2710058 2557806 2526496 2663275 2627183 2659403 2678049
15462 2678049 2622806 2835746 2900263 2828939 2943066 2843238 2765945 2704519 2762633 2737358 2795604
15451 2795604 2938749 2895467 2868912 2790185 2885010 2738390 2735751 2881825 2782352 2874111 2800759
$$ [...]
##END NTUPLES=NMR SPECTRUM
##END=
