##TITLE=1H_DE-80H_X3
 200.13MHz, d2o
 8 sc
 
 19ns.26.2.2025
##JCAMPDX= 6.0         $$ Bruker NMR JCAMP-DX V2.0
##DATA TYPE= NMR SPECTRUM
##DATA CLASS= NTUPLES
##ORIGIN= UXNMR, Bruker Analytische Messtechnik GmbH
##OWNER= pz
$$ XWIN-NMR		Version 3.5
$$ Wed Jun  3 10:43:14 2026 Russian Standard Time (UT+4h)  Yarkov@DPX200
##.OBSERVE FREQUENCY= 200.1313
##.OBSERVE NUCLEUS= ^1H
##.ACQUISITION MODE= SIMULTANEOUS
##.ACQUISITION SCHEME= undefined
##.AVERAGES= 8
##.DIGITISER RES= 18
##SPECTROMETER/DATA SYSTEM= spect
##.PULSE SEQUENCE= zg30
##.SOLVENT NAME= DMSO
##.SHIFT REFERENCE= (INTERNAL, DMSO, 0, 15.4604)
##AUDIT TRAIL= $$ (NUMBER, WHEN, WHO, WHERE, WHAT)
$$ ##TITLE= Audit trail, XWIN-NMR		Version 3.5
$$ ##JCAMPDX= 5.01
$$ ##ORIGIN= Bruker BioSpin GmbH
$$ ##OWNER= Yarkov
$$ C:/Bruker/XWIN-NMR/data/yarkov2/nmr/H-C/1/pdata/1/auditp.txt
$$ ##AUDIT TRAIL=  $$ (NUMBER, WHEN, WHO, WHERE, WHAT)
(   1,<2026-06-03 10:41:56.51 +0400>,<Yarkov>,<DPX200>,
      <created by zg, POWCHK disabled, PULCHK disabled
       configuration hash MD5:
       00 E9 B6 7A A2 85 ED C7 34 08 36 98 17 FE 4E 26
       data hash MD5: 16K
       ED E9 69 4F 3A 7D C5 BB BC 88 B5 5F B1 4D D8 3F>)
(   2,<2026-06-03 10:42:08.03 +0400>,<Yarkov>,<DPX200>,
      <Start of raw data processing
       efp BC_mod = 2 LB = 0.25 FT_mod = 6 PKNL = 1 PHC0 = -6403.122 PHC1 = 43.62196 SI = 16K 
       data hash MD5: 16K
       6B A1 AF 09 F1 B5 C0 A1 8D BC 54 F3 5A 18 22 84>)
(   3,<2026-06-03 10:42:35.42 +0400>,<Yarkov>,<DPX200>,
      <pk PHC0 = 24.27926 PHC1 = -35.4 
       data hash MD5: 16K
       54 DD 94 AB FA 14 A9 01 FE DE 59 E2 13 3D C4 21>)
$$ ##END=
$$ 
$$ hash MD5
$$ EE 68 EC 3D DE CE 32 1F 72 44 9E 19 32 73 86 D0
##$RELAX= 
##$RELAX= 
##$RELAX= 
##$RELAX= 
##$RELAX= 
##$RELAX= 
$$ Bruker specific parameters
$$ --------------------------
##$DU= <C:/Bruker/XWIN-NMR>
##$EXPNO= 1
##$NAME= <H-C>
##$PROCNO= 1
##$TYPE= <nmr>
##$USER= <yarkov2>
##$AMP= (0..31)
100 100 100 100 100 100 100 100 100 100 100 100 100 100 100 100 100 100 
100 100 100 100 100 100 100 100 100 100 100 100 100 100 
##$AQSEQ= 0
##$AQ_mod= 1
##$AUNM= <au_zg>
##$AUTOPOS= <>
##$BF1= 200.13
##$BF2= 200.13
##$BF3= 200.13
##$BF4= 200.13
##$BF5= 200.13
##$BF6= 200.13
##$BF7= 200.13
##$BF8= 200.13
##$BYTORDA= 1
##$CFDGTYP= 0
##$CFRGTYP= 5
##$CHEMSTR= <none>
##$CNST= (0..31)
1 1 145 1 1 1 1 1 1 1 1 1 1 1 1 1 1 1 1 1 1 1 1 1 1 1 1 1 1 1 1 1 
##$CPDPRG= <>
##$CPDPRG1= <>
##$CPDPRG2= <>
##$CPDPRG3= <>
##$CPDPRG4= <mlev>
##$CPDPRG5= <mlev>
##$CPDPRG6= <mlev>
##$CPDPRG7= <mlev>
##$CPDPRG8= <mlev>
##$CPDPRGB= <>
##$CPDPRGT= <>
##$D= (0..31)
0 0.7 0 0 0 0 0 0 0 0 0 0.03 0 0 0 0 0 0 0 0 0 0 0 0 0 0 0 0 0 0 0 0 
##$DATE= 1780468915
##$DBL= (0..7)
120 120 120 120 120 120 120 120 
##$DBP= (0..7)
150 150 150 150 150 150 150 150 
##$DBP07= 0
##$DBPNAM0= <>
##$DBPNAM1= <>
##$DBPNAM2= <>
##$DBPNAM3= <>
##$DBPNAM4= <>
##$DBPNAM5= <>
##$DBPNAM6= <>
##$DBPNAM7= <>
##$DBPOAL= (0..7)
0.5 0.5 0.5 0.5 0.5 0.5 0.5 0.5 
##$DBPOFFS= (0..7)
$$ [...]
##$SUBNAM2= <"">
##$SUBNAM3= <"">
##$SUBNAM4= <"">
##$SUBNAM5= <"">
##$SUBNAM6= <"">
##$SUBNAM7= <"">
##$SUBNAM8= <"">
##$SUBNAM9= <"">
##$SW= 18.0517328524113
##$SWIBOX= (0..15)
0 0 2 0 0 0 0 0 0 0 0 0 0 0 0 0 
##$SW_h= 3612.71676300578
##$TD= 16384
##$TD0= 1
##$TE= 0
##$TE2= 300
##$TE3= 300
##$TEG= 300
##$TL= (0..7)
0 120 120 120 120 120 120 120 
##$TP= (0..7)
150 150 150 150 150 150 150 150 
##$TP07= 0
##$TPNAME0= <>
##$TPNAME1= <>
##$TPNAME2= <>
##$TPNAME3= <>
##$TPNAME4= <>
##$TPNAME5= <>
##$TPNAME6= <>
##$TPNAME7= <>
##$TPOAL= (0..7)
0.5 0.5 0.5 0.5 0.5 0.5 0.5 0.5 
##$TPOFFS= (0..7)
0 0 0 0 0 0 0 0 
##$TUNHIN= 0
##$TUNHOUT= 0
##$TUNXOUT= 0
##$USERA1= <user>
##$USERA2= <user>
##$USERA3= <user>
##$USERA4= <user>
##$USERA5= <user>
##$V9= 5
##$VALIST= <valist>
##$VCLIST= <CCCCCCCCCCCCCCC>
##$VD= 0
##$VDLIST= <DDDDDDDDDDDDDDD>
##$VPLIST= <PPPPPPPPPPPPPPP>
##$VTLIST= <TTTTTTTTTTTTTTT>
##$WBST= 1024
##$WBSW= 4
##$XGAIN= (0..3)
0 0 0 0 
##$XL= 0
##$YL= 0
##$YMAX_a= 257202
##$YMIN_a= -224386
##$ZGOPTNS= <>
##$ZL1= 120
##$ZL2= 120
##$ZL3= 120
##$ZL4= 120
##$ABSF1= 0
##$ABSF2= 0
##$ABSG= 0
##$ABSL= 0
##$ALPHA= 0
##$AQORDER= 0
##$ASSFAC= 0
##$ASSFACI= 0
##$ASSFACX= 0
##$ASSWID= 0
##$AUNMP= <proc_1d>
##$AZFE= 0.1
##$AZFW= 0.1
##$BCFW= 0
##$BC_mod= 2
##$BYTORDP= 0
##$COROFFS= 0
##$CY= -3
##$DATMOD= 1
##$DC= 0
##$DFILT= <>
##$DTYPP= 0
##$F1P= 0
##$F2P= 0
##$FCOR= 1
##$FTSIZE= 16384
##$FT_mod= 6
##$GAMMA= 0
##$GB= 0
##$INTBC= 1
##$INTSCL= 3.241238e-09
##$ISEN= 128
##$LB= 0.25
##$LEV0= 0
##$LPBIN= 0
##$MAXI= 10000
##$MC2= 0
##$MEAN= 0
##$ME_mod= 0
##$MI= 1.114404
##$NCOEF= 0
##$NC_proc= -6
##$NLEV= 6
##$NOISF1= 3.799351
##$NOISF2= 2.8
##$NSP= 0
##$NTH_PI= 0
##$NZP= 0
##$OFFSET= 15.46042
##$PC= 1
##$PHC0= -6378.843
##$PHC1= 8.221958
##$PH_mod= 1
##$PKNL= yes
##$PPARMOD= 0
##$PSCAL= 0
##$PSIGN= 0
##$REVERSE= no
##$SF= 200.130012263943
##$SI= 16384
##$SIGF1= 3
##$SIGF2= 2
##$SINO= 0.751879
##$SIOLD= 32768
##$SREGLST= <19F.Aceton>
##$SSB= 0
##$STSI= 16384
##$STSR= 0
##$SW_p= 3612.71676300578
##$SYMM= 0
##$S_DEV= 0
##$TDeff= 16384
##$TDoff= 0
##$TI= <>
##$TILT= no
##$TM1= 0
##$TM2= 0
##$TOPLEV= 0
##$USERP1= <user>
##$USERP2= <user>
##$USERP3= <user>
##$USERP4= <user>
##$USERP5= <user>
##$WDW= 1
##$XDIM= 16384
##$YMAX_p= 390684906
##$YMIN_p= -656402
$$ End of Bruker specific parameters
$$ ---------------------------------
##NTUPLES= NMR SPECTRUM
##VAR_NAME=  FREQUENCY,     SPECTRUM/REAL,   SPECTRUM/IMAG
##SYMBOL=    X,             R,               I
##VAR_TYPE=  INDEPENDENT,   DEPENDENT,       DEPENDENT
##VAR_FORM=  AFFN,          ASDF,            ASDF
##VAR_DIM=   16384,         16384,           16384
##UNITS=     HZ,            ARBITRARY UNITS, ARBITRARY UNITS
##FACTOR=    0.220516191357247, 1,           1
##FIRST=     3094.09397513007, 0,            0
##LAST=      -518.622787875706, 0,           0
##MIN=       -518.622787875706, -656402,     0
##MAX=       3094.09397513007, 390684906,    0
$$ Real data points
##PAGE= N=1
##DATA TABLE= (X++(R..R)), XYDATA
$$ [...]
7550A76570J10826j04312l7466N6159K1944r0681j02641J46903O3969o2529Q9994
7539B68736q4240J3299J47958q872j25117j61478L8896j5860o4343Q5064J392
7528I5435Q0051O004O5397j04343R7726K81126o7182j00167j40197o8244J6024
7517A61630r775O505N4535r7466o3415N2773K06371k3993L1845j45690M1817J9874
7505B35011J0216o1151l3597k600P477Q2143K26122n9255j09130Q6112r6271J77757
7493D62834O1856N5792K861k01104j18615o2184k11558J2840j5318j07600P4599
7482d5597M0326j4624J31129p1616J57160m6157N9686P7103o3677M5721l0531
7471B38923r5993K4222l7837j32485J16834K10642m2304l9273k7999l9181Q4256
$$ plain form
7550 176570 287396 183084 145618 201777 223721 133040 30399 177302 241271 178742 268736
7539 268736 184496 197795 345753 336881 211764 50286 89182 73322 8979 94043 95435
7528 95435 175486 181490 246887 142544 240270 521396 454214 354047 213850 145606 161630
7517 161630 151855 158360 212895 115429 52014 104787 311158 287165 319010 173320 215137 235011
7505 235011 245227 184076 150479 147879 155356 237499 463621 404366 295236 381348 285077 462834
7493 462834 524690 580482 583343 382239 263624 201440 -10118 2722 -12596 -120196 -45597
7482 -45597 -5271 -19895 111234 39618 196778 150621 210307 287410 223733 269454 238923
7471 238923 142930 167152 129315 -3170 113664 324306 282002 242729 214730 175549 259805
7460B59805j53462J8366J24463R6454j20793P7235R3267j2097j6338J20784J4847
7449E02531O1898K8112M9118p9764m5037r9165K6231r0575j42804r5012l009R7612
7437B10136M1357k7456K2423J0078L2453L3185M1491L5864j14208K8895p9446
7426B34772J92063n7743J00373J27852r9632q7948J06864j63183m3550N8316K50207
7415F18391j78437j77412N0268R0540M8728m6635R1612o2575p2829K6768N4199
7404D42618j17087J64674J56781j59754j46111J88853L6912k06462k1990K4433
7394C62867Q975m9642k259J7696j66856j6405K08840J30757m8628J70025K1837
7383F37207j52393j16598K5711P925K20491j33377j02692j37052P9996J44824
$$ plain form
7460 259805 106343 124709 249172 345626 224833 302068 395335 383238 366900 487684 502531
7449 502531 564429 592541 641659 561895 516858 417693 443924 353349 210545 115533 112524 210136
7437 210136 251493 224037 246460 256538 288991 322176 363667 399531 285323 314218 234772
7426 234772 426835 369092 469465 597317 497685 409737 516601 353418 309868 368184 618391
7415 618391 439954 262542 312810 403350 452078 405443 497055 434480 361651 388419 442618
7404 442618 325531 490205 646986 487232 341121 529974 566886 360424 338434 362867
7394 362867 371842 322200 319941 337637 170781 154376 363216 493973 445345 615370 637207
7383 637207 484814 368216 393927 401852 622343 488966 386274 249222 329218 474042
7373D74042j69526p4115N7332J11398o1748l1618o30O6608r8252J09576k2336
7362C60731J4153l6268Q9224j033J31955J02419J11145j2928j64299l4793j05914
7351D54392R2070r8530k38722N0234J23352Q9674k3978q6957J84452j07825N5174
7340D93336K26507r3550J10021l4026n292O1174j00762Q9520j066J67787J85557
7329A099206J34942P2701L49909N04795N78808N96640M86278K44630k20802l08494
7319C538613k54360n90786m32617m00117k95851j18872l29961R9166J5377m25974
7309H04618j62699J12821l7744m5236p6999o0472j12329l3966k3196n8309j26374
7298A80115Q1221Q9678j04931J59615M6441J72616n1517o8022J14843j24356K16909
$$ plain form
7373 474042 304516 230401 287733 399131 337383 305765 305135 371743 273491 383067 360731
7362 360731 374884 338616 427840 426807 558762 661181 772326 759398 595099 560306 454392
7351 454392 546462 447932 209210 259444 382796 472470 448492 361535 545987 438162 493336
7340 493336 719843 626293 736314 702288 696996 758170 657408 746928 745862 913649 1099206
7329 1099206 1234148 1306849 1656758 2161553 2740361 3337001 3823279 4067909 3847107 3538613
7319 3538613 3284253 2693467 2260850 1860733 1564882 1446010 1116049 1215215 1230592 804618
7309 804618 641919 754740 716996 671760 594761 534289 421960 387994 364798 306489 180115
7298 180115 261336 351014 246083 405698 452139 624755 573238 505216 620059 495703 712612
7287G12612P2299l08136o4091m1331J19139o1027k53626J62104J40936j02030
7277C76849q9706P9698J66264q5186L9436J51154n9165j01751J27213j3553j09327
7266D81926J10772P8246r2827l28737j21317K53836M8692n7784K3357q3900J20693
7255D32957p8267L2406r249l6369m734j26374j9208j6627J02198M4812o3225J14247
7243C72567J25556J63848j27457j5575j10776j35003k0023m7677j2972J23093
7233C15581k4743N2075j75367m6087K87038Q9710q8433j49648L3277l3397K01382
7222D61388K01109R6588k17349N1747j84496O7300M2449j4441N7043j69951l3647
7211C57740M4394o6162k8016J97178o4746j03226J93296J68906r5551j96708o5973
$$ plain form
7287 712612 784911 476775 412684 371353 490492 429465 175839 337943 478879 376849
7277 376849 287143 366841 533105 447919 487355 638509 579344 477593 604806 591253 481926
7266 481926 592698 670944 578117 249380 128063 381899 430591 372807 396164 312264 432957
7255 432957 354690 387096 377847 341478 336744 210370 191162 174535 276733 321545 258320 372567
7243 372567 498123 661971 534514 518939 408163 273160 253137 205460 192488 315581
7233 315581 290838 342913 167546 121459 408497 498207 409774 260126 293403 260006 461388
7222 461388 662497 759085 541736 593483 408987 476287 518736 504295 561338 391387 357740
7211 357740 402134 335972 307956 505134 440388 337162 530458 699364 603813 407105 341132
7200C41132P546J58425r219k3257P169j61777l2797J63628J21121J9512J7099
7189F08582p8459j03186j46172R430O6970N0766r5249k6302o6472J6285P4071
7178C10264J95551l9684j7771m0729N5866R2137Q4666J12387o332j8375k16621
7167E11359R2884L5854k27297l5937n0473Q634J26845j49045M575J8078q5586
7156B49891J5030q948J93094K2530J1433L3252m9403k8220J9599o048l8047n0815
7144C63348j73508P4343l9454l0808J0214j34990J60276J50370p3589P2099N1864
7133D30165j33101k6908L2683K3864J23269q5574j91390j25930K7528K23842K07237
7122E05685k3279j11342r5906O8237j43407L1974P6724j88176J7826J251M1249
$$ plain form
7200 341132 348678 507103 497884 474627 481796 320019 287222 450850 571971 591483 608582
7189 608582 530123 426937 280765 290195 357165 407931 312682 286380 219908 236193 310264
7178 310264 505815 466131 448360 407631 463497 555634 640300 752687 746355 727980 511359
7167 511359 604243 640097 412800 376863 326390 335024 461869 312824 317399 335477 249891
7156 249891 264921 255973 449067 471597 483030 516282 466879 438659 458258 452210 414163 363348
7144 363348 189840 264183 224729 193921 204135 69145 229421 379791 306202 378301 430165
7133 430165 297064 270156 302839 326703 449972 364398 173008 47078 74606 298448 505685
7122 505685 482406 371064 275158 343395 199988 231962 308686 120510 138336 139587 180836
7111A80836K2389L3929M9758j0992O7878J90864J27836j21264j74722j3753J33512
7100D86271M7870L6377M9398m1658j90244j38599p2321K04710j6381P671k0982
7089C52112k47245L2159O5198Q2250N8996q8361R009J61481q0031j43979j05695
7078I5894K8242K833J12035j3602r5595J3578K11578N8008J02038J39620j33795
7067E20834N0475P9233m3602o7910j14537J0012K7838j14194J83023M5494o1993
7056E14673k6846j73597P8293J00012j583N4872l35437l4310J06331L2090j9440
7045B95058L2579n4512o4163q4603j5507J16294O1730O5398k6782j01247k4271
7034A99974R9733M8846N2037j59375Q0780o0516J5789k1989L7396M3399l4379
$$ plain form
7111 180836 203225 237154 286912 275920 343798 534662 662498 541234 366512 352759 486271
7100 486271 534141 570518 619916 578258 388014 249415 177094 381804 365423 373094 352112
7089 352112 104867 137026 202224 284474 343470 255109 264118 425599 345568 201589 95894
7078 95894 124136 126969 239004 225402 129807 143385 354963 412971 515009 654629 520834
7067 520834 571309 650542 606940 539030 424493 434505 462343 348149 531172 576666 514673
7056 514673 487827 314230 392523 492535 490952 545824 210387 176077 282408 314498 295058
7045 295058 327637 273125 208962 124359 108852 225146 286876 352274 325492 224245 199974
7034 199974 299707 348553 400590 241215 321995 261479 277268 255279 292675 336074 301695
7023C01695q1002Q1366L4417L9517L7383l1951k8069L0382R704j40007j4636p7142
7011A61657n3407n841M5786J74929o3548J00265k9968r4957P831l5373M6988j0701
6999B43661K6131j4543j42696n7105K19099J31251j13328r6842N6730k8905J21248
6988C44701m8890L2454o9982O7103R7842J0530n6554O6745K7185q1217k26183
6977A63734J05918K09500j02577p6503l6119J16392J79655J02135J65536k7175
6967H00496n7946J02168k77861j17644M6525K66793p0530j50056l1556J34406
6957F44795l3211m5826J35854K7149J03136K87k71173M2864j51230J29427l2836
6946E49236n2002J43010p3983K4895k19505r3109J11297r4628J39399K09468j41001
$$ plain form
7023 301695 220693 302059 336476 375993 413376 381425 353356 383738 393442 253435 238799 161657
7011 161657 108250 102409 148195 323124 259576 359841 329873 234916 242747 207374 254362 243661
6999 243661 269792 255249 112553 55448 274547 405798 292470 195628 252358 223453 344701
6988 344701 295811 328265 258283 325386 423228 433758 377204 443949 471134 389917 163734
6977 163734 269652 479152 376575 300072 263953 380345 560000 662135 827671 800496
6967 800496 742550 844718 566857 449213 495738 762531 692001 541945 510389 644795
6957 644795 611584 565758 701612 728761 831897 832184 561011 603875 452645 582072 549236
6946 549236 497234 640244 566261 591156 371651 278542 389839 295211 434610 644078 503077
6935E03077m9095j14145J85284n9667Q696P545N5408o3424q6252N6534n5112k8085
6923C60764K5580J31442J04871q3054J85997j13231k49614J61228J5787L9195
6913E78965j63920j14782J73669o9391O8225O6770M2553j21930M2657m8891R6564
6902E50489k3732k20836M5356j18025J72003q1077r5698N3183N6475J2060J08643
6891D58841J57763J77593k7307p5368Q1594m3696k4196r0518k3278r612K7928
6880F09744Q9842J30190j64807j80932O8106k8572R5888M3411j65970n9323K1357
6869D58934o2607l3524l7346R6964K3458j02904O2870R909J09522j0541j48624
6858C66111j09081J08261O8432N672q1282L371N9852j89589N8312P402q733J03441
$$ plain form
6935 503077 453982 339837 525121 465454 474150 481695 537103 473679 387427 443961 388849 360764
6923 360764 386344 517786 622657 539603 725600 612369 362755 523983 539770 578965
6913 578965 415045 300263 473932 404541 472766 539536 582089 460159 502816 453925 550489
6902 550489 526757 305921 351277 233252 405255 324178 228480 281663 338138 350198 458841
6891 458841 616604 794197 766890 691522 773116 729420 705224 614706 591428 581816 609744
6880 609744 699586 829776 664969 484037 552143 523571 619459 662870 496900 437577 458934
6869 458934 396327 362803 325457 422421 445879 342975 405845 415754 525276 514735 366111
6858 366111 257030 365291 433723 439395 358113 361484 421336 231747 290059 297461 288728 392169
6846C92169m3734j25563K4795J17719K75636k3947L5462l7272j21756l7720l8181
6835D17608n5635N5768q855j33053M8996k1449P8996M9440j38990q9972K4880
6824B27734J88578J82237J677k8525n1562k64898J8121J56879K46030p236k01266
6813D67769K2485k6530O4857J35457J10531j68523j18135r3466M2170k6123j90686
6802B19806Q8228j36683p5433J53621L9270L4965j43572J34596J65714j03839
6792C76673R2224J55851J4946k43513n1009R7715Q2285o3857N9533J22383k21682
6781D21549q135r0349o4874J27340J63214j54181j28922J06871J16298J49260
6771F38071j4547J51087j112j76937r0132l4698k06122l8429p3243j87434O9412
$$ plain form
6846 392169 348435 222872 247667 365386 641022 617075 652537 615265 493509 455789 417608
6835 417608 361973 417741 408886 275833 324829 303380 382376 431816 292826 202854 227734
6824 227734 416312 598549 600226 571701 520139 255241 273362 430241 676271 669035 467769
6813 467769 490254 463724 528581 664038 774569 606046 487911 394445 436615 410492 219806
6802 219806 308034 171351 95918 249539 288809 323774 180202 314798 480512 376673
6792 376673 468897 624748 639694 396181 345172 442887 525172 461315 520848 643231 421549
6781 421549 413414 323065 258191 385531 548745 394564 265642 372513 488811 638071
6771 638071 623524 774611 773499 596562 506430 471732 265610 227181 153938 -33496 35916
6760C5916K37013J40600Q5252q2424l0543m6936j07629n4419o4684Q0307j26415
6749F6038K5216J5678j0005R7550J97938r2728R5197M9814m1242J8882P6062p8587
6737D19813Q481p0794q6329J31202q9100r064j25644j61532J03821J04518R8744
6726C24116L1114k8223J88345N37R6347P9347j02351o4471m9990k92822k16180
6715c4231k6123J5872K00714M5978Q6305O2119J35118R1029M6021j49563M1436
6704E14675O2914j83148Q3329r5766r4911O3881P5857m4693J16091K04484q255
6693F94458n3482o0638k30452j80697P2419O6214k3922J26598j28486Q8742L7645
6682D08399k06761J048R5998R8130p8573j59679J49533J84992m4170O4700Q8936
$$ plain form
6760 35916 272929 413529 498781 416357 385814 338878 231249 176830 112146 192453 66038
6749 66038 91254 106932 96927 194477 392415 299687 394884 444698 403456 422338 498400 419813
6737 419813 428294 357500 271171 402373 313273 304209 178565 17033 120854 225372 324116
6726 324116 355230 327007 515352 515889 612236 691583 589232 524761 474771 181949 -34231
6715 -34231 -60354 -44482 156232 202210 288515 350634 485752 576781 622802 473239 514675
6704 514675 577589 394441 477770 382004 287093 350974 426831 382138 498229 702713 694458
6693 694458 640976 580338 349886 169189 241608 307822 283900 410498 282012 370754 408399
6682 408399 201638 202686 298684 396814 318241 158562 308095 493087 448917 513617 602553
6671F02553J12300R396o700k15632K7862n5101j25856J14836P5490P0606l6087
6660E73667P8142J24343Q8434J67757O2702m8429Q9433n9036p0112r8704n282
6649I02915o3374M4963J06831R1772J1331k47483J68187q2151k4559J29810J65173
6638A203415Q9028j78572q1659j03297P554m1086k204J9657M4518k58930J63597
6627H62021O8171J45718K3138j39927j7482K0870J39147l1437j63920k06945j35885
6616E63469P8711K23570m0606j8545r8665r3054r3291P2250N0122L17071k98973
6605F62059k87774N1249k2559J93406K1295k25953m6229L9410l0093j5412j56671
6594A82728J3925J19364P5732j09725o467J35340K77921N014q4239p6526m4783
$$ plain form
6671 602553 714853 724249 717549 501917 529779 474678 348822 463658 539148 609754 573667
6660 573667 651809 776152 864586 1032343 1095045 1046616 1136049 1077013 1006901 908197 902915
6649 902915 839541 884504 991335 1083107 1094438 846955 1015142 932991 908432 1038242 1203415
6638 1203415 1292443 1113871 1032212 928915 936469 895383 893179 912836 957354 698424 862021
6627 862021 930192 1075910 1099048 959121 941639 962509 1101656 1070219 906299 699354 563469
6616 563469 642180 865750 825144 806599 707934 614880 521589 593839 643961 961032 662059
6605 662059 374285 425534 402975 596381 617676 391723 345494 384904 354811 339399 182728
6594 182728 196653 316017 391749 282024 275557 410897 688818 693832 609593 533067 488284
6583D88284J13483r1036j91925q3243o7210M6612K3252o2940M6925P2509J6921
6572C11632n0086R6616j7505J27098N5017k14929J1875N4318Q0817N3234j29512
6561C78575n773L0906r7599j42144q7343j30475J45255J64820J07415P2035j5722
6550D19950R9821j57803j47623p7391j71520J54921r5817j02952J98842j0385
6540A10043N826O1756M7118K73629J26879k25627l3844j44167P349P8171q6696
6529B20437j58167J19130p9064n7237k9589j0470J97467l0490L4601k8547J578
6518A79649R2360Q8315O2577q4707l28005Q610M4604q8901k8283J22893L0004
6507I9116Q4784N6084N2960L6449n300R0464j04156q4134J29999J30453R925j28468
$$ plain form
6583 488284 601767 510731 318806 235563 168353 214965 238217 175277 222202 294711 311632
6572 311632 261546 358162 340657 467755 522772 307843 319718 374036 454853 508087 378575
6561 378575 372802 403708 306109 163965 76622 -53853 91402 256222 363637 435672 419950
6550 419950 519771 361968 214345 136954 -34566 120355 24538 -78414 120428 110043
6540 110043 115869 177625 224743 498372 625251 399624 365780 221613 228962 307133 220437
6529 220437 62270 181400 102336 45099 15510 5040 202507 172017 206618 178071 179649
6518 179649 272009 360324 422901 338194 10189 18799 63403 -25498 -53781 69112 99116
6507 99116 183900 239984 292944 329393 324093 414557 310401 226267 356266 486719 496644 368176
6495C68176k35991l7089k9289J96592N7437o794N7565j25145k5977j21854k7839
6484F9792K56825k03612r6593m5380j2893J82998P6928l700j39973N3274J68235
6473C05901J42188j87434j37040L4238J15883R7016J07978K2525k9837q0482k5035
6462C65901j7029J04751K05482k19279j99478l8651J652J40745N667m8837K81671
6451E82595l6710j01787k4946M9737J4534p6831Q6790j82591j26028n5402J35841
6440B65202j80595o5219p4901O7745K76888q4446J15038p8860j41320J71346P6098
6429C46976L157J14498j82753M0129K6872R3474M6007J19470M1693k52383n4765
6418C42375k1860L9267o0501o7824p3873L5096N1689n9676Q5979k2082j30524
$$ plain form
6495 368176 132185 95096 65807 262399 319836 313042 370607 245462 219485 97631 69792
6484 69792 326617 123005 26412 -18968 -31861 151137 228065 224365 84392 137666 305901
6473 305901 448089 260655 123615 157853 273736 370752 478730 501255 471418 390936 365901
6462 365901 348872 453623 659105 439826 240348 201697 203349 344094 349761 300924 582595
6451 582595 545885 444098 419152 468889 483423 406592 493382 310791 184763 129361 265202
6440 265202 84607 19388 -55513 12232 289120 204674 319712 240852 99532 270878 346976
6429 346976 350133 464631 281878 322007 348879 442353 488360 607830 649523 397140 342375
6418 342375 320515 359782 299281 231457 157584 192680 244369 184693 270672 248590 118066
6407A18066O4980r517q5797O8381p7584J17743j20162P1913K07529L0213J65653
6396E51418r8507j53481j37742N7557l7729j09549j51892l2290j5508R3893J21352
6385H7522L3603J13402J89498P7320r0033n3413p2191R3337j04400j06962J46692
6374C14375m0186n8931J38006j28281j28532N0254J3780l8135m0677O8270K5293
6363A75236J4025P516K17276M7494J20148J70229k28307p7579j4053K13464j038
6352F44411k01749J35633o8102k17661J80491q1242O5252J60101j05639l3256
6342D78239k02160k1651K4495j14708l6214K38718n3106q8102J66594l8113p8014
6331B75978n7807R0385N7490l62304N2397M6221n2944J17805J18050J81507r169
$$ plain form
6407 118066 183046 173529 87732 156113 78529 196272 76110 148023 355552 385765 551418
6396 551418 452911 299430 161688 219245 181516 71967 -79925 -112215 -127723 -33830 87522
6385 87522 121125 234527 424025 501345 411312 357899 285708 379045 274645 167683 314375
6374 314375 274189 215258 353264 224983 96451 146705 160485 122350 81673 149943 175236
6363 175236 189261 196777 414053 461547 581695 751924 523617 446038 431985 645449 644411
6352 644411 442662 578295 510193 292532 473023 391781 457033 617134 511495 478239
6342 478239 276079 254428 278923 164215 128001 366719 313613 225511 392105 353992 275978
6331 275978 218171 308556 366046 3742 56139 102360 49416 167221 285271 466778 457609
6320D57609o5647J00577j04597j17309P7523J15689Q3568m6190P8235R1763o1009
6309F10212n0968J52820Q7410j24957j59607q9344J00893n5774l4901J4869j02657
6298C47996L0984n1255J9132N1428l71013l9093J06413K3607K958k13700K32675
6287A40132l8796M0953J11069L4306J17580j76981k14563l9230K882J54809P6180
6276B08341l7444N6508J29263O4842j22885P1126p6328K05811k1393l8837J4106
6265D53110j45481J86194N7316l49J17511M4128n7577m3536M181j31706p6661
6254D07130M1658j4900j03097l0628j9117M9919j02773R3897o7297l8218K5868
6243B42442P878J40356k50710M9881J39657K5528j9851J35189j20938l9271p542
$$ plain form
6320 457609 391962 492539 387942 270633 348156 463845 547413 501223 579458 671221 610212
6309 610212 559244 712064 799474 674517 514910 425566 526459 470685 435784 450653 347996
6298 347996 378980 327725 346857 398285 27272 -11821 94592 118199 121157 -92543 140132
6287 140132 101336 142289 253358 287664 405244 228263 13700 -25530 -22648 132161 208341
6276 208341 170897 227405 356668 421510 298625 369751 293423 499234 477841 439004 453110
6265 453110 307629 493823 551139 550790 668301 712429 654852 611316 615497 483791 407130
6254 407130 448788 433888 330791 300163 281046 330965 228192 322089 254792 216574 242442
6243 242442 250320 390676 139966 189847 329504 355032 335181 470370 349432 310161 302619
6232C02619O0634k3902J45796k09463P2959q8802j62673K42119o2000Q3373P2391
6221D33051J197J36129q6582l3994O2482O9411J28363l4681J9188o8719j49374
6210D76471M1051J55670p3437o9412J29615M8216n694O2271q7257J07469k05545
6199E79418J74685r7354o5800m4501j00662N41J04011J83741l7351n6719j22677
6188E17332r5984p4021m1900J4834O3705j43510J48530p2112R8606N4923j56970
6177C13433J37568J04804J7252M9107k67866j04419k6565R7955R7919j11275J77061
6166D84974R5827p7473p5256J9005j07776p8812K08957p6132j76854M938L0615
6155B52013L8419o515P7704N9305O2962k78505p7698O6144J40524J09003p600
$$ plain form
6232 302619 363253 339351 485147 275684 348643 259841 97168 339287 277287 360660 433051
6221 433051 434248 570377 483795 449801 512283 581694 710057 675376 694564 625845 476471
6210 476471 517522 673192 599755 530343 659958 708174 702480 764751 677494 784963 579418
6199 579418 754103 656749 590949 546448 445786 446327 550338 734079 696728 640009 517332
6188 517332 421348 347327 305427 320261 383966 240456 388986 316874 415480 470403 313433
6177 313433 451001 555805 573057 622164 354298 249879 223314 321269 419188 307913 484974
6166 484974 580801 503328 428072 447077 339301 260489 469446 393314 216460 221398 252013
6155 252013 290432 283917 361621 420926 483888 205383 127685 193829 334353 443356 435756
6144D35756k41184p616J67039J45838l5035k8309R2769r0733k4787j04543K5862
6133C35057o7659J11190k3368L0656k7436J93374M2155l20001q4978J84900J42413
6122E16303J93373j49548k56699J15744n6424m183K7979M8010R7901m6714j32697
6111C53045l9764O7792J37978o6949j64304o0874J97193J40726J2533r4218J8918
6100E02076J22077M0198J9850j6006P794J65028n5921l1189P450J6878j657k18799
6088E57779q6854L7413l0619n540j9402L0487j37616m0004R0537Q4567N5969L8349
6076E75066J71236j49716j34698L3973k0346K5293m5286J9422r2398m9386J57809
6065D90969k3691l9415o2761M0806J7299L7160M1086j29098L8246q5025P8751
$$ plain form
6144 435756 194572 186956 353995 499833 464798 436489 529258 438525 413738 309195 335057
6133 335057 267398 378588 355220 385876 358440 551814 593969 273968 188990 373890 516303
6122 516303 709676 560128 303429 419173 362749 358566 386545 434555 532456 485742 353045
6111 353045 313281 381073 519051 452102 287798 226924 424117 564843 577376 483158 502076
6100 502076 624153 664351 684201 668195 675989 841017 785096 753907 761357 778235 776578 557779
6088 557779 470925 508338 477719 472179 452777 483264 345648 305644 396181 480748 536717 575066
6076 575066 746302 596586 461888 495861 475515 500808 455522 474944 382546 333160 490969
6065 490969 467278 427863 365102 405908 423207 460367 501453 372355 410601 325576 404327
6054D04327J09710j8212P7076j7067o4116o756N2386J0589N7012j02976j54632
6043C47341l3580k0834J74402P6990l0663J40493k8452j66766p7963l5864K24222
6032E69326J39741j41315o4138j2884l6756O2623J13821J46514M8133n4795k6375
6021G43895j63997l6069r8011l7631j55299K98150J32755N4902O6896j98321J37947
6010G45217k5105J51198K50039q8772k24162n6207J8953M1867j15499J8034J8254
5999G33817n8941j5141m7208j0517L11P9781j21531R9311j67650J45949J8716
5988F56897j33983q4283n0452J31145R2191j09473j60029J19839R0435R9829M4811
5977F96927J01442N7456M4163J1918o6715j12509N194P2190j10602k7986p9913
$$ plain form
6054 404327 514037 495825 572901 555834 491718 484962 537348 547937 604949 501973 347341
6043 347341 313761 292927 467329 544319 513656 654149 625697 458931 380968 345104 569326
6032 569326 709067 567752 503614 490730 453974 516597 630418 776932 825065 770270 743895
6021 743895 579898 543829 445818 408187 252888 551038 683793 738695 805591 607270 745217
6010 745217 720112 871310 1121349 1032577 808415 752208 771161 813028 697529 715563 733817
5999 733817 674876 659735 612527 602010 602321 682102 560571 659882 492232 638181 656897
5988 656897 522914 438631 388179 519324 611515 502042 342013 461852 552287 652116 696927
5977 696927 798369 855825 899988 911906 845191 732682 737876 810066 699464 671478 591565
5966E91565p3195L8880J70876L6909L01316J36549Q0165k92156k60132K66756
5956I97533j35765n5958k41144M6939J7062m3083q5073J02576L7446k4644p0343
5945E45546n2437L1933J66654l9080p9789o1412J54974J24320r6014l3424L6828
5934F98099j76255L8786J00752R0222n9659p2328m9907j33230o8212J56056K21458
5923G45782n5904q4407j37136m4449J47641J92170p435o3122K2939N1238k51383
5912E15934J74071J70057K43102j74557k33496L2940k3849J63442j98543k15235
5902D53866Q7569n618l4824L469P9476J48223j2486o5629K29639K22888M0328
5891A146901q4619j82114j34770q2162n4795K00188p0849j16720o690K9466J08560
$$ plain form
5966 591565 518370 557250 728126 765035 1066351 1202900 1283065 990909 730777 997533
5956 997533 861768 805810 564666 611605 628667 585584 500511 603087 640533 615889 545546
5945 545546 493109 525042 691696 652616 572827 511415 666389 790709 694695 661271 698099
5934 698099 521844 560630 661382 751604 691945 619617 569710 436480 368268 524324 745782
5923 745782 689878 605471 468335 423886 571527 763697 756262 693140 716079 767317 515934
5912 515934 690005 860062 1103164 928607 695111 728051 704202 867644 669101 453866
5902 453866 541435 535817 500993 504462 583938 732161 719675 654046 883685 1106573 1146901
5891 1146901 1062282 880168 745398 663236 608441 808629 737780 621060 614370 643836 752396
5880G52396L326Q3499m8702R598j12407P403R4442P15k9004J38565M908K3170
5868I27909K4152j4461n830m4145J27460j17930l7070O8130r7144j28116q436
5857F94519o3943Q4768J15146j17362J9025m5904J32364J38788k04391K2611N6534
5846H32155l563R0590O264O9107R4269k07476J41361k7138k77335k9395k9622
5835F59217J17184O200K0577R0718L8811q5337M6042o5243J75872J75370j52096
5824A027315p0490M7856p0469P7656n1574l7386K09480l2139J05967j18529j6552
5813A071135J29178j19445p8569O4403J9393j20363j8404Q0441Q1451j15739J3343
5802A006824M2878N2018o6204P8129M6003O6414J53458J47142m0300j57968J92921
$$ plain form
5880 752396 755722 839221 790519 800117 687710 695113 789555 790270 761266 899831 904739 927909
5868 927909 952061 937600 931770 887625 1015085 897155 860085 928215 831071 702955 694519
5857 694519 630576 715344 830490 713128 732153 686249 818613 957401 753010 775621 832155
5846 832155 828592 919182 925446 994553 1088822 881346 1022707 995569 718234 688839 659217
5835 659217 776401 782601 803178 893896 932707 847370 893412 828169 1004041 1179411 1027315
5824 1027315 956825 1004681 934212 1011868 960294 922908 1132388 1100249 1206216 1087687 1071135
5813 1071135 1200313 1080868 1002299 1066702 1086095 965732 947328 1027769 1109220 993481 1006824
5802 1006824 1049702 1101720 1035516 1113645 1159648 1226062 1379520 1526662 1486362 1328394 1521315
5791A521315q3725l8797L5008J70005O817r9103L0088K86232J21178q9011N6090
5780A916097J63951l578N1597J01170q4316J30009K43007J96071J30218L02241
5770C146467M03209K75001M54781N72020N89060J059185J541410K439192L606400
5761A4086725M951924N082455K480119P29947m21226j843641l436429m105774
5753A7524100l522713k957140k124088j588452j146568r37835o70447l42920l42175
5744C891762l35118l46790j54758l3760j20991l9452j24091j57822j9691r5552
5734B463737j26553J44721k32661j39430o9303L2668k9853J04624J97454j16504
5724B228900j89060j55649k67j77442M6775p9500J11619J710j38549j05180K2176
$$ plain form
5791 1521315 1437590 1398793 1433801 1603806 1610623 1511520 1541608 1827840 1949018 1860007 1916097
5780 1916097 2080048 2076470 2128067 2229237 2144921 2274930 2517937 2714008 2844226 3146467
5770 3146467 3549676 3824677 4279458 4851478 5440538 6499723 8041133 10480325 14086725
5761 14086725 19038649 24121104 26601223 27331170 26909944 25066303 21629874 17524100
5753 17524100 14001387 11044247 8920159 7331707 6185139 5247304 4576857 4233937 3891762
5744 3891762 3556644 3209854 3055096 3021336 2900345 2860893 2736802 2578980 2559289 2463737
5734 2463737 2337184 2481905 2249244 2109814 2040511 2073179 2043326 2147950 2345404 2228900
5724 2228900 2039840 1884191 1883924 1706482 1753257 1673757 1785376 1787086 1648537 1543357 1565533
5713A565533J7682J51583p8452M9875J41710P830l8591k75607P562N9111K03884
5702A812120l2259n1961k9013j2873j10260j66760N3331K27769Q0988j04438n3478
5691A613166p861P9594m2448J74122n4643j01104N9791j85959j52940L4473J16012
5680A532203j3780P9748l3984K01895l5498n7685J04886M7524N2652K8552j69109
5669A737404k3984r9585R126o873m594J72855P4442J65894J9856j81138p9167
5658A784236Q1945J24198j5931M0796k15195j13190l7569o3875J23455o5084K225
5647A646011J41585k9870O0460O9431j4807J07193L555N5532j160P0660p1638
5636B036952j39320p4552p1847O0936L00483N2049k7422j05611p4402J9458J63020
$$ plain form
5713 1565533 1583215 1734798 1656346 1706221 1847931 1855761 1817170 1541563 1549125 1608236 1812120
5702 1812120 1779861 1727900 1698887 1686014 1575754 1408994 1462325 1690094 1771082 1666644 1613166
5691 1613166 1605305 1684899 1642451 1816573 1761930 1660826 1720617 1534658 1381718 1416191 1532203
5680 1532203 1518423 1598171 1564187 1766082 1730584 1672899 1777785 1825309 1877961 1906513 1737404
5669 1737404 1713420 1613835 1622961 1616088 1611494 1784349 1858791 2024685 2044541 1863403 1784236
5658 1784236 1866181 1990379 1974448 2015244 1800049 1686859 1649290 1585415 1708870 1643786 1646011
5647 1646011 1787596 1757726 1818186 1887617 1872810 1980003 1983558 2039090 2037930 2108590 2036952
5636 2036952 1897632 1823080 1751233 1812169 2112652 2164701 2137279 2031668 1957266 1976724 2139744
5625B139744m6303j2365k6790j25637O1620r2028L2794N9942j10888k6993K7808
5614A880904J69000J25348p4572J3944l9041J90955J61826r6391O8655j15078
5604B285550j31532N3037j04486K1306J74576r0301m0616o2847M4365K25533R0158
5593B464743p6173k8885J29650J5277Q3053j76967R8360K780R6393N1650j70143
5582B489738L1711J3442L0775r3220j0629L2307K39770M9181J6106O2777O6559
5571B928517j17747j04122m8435O0627M2173o831m1051M2010Q5817Q1072J02669
5560C024699N0473m9682n0406L0545O6819J15293j21884k2085Q6121R5842k8010
5549C197725R3182J28706P4588n3613j56367K30090j8670j04962J10329Q6860
$$ plain form
5625 2139744 2093441 2081076 2054286 1928649 1990269 1898241 1931035 1990977 1880089 1853096 1880904
5614 1880904 2049904 2175252 2100680 2114624 2075583 2266538 2428364 2331973 2400628 2285550
5604 2285550 2154018 2207055 2102569 2123875 2298451 2208150 2167534 2104687 2149052 2374585 2464743
5593 2464743 2388570 2359685 2489335 2504612 2587665 2410698 2509058 2511838 2608231 2659881 2489738
5582 2489738 2521449 2534891 2565666 2472446 2461817 2494124 2733894 2783075 2799181 2861958 2928517
5571 2928517 2810770 2706648 2658213 2718840 2761013 2754182 2713131 2755141 2840958 2922030 3024699
5560 3024699 3075172 3025490 2975084 3005629 3072448 3187741 3065857 3043772 3129893 3225735 3197725
5549 3197725 3290907 3419613 3494201 3440588 3284221 3514311 3495641 3390679 3501008 3587868
5539C587868L2524p3255Q1608J64911K8566o9244Q1605j01713Q6583K595O2941
5528C884989R0659J54857J10094M6404R2322O4503l6717j06087P5022O7325N2054
5517D495425j01295j5961r5752Q6069P9396R1621q3666K14667K10659K6522k25029
5506D682656O6692L06147O9581R1832q3035M0496J47707N0661j10294r2100R4646
5495E264989J90971j21406J22010J33263k5886M2124j9656N3083K09984J41548
5485E991024N5747n5736k21695J95009K77108J04603j1810K66511K34234N5614
5475F890609o1123Q0066J66183Q5932J53655j99465q0262K47276K15227J26583
5465G624681j40164k1729K66957j74228J23229J78390J09803J76784J94933J82944
$$ plain form
5539 3587868 3620392 3547137 3628745 3793656 3822222 3752978 3834583 3732870 3819453 3822048 3884989
5528 3884989 3975648 4130505 4240599 4287003 4379325 4443828 4407111 4301024 4376046 4443371 4495425
5517 4495425 4394130 4378169 4282417 4368486 4447882 4539503 4455837 4670504 4881163 4907685 4682656
5506 4682656 4749348 5055495 5125076 5216908 5133873 5174369 5322076 5372737 5262443 5170343 5264989
5495 5264989 5455960 5334554 5456564 5589827 5563941 5606065 5586409 5639492 5849476 5991024
5485 5991024 6046771 5991035 5769340 5964349 6241457 6346060 6334250 6600761 6834995 6890609
5475 6890609 6829486 6909552 7075735 7161667 7315322 7115857 7035595 7282871 7498098 7624681
5465 7624681 7484517 7462788 7729745 7555517 7678746 7857136 7966939 8143723 8338656 8521600
5455H521600o83J9225K50510J21817j52761J66363J80605J3772R0286P5811K36268
5444I522813L3458L4799L00253J74233J10460L87713l0218J81081p4489J63251
5434A0803354J57308n3550K73942R7510M8596K53434K05006J11058Q5281N5770
5424A2037709K26806J12416K34935J81653R5546J54105K66013r4516Q8332L8307
5414A3341306M4577J52180M1555K09259K49438N4859K50410R660K34543J38579
5404A4726366J14373O8823J0758J68926Q3729J50833P6304K28299Q6438J78877
5394A5893726J27221N3052J34986J52313q1252J04519o4956K64517K67577M0282
5384A6891985J54010K870J17021K8554O6752j57303j19406O5884q1524j75227
$$ plain form
5455 8521600 8520917 8540142 8790652 8912469 8759708 8926071 9106676 9120448 9210734 9286545 9522813
5444 9522813 9556271 9591070 9891323 10065556 10176016 10563729 10533511 10714592 10640103 10803354
5434 10803354 10960662 10907112 11181054 11278564 11327160 11580594 11785600 11896658 11981939 12037709
5424 12037709 12264515 12376931 12611866 12793519 12889065 13043170 13309183 13214667 13302999 13341306
5414 13341306 13385883 13538063 13579618 13788877 14038315 14093174 14343584 14353244 14587787 14726366
5404 14726366 14840739 14909562 14920320 15089246 15172975 15323808 15400112 15628411 15714849 15893726
5394 15893726 16020947 16073999 16208985 16361298 16280046 16384565 16319609 16584126 16851703 16891985
5384 16891985 17045995 17048865 17165886 17194440 17261192 17103889 16984483 17050367 16968843 16793616
5374A6793616K6564L20285K47382q5015l3280J5010p1303L8824j17285j76498
5364A6958300m8474j00465N3462p5137j65488L4082Q192k49000k03647k08469
5354A6003356P6056O2915j0162k88933p5648k556J34619k19581k86846R9731k93507
5343A5199444k8799j79440m7860l2387l68115k50080j72607j55454J47003n0333
5333A4061372k16029l49050l3075j36595j24379j24842j93369j56847l88119J53812
5323A2492879n1795q0169m0309k91504j80831k64979o2403R0153k74757o8115
5313A1268170k66809j34445m3776j18370k6998k97238j60204j51026k19484l8842
5303I810978q9544K7035k11338k23111j12696M2805O7669j58928K1602l90949
$$ plain form
5374 16793616 16820180 17140465 17387847 17302832 17269552 17284562 17213259 17252083 17134798 16958300
5364 16958300 16909826 16809361 16862823 16787686 16622198 16656280 16664472 16415472 16211825 16003356
5354 16003356 16079412 16142327 16132165 15843232 15767584 15765028 15899647 15680066 15393220 15492951 15199444
5343 15199444 15170645 14991205 14943345 14910958 14542843 14292763 14120156 13964702 14111705 14061372
5333 14061372 13845343 13496293 13463218 13326623 13202244 13077402 12884033 12727186 12339067 12492879
5323 12492879 12441084 12360915 12320606 12029102 11848271 11583292 11520889 11611042 11336285 11268170
5313 11268170 11001361 10866916 10823140 10704770 10677772 10380534 10220330 10069304 9849820 9810978
5303 9810978 9721434 9748469 9537131 9314020 9201324 9244129 9311798 9152870 9174472 8783523
5293H783523j65872m1469O995r4317n5900k63767j92774R1552O8563j26062q3995
5282G926477j43437k21146j75376j23404Q3778N1843r3039j54937m9933j67475
5272F933351Q417l2874j13438q9093m392P70P866K0270j48358o2774l54551n6634
5260F108560N1107Q2905K20178m34100k70452r5649K7189j3658j29975P6614J3034
5249E635753k10358k3822l7805j06484L2097O7460j48566l5144K0258j02436k5279
5238E065674j51059J74012k6976j21257j9291J45970K22426L6028J63707K47051
5228E736285J25455L33710P2729j40859r6107N5024J96869N0089j02153k9966
5218F201076N2545k22217p2367r4510l3466j8005K2l68594m98030q0694n7060
$$ plain form
5293 8783523 8617651 8576182 8583177 8488860 8432960 8169193 7976419 8067971 8136534 8010472 7926477
5282 7926477 7783040 7561894 7386518 7263114 7346892 7398735 7305696 7150759 7100826 6933351
5272 6933351 6941768 6908894 6795456 6706363 6701971 6702741 6710607 6730877 6582519 6519745 6165194 6108560
5260 6108560 6159667 6242572 6462750 6028650 5758198 5662549 5689738 5676080 5546105 5622719 5635753
5249 5635753 5425395 5401573 5363768 5257284 5289381 5356841 5208275 5173131 5193389 5090953 5065674
5238 5065674 4914615 5088627 5061651 4940394 4921103 5067073 5289499 5325527 5489234 5736285
5228 5736285 5861740 6195450 6268179 6127320 6031213 6086237 6283106 6333195 6231042 6201076
5218 6201076 6253621 6031404 5959037 5864527 5831061 5813056 5813078 5444484 4946454 4865760 4808700
5207D808700k91047p6221m6676J60541n0902l40724k31777j36605o7389J06669
5197C834569n8042j52901J96239l6450j10406j43473K4172K58500K5868j24436
5187C713640L0723r8666j22478k54023N990l5711j16437J43724M7939q9360L2507
5176C257848J09415j56440j05787n9250l4348q1196k85104M1117J51629P1317
5166B909201J75582j1583r1341J47955j27984k4538r8810l4265K6714Q9679J2514
5155B973124o8427J2169n0204P8223j30915P3591r2308q1018M776q8369J2953
5144B643595L2022r3335N7216J03573L8536K02894j00469k88243M2981j305k27732
5133B409733p8641J25012m5853j69270j01611J3232J46531J28833M9526j58847
$$ plain form
5207 4808700 4517653 4441432 4394756 4555297 4504395 4163671 3931894 3795289 3727900 3834569
5197 3834569 3776527 3623626 3819865 3783415 3673009 3529536 3553708 3812208 3838076 3713640
5187 3713640 3744363 3645697 3523219 3269196 3275186 3239475 3123038 3266762 3314701 3225341 3257848
5176 3257848 3367263 3210823 3105036 3045786 3011438 2930242 2645138 2686255 2837884 2909201
5166 2909201 3084783 3073200 2981859 3129814 3001830 2977292 2878482 2844217 2870931 2960610 2973124
5155 2973124 2904697 2916866 2866662 2944885 2813970 2887561 2795253 2714235 2719011 2630642 2643595
5144 2643595 2675617 2582282 2639498 2743071 2781607 2984501 2884032 2595789 2638770 2637465 2409733
5133 2409733 2331092 2456104 2410251 2240981 2139370 2152602 2299133 2427966 2477492 2318645
5123B318645j38172R2843l1240J0776L1253l4953N107k29004J5321J69030j78105
5112B031501J24877K9056K1689K5746M0284J11881n6383j75541K0603M5168K834
5101B221715p736J08846n5428k7742r0914j63352K40426Q9936J45968j26302j36142
5090B199275l9178O2539K9694j31954M7859r801Q170N3416K5114L48405J12033
5079B705572l13090j88657P9161M0746j6866m3681j73909j1828J77796l8332J86376
5068B403288Q3245p4860p1915o6757m3485N7897l3193k6859n4971m0620L5935
5057B167705J10520M5951k03707L7506J6229J00911r9918m0663r1623J8036N1492
5046B112439J066L8382N2226J97391j07225k48186p8176M0602J14884K8140J20897
$$ plain form
5123 2318645 2180473 2273316 2242076 2252852 2284105 2249152 2254259 2025255 2040576 2209606 2031501
5112 2031501 2156378 2185434 2207123 2232869 2273153 2385034 2328651 2153110 2173713 2218881 2221715
5101 2221715 2213979 2322825 2267397 2239655 2148741 1985389 2225815 2315751 2461719 2335417 2199275
5090 2199275 2160097 2222636 2252330 2120376 2168235 2158434 2166604 2220020 2245134 2593539 2705572
5079 2705572 2392482 2203825 2282986 2323732 2306866 2263185 2089276 2077448 2255244 2216912 2403288
5068 2403288 2486533 2411673 2339758 2273001 2229516 2287413 2254220 2227361 2172390 2131770 2167705
5057 2167705 2278225 2324176 2120469 2157975 2174204 2275115 2175197 2134534 2042911 2060947 2112439
5046 2112439 2113505 2151887 2204113 2401504 2294279 2046093 1967917 2008519 2123403 2151543 2272440
5035B272440K16050M1785q8524o712M2523J39303m5056Q857r0828j03146K4891
5024B411583O046N0003l0806j07213j8580J06551J78164r7736R450R9832n2677
5013B554617j63786q3929K16562j18667q064J11541l2528J67250K68145K15185
5003C126326j50279J538K44186L3401j27790o9664p179j10511r9n7279j38294
4992B744356m4454O2029n7110N4654J9712q946J93618K14797N7210J51671J46645
4981C534182L39939L15077K4860K39065J4040q2661j14245l86579Q1535l0123
4971C935090p1946L313k16182j27605J37411j08687R5795N9780Q2726l6789j20881
4960C632025k0526K33733k8989L2971O0533j34809J53043J67489K12010j15494
$$ plain form
5035 2272440 2488490 2530275 2441751 2435039 2477562 2616865 2571809 2580666 2489838 2386692 2411583
5024 2411583 2417629 2467632 2436826 2329613 2311033 2417584 2595748 2498012 2507462 2607294 2554617
5013 2554617 2390831 2306902 2523464 2404797 2396733 2508274 2475746 2642996 2911141 3126326
5003 3126326 2976047 2977585 3221771 3255172 3127382 3057718 3050539 2940028 2939929 2882650 2744356
4992 2744356 2699902 2761931 2704821 2759475 2779187 2770241 2963859 3178656 3235866 3387537 3534182
4981 3534182 3874121 4189198 4214058 4453123 4467163 4384502 4270257 3883678 3965213 3935090
4971 3935090 3863144 3866457 3650275 3522670 3660081 3551394 3647189 3706969 3789695 3752906 3632025
4960 3632025 3611499 3845232 3816243 3849214 3909747 3774938 3927981 4095470 4307480 4191986
4950D191986j09580N1802k4332j01262n1984m9194K2034p8716j07020Q127J96609
4939C948470K88156J51950j34266r8858K62612N6864j17915r9242k60177o2894
4929C934700j0081J75334L8335m9480K12703J93612j15616J9593J71572p6l7224
4918D533372k0318J01140j2738q3671Q4382P520j32497M063J34190J17252R7639
4907D830334J579J56738l276k14547m235R9965J03426J3905R0841M3974R4388
4896E213092k540Q9248n3121n3381K42577J50726L3181k7785r7732K10739P3008
4885E778012O9817N8204o7966L18149m0982N7897J48921K07091K10740J38368
4875F878251p5625L25940K68706J42083K6833O507K76786M68143K92368K21574
$$ plain form
4950 4191986 4082406 4134208 4109876 4008614 3956630 3907436 3929470 3850754 3743734 3751861 3948470
4939 3948470 4236626 4388576 4254310 4155452 4418064 4474928 4357013 4257771 3997594 3934700
4929 3934700 3924619 4099953 4138288 4088808 4301511 4495123 4379507 4399100 4570672 4570596 4533372
4918 4533372 4513054 4614194 4601456 4517785 4602167 4609687 4477190 4481253 4615443 4732695 4830334
4907 4830334 4831913 4988651 4985375 4770828 4766593 4866558 4969984 4983889 5074730 5118704 5213092
4896 5213092 5210552 5299800 5246679 5193298 5435875 5586601 5619782 5591997 5494265 5705004 5778012
4885 5778012 5847829 5906033 5838067 6156216 6115234 6173131 6322052 6529143 6739883 6878251
4875 6878251 6802626 7128566 7397272 7539355 7566188 7572695 7849481 8317624 8609992 8831566
4865H831566k7587K12018L31928L22283K22197L94705L02275K07610k224J86104
4855A0980875K28666K65714M05527J84925K98386N07909O60494N12379M06438
4846A4451313L82150R67558Q89720J228950J353665J999772K937211L925340M679729
4837C2815408L335607J925719J393826M72976p03852j279786j076904l53571J85723
4828C6715146O25718J060894J444579J586254J774779J725694J704167J880657
4820D8517888J629896J587007J315113J349344Q33729P34238N08319M29064N27013
4811E7431611O80481Q19513J075796J173619J546095J769456J897006K155176
4803F8548753K101350K392735K287831K190650K121565J852531J449796R51414
$$ plain form
4865 8831566 8803979 9015997 9347925 9670208 9892405 10287110 10589385 10796995 10794771 10980875
4855 10980875 11209541 11475255 11880782 12065707 12364093 12872002 13532496 14044875 14451313
4846 14451313 14833463 15801021 16690741 17919691 19273356 21273128 24210339 28135679 32815408
4837 32815408 36151015 38076734 39470560 39943536 39239684 37959898 36882994 36529423 36715146
4828 36715146 37340864 38401758 39846337 41432591 43207370 44933064 46637231 48517888
4820 48517888 50147784 51734791 53049904 54399248 55232977 55967215 56475534 56904598 57431611
4811 57431611 58112092 58931605 60007401 61181020 62727115 64496571 66393577 68548753
4803 68548753 70650103 73042838 75330669 77521319 79642884 81495415 82945211 83896625
4795H3896625L64079J75520k01722r50444j103715j830673k167390k479937k635358
4786G3066985k541018k427726k713585k202714j880625j642723j021418q39681
4778E7797495m73809m13091k63536Q45j02584p6298l6552m42936l85215p69076
4768E4835243p99669q44317j280178j291574j398455j611538j420148j367775
4760D4821589j475813j305238j328872j046040n37685n31250M4046N2585L82902
4751C9076224P46805P66777J042191Q83497J016525Q79764O50017P60854N97876
4742D6420530L66894N09891L20251K79474K95682R4464j6407m7146q0141J92464
4732D8335956K93146M34083R91526J115244J914725K212619K518081K832042K870155
$$ plain form
4795 83896625 84260704 84436224 84234502 83284058 82180343 80349670 78182280 75702343 73066985
4786 73066985 70525967 68098241 65384656 63181942 61301317 59658594 58637176 57797495
4778 57797495 57323686 56910595 56647059 56647904 56545320 56469022 56432470 55989534 55604319 54835243
4768 54835243 54035574 53191257 51911079 50619505 49221050 47609512 46189364 44821589
4760 44821589 43345776 42040538 40711666 39665626 39127941 38596691 38640737 38693322 39076224
4751 39076224 39823029 40589806 41631997 42515494 43532019 44411783 45061800 45822654 46420530
4742 46420530 46787424 47297315 47617566 47897040 48192722 48287186 48270779 48223633 48143492 48335956
4732 48335956 48629102 49063185 50054711 51169955 53084680 55297299 57815380 60647422 63517577
4723F3517577L015288K843760K627320K360484K058430J536343J248725R45828
4715H0153755N53575p3566q55089j441532j639312j822806j798686k154458k163723
4706F8758158k034906k036399j600882j549546j023612r19298n92237l53685k45452
4697E8402141k54496k05491m77762j075858j284450j360129j440949j778364k215827
4688D8308815k274894k662605k661883k286365k420121k078749j808143k089750
4680C0026305j845089j539581j215133r88321j020770j104627r43987j049940
4672B0318857p80267o17646p93837n60209p08871m53480m64940l57993k27864
4663A5353750k52410m05907l93759k72217k8988M1272l00472k62515k4684k70751
$$ plain form
4723 63517577 66532865 69376625 72003945 74364429 76422859 77959202 79207927 80153755
4715 80153755 80707330 80633764 79778675 78337143 76697831 74875025 73076339 70921881 68758158
4706 68758158 66723252 64686853 63085971 61536425 60512813 59593515 59001278 58647593 58402141
4697 58402141 58147645 57942154 57464392 56388534 55104084 53743955 52303006 50524642 48308815
4688 48308815 46033921 43371316 40709433 38423068 36002947 33924198 32116055 30026305
4680 30026305 28181216 26641635 25426502 24438181 23417411 22312784 21368797 20318857
4672 20318857 19538590 18920944 18127107 17566898 16858027 16404547 15939607 15581614 15353750
4663 15353750 15101340 14695433 14301674 14029457 14000469 14041741 13741269 13478754 13454070 13183319
4653A3183319J31048J2213r7603L0960j21667R7531m6793k30837J05223J10743
4643A3174137n3548j25330P8155J63294K03230J3419P7556J20439J7649K01596
4633A3870597R055K71514K29757M38979L86466M85884Q01689J147694J083543
4624A8725178P46711K07208O6242j29510l1842l15396j60207J19904L55757M86072
4614B0070117J68251J46738n3439k18691l71433l89846l63876l04702k58323k77732
4604A8147064l88809j0438L07640P60231P89168O53657L87478L27434K02947M03297
4594B1579669L56467N37834J063181Q22814K13819J03748j8971j78214o98428
4585B3781919m01126j16596m4578j2942k36574l55325l83984m30719n08652l26522
$$ plain form
4653 13183319 13314367 13326580 13228977 13259937 13138270 13235801 13189008 12958171 13063394 13174137
4643 13174137 13120589 12995259 13073414 13236708 13439938 13453357 13530913 13651352 13669001 13870597
4633 13870597 13879652 14151166 14380923 14819902 15206368 15692252 16493941 17641635 18725178
4624 18725178 19471889 19679097 19745339 19615829 19583987 19268591 19108384 19228288 19584045 20070117
4614 20070117 20238368 20385106 20331667 20112976 19741543 19351697 18987821 18683119 18424796 18147064
4604 18147064 17758255 17747817 18055457 18815688 19604856 20258513 20645991 20973425 21176372 21579669
4594 21579669 21936136 22473970 23537151 24359965 24573784 24677532 24658561 24480347 23781919
4585 23781919 23380793 23264197 23219619 23206677 22970103 22614778 22230794 21800075 21291423 20964901
4575B0964901l40930m56434l91913n09450n77029r5091l41638k58310l76936k46939
4565A7370231j88616J3362J91138P7584J08465K73613K82265j08934l1918N922
4555A7993112j41065J26652R9813k4996k01306k84684J8521j06952M9474J52619
4545A7681188L30362L34621L11617M51152P71711P24802J019577R56440Q62016
4536B3443486R01532R91228R50038O90821N61754O37496O55954N32324N22026
4527B9886659N86115O88606O70458J094056J315225J583606J870720K250754K427212
4518D2373411K832351L736438M637487N212607N835587O717228P833726Q993848
4510H8172683J0984549J3662727J7491005K2901415K9749379L7383101M2698056
$$ plain form
4575 20964901 20623971 20167537 19775624 19266174 18689145 18594054 18252416 17994106 17617170 17370231
4565 17370231 17181615 17194977 17386115 17463699 17572164 17845777 18128042 18019108 17987190 17993112
4555 17993112 17852047 17978699 18078512 18053516 17852210 17567526 17586047 17479095 17528569 17681188
4545 17681188 18011550 18346171 18657788 19108940 19880651 20605453 21625030 22581470 23443486
4536 23443486 24345018 25336246 26286284 26977105 27538859 28176355 28832309 29364633 29886659
4527 29886659 30472774 31161380 31831838 32925894 34241119 35824725 37695445 39946199 42373411
4518 42373411 45205762 48942200 53579687 58792294 64627881 71345109 79178835 88172683
4510 88172683 99157232 112819959 130310964 153212379 182961758 220344859 263042915
4503B63042915M3160309L8123082K8211405J5906946K240249j2456933k5349298
4496C52878675l3619373l7022068l7107000l4378101k9663807k4265779j9485612
4489A37336935j5280270j2342126j0630450r464868q518335p389663o980003o272872
4481F0458348n128123m719240m057076l403111k871891k600178k530760j748722
4473C3399247j776419k011974j498358j144886j116349j239932r39019n43546
4465B3128764q17281p26808p50309o74509o57350l62266m02567o07637o03246
4456A7526791k66151m14072o30580m98905l30899m25595j65152r0821k64749n3200
4446A4386667j3742J62036j15634k68678J87079j3648l43760q4445O207J02907
$$ plain form
4503 263042915 306203224 344326306 372537711 388444657 390684906 378227973 352878675
4496 352878675 319259302 282237234 245130234 210752133 181088326 156822547 137336935
4489 137336935 122056665 109714539 99084089 89619221 81100886 73711223 66731220 60458348
4481 60458348 55330225 50610985 46553909 43150798 40278907 37678729 35147969 33399247
4473 33399247 31622828 29610854 28112496 26967610 25851261 24611329 23672310 23128764
4465 23128764 22311483 21584675 20834366 20159857 19502507 19140241 18737674 18130037 17526791
4456 17526791 17260640 16846568 16215988 15717083 15386184 14960589 14795437 14704616 14439867 14386667
4446 14386667 14372925 14534961 14419327 14150649 14337728 14324080 13980320 13895875 13902082 14004989
4436A4004989j70052K2010L357k8492J91598N2446K1730k7968k27921j09084k05218
4425A3527395j87895q2778k00018m40991j23719k25104k34438j08465k13337k50801
4415A1459849k75035k84203R3847O6784j42074j29353j63312M2291j80873j50893
4405A0337028k55662k81923k06150l9983p7499L9102K19739L05674K31691Q6980
4395A0358997L58637O20385O16733N78714O01038N14848K59646J55331J70165
4386A4234494k28239o02402q24879p46073q40813r76156p37435m78758n70383
4377H229356m95819l36779M638j02307j34000k19412j28552K0528j27954j04973
4367F604726q5994J121L1288r2756k56852R8827N2519K32979L2637O618J13920
$$ plain form
4436 14004989 13834937 13856947 13860304 13831812 14023410 14075856 14097586 14069618 13841697 13732613 13527395
4425 13527395 13339500 13256722 13056704 12615713 12491994 12266890 12032452 11923987 11710650 11459849
4415 11459849 11184814 10900611 10994458 11061242 10919168 10789815 10626503 10668794 10487921 10337028
4405 10337028 10081366 9799443 9593293 9553310 9475811 9514913 9734652 10040326 10272017 10358997
4395 10358997 10717634 11338019 11954752 12533466 13134504 13649352 13908998 14064329 14234494
4386 14234494 14006255 13403853 12578974 11832901 10992088 10015932 9278497 8799739 8229356
4377 8229356 7733537 7396758 7401396 7299089 7165089 6945677 6817125 6837653 6709699 6604726
4367 6604726 6518732 6519853 6551141 6458385 6201533 6300360 6352879 6585858 6618495 6625113 6739033
4356F739033j27624J17780J80177J15920P5061L3542K38831k5780n7331J50720
4346G440329J28034k1586j76965K14672J54351J65583R6386K2487r3499l2655
4336G897137K87432r8112r1704J98001J62745p9544j33742K08719L51947K41054
4326H943933Q6958K9975P1906o1954K00549j1850k75014o2355J39622N1735k78401
4315H835104j268L7276r4179j28566L7194J48882M6650R3022K8666j41206J36498
4304H998073P3238J80017L0773k02133m4467l5229L5548n0228j16461J41607m4600
4293H966138n0164l9227r6463J49044J32829k19678L1851n7854j34444M3082k48835
4282H476279J54591M8507N6512J36151J6406j4806K16979k15359j99744j15610
$$ plain form
4356 6739033 6611409 6729189 6909366 7025286 7100347 7133889 7372720 7346940 7289609 7440329
4346 7440329 7568363 7546777 7369812 7584484 7738835 7904418 8000804 8023291 7929792 7897137
4336 7897137 8184569 8086457 7994753 8192754 8355499 8275955 8142213 8350932 8702879 8943933
4326 8943933 9030891 9060866 9132772 9070818 9271367 9259517 8984503 8922148 9061770 9113505 8835104
4315 8835104 8833836 8871112 8776933 8648367 8685561 8834443 8881093 8974115 9002781 8861575 8998073
4304 8998073 9071311 9251328 9282101 9079968 9035501 9000272 9035820 8985592 8869131 9010738 8966138
4293 8966138 8915974 8876747 8780284 8929328 9062157 8842479 8874330 8816476 8682032 8725114 8476279
4282 8476279 8630870 8679377 8735889 8872040 8888446 8873640 9090619 8875260 8675516 8559906
4272H559906l7322J74656K7569j28009k1310r8935K7869L5954J2351N2371P804
4261H612904j13695j20933k14442j60760K5075j91132l5113o5297j17286o2373
4251G556948o7134j87850n1645m3970L8419j69845L0707N9007j11768j9998Q8161
4240G121032q3659M3868q5374q2679n6429j92817k45504j75721j08202K41793
4230F376308Q635j16310J37458m4807p562N5201J89949J26080K17004k2574J26615
4219G045997J16929L21650J81082N0731J42783J61700j93098j65600k92059j39556
4209G230559j20455k30671j64639n5966j9929r9553J384k62275P3729Q3649r9536
4198F336297k02730j62206N034R450l3504l0387j05775J98215O3259r9008o7067
$$ plain form
4272 8559906 8522584 8697240 8724809 8596800 8575490 8476555 8504424 8540378 8552729 8605100 8612904
4261 8612904 8499209 8378276 8163834 8003074 8028149 7837017 7801904 7736607 7619321 7556948
4251 7556948 7489814 7301964 7250319 7206349 7244768 7074923 7105630 7164637 7052869 7032871 7121032
4240 7121032 7037373 7081241 6995867 6913188 6856759 6663942 6418438 6242717 6134515 6376308
4230 6376308 6384943 6268633 6406091 6361284 6353722 6408923 6598872 6724952 6941956 6919382 7045997
4219 7045997 7162926 7484576 7665658 7716389 7859172 8020872 7827774 7662174 7370115 7230559
4209 7230559 7110104 6879433 6714794 6658828 6638899 6539346 6540730 6278455 6352184 6435833 6336297
4198 6336297 6133567 5971361 5976395 5985845 5952341 5921954 5816179 6014394 6077653 5978645 5911578
4187E911578q779o4765r1022O9352m5059k5471R9549N1577O9944k5657P1937J20862
4175F134046K2016r5981J29989J95995R7897N4007K7174J52601p4245M5675M4095
4164F733269J33094R5450j6615n0564P6343p2613K04692n0877N4704J71292O6621
4153G344796r6765N6424K80876J70509M150L5926M8225j68678l6331R4097J44253
4142G877482k6497J08475j20268r892j77982Q7985m7626o4377J41669N9732M7658
4131G876359j63797j62608J02921k7911l9206J64387K85318J40379K84027L4702
4121H494571J9641K37723K86325L40029J02245K16161M22956K73057K59941L19018
4111A0971667K66469N26259M81515N18893L72916L52955M79957L78285L52858
$$ plain form
4187 5911578 5902799 5838034 5747012 5816364 5771305 5745834 5845383 5896960 5966904 5941247 6013184 6134046
4175 6134046 6156062 6060081 6190070 6386065 6483962 6537969 6565143 6717744 6643499 6689174 6733269
4164 6733269 6866363 6961813 6945198 6894634 6970977 6898364 7103056 7052179 7106883 7278175 7344796
4153 7344796 7248031 7304455 7585331 7755840 7759990 7795916 7844141 7675463 7639132 7733229 7877482
4142 7877482 7850985 7959460 7839192 7829300 7651318 7739303 7691677 7627300 7768969 7828701 7876359
4131 7876359 7712562 7549954 7652875 7624964 7585758 7750145 8035463 8175842 8459869 8494571
4121 8494571 8514212 8751935 9038260 9378289 9480534 9696695 10119651 10392708 10652649 10971667
4111 10971667 11238136 11764395 12245910 12764803 13137719 13490674 13970631 14348916 14701774
4102A4701774M91944M43977N40474N13373K64215L57692N73508O24961N31898
4093A9043816N65804N99234P53483N65977N50041N65970N68836P28179N96385
4084B4537725O31017P25150R75662Q33182M54628N48025N45984M24540L67270
4075C0043183M69999P19560R46198Q72249J115598J081575J193050J285902J572278
4066C9299592J641231J608388K007698K171762K146609J862395J951686J484283
4058E4173644J477352J241707J130630J257884J142127J337733J586607J322447
4050F4670131J926034K048671K406544K818406L083410M018377M497264M858805
4042I0327642N094356M716908L985383L251160K340919J799278J435261J378005
$$ plain form
4102 14701774 15193718 15637695 16178169 16691542 16955757 17313449 17886957 18511918 19043816
4093 19043816 19609620 20208854 20962337 21528314 22078355 22644325 23213161 23941340 24537725
4084 24537725 25168742 25893892 26869554 27702736 28157364 28705389 29251373 29675913 30043183
4075 30043183 30513182 31232742 32178940 33051189 34166787 35248362 36441412 37727314 39299592
4066 39299592 40940823 42549211 44556909 46728671 48875280 50737675 52689361 54173644
4058 54173644 55650996 56892703 58023333 59281217 60423344 61761077 63347684 64670131
4050 64670131 66596165 68644836 71051380 73869786 76953196 80971573 85468837 90327642
4042 90327642 95421998 100138906 104124289 107375449 109716368 111515646 112950907 114328912
4034A14328912J520514J424985J665247J721077J541009J896369J319033J002666
4026A26419812O72968J49165L4983o69793j151731j346111j801325k064653k286305
4017A17957010j741191j128140j147559j209212j221041j973832k539878l236841
4009A03759316m100173m324081m740371m314050m125815l630920l045607k712986
4001G2765313k507282k296038k178553j835928j652866j529695j405548j613802
3993E7745601j500411j357383j707755j993549j897488k077833k146596k303272
3985D2761314k065760j813236j865562j330302j385253j274800j105367j294981
3977C0626053j130028j192915q99441q94917o21075o24189n46046n06067k81669
$$ plain form
4034 114328912 115849426 117274411 118939658 120660735 122201744 124098113 125417146 126419812
4026 126419812 127092780 127241945 127276928 126607135 125455404 124109293 122307968 120243315 117957010
4017 117957010 116215819 115087679 113940120 112730908 111509867 109536035 106996157 103759316
4009 103759316 99659143 95335062 90594691 86280641 82154826 78523906 75478299 72765313
4001 72765313 70258031 67961993 65783440 63947512 62294646 60764951 59359403 57745601
3993 57745601 56245190 54887807 53180052 51186503 49289015 47211182 45064586 42761314
3985 42761314 40695554 38882318 37016756 35686454 34301201 33026401 31921034 30626053
3977 30626053 29496025 28303110 27403669 26508752 25887677 25263488 24717442 24211375 23929706
3968B3929706l44988j24024J28391J31716L49830L34330J4301k31393n57192n87246
3958B3043431n34893q67491q60956j108314j030287o77185o53985n49160m82183
3949A6278977l62822l66287m60245l38621n43544m15434l27902m82320j79719
3940A2802083k24730l36355k65759o32546o41043l1831J65204Q8470J86887J37328
3930A1247708J68756j62349l26872k79690o31729n99344n90152o34056m02154
3921G790118l14129l39714p2214l05428n2742q9324l22819l2872l09342k65389
3911E686145j47037r9744J24661j05823l45724M8191j06339j97527J4181N9954
3901D930938j0957p3637l81968m9551j15083r8699N1762n4689m8304p587k32800
$$ plain form
3968 23929706 23584718 23460694 23589085 23720801 24070631 24404961 24419262 24187869 23630677 23043431
3958 23043431 22508538 21641047 20780091 19671777 18641490 17964305 17310320 16761160 16278977
3949 16278977 15916155 15549868 15089623 14751002 14207458 13792024 13464122 12981802 12802083
3940 12802083 12577353 12240998 11975239 11342693 10701650 10669819 10835023 10923493 11110380 11247708
3930 11247708 11416464 11254115 10927243 10647553 10015824 9416480 8826328 8192272 7790118
3921 7790118 7475989 7136275 7064061 6758633 6705891 6616567 6293748 6260876 5951534 5686145
3911 5686145 5539108 5439364 5564025 5458202 5112478 5160669 5054330 4856803 4870984 4930938
3901 4930938 4919981 4846344 4464376 4414825 4299742 4201043 4252805 4198116 4149812 4142225 3909425
3890C909425q7400j21030o9413N0325p3780M6637J78988j34155p3291j35753p0888
3879C419665L5031k3017J2117l7835p8330j25693k286q9843J48842M2464q5904
3868C215211P5598M6584m2410o7628j53235O7984N7080Q1322o4674p663K29386
3857C437555j12820j10313J31197N7800J88384p2132Q7489j38097N357J20235
3847C594655M2284J19560k3181K02204J82859q0404M0025p5511J00663R2212J65116
3836D360482J68606R5753K19070j87451P1896j12787J78148K40399o1774J90126
3826E162468J69189J54785J18260J82326L15842K02591K65799P8424J72742J51807
3816F974233j6459J18951k1164J18300j3022K47085K33186l5685R3207K7453J32100
$$ plain form
3890 3909425 3822025 3700995 3631582 3681907 3608127 3654764 3833752 3699597 3626306 3490553 3419665
3879 3419665 3454696 3431679 3443796 3405961 3327631 3201938 3199652 3109809 3258651 3301115 3215211
3868 3215211 3290809 3337393 3294983 3227355 3074120 3142104 3199184 3280506 3215832 3208169 3437555
3857 3437555 3324735 3214422 3345619 3403419 3591803 3519671 3607160 3469063 3474420 3594655
3847 3594655 3636939 3756499 3733318 3935522 4118381 4037977 4078002 4002491 4103154 4195366 4360482
3836 4360482 4529088 4624841 4843911 4656460 4728356 4615569 4793717 5034116 4972342 5162468
3826 5162468 5331657 5486442 5604702 5787028 6102870 6305461 6571260 6649684 6822426 6974233
3816 6974233 6957774 7076725 7055561 7173861 7160839 7407924 7641110 7605425 7698632 7726085 7858185
3805G858185J6854n6110P9527j07718j51127j49008J39486Q5439J06223K839o4089
3794G760501R1957j33824j56405p745l7011J97343J5983j42208j35977j72129
3784G280485j84754j04702k32572n7125P4101o1915j89485k49730j81032K9848
3774F123119j49563j13142l6893j90109j36056j68329m7350r47o8875p9590K8733
3763E160998o4715K00439j07784l3856M7602J88768p0092J924N6216J09407P907
3752E496814J3975J67559J84270j42806Q1640J27801j2231o1655k4037J42528
3742E973858L044l4235N2686o3265j74829J00100P7598j21808j3289R7898j10215
3731E787543j56058j36383K9921j19489r79J99001j53376j57839m8995j01242
$$ plain form
3805 7858185 7875039 7818929 7898456 7790738 7639611 7490603 7630089 7715528 7821751 7824590 7760501
3794 7760501 7852458 7718634 7562229 7554484 7517473 7714816 7730799 7588591 7452614 7280485
3784 7280485 7095731 6991029 6758457 6701332 6775433 6713518 6524033 6274303 6093271 6123119
3774 6123119 5973556 5860414 5823521 5633412 5497356 5329027 5281677 5280730 5211855 5132265 5160998
3763 5160998 5096283 5296722 5188938 5155082 5202684 5391452 5321360 5323284 5379500 5488907 5496814
3752 5496814 5510789 5678348 5862618 5719812 5801452 5929253 5917022 5855367 5831330 5973858
3742 5973858 5976902 5942667 5995353 5932088 5757259 5857359 5934957 5813149 5799860 5897758 5787543
3731 5787543 5631485 5495102 5525023 5405534 5404555 5603556 5450180 5292341 5243346 5142104
3721E142104j34570j86460n9400M3820j12840m5693R5519l735j8880l3373k28052
3710D458440k18051r1785O2095j2612l15056J7781J08332j81578r1699j03278
3700C632589J95958j3225j02523P2838n0448j34401l1021j77778j79655j33432
3690C078902R8015j2219j83511J21826o6672j85677m7729O7198m0783R28j37635
3679B692643j2345j32523r174O8260J01128j13201O1417R0916J60603J04974m9667
3668B963031O820O3557R8802O8143k15519J8054M2660R0866m957O0963R7081p1938
3656C217563J47256l6313K7113J49941J33192J9972L8781J56170j32854k88196
3646C432625J09499R0625J30182j17790N8952M7926j88576M7135p1563P6598o2776
$$ plain form
3721 5142104 5007534 4821074 4761674 4805494 4692654 4646961 4742480 4738745 4719865 4686492 4458440
3710 4458440 4240389 4148604 4210699 4198087 3883031 3900812 4009144 3827566 3735867 3632589
3700 3632589 3828547 3815322 3712799 3785637 3735189 3600788 3569767 3391989 3212334 3078902
3690 3078902 3176917 3164698 2981187 3103013 3036341 2850664 2802935 2870133 2829350 2830278 2692643
3679 2692643 2680298 2547775 2538601 2606861 2707989 2594788 2656205 2747121 2907724 3012698 2963031
3668 2963031 2969851 3033408 3132210 3200353 2984834 3002888 3045548 3136414 3131457 3192420 3289501 3217563
3656 3217563 3364819 3328506 3355619 3505560 3638752 3658724 3697505 3853675 3720821 3432625
3646 3432625 3542124 3632749 3762931 3645141 3704093 3752019 3563443 3610578 3539015 3615613 3552837
3635C552837k0450K65062L4743m2811L5778j47061j0706J38088J70201p2558j699
3624C901424n5589Q37m3542p0770J60461n8841r0661j5973J75767M9760Q9167
3613D042040J80641M6939j42024K1912K49776J34872k8297k2711j82293K829K22205
3602D525889m315l9856k35137m0151N9691m715J36189J10577J1654K5686j10080
3591D435432j46217K6084k40197K0838p7112r6421K17937n9336m4831j61821j38551
3580C735805J00217K046O7523j42032j76093O7755p9080o4109o0138l4947K381
3569C419328J45515K6175j01732n3755n5391j2038j07005n416J99581J60673p3880
3558C542055j20679j40849K16857r148r0940o5762O8947N5821m0627q5066j25552
$$ plain form
3635 3552837 3532387 3797449 3832192 3789381 3825159 3678098 3667392 3805480 3975681 3903123 3901424
3624 3901424 3845835 3846672 3803130 3732360 3892821 3833980 3743319 3727346 3903113 3952873 4042040
3613 4042040 4222681 4269620 4127596 4149508 4399284 4534156 4505859 4483148 4300855 4303684 4525889
3602 4525889 4521574 4481718 4246581 4206430 4266121 4261406 4397595 4508172 4519826 4545512 4435432
3591 4435432 4289215 4315299 4075102 4095940 4018828 3922407 4140344 4081008 4036177 3874356 3735805
3580 3735805 3836022 3838068 3905591 3763559 3587466 3655221 3576141 3512032 3451894 3416947 3419328
3569 3419328 3564843 3591018 3489286 3435531 3380140 3368102 3261097 3255681 3455262 3615935 3542055
3558 3542055 3421376 3280527 3497384 3488236 3397296 3331534 3400481 3456302 3415675 3330609 3205057
3547C205057j2977J15627j93p6260j23316k2963l1542k52605p3663R6481j2383
3536B811263r0820j24888o3087Q542J69503M7908m9893o4400r9512L4517j56019
3525B423114K5446m2910q8451q8843j79984L5095K6744J31405P7112j88386P7891
3514B208233Q8539R1634l7870k7430N5157K8213P7343j36637n6945j3613j5372
3503B261252l3525J6277J52368N1745j9683K0687Q4112O4684j12915L5564o2766
3492B457800m1731K18995m9768m2589o6635K20430J95755r8687J81306n6933J29120
3481C047063N2197K9304R2194o8182R4548N9215o4650P5402J49904J52514K3258
3470C642767J13608L06901K60159Q4643L5007J84760k61658q9831j45993k16637
$$ plain form
3547 3205057 3192080 3307707 3307514 3231254 3107938 3084975 3053433 2800828 2727165 2823646 2811263
3536 2811263 2720443 2595555 2532468 2541010 2710513 2758421 2708528 2644128 2544616 2579133 2423114
3525 2423114 2448560 2405650 2317199 2228356 2048372 2083467 2110211 2241616 2318728 2130342 2208233
3514 2208233 2296772 2388406 2350536 2323106 2378263 2406476 2483819 2347182 2290237 2276624 2261252
3503 2261252 2227727 2244004 2396372 2448117 2428434 2449121 2533233 2597917 2485002 2520566 2457800
3492 2457800 2416069 2635064 2585296 2542707 2476072 2696502 2892257 2793570 2974876 2917943 3047063
3481 3047063 3099260 3128564 3220758 3152576 3247124 3306339 3241689 3317091 3466995 3619509 3642767
3470 3642767 3756375 4063276 4323435 4408078 4443085 4627845 4366187 4276356 4130363 3913726
3460C913726o4107k45055j93997k39505l07388Q7044L5611o086K28062K15620
3450C423925L19385K40833K211Q9832Q5907n6038k95571m09077l47280k17406
3440B836721k86735j79367j40797j23316j96902k24633j07332R6681M0055n4664
3430A659711k2058j09137J2924J66298j0238J3563j71912m6331N6483l6152n2693
3419A460458O5771J47817J4100R39K50758L75756J51286M9686L80523L03532L25524
3408C526150L35372L46982K85375J18635N41843J57026p4237K01856J56407l47130
3398E248279m84688o9440j89174k96996j04066j29531j04051m0419K78936K71644
3388D380494K7460L40274K50583M706J99570J58519J06827j59052l11273l71984
$$ plain form
3460 3913726 3849619 3604564 3410567 3171062 2863674 2950718 2986329 2980243 3208305 3423925
3450 3423925 3743310 3984143 3986354 4076186 4162093 4106055 3810484 3401407 3054127 2836721
3440 2836721 2549986 2370619 2229822 2106506 1909604 1684971 1577639 1674320 1714375 1659711
3430 1659711 1637653 1528516 1541440 1707738 1697500 1711063 1539151 1492820 1549303 1513151 1460458
3419 1460458 1526229 1674046 1688146 1689085 1939843 2315599 2466885 2516571 2897094 3200626 3526150
3408 3526150 3861522 4208504 4493879 4612514 5154357 5311383 5237146 5439002 5595409 5248279
3398 5248279 4763591 4694151 4504977 4207981 4103915 3974384 3870333 3829914 4108850 4380494
3388 4380494 4407954 4748228 4998811 5003517 5203087 5361606 5468433 5309381 4998108 4626124
3378D626124l27146l06994j78880l66404n11453j95712j80655l58913j34182m6161
3368B019624L1510j60758k04908o8m0426K43804J569j33963j32446M5487m9880
3357A619545O3945q9565l0988K81725M0117K41956J72531J7199J65698L4330o0319
3346B456174M07186K27475L98874J72754J87944N9807l064J77453P3048l35412
3336C822239J21014j94887l13306k62807j05741p0560n7264j8266k6950M7647
3326B941119q4313J60269P9321j40969m3483k3092J17939j21082p1606P4601m71579
3315B417125l59272j96673J3181o1742j10814o2609k02557k00073J83963O7220
3305A487749j00769q0537j5848k05055J26051K0107N5568r9625m1539J03420l0341
$$ plain form
3378 4626124 4298978 3991984 3813104 3446700 2935247 2739535 2558880 2199967 2065785 2019624
3368 2019624 2051134 1890376 1685468 1685400 1644974 1888778 1890347 1756384 1623938 1669425 1619545
3357 1619545 1683490 1593925 1562937 1844662 1884779 2126735 2299266 2316465 2482163 2516493 2456174
3346 2456174 2863360 3090835 3489709 3662463 3850407 3910214 3907150 4084603 4157651 3822239
3336 3822239 3943253 3748366 3435060 3172253 3066512 2995952 2938688 2920422 2893472 2941119
3326 2941119 2856806 3017075 3096396 2955427 2911944 2888852 3006791 2885709 2814103 2888704 2417125
3315 2417125 2057853 1861180 1874361 1812619 1701805 1639196 1436639 1236566 1420529 1487749
3305 1487749 1386980 1306443 1290595 1085540 1211591 1231698 1287266 1187641 1146102 1249522 1219181
3294A219181J82964K41419J24936J03033q7383K52265N9805J0193M7615j65257
3284A988771j54660p0847k612l7672N5145p9232K6577o1482l2130J38P2501J05221
3272A809718J5003n8637O6711r7412j38443j27016q8478j47883j28585O13l574
3261A102017l5971j22067J03379j10424q661J2299N6187o2119o7972n1861l0089
3250G84718k19781K5490R7193J67424l1155j543K8964q3995J14470L1608j03199
3239H10194r5028L7089Q2457j1778L6713O4593j19109Q3215M2924Q5054m2223
3228I74101k7141M2844q7688j28511N1810K06680p7745J11469K0058j41540J13957
3217A058294j51535O1566k1255j8684o5809j8754j22413N134p7439J67995Q6742
$$ plain form
3294 1219181 1402145 1643564 1768500 1871533 1784150 2036415 2096220 2106413 2154028 1988771
3284 1988771 1834111 1763264 1760652 1722980 1778125 1698893 1725470 1663988 1631858 1631996 1704497 1809718
3272 1809718 1824721 1766084 1832795 1735383 1596940 1469924 1381446 1233563 1104978 1105591 1102017
3261 1102017 1066046 943979 1047358 936934 928273 940572 996759 934640 866668 814807 784718
3250 784718 564937 590427 687620 855044 823889 822346 851310 767315 881785 913393 810194
3239 810194 715166 752255 834712 822934 859647 924240 805131 888346 931270 1016324 974101
3228 974101 946960 989804 902116 773605 825415 1032095 954350 1065819 1085877 944337 1058294
3217 1058294 906759 968325 947070 928386 862577 843823 721410 726544 649105 817100 903842
3206I03842p7052m3372m3571J7833k87l926k3763J01387q6191N2597l00424j16855
3194C80218J92522J02488j80451j1129R4865k6760j22529k47231P7392j00619
3184A58766j08648K37259L264k25114R7406l8156L137M5626Q5812L8860q5895
3173B12317M4580j7080m8150O0423Q5015J25536M1337n5644O2472o8326j01526
3162C40954Q3794M4910k8330J5757j80096N7063P7613p2809M4249R7430O7086
3151E47621J36360j56165j24344Q2098l7519L3186m2644j89754K8534K2q522O7283
3139C36156q9071M6827k4899k7436o015J33678o0540l4258q7066J32625M7066
3128C67067J11415j12671k10735J55536Q1224P8147l961L77l256j55392o559P1573
$$ plain form
3206 903842 826790 783418 739847 757680 757393 753467 729704 831091 744900 797497 497073 380218
3194 380218 572740 675228 494777 483648 578513 551753 429224 181993 259385 158766
3184 158766 50118 287377 290641 65527 162933 124777 127914 173540 259352 298212 212317
3173 212317 256897 239817 191667 252090 337105 462641 503978 448334 510806 442480 340954
3162 340954 424748 469658 441328 457085 276989 334052 411665 338856 383105 480535 547621
3151 547621 683981 527816 403472 485570 448051 481237 438593 248839 277373 277395 268873 336156
3139 336156 247085 293912 269013 241577 235562 369240 308700 274442 187376 320001 367067
3128 367067 478482 365811 155076 310612 391836 469983 466022 466399 463143 307751 301192 372765
3116C72765J070Q5238j46587j52162q1485R7417R2122P7754j09885k9416k0343
3105A86488n0796R0562k389L7551K8439j62548P3872P8609O4227Q1869j63290
3094B62594r6003j53467m8417O7146P3941j11102j01869J66168k4591K74642J11142
3083D20184O0210j56452j39645J02553k58705J03143l16l03638j3926L9809j33109
3072b79892J03418l1069J83507J4631l1918N4997j03192m495J05738p5308k4621
3061h8204J1049k2367M4358k09384J70261O5848o4691J92352Q5366q8998q0017
3050A5573K7588J1173j50224k4349K99417M358k39824O7593j4456k1562K2587
3039b126r65J35133j2054n7118P6538j89057J10255J04647j7181l3279N2630N7410
$$ plain form
3116 372765 373835 459073 312486 160324 78839 176256 268378 346132 236247 206831 186488
3105 186488 135692 226254 223865 261416 289855 127307 201179 279788 344015 425884 262594
3094 262594 166591 13124 -35293 31853 105794 -5308 -107177 58991 34400 309042 420184
3083 420184 480394 323942 184297 286850 28145 131288 130972 -172666 -186592 -146783 -279892
3072 -279892 -176474 -207543 -24036 -9405 -41323 13674 -89518 -94013 11725 -63583 -88204
3061 -88204 -77155 -99522 -55164 -264548 -94287 -28439 -93130 99222 184588 95590 15573
3050 15573 43161 54334 -95890 -120239 179178 183536 -56288 11305 -3151 -24713 -2126
3039 -2126 -3091 132042 119988 62870 139408 -49649 60606 165253 148072 114793 167423 224833
3027B24833j15267k75790M7993P6767p6745P3527j5380j07226j5056N6453L3478
3016i2413R7658K0142K71193k49398j11501N0244q6670O4587l393M3225m6570
3005d2896n5208O1627l7592p6332L0010J56179m2181o8239J00293K0229j10745
2994f4855j59271l0397J53863J86241L1547j55483j71143O5869J18449Q3960m3542
2983A5238R3479r9961l2289L3231o8384P4926J52890j34276j26305o5945J08203
2972d9193j7262j43555K2565N529L0201J32883L7855j35360n128K2339N4129n7609
2960a02606Q6691J47026R042j80736l6388k34117R8780L7770j20019P7258j25222
2949c42521J68757M3496j47721L02787L6432m0869j6542k09944J50585L6488q8187
$$ plain form
3027 224833 109566 -166224 -118231 -41464 -118209 -44682 -60062 -167288 -182344 -125891 -92413
3016 -92413 5245 25387 296580 47182 -64319 -14075 -100745 -36158 -39551 3674 -42896
3005 -42896 -98104 -36477 -74069 -150401 -120391 35788 -6393 -74632 25661 45890 -64855
2994 -64855 -224126 -254523 -100660 85581 117128 -38355 -209498 -143629 -25180 58780 15238
2983 15238 108717 8756 -23533 9698 -58686 16240 169130 34854 -91451 -157396 -49193
2972 -49193 -66455 -210010 -187445 -181916 -151715 -18832 19023 -116337 -121465 -99126 -44997 -102606
2960 -102606 -15915 131111 140153 -40583 -76971 -311088 -212308 -174538 -294557 -217299 -342521
2949 -342521 -173764 -130268 -277989 24798 61230 20361 3819 -206125 -55540 -19052 -107239
2938a07239r4460j35204M8314K26940j6766o8905J02381p4602m7673Q1739J6000
2927f9475K80667j99555p7558M962j39606L02443J14697j47880p2703o2730l1231
2916i7969k7813J9312Q8547j94372l4697L1758K6291N7148J16650p5142L8629
2905e1658l8095M4992J47101j09413J47058o8401q6336K65505m0193k6626N5972
2894B39906K4422m9792j97925j43640K10580j4770N2978q4272j86411P9762o3585
2883a32747J64401J14609k32396k9455r3447K983Q4302Q2507J11302l7430l03082
2872b68453J24933J02576q0406N4359k10671j12635J05631j9204R8270J05853
2862i9747k30997J03941k3170Q1515R8424J55858N5325j58820j27357J55871Q945
$$ plain form
2938 -107239 -201699 -336903 -288589 -61649 -78415 -147320 -44939 -119541 -167214 -85475 -69475
2927 -69475 211192 11637 -65921 -60959 -200565 101878 216575 68695 -4008 -66738 -97969
2916 -97969 -125782 -106470 -17923 -212295 -246992 -215234 -188943 -131795 -15145 -90287 -51658
2905 -51658 -89753 -44761 102340 -7073 139985 71584 -14752 250753 210560 183934 239906
2894 239906 264328 214536 16611 -127029 83551 68781 121759 37487 -148924 -69162 -132747
2883 -132747 31654 146263 -86133 -115588 -209035 -206052 -121750 -39243 72059 34629 -268453
2872 -268453 -143520 -40944 -121350 -66991 -277662 -390297 -284666 -303870 -205600 -99747
2862 -99747 -330744 -226803 -249973 -168458 -70034 85824 141149 -17671 -145028 10843 19788
2851A9788J61130O1087k58007m2578J125m6648o9449o7716J20573J9550k10047
2840c11192J01310O3771M6156N5697m4996j3993j57647J62309J30717j98308r9032
2829b65208J57454M6688m8208l7573J80778O9993J1419L415j69229m6114J08170
2818A1585J42334m5020l26346L1527O1784P2132J68215j3452Q8624M4077j46889
2807H8571o1757j91630J27606P5212j06345N3901L6685M6117p4162m2995p8593
2796a27390O7303O115k9237J09424j13269l4348K072n4012K30434M2176l1613
2785F7655L9414L7061K7176K6550O9874J17357l59779j08298K2852k924m5927
2774a08989O7143K194N0387N6665l0764P7835k06701k2106Q2706m9940J05955
$$ plain form
2851 19788 180918 242005 -16002 -58580 -57455 -104103 -173552 -241268 -120695 -101145 -311192
2840 -311192 -209882 -146111 -99955 -44258 -89254 -103247 -260894 -98585 32132 -166176 -265208
2829 -265208 -107754 -61066 -109274 -146847 33931 103924 115343 118758 -50471 -96585 11585
2818 11585 153919 108899 -217447 -185920 -124136 -52004 116211 102759 191383 235460 88571
2807 88571 26814 -164816 -37210 38002 -68343 -14442 22243 68360 -5802 -48797 -127390
2796 -127390 -60087 -53972 -83209 26215 -87054 -121402 -119330 -173342 57092 99268 67655
2785 67655 107069 144130 171306 197856 267730 385087 25308 -82990 -60138 -63062 -108989
2774 -108989 -41846 -39652 10735 67400 36636 114471 -92230 -114336 -31630 -81570 24385
2763B4385L3666p2744J0937m1000J75287j06698k1737P0216Q5107j08992j77106
2752a28679R7662q4072k4572k2365q2506k1823Q1153M9030p7953p4802L61206
2741G2279q1144p2858K4285R4519J86304j66597j57537J11377o289O311L0632
2730D1282J3586j16768r9540M9849J19743j15110l9186j1676r1376J5439l0647
2719b64404J15257j4886m2354K5087R8614p468K21198m7805j91640j3077J18624
2708b854m6695j50063j40807J25383n7806O0566Q1895J33509Q2828m0331J9215
2697F4840k14344j95073Q5889p660q0614O5731P7606N9603J40821J4736K13988
2686B25523L6261k08928K31365p0577k646m9848p2623j78283m4543k1019K10083
$$ plain form
2763 24385 58051 -14693 -3756 -44756 130531 23833 2096 72312 157419 48427 -128679
2752 -128679 -31017 -115089 -139661 -162026 -244532 -266355 -185202 -136172 -214125 -288927 72279
2741 72279 -8865 -81723 -57438 37081 223385 56788 -100749 10628 4339 10650 41282
2730 41282 54868 -61900 -161440 -111591 8152 -106958 -146144 -157820 -249196 -233757 -264404
2719 -264404 -149147 -164033 -206387 -181300 -82686 -90154 131044 83239 -108401 -121478 -2854
2708 -2854 -49549 -199612 -340419 -215036 -272842 -212276 -130381 3128 85956 45625 64840
2697 64840 -149504 -344577 -258688 -266348 -346962 -281231 -203625 -144022 -3201 11535 225523
2686 225523 261784 52856 284221 213644 210998 161150 88527 -89756 -134299 -155318 54765
2675E4765k37J64678q9694j16280j7937o6694J61792L9440k112j02567q9441L1165
2663c3122R5274O1508q8673j14757J41452j4825Q4070q7173Q8997L7212M2895
2652B12858q7630j035J09232p2188l31509j47268J50062J96550o6510o6716N5096
2641d9058R147Q154j41867K40219N6648K0976K4340j01006M1652J53765O347j30361
2629A38956j06294j4084J02539j27730k6062J5447K26146J33438J76796P8166
2619E97318L0769R3508R072k7019k86128j16754l9195l5233j88773j33281j25995
2608b21711R1721J3751J6716M7526J57312J7099j56948j79486m3089J43930R1570
2597b1609Q1117j35567j16884J19218M9465j60035K6576J22210O5907r6045l0865
$$ plain form
2675 54765 54528 219206 129512 13232 -4705 -71399 90393 129833 127721 25154 -64287 -33122
2663 -33122 62152 123660 34987 -79770 61682 46857 130927 43754 132751 169963 212858
2652 212858 125228 124193 233425 161237 -170272 -317540 -167478 29072 -37438 -104154 -49058
2641 -49058 -39911 -31757 -173624 66595 123243 144219 168559 67553 109205 262970 269317 138956
2629 138956 32662 18578 121117 -6613 -32675 -17228 208918 342356 519152 597318
2619 597318 628087 721595 730667 703648 417520 300766 261571 226338 37565 -95716 -221711
2608 -221711 -129990 -116239 -99523 -51997 105315 122414 -34534 -214020 -257109 -113179 -21609
2597 -21609 59508 -76059 -192943 -73725 -24260 -184295 -157719 -35509 30398 -65647 -96512
2586i6512N8354l4335o0723j14527J05676K54581N9253o8987j21423p0657o53
2575h9953R3503L6494M6240p1975o6732J21363O9286l0547n3499J27614L7339
2564B19133j01569k8531m9274J7009q3063q0358Q1893O9786m9489M0252j42384
2553a06595P9002J95668P7934j89009l143J67378R8538k8095m8458Q082K6468
2542B77770K8428j67750L3200j32531R8929j2983j49178k9796K33348P5180j0858
2531B43759r2108J07614J45094j82292m7553p8344n3733p6884J18713J02381L9822
2520B26469j19325J94222n379j81817R6615R0972K36662r855k85946O667P8100
2509C27385k33011q1346j32017J06057M3776l0062L4432j21491J33865J62471
$$ plain form
2586 -96512 -38158 -72493 -133216 -247743 -142067 112514 171767 102780 -18643 -89300 -89953
2575 -89953 3550 40044 86284 14309 -52423 68940 138226 107679 54180 181794 219133
2564 219133 117564 89033 39759 56768 -26295 -106653 -24760 45026 -4463 35789 -106595
2553 -106595 -27593 168075 246009 57000 53857 221235 319773 291678 243220 251302 277770
2542 277770 306198 138448 171648 39117 138046 125063 -24115 -53911 179437 254617 243759
2531 243759 151651 259265 404359 222067 174514 96170 42437 -34447 84266 186647 226469
2520 226469 107144 301366 295987 114170 210785 301757 538419 528564 242618 249285 327385
2509 327385 94374 13028 -118989 -12932 30844 782 35214 -86277 47588 210059
2499B10059j60676o4420K41057n4918m6419j9432p6475J37279r0405J37227k587
2488B10290j63513J79509P396O042N3482J33413J25511j71842k10466o2746N3479
2477A60555j0173q103o6453q5328j6159M7213O9404O2966K76257J40931j6551
2466E54559k00508j06847J04338L857q3279k96437j4225J01636R9164m1546k0049
2455A00663k6515P4293J16030M3655R8493J02881R3931j90575j21406K77988J54448
2444G23886l2595Q7935l5096J08258M7700m3268J52040j51989q7668r4756N8359
2433G32806R4941L4459q941L1564L0258r5682j5523j88796m8522n1702Q8480P0716
2421F74058P9040J63747J23445j35481O6777J6307O3757K24502p42J58665o0171
$$ plain form
2499 210059 49383 -15037 226020 171102 124683 105251 28776 166055 75650 212877 210290
2488 210290 46777 226286 233682 239724 293206 426619 552130 380288 169822 107076 160555
2477 160555 150382 142279 75826 -9502 -25661 21552 90956 153922 430179 571110 554559
2466 554559 354051 247204 351542 355399 272120 -24317 -38542 63094 162258 120712 100663
2455 100663 74148 148441 264471 308126 406619 509500 603431 412856 291450 569438 723886
2444 723886 691291 779226 744130 852388 900088 856820 1008860 856871 769203 674447 732806
2433 732806 827747 862206 853265 884829 915087 819405 803882 615086 566564 514862 603342 674058
2421 674058 753098 916845 1040290 904809 971586 987893 1051650 1276152 1275410 1434075 1373904
2410A373904p8877p247L9191J26805O2484j52783l755j48651M8571J82677n0829
2399A391490J22756j61595j2788K45530J90565q3730J83521J2531J53878J19465
2389B161623m4474J91322J39201J74208J25905K12096M18468K77449J0115N0694
2379C716607P5779K56272J20226J68723L28069J62202N25937N42917P81901J021327
2369G699960J320822J106883R79990R39664J102926J114508J227879J423081K359076
2360A9274789L720356M891522O754972J1418576J7603491K4374920K1892753R097100
2352A19028479J507994l209579r707828j5864739j8184826j5799693j2234335
2345D5535473r774675p308426n148409l500259k425629j766916r16577j022144
$$ plain form
2410 1373904 1295027 1287780 1326971 1453776 1516260 1363477 1359722 1211071 1259642 1442319 1391490
2399 1391490 1514246 1352651 1339863 1585393 1775958 1692228 1875749 1888280 2042158 2161623
2389 2161623 2117149 2308471 2447672 2621880 2747785 2959881 3378349 3655798 3665913 3716607
2379 3716607 3792386 4048658 4168884 4337607 4665676 4827878 5353815 5896732 6678633 7699960
2369 7699960 9020782 10127665 11107655 12047319 13150245 14264753 15492632 16915713 19274789
2360 19274789 22995145 27886667 34641639 46060215 63663706 88038626 109931379 119028479
2352 119028479 120536473 117326894 107619066 91754327 73569501 57769808 45535473
2345 45535473 35760798 28452372 23303963 19803704 17378075 15611159 14694582 13672438
2337A3672438r60750o00511j046295p92850j004679p68198o11476o64191p74278
2328F449210m56532m18612m51480l16956j12536k26783n33655j34145J34136k29371
2318C703276l24843l1459k25194j33685J34550j74246q3679l26704R879r7474
2308B450421j67019q2224j3845m3505k37739q930J23002O6752j05377L997l1762
2297A953771l5490N2865J20412k96193K8406j42988m177J5648j58523K26130K3629
2286A783490j96782j02456j6785j53332j52921l3937P248j316m8831P9556m2472
2275A121462j45206l4350M272j21966Q2629k48246O015k63615j117K11972j54874
2264D56976J54545J06064j4028j70879j97999L3107l4064j57866J11158n638J6988
$$ plain form
2337 13672438 12711688 12111177 11064882 10272032 9267353 8499155 7887679 7223488 6449210
2328 6449210 5992678 5574066 5122586 4805630 4693094 4466311 3932656 3798511 3932647 3703276
2318 3703276 3378433 3346974 3121780 2988095 3122645 2948399 2864720 2538016 2547895 2450421
2308 2450421 2283402 2201178 2187333 2143828 1906089 1897159 2020161 2086913 1981536 1985533 1953771
2297 1953771 1918281 1971146 2091558 1795365 1823771 1680783 1676606 1692254 1533731 1759861 1783490
2286 1783490 1586708 1484252 1467467 1314135 1161214 1127277 1134525 1133209 1084378 1163934 1121462
2275 1121462 976256 941906 946178 824212 906841 658595 664610 400995 399878 611850 456976
2264 456976 611521 717585 703557 532678 334679 367786 333722 175856 287014 281376 298364
2253B98364Q1766J64196L1849k3888P7782J4933N087k05240J28105j31673j03683
2242C37598j581L5285K13599j67964r8421j36798k55990j49410J17310J46044
2232C9672N3537O457J16094k58559J03324J06222J25259J35953k09263P0330j89930
2221I9096j35599l5883k4576O8033O0645Q3154P6620q4803j57928j51958k21J35813
2209f7607J55139J85743r5300J908M28o2180L7428j8122J78105m7785n2606j32728
2197H2423M5850R4253p141N6332k4843q8842k8780k10523j25255K6505M0769J64245
2185B4993r7110J07505j04078M010J27981J95744O839L2849m1281r615j44633
2174A03204k61056J57850J40908m274J24440q9058J65440J08309l89527J01964
$$ plain form
2253 298364 380130 544326 576175 552287 630069 645002 650089 444849 572954 441281 337598
2242 337598 336017 371302 584901 416937 318516 181718 -74272 -223682 -106372 39672
2232 39672 93209 99666 215760 -42799 60525 166747 292006 427959 218696 289026 99096
2221 99096 -36503 -72386 -96962 -28929 31716 114870 191490 106687 -51241 -203199 -203420 -67607
2209 -67607 87532 273275 177975 179883 180311 118131 155559 137437 315542 267757 215151 82423
2197 82423 128273 222526 215385 271717 246874 158032 129252 -81271 -206526 -180021 -139252 24993
2185 24993 -72117 35388 -68690 -64680 63301 259045 265884 298733 257452 247837 103204
2174 103204 -157852 -2 140906 136632 261072 172014 337454 445763 56236 158200
2164A58200l892J1913K15879j77638k4740j12355K4163J91874n7992L3243O1377
2153C20032p6667j60769r6836j11305J06702L7329j22122j3956N4090L4144J95952
2142A66594j07781q0725k03379k8172K17993j69390o8169J42174q828J6482Q6023
2131c7178L5364P8096l9919n8845j11038k33699J51424J90245j13910j03013r0607
2120c33080J43081J12789j01885J70105L0485k08100J8367p3489M9500R5949n909
2109a02187J03406q6651j01244J22210m0168j41427K3793k15819J00922K59900
2099g7265P127P4025K1785R2078L5094j22303K5570J07050j1926L1019j46821
2088C5433o232K78487O2247J02885l005r2215J91049q5903N5405o832k83892q8552
$$ plain form
2164 158200 154308 166221 382100 204462 179722 67367 91530 283404 225412 258655 320032
2153 320032 243365 82596 -14240 -125545 -18843 18486 -103636 -117592 -63502 -29358 166594
2142 166594 58813 -21912 -225291 -253463 -35470 -204860 -273029 -130855 -139683 -123201 -37178
2131 -37178 -1814 76282 36363 -22482 -133520 -367219 -215795 -25550 -139460 -242473 -333080
2120 -333080 -189999 -77210 -179095 -8990 21495 -186605 -168238 -241727 -192227 -96278 -102187
2109 -102187 1219 -85432 -186676 -64466 -104634 -246061 -222268 -438087 -337165 -77265
2099 -77265 -70138 3887 25672 117750 152844 30541 56111 163161 151235 182254 35433
2088 35433 29201 307688 369935 472820 469815 377600 568649 482746 538151 531319 247427 158875
2076A58875j52545o8398j13756M1502K02512q5395k81277P8624J48062O2419o7915
2065g7292o5207O6480R0049R2742K6963k25013n3630J25835o5858P8223J47580
2054A40872P1941J8664j78665N1023J26727m5158p6340j29130j267O9338J62722
2043B10727p7984j11868q9662J57026p3350q1551J18185K3335k26848N3707j85212
2032b83495N2652l8431l8207J24061n3650j8079J20484L9249l1416J68887k28031
2021a85976q2603J6505J7462p280J24390R6763O947p3037N08J09454q9563O1109
2009e321q1209j45006P2610j55596J93340n7656q4920J06525j43915m5125L41389
1998d884k9381Q4943j56072j81513Q2520n8173P7095J39408j76618q8439K32631
$$ plain form
2076 158875 6330 -62068 -175824 -134322 68190 -17205 -298482 -219858 -71796 -9377 -77292
2065 -77292 -142499 -76019 14030 106772 133735 -91278 -144908 -19073 -84931 -6708 140872
2054 140872 212813 231477 52812 103835 230562 185404 109064 -20066 -21333 48005 210727
2043 210727 132743 20875 -68787 88239 14889 -66662 51523 74858 -151990 -98283 -283495
2032 -283495 -230843 -269274 -307481 -183420 -237070 -255149 -134665 -95416 -126832 42055 -185976
2021 -185976 -268579 -252074 -234612 -241892 -117502 -20739 -13792 -86829 -86321 23133 -66430 -5321
2009 -5321 -86530 -231536 -158926 -314522 -121182 -178838 -263758 -157233 -301148 -346273 -4884
1998 -4884 -34265 50678 -105394 -286907 -204387 -262560 -185465 -46057 -222675 -311114 -78483
1987g8483K7912J74223j31921o5900p083j21790N008n8656k74281K32879q0270
1976c78362J1516J23011J6867J12286k9383j22695j11628J44974M4154P4133q5314
1965b00441q0320j16004k4483L6704P6434N0731Q8807p8505j8603O6138L8691
1954a60851J93678k1076m5923k1257Q7785J10129J25550N7613j06168j9806j00977
1943I8697j36239O651N9296N0318R6545k31359J2537J36575l8135J14053k58769
1932h9830O678n5858j05770L0620J72336j7926L6810k7965N9067Q3133k06145
1921a14850J4457n831j6640Q2342n9311K1056k185j61361Q6507m9353J68670J55914
1909A19415j64976p1026O5428N4351J42030j54809J36601K2522n6860j13084J72007
$$ plain form
1987 -78483 -50571 123652 -8269 -74169 -81252 -203042 -198034 -256690 -530971 -298092 -378362
1976 -378362 -366846 -243835 -226968 -114682 -144065 -266760 -378388 -233414 -189260 -115127 -200441
1965 -200441 -280761 -396765 -421248 -384544 -308110 -257379 -168572 -247077 -265680 -199542 -160851
1954 -160851 32827 11751 -34172 -55429 32356 142485 268035 325648 219480 199674 98697
1943 98697 -37542 -30891 28405 78723 175268 -56091 -43554 93021 54886 168939 -89830
1932 -89830 -83152 -139010 -244780 -214160 -41824 -59750 -22940 -50905 8162 91295 -114850
1921 -114850 -100393 -106224 -122864 -40522 -99833 -78777 -80962 -242323 -155816 -205169 -36499 119415
1909 119415 -45561 -116587 -51159 3192 145222 -9587 127014 149536 92676 -20408 151599
1898A51599J0225j26754q1923L9983k5125O4274k580j6821k2444j49304j57530
1887c16400J35398m1626k54950J49589q8599J14696k1854r0224j2484K21149J55197
1876e0108p3661k02057J69581k4161J38105j9830o9479Q0572l0464k049k48367
1865c31918P3934O3299R6745J4775j13945K9593o4402L2827J14381o4844J06525
1854d3030J39748j24991j16538L8688Q928J87136J3960k31788j16946L3559J13042
1843i8232O0843j81003j00519J41106N9296M6115p91Q9500p5955m6110N5305n0735
1831a01180O1682O6129j60487j2643J2477K05001P8057j86363k46992J40841P7209
1820f6269l7362j216n9526n9493J09434P9853J13458j2938k8785j29053P664K3153
$$ plain form
1898 151599 161824 35070 -46853 -6870 -31995 32279 29699 12878 -9566 -158870 -316400
1887 -316400 -181002 -222628 -477578 -327989 -416588 -301892 -323746 -413970 -426454 -205305 -50108
1876 -50108 -123769 -325826 -156245 -180406 -42301 -62131 -131610 -51038 -81502 -83551 -331918
1865 -331918 -257984 -194685 -97940 -83165 -197110 -167517 -231919 -199092 -84711 -149555 -43030
1854 -43030 96718 -28273 -144811 -106123 -97195 89941 103901 -127887 -244833 -211274 -98232
1843 -98232 -37389 -218392 -318911 -177805 -118509 -72394 -73185 16315 -59640 -105750 -50445 -101180
1831 -101180 -39498 26631 -133856 -146499 -134022 70979 149036 -37327 -284319 -143478 -66269
1820 -66269 -103631 -104847 -164373 -223866 -114432 -34579 78879 65941 37156 -91897 -84233 -61080
1808f1080R8627N612p2339L4138J814j6442n1425j5044P2052r9938q2907K0527
1796a66405j74448R1446o8986N6903O9120n876K3926q4836r4082J60562k6871
1785b19547L8461K26820L0754j05539J09564L1849k4983j96192j60725p2946J1898
1774c30586J78481J18701j03456K3927q7931r1746J04433J70094J07143o942k19779
1763a37661Q2608K8658j76827Q825n8128K06865M2673j44137K7208O3766o2480
1752a18630j78688k23272L8694Q0595n1325J23043J02919J22493J31818j21195
1742i3548P0863O1999P85J00529k16791j02726m0010p5379K40826R5687r8430
1731e6195j27116M9460K23991L831o9495j97160j04196p8020j17378M9441J03494
$$ plain form
1808 -61080 37547 43159 -29180 4958 6772 -9670 -61095 -76139 -4087 -104025 -186932 -166405
1796 -166405 -340853 -249407 -318393 -261490 -192370 -198246 -174320 -259156 -353238 -192676 -219547
1785 -219547 -181086 45734 76488 -29051 80513 112362 87379 -108813 -269538 -342484 -330586
1774 -330586 -152105 -33404 -136860 -112933 -200864 -292610 -188177 -18083 89060 82118 -137661
1763 -137661 -55053 -26395 -203222 -194397 -252525 -45660 -2987 -147124 -119916 -56150 -118630
1752 -118630 -297318 -520590 -481896 -401301 -452626 -329583 -226664 -104171 27647 -93548
1742 -93548 -22685 39314 40099 140628 -76163 -178889 -218899 -294278 -53452 42235 -56195
1731 -56195 -183311 -133851 90140 93971 24476 -172684 -276880 -354900 -472278 -422837 -319343
1720c19343J61859M461L1500J46397N5375N4962j31563j66183m9360Q2460J32785
1709C350n2550J44402n0910k62848M7677J43218N8982j01994o0639n485l1703
1698a68500P2957l7388o8326O5510k1311K9564P4213J9932J9395k03150L8837
1687a78267N9317J41865n0887l2916K2521j07625P8699l3773J3369j0573J11100
1676A2830j28087j0301l5604K4232J88879J9033m2539J27094r8127p9600o146
1665b8336n0407R6116l0428j6628n140r7935n7951m8180q3l4970j98199J10122
1653c62019J64679N988r4423l0676J00093J37455o096K9448Q8566r3157j01826
1642a61968m2001O4011M7639M127j00583l2815Q2651O3239q4611l42584J17333
$$ plain form
1720 -319343 -157484 -153023 -121523 24874 80249 135211 3648 -162535 -211895 -129435 3350
1709 3350 -49200 95202 44292 -218556 -170879 -27661 31321 -70673 -131312 -136797 -168500
1698 -168500 -95543 -132931 -201257 -135747 -157058 -127494 -53281 -33349 -13954 -217104 -178267
1687 -178267 -118950 22915 -27972 -60888 -38367 -145992 -67293 -101066 -87697 -98270 12830
1676 12830 -115257 -125558 -161162 -136930 51949 70982 28443 155537 57410 -22190 -28336
1665 -28336 -78743 17373 -13055 -29683 -34823 -132758 -190709 -238889 -238972 -273942 -472141 -362019
1653 -362019 -197340 -191352 -285775 -316451 -216358 -78903 -84999 -55551 33015 -60142 -161968
1642 -161968 -203969 -139958 -92319 -88192 -188775 -221590 -138939 -75700 -160311 -502895 -385562
1631c85562J67794K0940l4063l4375l492M7530O1256P7730O9249J4033K4218j52724
1619a27466j53817J26531K4161l0232j54990j76820J54693J05750l3977M1255
1609b24912j5750M6338K78962L1494l4085J5643q121J04624L05P705J00374m7332
1597B55245k32131j02561j26076L6787J24522P2996j27342l7456J91013P5977
1587A30974j90052R0665k28683j00793N5336j40649J71763Q8749k83425N8919
1577c47196K36393Q1035M842j05654M0388k7380o4802J7570J17107L9154L7834
1566B9291k9848q7280p8495Q5294j3643M4950J2125l6297j25915O7822q720K34586
1554I3870O1811l0443r0779r114j06971O4657n3034j05534N9734j8982L4956l445
$$ plain form
1631 -385562 -217768 -196828 -230891 -265266 -268758 -221228 -159972 -82242 -12993 1040 25258 -127466
1619 -127466 -281283 -154752 -130591 -160823 -315813 -492633 -337940 -232190 -266167 -224912
1609 -224912 -240662 -194324 84638 116132 82047 97690 89569 194193 194498 202203 302577 255245
1597 255245 23114 -79447 -205523 -168736 -44214 28782 -98560 -136016 54997 130974
1587 130974 -59078 31587 -197096 -297889 -242553 -383202 -211439 -122690 -406115 -347196
1577 -347196 -110803 -29768 -24926 -130580 -90192 -117572 -182374 -164804 -47697 -8543 29291
1566 29291 -557 -87837 -166332 -81038 -94681 -49731 -37606 -73903 -199818 -131996 -140716 93870
1554 93870 155681 125238 34459 25345 -81626 -16969 -70003 -175537 -115803 -134785 -99829 -103274
1542a03274P7081R419n5144j851L3998L2514J09068j69594j40367q6547P1631
1531b23066J91635m1229p8033j39002P4460J48524N519j7094j7043N8912q4875
1520a21292j29648j47036J17161O5102l9239n657m5793K50876P7095k57091q0062
1509c15584K9002J65645L2876j1022M9253J228o8864j42507J22138N6417N6962
1498b4456K8764j74459l7268M9208J36144J14737j60209j34487N2122j1749n8149
1487b19802N8226J72645P9789O6052k2989m9537O4200n6924N31j35804O0502J07030
1475A23919j90622N8423k54533j47556R7191k6688O8208Q8597O9699m064r8842
1464b16268j90142J36593P6717J49747J68723q1553j59618m3567K9445J10538
$$ plain form
1542 -103274 -26193 -16774 -71918 -73769 -39771 -7257 101811 -67783 -208150 -294697 -223066
1531 -223066 -31431 -72660 -150693 -289695 -215235 -66711 -61192 -78286 -95329 -36417 -121292
1520 -121292 -250940 -397976 -280815 -215713 -254952 -260609 -306402 -55526 21569 -235522 -315584
1509 -315584 -286582 -120937 -88061 -99083 -49830 -48602 -117466 -259973 -137835 -81418 -24456
1498 -24456 4308 -170151 -207419 -158211 -22067 92670 -67539 -202026 -149904 -161653 -219802
1487 -219802 -161576 11069 90858 156910 133921 84384 148584 91660 92191 -43613 16889 123919
1475 123919 -66703 -8280 -262813 -410369 -313178 -339866 -271658 -183061 -113362 -117426 -216268
1464 -216268 -406410 -269817 -193100 -43353 125370 43817 -115801 -159368 -129923 -19385
1454a9385m3722r218L8426k74135P4689Q1034n7834R1711R3683J85023n1086p1762
1442C7424O8941k37495j16704Q6311J60807J0924Q7340L4278j10595q1662k7215
1431h7646K72896o8665j17765L4165k73469j45050J74583J05698q9564j10967
$$ plain form
1454 -19385 -63107 -72325 -33899 -308034 -233345 -152311 -210145 -118434 -24751 160272 109186 37424
1442 37424 106365 -131130 -247834 -161523 -716 10208 97548 131826 21231 -60431 -87646
1431 -87646 185250 116585 -1180 32985 -240484 -385534 -210951 -105253 -194817 -305784
$$ [...]
##END NTUPLES=NMR SPECTRUM
##END=
