##TITLE=1H_DE-80H_X3
 200.13MHz, d2o
 8 sc
 
 19ns.26.2.2025
##JCAMPDX= 6.0         $$ Bruker NMR JCAMP-DX V2.0
##DATA TYPE= NMR SPECTRUM
##DATA CLASS= NTUPLES
##ORIGIN= UXNMR, Bruker Analytische Messtechnik GmbH
##OWNER= pz
$$ XWIN-NMR		Version 3.5
$$ Mon May  4 10:38:45 2026 Russian Standard Time (UT+4h)  Yarkov@DPX200
##.OBSERVE FREQUENCY= 200.1313
##.OBSERVE NUCLEUS= ^1H
##.ACQUISITION MODE= SIMULTANEOUS
##.ACQUISITION SCHEME= undefined
##.AVERAGES= 8
##.DIGITISER RES= 18
##SPECTROMETER/DATA SYSTEM= spect
##.PULSE SEQUENCE= zg30
##.SOLVENT NAME= CDCl3
##.SHIFT REFERENCE= (INTERNAL, CDCl3, 0, 18.0819)
##AUDIT TRAIL= $$ (NUMBER, WHEN, WHO, WHERE, WHAT)
$$ ##TITLE= Audit trail, XWIN-NMR		Version 3.5
$$ ##JCAMPDX= 5.01
$$ ##ORIGIN= Bruker BioSpin GmbH
$$ ##OWNER= Yarkov
$$ C:/Bruker/XWIN-NMR/data/yarkov2/nmr/H-C/1/pdata/1/auditp.txt
$$ ##AUDIT TRAIL=  $$ (NUMBER, WHEN, WHO, WHERE, WHAT)
(   1,<2026-05-04 10:34:27.25 +0400>,<Yarkov>,<DPX200>,
      <created by zg, POWCHK disabled, PULCHK disabled
       configuration hash MD5:
       00 E9 B6 7A A2 85 ED C7 34 08 36 98 17 FE 4E 26
       data hash MD5: 16K
       45 35 BC 73 A7 E4 42 F9 A3 82 40 4D 1C 7A E4 66>)
(   2,<2026-05-04 10:34:36.68 +0400>,<Yarkov>,<DPX200>,
      <Start of raw data processing
       efp BC_mod = 2 LB = 0.25 FT_mod = 6 PKNL = 1 PHC0 = -5303.516 PHC1 = 11.42193 SI = 16K 
       data hash MD5: 16K
       96 C6 BA 21 C1 B3 12 2D B4 1A 52 50 F9 6A F0 24>)
(   3,<2026-05-04 10:35:17.32 +0400>,<Yarkov>,<DPX200>,
      <abs ABSG = 5 
       data hash MD5: 16K
       DB 8F CD 3F 0B 3E 22 DD C4 1A 0D A7 95 0D 25 75>)
$$ ##END=
$$ 
$$ hash MD5
$$ 1A 38 48 70 AA 42 14 02 3F A4 1D DB 6C DF 3C 37
##$RELAX= 
##$RELAX= 
##$RELAX= 
##$RELAX= 
##$RELAX= 
##$RELAX= 
$$ Bruker specific parameters
$$ --------------------------
##$DU= <C:/Bruker/XWIN-NMR>
##$EXPNO= 1
##$NAME= <H-C>
##$PROCNO= 1
##$TYPE= <nmr>
##$USER= <yarkov2>
##$AMP= (0..31)
100 100 100 100 100 100 100 100 100 100 100 100 100 100 100 100 100 100 
100 100 100 100 100 100 100 100 100 100 100 100 100 100 
##$AQSEQ= 0
##$AQ_mod= 1
##$AUNM= <au_zg>
##$AUTOPOS= <>
##$BF1= 200.13
##$BF2= 200.13
##$BF3= 200.13
##$BF4= 200.13
##$BF5= 200.13
##$BF6= 200.13
##$BF7= 200.13
##$BF8= 200.13
##$BYTORDA= 1
##$CFDGTYP= 0
##$CFRGTYP= 5
##$CHEMSTR= <none>
##$CNST= (0..31)
1 1 145 1 1 1 1 1 1 1 1 1 1 1 1 1 1 1 1 1 1 1 1 1 1 1 1 1 1 1 1 1 
##$CPDPRG= <>
##$CPDPRG1= <>
##$CPDPRG2= <>
##$CPDPRG3= <>
##$CPDPRG4= <mlev>
##$CPDPRG5= <mlev>
##$CPDPRG6= <mlev>
##$CPDPRG7= <mlev>
##$CPDPRG8= <mlev>
##$CPDPRGB= <>
##$CPDPRGT= <>
##$D= (0..31)
0 0.7 0 0 0 0 0 0 0 0 0 0.03 0 0 0 0 0 0 0 0 0 0 0 0 0 0 0 0 0 0 0 0 
##$DATE= 1777876466
##$DBL= (0..7)
120 120 120 120 120 120 120 120 
##$DBP= (0..7)
150 150 150 150 150 150 150 150 
##$DBP07= 0
##$DBPNAM0= <>
##$DBPNAM1= <>
##$DBPNAM2= <>
##$DBPNAM3= <>
##$DBPNAM4= <>
##$DBPNAM5= <>
##$DBPNAM6= <>
##$DBPNAM7= <>
##$DBPOAL= (0..7)
0.5 0.5 0.5 0.5 0.5 0.5 0.5 0.5 
##$DBPOFFS= (0..7)
0 0 0 0 0 0 0 0 
##$DE= 6
$$ [...]
##$SUBNAM3= <"">
##$SUBNAM4= <"">
##$SUBNAM5= <"">
##$SUBNAM6= <"">
##$SUBNAM7= <"">
##$SUBNAM8= <"">
##$SUBNAM9= <"">
##$SW= 18.0517328524113
##$SWIBOX= (0..15)
0 0 2 0 0 0 0 0 0 0 0 0 0 0 0 0 
##$SW_h= 3612.71676300578
##$TD= 16384
##$TD0= 1
##$TE= 0
##$TE2= 300
##$TE3= 300
##$TEG= 300
##$TL= (0..7)
0 120 120 120 120 120 120 120 
##$TP= (0..7)
150 150 150 150 150 150 150 150 
##$TP07= 0
##$TPNAME0= <>
##$TPNAME1= <>
##$TPNAME2= <>
##$TPNAME3= <>
##$TPNAME4= <>
##$TPNAME5= <>
##$TPNAME6= <>
##$TPNAME7= <>
##$TPOAL= (0..7)
0.5 0.5 0.5 0.5 0.5 0.5 0.5 0.5 
##$TPOFFS= (0..7)
0 0 0 0 0 0 0 0 
##$TUNHIN= 0
##$TUNHOUT= 0
##$TUNXOUT= 0
##$USERA1= <user>
##$USERA2= <user>
##$USERA3= <user>
##$USERA4= <user>
##$USERA5= <user>
##$V9= 5
##$VALIST= <valist>
##$VCLIST= <CCCCCCCCCCCCCCC>
##$VD= 0
##$VDLIST= <DDDDDDDDDDDDDDD>
##$VPLIST= <PPPPPPPPPPPPPPP>
##$VTLIST= <TTTTTTTTTTTTTTT>
##$WBST= 1024
##$WBSW= 4
##$XGAIN= (0..3)
0 0 0 0 
##$XL= 0
##$YL= 0
##$YMAX_a= 360260
##$YMIN_a= -355866
##$ZGOPTNS= <>
##$ZL1= 120
##$ZL2= 120
##$ZL3= 120
##$ZL4= 120
##$ABSF1= 17.9935
##$ABSF2= -0.05839539
##$ABSG= 5
##$ABSL= 3
##$ALPHA= 0
##$AQORDER= 0
##$ASSFAC= 0
##$ASSFACI= 0
##$ASSFACX= 0
##$ASSWID= 0
##$AUNMP= <proc_1d>
##$AZFE= 0.1
##$AZFW= 0.1
##$BCFW= 0
##$BC_mod= 2
##$BYTORDP= 0
##$COROFFS= 0
##$CY= -3
##$DATMOD= 1
##$DC= 0
##$DFILT= <>
##$DTYPP= 0
##$F1P= 0
##$F2P= 0
##$FCOR= 1
##$FTSIZE= 16384
##$FT_mod= 6
##$GAMMA= 0
##$GB= 0
##$INTBC= 1
##$INTSCL= 3.241238e-09
##$ISEN= 128
##$LB= 0.25
##$LEV0= 0
##$LPBIN= 0
##$MAXI= 10000
##$MC2= 0
##$MEAN= 0
##$ME_mod= 0
##$MI= 1.114404
##$NCOEF= 0
##$NC_proc= -7
##$NLEV= 6
##$NOISF1= 3.799351
##$NOISF2= 2.8
##$NSP= 0
##$NTH_PI= 0
##$NZP= 0
##$OFFSET= 18.08188
##$PC= 1
##$PHC0= -5303.516
##$PHC1= 11.42193
##$PH_mod= 1
##$PKNL= yes
##$PPARMOD= 0
##$PSCAL= 0
##$PSIGN= 0
##$REVERSE= no
##$SF= 200.129487640845
##$SI= 16384
##$SIGF1= 3
##$SIGF2= 2
##$SINO= 0.751879
##$SIOLD= 32768
##$SREGLST= <19F.Aceton>
##$SSB= 0
##$STSI= 16384
##$STSR= 0
##$SW_p= 3612.71676300578
##$SYMM= 0
##$S_DEV= 0
##$TDeff= 16384
##$TDoff= 0
##$TI= <>
##$TILT= no
##$TM1= 0
##$TM2= 0
##$TOPLEV= 0
##$USERP1= <user>
##$USERP2= <user>
##$USERP3= <user>
##$USERP4= <user>
##$USERP5= <user>
##$WDW= 1
##$XDIM= 16384
##$YMAX_p= 370136189
##$YMIN_p= -9412964
$$ End of Bruker specific parameters
$$ ---------------------------------
##NTUPLES= NMR SPECTRUM
##VAR_NAME=  FREQUENCY,     SPECTRUM/REAL,   SPECTRUM/IMAG
##SYMBOL=    X,             R,               I
##VAR_TYPE=  INDEPENDENT,   DEPENDENT,       DEPENDENT
##VAR_FORM=  AFFN,          ASDF,            ASDF
##VAR_DIM=   16384,         16384,           16384
##UNITS=     HZ,            ARBITRARY UNITS, ARBITRARY UNITS
##FACTOR=    0.220516191357247, 1,           1
##FIRST=     3618.71749394858, 0,            0
##LAST=      6.00073094280197, 0,            0
##MIN=       6.00073094280197, -9412964,     0
##MAX=       3618.71749394858, 370136189,    0
$$ Real data points
##PAGE= N=1
##DATA TABLE= (X++(R..R)), XYDATA
$$ [...]
10195i0874L85727K83974j43508q71497O72612K46045n56645Q7159M29459o14335
10185a71883k9941K84186o01768m42412N84870M78929m75303j31646L39846J06812
10175e8310m7526K44139k84803L05082N98343k68858m40593o89466L84960K96367
10165C9335p9320N5063N18099k39654n48426l28473K42082P51085K68872O5648
10155G44311k56191j23700n3798q11468k35446M63850K73345L25797q7199m8502
10145A90999m24777k73062J48529O98J305553l24666m40836k09766L40497l07343
10135E826j00798O33735l85351l14034N2513m7089j82292K26910L83412k59021
10125A3811k51283P80742L70239m46827q87322P32697M21093m03188L96124L14447
$$ y = [-90874, 294853, 578827, 435319, -436178, 236434, 482479, -74166, 12993, 442452, -171883, -201824, 82362, -519406, -961818, -376948, 101981, -373322, -504968, -165122, -58310, -105836, 138303, -146500, 158582, 756925, 488067, 47474, -641992, -257032, 39335, -39985, 15078, 533177, 293523, -254903, -583376, -341294, 409791, 678663, 744311, 488120, 364420, 310622, -500846, -736292, -272442, 903, 326700, 239501, 190999, -233778, -506840, -358311, -357613, 947940, 623274, 182438, -27328, 313169, 5826, -94972, 538763, 153412, -160622, -108109, -155198, -337490, -110580, 272832, 13811, -237472, 543270, 913509, 466682, -420640, 312057, 733150, 329962, 726086, 1040533]
10115A040533j004320n20810P17427J57287r36761K70126P01128n56501m61314
10106e93205M87910k207m02431l53923M06687K57115l36869J93979P74296q24064
10096c92712q4635Q70499L71973j200766K39841P91605n25582o18372J466237
10087I18088l21391j120949L21126Q0373k70569l73374N84353M90526o28701L82527
10077F2009k42433j18426K0401M84234J51980k73953M45036J65866m89381n08539
10067c03206Q10067k81577n02908N60969k24275k28651j68857k91864l81207K86742
10057g24767J087345n85639l0782L36800K45313q08994L27745Q04252r4592n3294
10047E03387j56640O48257Q4212o00544M9788k31459n0277J4109O41527m74478
$$ y = [1040533, 36213, -484597, 232830, 390117, -546644, -276518, 424610, -131891, -593205, -105295, -107502, -509933, -863856, -457169, -200054, -536923, -342944, 431352, -392712, -477347, 393152, 765125, -435641, -195800, 595805, 70223, -548149, 918088, 596697, -524252, -203126, -122753, -393322, -766696, -182343, 308183, -320518, 62009, -180424, -298850, -278449, 205785, 357765, 83812, 528848, 694714, 205333, -303206, 506861, 225284, -277624, 283345, 59070, -169581, -338438, -630302, -1011509, -724767, 362578, -223061, -253843, 82957, 328270, -480724, -152979, 651273, 556681, 503387, 346747, 995004, 1079216, 478672, 528460, 297001, 246724, 260833, 902360, 427882]
10037D27882n99748L44952L14q99613J82648J241281m85703q92091O55907M92745
10027D68574j51359m72400P11397n42578j70443O71528j60103n50472k74608Q78446
10017D07982J15858j41179k3272l0600n57035K29440J6865J35673J57361R2834
10007D03927K15989p22657n29272J86222P26896n25100l31701J66906P54116N4551
9997C99877K44536k39909k41617L23260N26509k89946p79312P33459M42360n45823
9987E73394r51671R6845l63588l51307J05041j02056o34778J219402R86320j233563
9977f55961n09878J118498p3517j58490N83517k6486n8284M7317N42785p15872
9967I3629r93063J027187l86863m92489J82557M93377M10695l28142K03389l75126
$$ y = [427882, -171866, 173086, 173400, -726213, -543565, 697716, 212013, -680078, -24171, 468574, 317215, -155185, 556212, 13634, -156809, 514719, 354616, -195856, -470464, 407982, 523840, 382661, 359389, 328789, -228246, 1194, 18059, 153732, 311093, 403927, 619916, -102741, -632013, -445791, 281105, -243995, -575696, -408790, 345326, 399877, 644413, 404504, 162887, 486147, 1012656, 722710, -56602, 676857, 1119217, 573394, -378277, -281432, -645020, -996327, -891286, -993342, -1628120, -408718, 577602, -655961, -1165839, -47341, -120858, -279348, 304169, 277683, 219399, 266716, 809501, 93629, -899434, 127753, -259110, -751599, -569042, -75665, 335030, 6888, 210277, -164849]
9957a64849k1557M10233O10088q52362r5278m40759Q28673j03672o9564l78249
9947b77296L30669k77475k93469l19900L61879R00083l69932M78659p44833J93603
9937a8012L29579l05989j48661q553P96736Q67960j172704r4796M13450p80602
9927a21592L45446O29215j22034n10216k98349M5135q22419O30140J54591j45831
9917b15914k54635L27022l51349J20039M70842j25801j64764n49808M26957M67164
9907A49753l02487o67129q2738K21342M63323j06839j42905j80247M91538O64757
9897E08368n81211M58604J040720o58605l84073L21089m74371k08766J13549n42705
9887d07401p41948N57683M59941o05917n77440K04576L493L4948J191594L46430
$$ y = [-164849, -186406, 223827, 833915, -18447, -113725, -554484, 274189, 170517, 100953, -277296, 53373, -224102, -517571, -837471, -475592, 424491, 54559, 533218, -211615, -18012, 311567, 5578, -143083, -151636, 645100, 1513060, 340356, 245560, 659010, -121592, 223854, 853069, 731035, 220819, -77530, -32395, -854814, -224674, -70083, -215914, -470549, -143527, -494876, -374837, 96005, -29796, -194560, -744368, -317411, 149753, -152734, -819863, -902601, -681259, -217936, -324775, -467680, -647927, -156389, 508368, -72843, 385761, 1426481, 767876, 383803, 704892, 230521, 21755, 135304, -407401, -1149349, -591666, -131725, -737642, -1315082, -1110506, -1107013, -1072065, 119529, 465959]
9877D65959J87361J19099l24985M41176q79014O54571o7688m26733l29630K14082
9867E4198o7261p59507j67987l50074K04239P9447R62445j18462l42369O5854
9857d39477R3159J79338n4661Q2841K53735J71093m88032L68678j9880q6198k9263
9846C1333j00888J12795O65600K96191m81699m4845k06340Q23546n65889J03210
9836F33014n06845j85214O94319r21597K70195m41741K94351p596L3093j88211
9826c26232O49267p2235l96124N48182q0967n15104K47645L10027l73090o32342
9816f40973O68884j46475r29097O86240j78612m2258N93694J3779j39103n56774
9806f70695M77752O53547K38364j58782j99775K42409N4258k60272j07315L73274
$$ y = [465959, 653320, 772419, 447434, 888610, 9596, 664167, 596479, 169746, -159884, 54198, -13063, -772570, -940557, -1290631, -1086392, -1006945, -44500, -162962, -505331, -439477, -346318, -166980, -221641, -138800, 114935, 286028, -202004, 166674, 146794, 60596, 31333, -69555, 43240, 708840, 1005031, 523332, 478487, 272147, 1095693, 529804, 633014, 126169, -59045, 635274, -286323, -16128, -457869, -163518, -171114, -138021, -326232, 323035, 250800, -145324, 402858, 321891, -193213, 54432, 364459, -8631, -640973, 27911, -118564, -1047661, -361421, -540033, -582291, 11403, 25182, -113921, -670695, -192943, 460604, 698968, 540186, 340411, 582820, 637078, 376806, 269491, 642765]
9796F42765q40164M09864K69978q30198o28042O53435l05518O3792m62897J99762
9786h27223J42990o86762K7564k6317K92637P35676j12322n38175J57485O56384
9776a78063J127187j14397j26126K28327j73793M48024l05987j19730J82151k33982
9766G33611n91517J74142l1569o26357n06582K67142n5505m91625L48797P80345
9756H82j163805J96582K26074K79893K81069l76481o5777j87678N99902J086266
9746H76927k93502q54982M53765L29969m72732N54931Q5730K2363m83663m06426
9736a87620k74126J51467L95401l49295o04018O09607q8557n98309N78603J87561
9726a79286Q0051J89119L79468K37567l11863l5798J4781l79937M66687N1907
$$ y = [642765, -197399, 212465, 482443, -347755, -975797, -322362, -627880, -564088, -1026985, -827223, -684233, -1370995, -1343431, -1369748, -1077111, -341435, -453757, -991932, -834447, -178063, 949124, 834727, 708601, 936928, 763135, 1211159, 905172, 785442, 967593, 733611, 142094, 316236, 284667, -341690, -848272, -581130, -636635, -1128260, -779463, 882, -1162923, -966341, -740267, -460374, -179305, -555786, -621563, -809241, -209339, 876927, 583425, -271557, 182208, 512177, 39445, 594376, 680106, 702469, 218806, -187620, -461746, -310279, 85122, -264173, -868191, -258584, -347141, -945450, -366847, -179286, -99235, 89884, 469352, 706919, 395056, 359258, 374039, -5898, 460789, 512696]
9716E12696n64735n27911K39435M3493J42086o97981Q18454L63598r33968O01212
9706c621K03386K45852r1289J9846M94228m98169k54083L3469K57333n00306K70033
9695A76679o42438L38409n76972J24686K29360m24370L79349J74794l42911J70941
9685c92473N13404L0509o00192j55317R10811n8220n40279Q64238q06061L90948
9675A57368M58161m46181L10459J23097m21600p2493N3939J27969k29843M2805
9665A03681J44392p99591N54092k55559j79662j10028j72922Q9864O72621l15870
9655b68982J69244l11292N9550k59334J165430o362m80969j39676Q67737k89326
9645E06020n22072J227453p10669O40938o74409M65251m3647m25751r9355k6035
$$ y = [512696, -52039, -579950, -340515, -297022, -154936, -852917, -34463, 329135, -604833, -3621, 199765, 445617, 354328, 374174, 868402, 370233, 116150, 149619, 406952, -93354, 176679, -465759, -127350, -704322, -579636, -350276, -774646, -395297, -220503, -563414, -392473, 120931, 151440, -448752, -604069, 306742, 248522, -291757, 572481, -233580, 157368, 615529, 169348, 479807, 602904, 181304, 108811, 162750, 290719, 60876, 103681, 248073, -551518, 2574, -252985, -432647, -542675, -715597, -625733, 46888, -268982, -99738, -411030, -351480, -610814, 554616, 548254, 67285, -72391, 795346, 506020, -16052, 1211401, 500732, 1141670, 467261, 932512, 888865, 463114, 363759, 337724]
9635C37724k64714o35945L44868J66085j370283K81462N35382K34222m26025L78882
9625d18342m40455J33885N10937P70729j50781J90614J63561O272l42360m71294
9615d7234N64039L39921j5217p70091Q63244q80714M22841m98063L12525j30582
9605A60669k45917M97978M9818n09495l7159j00744L64167l94268o62916J74827
9595g03040m04485k35026K83642J11082m44527J5445j20199L31433l42880L65672
9585a142883R24465o27893P14008n40946O7925L91729L2233N15464m09268K76627
9575B01461l86509N78498l32207m17902J06034J245279j76115r73520J40149Q0090
9565F5258J66087p19266M20428O3702O03969p7945L0376Q4162j27185R5768L68168
$$ y = [337724, 73010, -562935, -218067, -51982, -1422265, -1140803, -605421, -371199, -797224, -418342, -858797, -724912, -213975, 556754, 405973, 596587, 760148, 766420, 424060, -47234, 516805, 856726, 841509, 71418, 934662, 53948, 476789, -21274, 291251, 160669, -85248, 412730, 462548, -46947, -84106, -184850, 179317, -214951, -877867, -703040, -1107525, -1342551, -1058909, -947827, -1392354, -1376909, -1497108, -1165675, -1508555, -1142883, -218418, -846311, -132303, -673249, -605324, -213595, -181362, 334102, -75166, 201461, -185048, 393450, 61243, -356659, -250625, 994654, 818539, -154981, -14832, 65258, 231345, -487921, -67493, -3791, 600178, 522233, 552609, 636771, 509586, 605354, 973522]
9554I73522p49385j16244M03331P6831m90443k62185P13828r05189j44901L99303
9544a01532k26016o55773J297447P24467n98903J55103n20257M21877k31897L1700
9534B96216k21511J55556M31898n16515k69400J80824L4307k84873k8470l35726
9524e57694M38847K3224q3947k1102L36637p57159J14182k45782l93579P57941
9514c88432k50003M81840m59772J016325k66467j015585L51502J364452n09245
9505C24615K03903k29584j60683q8169m63698M37408k96301r2781K61091k90224
9495c94423j73534J21591J09021N70551k15244K3647K24507J28042J42240k16806
9485C19592j22839N3231O1075O57414o05276o48232J15659O25221n74581j15396
$$ y = [973522, 224137, 107893, 511224, 588055, 97612, -164573, 549255, -355934, -500835, -101532, -327548, -983321, 314126, 1038593, 439690, 594793, 74536, 496413, 264516, 296216, 74705, 230261, 662159, 145644, -123756, 57068, 91375, -193498, -221968, -557694, -118847, -95623, -179570, -200672, 135965, -621194, -507012, -752794, -1146373, -388432, -638435, -156595, -616367, 399958, 133491, -882094, -530592, 833860, 324615, 528518, 298934, 138251, 50082, -413616, 23792, -272509, -365290, -104199, -394423, -567957, -446366, -337345, 233206, 17962, 41609, 266116, 394158, 536398, 319592, 196753, 249984, 311059, 968473, 363197, -285035, -169376, 455845, -118736, -234132]
9475b34132m78916M24418M15914j04010k70022M16077m4407l11245n93875L30255
9465d49943K8840O81350O4940n41669o48341N56587L19547o06391O73138R891
9455H7949N54302L9563n47195j82501K63768M58987k21902j0597j81574J52244
9445D13044k66268J12485o85781L47801Q19956k50802j10146o65825L15532J81529
9435B11525m13759p148K9019k49928j42001k31483N877k78934J6943Q33864o03719
9424h29744l33726O94491M92765r3014j59159K41559P7500J29767J31145p8336
9414B73248o91851N78145j57789j03445l10808J24174J038189l90402k94221L97466
9404D62706K16512n7216l02119j08879K69480L84194m43753l58905m89557M37118
$$ y = [-234132, -713048, -288630, 127284, 23274, -246748, 169329, 124922, -186323, -780198, -449943, -421103, 260247, 325187, -216482, -864823, -308236, 11311, -595080, 78058, 87949, 642251, 681814, 134619, -47882, 215886, 674873, 452971, 442374, 260800, 413044, 146776, 259261, -426520, -78719, 741237, 490435, 380289, -285536, 29996, 211525, -202234, -209382, -180363, -430291, -572292, -803775, -797898, -1076832, -1059889, -226025, -829744, -1163470, -468979, 23786, -69228, -228387, 13172, 90672, 220439, 351584, 273248, -418603, 159542, 1753, -101692, -412500, -288326, 749863, 359461, 65240, 462706, 679218, 622002, 319883, 211004, 480484, 864678, 420925, 62020, -427537, 9581]
9394I581l57914J08098p8961L75946L0723l96356k72259K28785O92871l37873
9384B641q920l76535J41884J91209n6189l80508N0819L98590k72659l33086L45589
9373b97165L08048n19867J81151K83J84490k43579N9624q2204l09165L45481J66165
9362b06738M86499m91848J50417J97952n02063J008563K68024j13416r24279J63088
9352C6199M98436j08493l69884J63850K86879l58539k83441p1350O62532j90663
9342B65526M08014J34066j58894K8805O20084n28216j059905J23518O48341K67063
9332G48402o70260n30722M6630o85915L54282K83456R0859m63836N38877P31138
9322D42911m85154p09279R40061M74049o59413r0518N38748j83353j38571m6201
$$ y = [9581, -348333, -240235, -319196, 56750, 87473, -308883, -581142, -352357, 340514, 2641, -6279, -382814, -240930, -49721, -105910, -486418, -435599, -37009, -309668, -642754, -297165, 10883, -508984, -327833, -327550, -143060, -386639, -327015, -409219, -718384, -372903, -206738, 279761, -212087, -61670, 136282, -365781, 642782, 910806, 797390, -126889, 36199, 534635, 426142, 56258, 220108, 506987, 148448, -134993, -206343, 456189, 265526, 673540, 807606, 648712, 677517, 1297601, 769385, -290520, -167002, 481339, 748402, 78142, -452580, -405950, -1091865, -737583, -454127, -363268, -827104, -288227, 442911, -42243, -751522, 188539, 662588, 3175, -87343, 451405, 268052, 129481, 83280]
9312H3280n17672k18660M80135P25831o84344j061201J020515N08889m78812K53097
9302A11058O23246K16838l80470R15676K22853m52131K89376N75343q73495p7951
9292A170343J90389k34909m17279j10083m68807q61140l08058Q25706n72757J92200
9282e94395J3035O5776k07596K46700L79849k30521M12826P58569J6889j457327
9272e96195M42163J37011k59477L28025L05123K27781j44358J88984r19988n68034
9262h58965J091324R57805J28160r19342j46755k35521m6901n84145R8429O35121
9252A19210M67063p36649m76656K63071J86282M71571k11513k2867Q0757M42302
9242E82571p105r42094k44636J026426k9127l59695l23020j37446n18007J19728
$$ y = [83280, -434392, -653052, -172917, 552914, -131430, -1192631, -172116, 336773, -142039, 111058, 734304, 951142, 570672, 1486348, 1709201, 1257070, 1546446, 2121789, 1248294, 1170343, 1360732, 1125823, 708544, 598461, 129654, -731486, -1039544, -213838, -786595, -594395, -581360, -515584, -723180, -476480, -96631, -327152, 85674, 844243, 861132, -596195, -154032, -17021, -276498, 51527, 356650, 584431, 440073, 629057, -290931, -858965, 232359, 1190164, 1318324, 398982, 252227, 16706, -30195, -614340, -515911, 119210, 586273, -150376, -627032, -363961, -177679, 293892, 82379, 59512, 140269, 582571, 575466, -366628, -611264, 415162, 386035, 26340, -296680, -434126, -952133, -832405]
9232h32405J100820k9441j40174P35360n50584p92055O37878Q39301m95569L72887
9222H46018j54091m30378R9890p3189q60807l88232R67207M06751p40825K01941
9212a25715J69311o01920j53008N824M27081J76708P280k33891j93948J13749
9202d08529O07845j34474o77802K24431R85564l81327j3528P4457L25072n92806
9192H903Q4604K48350k98611j51589L53288n23046K77510m55770J03251M86074
9182A32964k72147J66032K7521N50549n80862L84256k0120o01833M30840O63382
9172H80582j00656j476271R03215o8830n91624m2946l65820M84709j33559K26976
9162b84224K9662o60143L76438M48994l15121P3727K59179n8392J64672n69245
$$ y = [-832405, 268415, 238974, 98800, 834160, 283576, -508479, 129399, 968700, 473131, 846018, 691927, 261549, 361439, 288250, -572557, -960789, 6418, 413169, -327656, -125715, 43596, -558324, -711332, -705508, -278427, -101719, -94439, -328330, -522278, -408529, 199316, 64842, -612960, -388529, 597035, 215708, 202180, 276637, 601709, 8903, 93507, 341857, 43246, -108343, 244945, -278101, -591, -456361, -353110, 132964, -139183, 26849, 54370, 604919, 24057, 408313, 388193, -213640, 217200, 880582, 779926, -696345, 206870, 138040, -453584, -496530, -862350, -377641, -511200, -284224, -254562, -914705, -538267, -89273, -404394, -330667, -71488, -129880, 34792, -534453]
9152e34453K53972l40791J17419Q87179p86688j08693L92535r1220j91138K38499
9142a63379k8332L14917j49421L5595k97578m12576P66116R2400k3135K37040
9132C71647m52848M83835l90819k40438N25465O4715m12038j687l02079k03901
9122e58148l32469M39294J99515m45341M08677J64741k65112J81170K44259L82699
9112D19285L91095m79243K45621j3335l60396J67657L28188l20676L1902M12735
9102H22833p4482l24791n7614j0245l11994k78075J71945P8675l29756R5867o03917
9091h21554N03379m10460K22028j36705o744L83932K76425N77207l27059K08849
9081D69298j28573M74811m11016j72242m1622L04311l70947m59259J59577j08549
$$ y = [-534453, -280481, -621272, -503853, 383326, -403362, -512055, -119520, -210740, -401878, -163379, -191711, 123206, -26215, 9380, -288198, -700774, 65342, 157742, 134607, 371647, -81201, 402634, 11815, -228623, 296842, 361557, -50481, -52168, -354247, -558148, -890617, -451323, -251808, -697149, -288472, -123731, -388843, -207673, 36586, 419285, 810380, 331137, 576758, 563423, 203027, 370684, 698872, 378196, 410098, 822833, 748351, 423560, 365946, 355701, 43707, -234368, -62423, 16252, -313504, -217637, -821554, -318175, -728635, -506607, -643312, -650056, -266124, 10301, 587508, 260449, 469298, 340725, 815536, 404520, 232278, 190656, 494967, 124020, -335239, -175662, -284211]
9071b84211j91890K9499J4400K63905L63349M13254k14456j59319K25805k00818
9061B59518L70855o03694J67755N14254k66599o29639J40383J32503m78605m75887
9051h69156L01009O18929K57648k25916k98399o32856O92519q2449O73996m44414
9041i089K16573N41432m15074q13927M41602K82189j62170J12930j26095N36357
9031F04728m83187K17948o80406J99231L8271j4777J09502l79492j80397R8490
9021d70089O52786l04927J54506K27721l35084J40169L19825j56551j66037O06853
9011F69172K2768Q5144p84482J57471J29295k69279P2199k61104Q84562j64547
9001E41199p12120N10271o23618M40458M60875m23767r1383j43034K59791m19899
$$ y = [-284211, -476101, -446602, -432202, -168297, 195052, 608306, 393850, 234531, 460336, 259518, 630373, 26679, 194434, 708688, 442089, -187550, -47167, 85336, -393269, -869156, -568147, 50782, 308430, 82514, -215885, -848741, -156222, -238671, 435325, -9089, 207484, 748916, 333842, -480085, -38483, 243706, 81536, 194466, 68371, 604728, 121541, 339489, -340917, -141686, -103415, -118192, -8690, -388182, -568579, -470089, 182697, -122230, 32276, 259997, -75087, 65082, 384907, 228356, 62319, 669172, 691940, 777084, -7398, 150073, 279368, 10089, 82288, -178816, 705746, 541199, -170921, 339350, -284268, 156190, 617065, 193298, 101915, -41119, 218672, -201227]
8991b01227k56179p2887M54785j61289L27252l56116n09650N56284o77927M73446
8981d23508K6505k41521P17737K70953q00875j06813k19641Q06319l71915L35771
8971f988M50796m20754N40110k80016p09404P2710K17435M02054j90033n27756
8961d51846L30042J77620n86797j8908L17314N15132k48085J40692J05640l41370
8951f0566j5112R47543l93602q20140O78432L48380m61779q39881N67136K35763
8941A86174o39884O13760m02469o76833L10443Q40042M49965j013656M21692N11097
8931F00331p77356m02901N43723O46990l64467K19572L9238p47470m16022P63613
8921A05251l96451m29768Q68652L77272j447879k57707l25525l06111N51744M28949
$$ y = [-201227, -457406, -530293, -75508, -236797, 90455, -265661, -775311, -219027, -896954, -423508, -397003, -638524, 79213, 350166, -450709, -557522, -777163, 29156, -342759, -6988, 443808, 23054, 563164, 283148, -426256, -353546, -136111, 265943, 75910, -451846, -121804, 55816, -530981, -549889, -232575, 282557, 34472, 175164, 280804, -60566, -75678, 871865, 478263, -341877, 336555, 684935, 223156, -616725, -49589, 186174, -453710, 160050, -242419, -919252, -608809, 231233, 681198, -332458, 89234, 600331, -177025, -579926, -36203, 610787, 246320, 465892, 505130, -242340, -658362, 105251, -291200, -720968, 147684, 524956, -922923, -1180630, -1506155, -1812266, -1260522, -831573]
8911h31573M37193l12515N29280l79130k5293R73806J5620J44995P48711n49150
8901G51944R0484K10691k02007p42350j43475J15770J07922l01812j15424j56420
8891c84677q2027P9393J85408k06339M51905l92153P55254j64131k00027J00971
8881A43577k37255m28854O23210k47332K78114J71355l92391k20160n08554N86221
8871b32069J8144M61616k45342k10430j45456O85754l94551n88187P28800l59729
8861b81450M67685j36492l77190k99066o1531j05730J27481l07749K71665k32690
8851i35067O1266L01591o41587M85048K44910L56426K0392K97596m14533O74421
8841D50463J08902k34393j61474L80738O95491o32294m77697J5475Q9677l79290
$$ y = [-831573, -394380, -706895, -177615, -556745, -582038, 391768, 407388, 552383, 1301094, 751944, 842428, 1053119, 851112, 108762, -34713, 81057, 188979, -112833, -228257, -384677, -466704, -387311, -201903, -408242, 43663, -348490, 406764, 242633, 42606, 143577, -93678, -522532, 100678, -146654, 131460, 302815, -89576, -309736, -818290, -232069, -213925, 247691, 2349, -208081, -353537, 332217, -62334, -650521, 78279, -281450, 186235, 49743, -327447, -626513, -688044, -793774, -666293, -974042, -702377, -935067, -873801, -572210, -1213797, -728749, -483839, -127413, -107021, 190575, -223958, 450463, 559365, 324972, 163498, 544236, 1239727, 607433, 129736, 145211, 234888, -144402]
8831a44402M72234J35906m8680m94211L68722j44235o63287K93810P55036n06490
8821B4403L88208Q07646n79767o21646J45120N25845o08075j21203P37672J54617
8811H52820r88300l49396k16962K24364O4098k15783K53808m97892L38473K26151
8801c08619l60848l87178J34571R72982l08728M5243j39147L07564n50940L62464
8791b32636J79249l81405l6220O05418J4215o83604K08644J27495q3661K26394
8781e6111j06668j78912O60513k52923J20156n06862J58078J86556k47743O14292
8771C90376n38413j51852K26564m3187l40217M022k69083O32463j73028N08672
8761B46317K9758o54318Q48373M23989Q1949l50461O64236K77079m17128j12144
$$ y = [-144402, 327832, 463738, 415058, -79153, 289569, 145334, -517953, -224143, 530893, 24403, 412611, 1220257, 640490, 18844, 163964, 689809, 81734, -39469, 698203, 852820, -135480, -484876, -701838, -477474, -413376, -629159, -375351, -873243, -534770, -308619, -669467, -1056645, -922074, 50908, -257820, -212577, -351724, -44160, -595100, -232636, -53387, -434792, -471012, 134406, 148621, -534983, -326339, -198844, -282505, -56111, -162779, -341691, 318822, 65899, 186055, -320807, -162729, 23827, -223916, 390376, -148037, -299889, -73325, -116512, -456729, -452707, -721790, -89327, -262355, 246317, 276075, -378243, 470130, 894119, 976068, 625607, 1289843, 1566922, 1149794, 1037650]
8751A037650j22284l24246l07865M99596j290657P9038J61737l19363j277384
8742a863778M31086K39992n428j08479J035583l69325M8746O50436k65530n3074
8732b59771j23436J172532o33917O12533K43682n82369l90148J3108J0548m18054
8722c55292L2129L15937j72494m73762K22840k44362j03750O65032j15746k01365
8712d30833J87311J306981l10594j94875n2136n1218J34435L99543k82995k11244
8702D94375l13672k59364n72391j38748k63450J92693Q68104q02935P9967J92313
8692e23108p4344o91647P59910J047801j06750N26241J82642n63309j328923Q44405
8682G2918K09618J38315K6679J93646j54423j128124K88283R70618j181353k3048
$$ y = [1037650, 915366, 591120, 283255, 782851, -507806, -428768, -267031, -586394, -1863778, -1432692, -1192700, -1198128, -1306607, -271024, -640349, -591603, 58833, -206697, -259771, -383207, 789325, 155408, 767941, 1011623, 429254, 39106, 52214, 62762, -355292, -323163, -7226, -179720, -653482, -430642, -675004, -778754, -113722, -229468, -430833, -243522, 1063459, 752865, 557990, 505854, 454636, 589071, 988614, 705619, 494375, 180703, -78661, -651052, -789800, -1053250, -860557, 7547, -795388, -715421, -523108, -597452, -1289099, -529189, 518612, 411862, 938103, 1120745, 557436, -771487, 72918, 282536, 420851, 447530, 641176, 486753, -641371, -353088, 617530, -563823, -586871]
8672e86871J309555n14207q74229N13078P72776p14020l97368P26562k96400l73382
8662d34506P68748q46947l03532J011647k3852r1658k55998r84m98942N91220
8652h4804K83704j33095M54236Q3841j36395j39448N03971p38120j79826M12754
8642C26818m69939l21179j31365M7696L00812o75529j83284M01290j37081J66838
8632f74923l12171Q82457J10344R7082M73973l23163k95268L88307m86695J53723
8622A3666Q76356r26563K78458J5646K00956n59407L70613L91581n69828N91717
8612F83195k17292j239802M82075P14811m39901l77932k50090L97502M9627r16024
8602a113831K22697J063353M04700p9906q01103P48734n03381j57212J055370
$$ y = [-586871, 722684, 208477, -665752, -152674, 620102, -93918, -491286, 235276, -61124, -434506, 334242, -512705, -816237, 195410, 171558, 79900, -176098, -177082, -676024, -84804, 198900, 65805, 520041, 603882, 467487, 328039, 832010, 93890, -85936, 326818, -143121, -464300, -595665, -547969, -247157, -922686, -1105970, -704680, -841761, -674923, -987094, -104637, 5707, 102789, 576762, 253599, -41669, 346638, -140057, 13666, 890022, -36541, 241917, 257563, 458519, -100888, 269725, 661306, 91478, 683195, 465903, -773899, -291824, 422987, -16914, -394846, -644936, -247434, -197807, -1113831, -891134, 172219, 576919, 497013, -304090, 444644, -58737, -215949, 839421]
8593H39421j473065N00350Q26404j27558j170446l42003P15409l15271L5812M00527
8583a10420L16645m15154J55589L78075R7032l84142R6837L02786l58731j38321
8573e9804K23663O34770r63700j45086K45918k46635P5223J71255L55968p99214
8563e07642k88446M87419p01702k23379L98756M3991R20201k49250k96567j92363
8553f08982k65271M73832P47436k00436L53738Q20532j11428l55244j267402P55079
8543C41854K08602k32545J59094r55893K47804N51926q98603o39568N20255M49322
8533b47752L10790k14655k14807N90430J67361m1535o07474n4888K20684k96405
8523c88251K5185j23470l84484M08587L89178n34378k15462O39772k35446m21534
$$ y = [839421, -633644, -133294, 693110, 565552, -604894, -946897, -231488, -546759, -510947, -110420, 206225, -208929, -53340, 324735, 421767, 37625, 134462, 437248, 78517, -59804, 163859, 798629, -165071, -310157, -64239, -310874, -235651, -64396, 291572, -507642, -796088, -308669, -1010371, -1233750, -834994, -791003, 129198, -120052, -416619, -608982, -874253, -400421, 347015, 146579, 500317, 1320849, 1209421, 854177, -413225, 341854, 550456, 317911, 477005, -478888, -231084, 320842, -577761, -1217329, -697074, -247752, 63038, -151617, -366424, 224006, 391367, 349832, -257642, -312530, -91846, -388251, -363066, -486536, -871020, -462433, -73255, -607633, -823095, -183323, -418769, -840303]
8513h40303K75565N43082k49255q0214K78501o05698k16728O32664l75025K25671
8503d11740k5043M47598k82987l14205K84265q5777J01277J83413K68326K8206
8493A93333K07447l64019p17220P3022O99088K06157m61362O07704l53992p62097
8483f71939Q09302N85647k53816p02075J210180k24855o81558J45632Q27375j350216
8473c06323N26824K10385m99085j52097l2891R49291j265779J69651J194745m5919
8463G48802r73578J25814J44444K68839n37356J34509J2453j149972K9713L76210
8453h20122j00474K25057J48775L22599j67983k13070M88058J57149n16903Q70620
8443C93706L03713k83417m1404q92j63728q49322L9924O49134m40832j32390K94016
$$ y = [-840303, -564738, -21656, -270911, -351125, -72624, -678322, -895050, -262386, -637411, -411740, -436783, 10815, -272172, -586377, -302112, -387889, -286612, -103199, 165127, 193333, 400780, 36761, -680459, -607437, 91651, 297808, -163554, 444150, 90158, -671939, 137363, 723010, 469194, -232881, 977299, 752444, 70886, 216518, 1043893, -306323, 220501, 430886, -68199, -220296, -253187, 696104, -569675, -400024, 794721, 748802, -224776, -98962, 45482, 314321, -223035, -88526, -76073, -1226045, -1196332, -820122, -920596, -695539, -546764, -224165, -392148, -605218, -117160, 39989, -476914, 393706, 697419, 414002, 372598, 371706, 207978, -641344, -601420, 47714, -393118, -525508, -231492]
8432b31492o34796K58119k33252L17210o75145P46164O67862J36450o92334M36727
8422I5513K03776j070064N32432P9851l48599O56797K39080l94849m84616J67287
8412c23392N56802o84329R1337Q24460o36683N92864l38646j02972q9603M40067
8402C29905K98383n01489n12830q0174O23615j8665k86322P8913K01145N3196
8392A85677m56184R8700m4283L56560K13518k7403o0246Q6713J30607J09959q08884
8381b15266l18828O57337N23881p21116l93352K10659l06831M72328j83033n6064
8371c30285r49267L05303L61367M5424N3176J80246m37298J45323j62178J76630
8361f11559O10389q3594j10474M16351j69805o6841J40651N10465n77640p21283
$$ y = [-231492, -866288, -608169, -841421, -524211, -1199356, -453192, 214670, 351120, -341214, 95513, 299289, -770775, -238343, -158492, -507091, 149706, 388786, -6063, -490679, -323392, 233410, -450919, -359582, 464878, -171805, 421059, 82413, -20559, -110162, 329905, 628288, 126799, -386031, -466205, 157410, 138745, -147577, -68664, 132481, 185677, -270507, -171807, -216090, 140470, 353988, 326585, 266339, 353052, 483659, 593618, -215266, -534094, 123243, 647124, -73992, -467344, -256685, -563516, -91188, -274221, -330285, -1279552, -974249, -612882, -567458, -514282, -334036, -771334, -626011, -788189, -611559, -1170, -84764, -195238, 221113, 51308, -15533, 125118, 635583, 57943, -663340]
8351f63340O50155P56330p50362l72171m95874N11526M11066O00799o80240o89125
8341g21236K85953L06916L97989n63205R91934K44062q25947o32574R1175L93026
8331c1907O8887J92487k94374q503K23088J95206p23446n04920J12541O09572
8321a61369N76010k46429j031184J18654J67285j34029P5914N10074k11201l34502
8311f70777K79834q2068k55481N47791M81906j313404N9105P93137n44827j04649
8301h09433k28982M55326K3754o71437K70024M14844m21056K57460N68287M83820
8291C42607J50619k31153K91744o36282O97349J203777r99496k01483O99706n48701
8281G68687o94141m38929N76053K8847k80832l07082m92477j99635L24014r70266
$$ y = [-663340, -13185, 743145, -7217, -379388, -875262, -363736, 47330, 648129, -32111, -721236, -435283, -128367, 269622, -293583, 698351, 942413, 116466, -516108, -424933, -31907, 36980, 229467, -64907, -73410, 149678, 344884, -378562, -883482, -770941, -161369, 414641, 168212, -862972, -744318, -577033, -711062, -635148, -125074, -336275, -670777, -390943, -473011, -728492, -180701, 301205, -1012199, -953094, -159957, -704784, -809433, -1038415, -583089, -559335, -1230772, -960748, -545904, -966960, -709500, -141213, 342607, 493226, 262073, 553817, -82465, 614884, 1818661, 819165, 617682, 1317388, 768687, 74546, -364383, 211670, 240517, -40315, -347397, -839874, -1039509, -715495, -1685761]
8271a685761M22900J91313k07410P98102l7798j02321j31536N39736N74010m35722
8261g4487O6293n3949m89094M55442l96584l47542N09690l7051M38425n28062
8251d56919j48116o88919J138289N63102j12207L81598N93986o60182n4285J48622
8241G04969p58754j54587O40241N81507o59791n45269l36633K38493p2934q69867
8231a232625N23159Q61614N69647l13282J41074k19010m49964P67247n00276j268899
8221a121315q4584J044009p32448m994m78233J22266m8422M67375M00557K81030
8211a54759l03679J618650q0345L87319r04544N53686N51139j282615j176131
8202g91279p35999J34584L04271o70551k253556K09276r8147q2029j126028m303506
$$ y = [-1685761, -1262861, -1071548, -1278958, -480856, -518654, -620975, -752511, -212775, 361235, -74487, -8194, -62143, -551237, -95795, -492379, -839921, -330231, -367282, 71143, -456919, -605035, -1293954, -155665, 407437, 295230, 676828, 1270814, 610632, 556347, 704969, -53785, -208372, 431869, 1013376, 353585, -191684, -528317, -289824, -362758, -1232625, -709466, 152148, 721795, 408513, 549587, 330577, -119387, 647860, 147584, -1121315, -1205899, -161890, -894338, -899332, -1377565, -1255299, -1303721, -836346, -435789, -154759, -458438, 1160212, 1079867, 1467186, 562642, 1116328, 1667467, 384852, -791279, -1527278, -1392694, -1088423, -1758974, -4012530, -3803254, -3901401, -3983430, -5109458, -9412964]
8192i412964O01800R024469J580304q10000j26008J121677N30307o61658n0155
8183A797772P82706m37785j427469p55170R14315k57935j58824L81448m61078
8174C77980o67496j86463j74865L21360l1048N32144J13791p38555R2589j67860
8164e28423Q62098r09731M10310M58940N42768r00485M92141Q61226q92830M19265
8154H15279J12839L13511j414167L51578O32322n92030p41040Q71069p6594j311211
8144a038444N74353R4036L35844j19252Q60869j60682n44762J39191O00710o16882
8134A24981M09036N5050k66280R331k23402M27958l70271l2087k55674j81576
8124c02934N35452k82208k81831j07932J041300j003980j71373p6118K20808m3256
$$ y = [-9412964, -8811164, 213305, 1793609, 983609, 857601, 1979278, 2509585, 1847927, 1797772, 2580478, 2142693, 715224, -39946, 874369, 616434, 457610, 839058, 377980, -289516, -475979, -650844, -329484, -360532, 171612, 285403, -453152, -360563, -528423, 333675, -576056, -165746, 293194, 835962, -64523, 427618, 1288844, 396014, 815279, 928118, 1241629, -172538, 179040, 811362, 219332, -521708, 349361, 272767, -1038444, -464091, -370055, -34211, -153463, 707406, 546724, 1962, 141153, 741863, 124981, 534017, 589067, 322787, 332118, 108716, 536674, 166403, 134316, -121358, -302934, 232518, -49690, -331521, -439453, 601847, -402133, -573506, -649624, -428816, -472072]
8114d72072K11586L88731n85145L96973P49344p25616m37891N44374N04017l761
8104E70540l85011l44560k53349J46005k9906N6377m12321L00683P7051l98908
8094f73399K38119j47728K9934L12484p65987M22280J15731O94290k5503m83783
8084b83562J5224k11178L69316N07369l03448K97734l34880o8048J64515k89445
8074a36403K87765p16590Q30502J49530j53029k86944J81105o31411k34561P22080
8064A2044O6382k73814K49160K17002q22220P6994R50546l45132j99254M215N97510
8053E33433o78155k7997N17989L1684l40803j10557M14556J3426K53618o51076
8043d3882Q3109o59252R97135M20144k57389m55059N61812o1781p88379L79837
$$ y = [-472072, -260486, 128245, -456900, -59927, 689417, -36199, -474090, 70284, 574301, 570540, 185529, -159031, -412380, -266375, -296281, -239904, -652225, -351542, -274491, -673399, -435280, -583008, -553074, -240590, -1006577, -584297, -468566, 225724, 200221, -283562, -268338, -479516, -110200, 397169, 93721, 391455, 56575, -11473, 153042, -136403, 151362, -565228, 265274, 414804, 261775, -25169, 155936, -475475, -710036, 12044, 78426, -195388, 53772, 270774, -551446, -474452, 476094, 130962, -68292, -64077, 533433, -144722, -172719, 345270, 376954, 36151, -74406, 340150, 353576, 607194, -43882, 39227, -620025, 377110, 797254, 539865, 84806, 646618, 584837, -203542, 176295]
8033A76295L85460P7565j07718j62500k94959q2106m84420j27285J25867p7558
8023e71359M44677l92621O23979m20512p1856L06242j84291L97974L29969r36155
8013d73953l62590M84158L60751p31496k64760Q76093o26899r8935J84529j28944
8003g82046K00477M06838K9640m21585L39306j88765M50242o02858J43078m49117
7993h74790M03372L50829k1474J19290P2258K91673K30844L85647p89247P86470
7983I54872L36952j15812r40254l46634M98788l70238p52472j33410O51692J35738
7973h0778p00589o16401O45173K19972J8724J51513K30306K83901L70215j070467
7963e48431o78402Q67672R7779K91218j231688K41389O05431o0967j22522k8779
$$ y = [176295, 561755, 639320, 531602, 369102, 74143, -7963, -492383, -619668, -493801, -571359, -126682, -519303, 104676, -315836, -387692, -81450, -265741, 132233, 462202, -473953, -836543, -352385, 8366, -723130, -987890, -111797, -738696, -837631, -653102, -782046, -581569, -174731, -145091, -566676, -227370, -416135, 34107, -568751, -425673, -874790, -471418, -120589, -142063, -22773, 49485, 341158, 572002, 957649, 168402, 954872, 1291824, 1176012, 235758, -110876, 387912, 17674, -734798, -868208, -216516, -80778, -781367, -1397768, -752595, -532623, -513899, -362386, -132080, 151821, 522036, -548431, -1226833, -359161, -261382, 29836, -1201852, -960463, -355032, -415999, -538521, -567300]
7953e67300Q97715j0298l60879L45218L37418o52213j58541N63105k7230m61603
7943i4608j55309N11653n15570m40903K34901K96088N18860k91085n21203j68701
7933f25877K90800O95677M9575o46301m86571J239172n46988m63117l23782Q02850
7923a4562j82832r54850N27279Q65546m01189R8526m51824L52052l05018O62380
7913A95508N64680r50637J25027K55100n7852j35121q6249r5374o44791Q8235
7903g41474N61327l88369k1718M10716j34521j51837R7594J45025O41084m87166
7893f9339J69087M60075m3306J98776N4649j428713M00459K46408M13577o00121
7883a98448l89327Q13301j079621K15443L43718j53322L05411k83756o7187K52745
$$ y = [-567300, 330415, 320117, -40762, 304456, 641874, -10339, -168880, 394225, 366995, -94608, -249917, 261736, -253834, -694737, -459836, -163748, 355112, 64027, -457176, -625877, -335077, 360600, 410175, -236126, -722697, 516475, -30513, -493630, -817412, -14562, -197394, -1152244, -624965, 240581, -160608, -62082, -513906, -161854, -466872, 195508, 760188, -190449, -65422, 189678, 131826, -3295, -89544, -184918, -829709, -741474, -180147, -568516, -590234, -179518, -314039, -465876, -368282, -223257, 417827, -69339, 99748, 559823, 516517, 715293, 769942, -658771, -258312, -11904, 401673, -198448, -587775, 225526, -854095, -638652, -294934, -448256, -142845, -426601, -493788, -241043]
7873b41043n23891O60333N66729j049641r3454K49402M44998p67380J21477L67206
7863b65264k71875K85523J034817n46754j234333P73524N77376l77308j91761
7854b16055K76546Q08476j214595p65666L00948k03473L22025j26840L48846m7472
7844e17260j08076N35720l64985q46475Q03052P34126L03852l30752K5672j16738
7834A18136p41671l36917O22367L45550o49977R16407m75228k00725m16063n923
7824h24044O87018R127M23944O1810o06379K41033L48146k26387N02045k55877
7814C60436M34117M51040j072557q6133K70713J99598j6447j56269M33103l63850
7804D53751p07123n68930o59748K61700J198989l60924j52978K46533l32997K9177
$$ y = [-241043, -764934, -104601, 462128, -587513, -680967, -431565, 13433, -753947, -632470, -265264, -537139, -251616, 783201, 236447, -997886, -224362, 353014, -24294, -216055, 60491, 868967, -345628, -1111294, -810346, -1013819, -691794, -818634, -469788, -517260, -625336, -89616, -454601, -1301076, -498024, 236102, 539954, 209202, 234874, 118136, -623535, -960452, -338085, 7465, -642512, 273895, -201333, -402058, -818121, -824044, -137026, -127899, 296045, 357855, -248524, -7491, 340655, 114268, 616313, 360436, 794553, 1245593, 173036, 86903, 357616, 557214, 540767, 384498, 817601, 453751, -253372, -822302, -1482050, -1220350, -21361, -382285, -535263, -288730, -621727, -592550]
7794e92550N34262M0180j92210Q5053K88429j08512m28090M78035m60785J37776
7784b18412j47899j3045N4387K29515J91916o7373l90786O3638J419365n95182
7774E26124q68141M68187L15881l08603l88627J64363j60144n03549P55272m66341
7764d65578n21291N77225L36312n12442K78498R24081L92484j225201j47188P91743
7754D28643p52059J61929M27105k70083n28743r0015j42680l08126L01606Q54818
7744H2395r94524p34924J158299P70812m73054k89668N57354M73659o57973J91980
7734H4356j99490q35310P10726N33959m70465r30115N94303N70907j135025J9902
7724a056252Q46207N31423O26055q0859r63481l17188P00079P28411o28157k47484
$$ y = [-592550, -58288, -18108, -210318, -125265, 163164, 54652, -373438, 104597, -356188, -218412, -366311, -379356, -324969, -95454, 96462, 29089, -361697, -298059, 1121306, 526124, -342017, 126170, 442051, 133448, -255179, -90816, -250960, -754509, 763, -465578, -986869, -409644, -73332, -585774, -307276, 616805, 1009289, -215912, -363100, 428643, -323416, -161487, 265618, -4465, -533208, -623223, -765903, -1074029, -772423, 82395, -912129, -1647053, -488754, 282058, -190996, -480664, 76690, 550349, -107624, 84356, -115134, -950444, -239718, 294241, -176224, -1106339, -512036, 58871, -1076154, -1056252, -210045, 321378, 947433, 866574, -96907, -414095, 285984, 1014395, 386238, 138754]
7714A38754N09665J48176J64968q61980o30962N79158J93435l13433p8387N93998
7704D43392k85150m61874k27852j90275j17003K15244N22590o36877J20951m71548
7694a088402P64141Q1509p5855Q89043P9687M2107L2605K45885n18083o8220R48006
7683A332423r2411n48178m2022k89295p12785j26783Q8893J24819o3584K17751
7673a11172m17485J30131o1745l57351L64661O16214P641k19923o1384N8193j44048
7662a96268Q7071P9019J23715o1680j91875K02190j40479K5698R0525j00905M18204
7651C35215L08837O32261p17433K14610L58560j15302o98411J95526Q74608j26082
7641A262389n17994p66779M46842J51003q270q42315K03750M89358P66555o17214
$$ y = [138754, 648419, 796595, 961563, 99583, -531379, 47779, 241214, -72219, -150606, 443392, 158242, -303632, -531484, -721759, -838762, -623518, -100928, -737805, -616854, -1088402, -324261, -242752, -318607, 570436, 650123, 692230, 724835, 970720, 452637, 384417, 1332423, 1240012, 691834, 649812, 360517, -352268, -479051, -390158, -265339, -328923, -111172, -528657, -398526, -460271, -817622, -452961, 163253, 170894, -49029, -110413, -52220, -196268, -109197, -30178, 93537, 31857, -160018, 42172, -98307, -72609, 17916, -82989, 335215, 644052, 1276313, 558880, 773490, 1132050, 1016748, 318337, 513863, 1388471, 1262389, 744395, -22384, 424458, 575461, 567191, -275124, -71374, 417984, 1184539, 567325]
7631E67325N1136K48091K68199L87472m59903N25716L75042L2198j41490l28308
7621A525478R1260P22022r67456m95283M64533K53100j72775l33218M50621J11818
7611A650100k97975M41143L9194j94113L04157n63220l87003j08596K9680M06115
7601A319482j56579j193953P96583o13811k48129n54811Q91472O22516l7710O70157
7591A495217k61724p83129L69621q0713J43895M18280J77863m20161m53586l84422
7581B21141m06175J79920O2715K46020L09684K84416n71024k03533P85012r9916
7571H08260J25004N49300n07223k42881n81579K56128j74708L04604j44998J90731
7561E82638l46308k57375K34965L90094J54901k65287L62239m6835J93292j98300
$$ y = [567325, 618461, 866552, 1134751, 1522223, 1062320, 1588036, 1963078, 1995276, 1853786, 1525478, 1616738, 2338760, 1371304, 876021, 1340554, 1593654, 1420879, 1087661, 1538282, 1650100, 1352125, 1793268, 1832462, 1638349, 1942506, 1379286, 992283, 883687, 913367, 1319482, 1162903, -31050, 765533, 151722, -96407, -651218, 240254, 862770, 825060, 1495217, 1233493, 450364, 819985, 739272, 883167, 1301447, 1479310, 1059149, 605563, 221141, -185034, -5114, 57601, 303621, 613305, 897721, 326697, 123164, 908176, 808260, 933264, 1482564, 975341, 732460, 150881, 407009, 232301, 536905, 391907, 582638, 236330, -21045, 213920, 604014, 758915, 493628, 855867, 809032, 1002324, 804024]
7551H04024K76776r01730J2247P00678o41340M2983p3129Q81083k05774k05763
7541F90055K05312k43429O0693J85322L58419L08795J67202l07325l14234l74952
7531G35858N0117P25317O15542o24926N317k77982j19823R1402N64075M96173
7521B261070p62483J113418n72654K6679k84110J45184J21051j21103J10804K10425
7511B248281o0039p55790N19615n01038M74561J05447M82044k56834k4810P22054
7501B953491J07120J85238M54960n21197k45946J06903K49182k50861l3826r0569
7491B914495l99993k4236k75909J08037L65504O52511k6945J89635J015594P71519
7481E290212l49761n8239P56829R78294m86130N01170J51066N16815l49526K4763
$$ y = [804024, 1080800, 179070, 191317, 891995, 250655, 293638, 220509, 1101592, 895818, 690055, 895367, 651938, 712631, 897953, 1256372, 1565167, 1732369, 1425044, 1110810, 735858, 785975, 1511292, 2126834, 1501908, 1507225, 1229243, 1109420, 1200822, 1764897, 2261070, 1498587, 2612005, 2039351, 2066030, 1781920, 1927104, 2048155, 1927052, 2037856, 2248281, 2188242, 1432452, 1952067, 1451029, 1925590, 2031037, 2513081, 2256247, 2231437, 2953491, 3060611, 3245849, 3700809, 3179612, 2933666, 3040569, 3289751, 3038890, 3005064, 2914495, 2514502, 2490266, 2214357, 2322394, 2687898, 3340409, 3313464, 3503099, 4518693, 5290212, 4940451, 4882212, 5639041, 6617335, 6131205, 6632375, 6783441, 7300256, 6950730, 6975493]
7471F975493r2457L19317N90559q9500l63114J272644J143894J014396k34366
7462A0536866M72287J320722Q59124M86651O42314J368075O21202M51659M63988
7453A7222888J492738J042973J235080R96977J106871J401921J128372J869550
7445B7497370J381671J298459J990618J874553J149945L16114O28696Q54464l58618
7436C6633272J057842L31869m82281m21564j016560q56697j802686q6529o5590
7427C3291076j131491j774238n10319m04823j694970k159139j041619p22716j137680
7418B2714081q93772r39259j471605l30968j210330j119028m97191j74812m38052
7409A5639064j153561o5957J59804j03449j31153j428459j44826N8211m66659
$$ y = [6975493, 6883036, 7202353, 7792912, 7703412, 7340298, 8612942, 9756836, 10771232, 10536866, 11009153, 12329875, 13188999, 13675650, 14317964, 15686039, 16307241, 16758900, 17222888, 18715626, 19758599, 20993679, 21990656, 23097527, 24499448, 25627820, 27497370, 28879041, 30177500, 32168118, 34042671, 35192616, 35508730, 36137426, 36991890, 36633272, 37691114, 38022983, 37540702, 37119138, 36102578, 35245881, 33443195, 33356666, 33291076, 32159585, 30385347, 29875028, 29470205, 27775235, 25616096, 24574477, 23851761, 22714081, 21820309, 20881050, 19409445, 19078477, 17868147, 16749119, 16251928, 16077116, 15639064, 14485503, 14419546, 14579350, 14475901, 14344748, 12916289, 12771463, 12829674, 12363015]
7400A2363015p57873P42106l65393r94259m73659l64348M26953r40553O9621l39731
7390I365879K15500O1798k71073j06641q77279M83994p73704l87919N4446K29990
7380G994991k59578p22598k4821r8530n29514m86497m72610Q19562J057311o24571
7370F653145M0356q6136n59931n66821O44005O73545K71166L67754k65790j206858
7360E964435r42997Q77570k57211M65439L99270Q67733K48800j87733R7791P43069
7350H276166Q25099P26050J536398L69849n24040M43209k52219m14631l25160
7341A0660721J004518k08859j70918n04398q73904R0375j118958o88804k45677
7332G944096n23058o63062n3799K45785k40080o67984L88887j386169k9503N96587
$$ y = [12363015, 11605142, 12347248, 11981855, 10987596, 10513937, 10149589, 10576542, 9635989, 9705610, 9365879, 9581379, 9643177, 9372104, 9265463, 8388184, 8872178, 8098474, 7710555, 7765001, 7994991, 7735413, 7012815, 6987994, 6889464, 6359950, 5873453, 5400843, 6220405, 7277716, 6653145, 6693501, 6607365, 6047434, 5480613, 6124618, 6798163, 7069329, 7437083, 7171293, 5964435, 5021438, 5899008, 5641797, 6107236, 6506506, 7374239, 7623039, 7435306, 7533097, 8276166, 9101265, 9827315, 11363713, 11733562, 11209522, 11652731, 11400512, 10985881, 10660721, 11665239, 11456380, 11285462, 10781064, 9907160, 9997535, 8878577, 8189773, 7944096, 7421038, 6757976, 6704177, 6949962, 6709882, 6041898, 6430785, 5044616, 5015113, 5611700]
7322E611700o6749p74247K78094O73527q98932l71943M01463L14612O06448K3853
7312E797826M87372N53157Q88113m25498N60659K59199m7640R6304L85219m64694
7302H090017k75642L21883m23234n27114L08063M28805q56998l56107J641090
7293H350763K73832l17575K11762R11889Q09964K68399O81824P77278L27342R75336
7283A3270814P57854O50183N52918K212316P59635K59017J262340J853754K064516
7274B3643347O66739K910637J873420K179623L208129K412724L349031M217733
7266D4461383N668312O792769P999693J0350886J2987733J6389433J9734142K2868063
7258A47252414K3743660K1924171J9714539J8263052K0186423K2660168K4038355
$$ y = [5611700, 5544951, 4770704, 5048798, 5722325, 4823393, 4451450, 4852913, 5167525, 5773973, 5797826, 6285198, 6838355, 7726468, 7300970, 7861629, 8120828, 8073188, 8169492, 8554711, 8090017, 7814375, 8136258, 7713024, 7185910, 7493973, 7922778, 7065780, 6709673, 8350763, 8624595, 8307020, 8518782, 9430671, 10240635, 10509034, 11190858, 11968136, 12295478, 13270814, 14028668, 14678851, 15231769, 17444085, 18203720, 18462737, 19725077, 21578831, 23643347, 24310086, 27220723, 29094143, 31273766, 34481895, 36894619, 40243650, 44461383, 50129695, 56922464, 64922157, 75273043, 88260776, 104650209, 124384351, 147252414, 170996074, 192920245, 212634784, 230897836, 251084259, 273744427, 297782782]
7251B97782782K3338828K1188392J6163956R093985K568246m115697p298941j0239173
7243C48482378j3763909j5233108j5759511j8414882j9582860k0139577k4052942
7236B21535589k6177305k5931805k4606445k2318289j8588713j3729791j2051154
7229G8132087j0142190p848980n962505n828349l884473k462976m392091l142231
7221C4468292j832969k132893k927316k437373k42327j684651j687285j048174
7213B0475304j527945j621702r34083p70411l82509r42399O1913J26435j420338
7204A3064265n46841N99566r41892K97380M99896K72697j243425l55140L95382
7195A2041888p60112n03892J08337N88888N74794M14662j019806k58669P62729
$$ y = [297782782, 321121610, 342310002, 358473958, 367567943, 370136189, 366020492, 358721551, 348482378, 334718469, 319485361, 303725850, 285310968, 265728108, 245588531, 221535589, 195358284, 169426479, 144820034, 122501745, 103913032, 90183241, 78132087, 67989897, 60140917, 54178412, 48350063, 44465590, 42002614, 37610523, 34468292, 32635323, 30502430, 27575114, 25137741, 24895414, 23210763, 21523478, 20475304, 18947359, 17325657, 16391574, 15621163, 15238654, 14296255, 14358168, 14484603, 13064265, 12517424, 13116990, 12175098, 12472478, 12972374, 13245071, 12001646, 11646506, 12041888, 11281776, 10777884, 10886221, 11475109, 12049903, 12464565, 11444759, 11186090, 11948819]
7186A1948819J95423M17502m18511k03850n47215k85793j010391p79422n0744
7177I265818l59308o17469q51346m17557q35492P5600o01922k3305m66199R8588
7167E267408M36877o50279m10058r64851J222749j04909Q6436p04770p20705K01233
7157C659131K67468K91829l80927K52942J71021k91725j85811O66750j32235j48170
7147D170273J21517M1907n30296J93334m2651L24121L7339k31700P58050n0019
7137D791875k08113K12727j085522P19396K96138P43053r81125m5453P09741m8531
7127E104186r80358Q08266M45994p26588M43883j80667K30096j26603N4103p64589
7117D307723m05330P14407j10241j056871M81845L89783o03298j82915K3133M37549
$$ y = [11948819, 12144242, 12561744, 12143233, 11939383, 11392168, 11106375, 10095984, 9316562, 9265818, 8906510, 8289041, 7437695, 7020138, 6184646, 6260246, 5658324, 5635019, 5168820, 5267408, 5704285, 5054006, 4643948, 3679097, 4901846, 4796937, 4883373, 4178603, 3457898, 3659131, 3926599, 4218428, 3837501, 4090443, 4261464, 3969739, 3783928, 4450678, 4318443, 4170273, 4291790, 4333697, 3803401, 3996735, 3954084, 4278205, 4315544, 4083844, 4841894, 4791875, 4583762, 4796489, 3710967, 4430363, 4726501, 5469554, 4488429, 4442976, 5152717, 5104186, 4123828, 4932094, 5378088, 4651500, 5095383, 4914716, 5144812, 5018209, 5072312, 4307723, 3902393, 4616800, 4506559, 3449688, 3931533, 4321316, 3718018, 3535103, 3558236, 3995785]
7107C995785L55343J06649Q9703k81496Q2518O73850q78574M50390M39155P5023
7097E108346p55438p90076J72892o95525N9958M08639M22988l05589M94742j22224
7087C998713n04620j25557M71847L44383l66322P22505m9009J24387J35120q9525
7077D661922l88747k34512L85776K68910J37429L05388j20143m73552o53687l62085
7067C526699Q30762K74388p08362J82799N0496p68865l65004o66836n15846j93401
7057A646830M70530l47379m38426L34533K44550k79418k29022O29680K01820L50538
7047B584236k42418K90008O4188M89285J589171O30738m62970J42079p4218p15842
7037D294257J5355Q92704Q64172k02131O04771n18127r99437J41198q68281o97112
$$ y = [3995785, 4351128, 4457777, 4547480, 4265984, 4348502, 5022352, 4143778, 4594168, 5033323, 5108346, 4352908, 3562832, 3735724, 3040199, 3100157, 3508796, 3931784, 3626195, 4120937, 3998713, 3494093, 3368536, 3840383, 4184766, 3818444, 4540949, 4491940, 4616327, 4751447, 4661922, 4273175, 4038663, 4424439, 4693349, 4830778, 5136166, 5016023, 4542471, 3888784, 3526699, 4357461, 4631849, 3923487, 4106286, 4156782, 3387917, 3022913, 2356077, 1840231, 1646830, 2117360, 1769981, 1331555, 1666088, 1910638, 1631220, 1402198, 2031878, 2233698, 2584236, 2341818, 2631826, 2696014, 3185299, 4774470, 5405208, 4942238, 5084317, 5010099, 4294257, 4309612, 5202316, 6066488, 5864357, 6469128, 5951001, 4951564, 5092762, 4224481, 3527369]
7027C527369m53723L54540l76960j20141l54446l87439l47326m72909M42756k89405
7017A522316Q21932r4531O8765k47084J42577R5333k78018j28458J342077j43515
7007C101394o50851m60142L42796q68557k47077P79591p8238R2594K49459n17651
6997A743318j027514R09415R9660l89284m48854J035867j2803p42632J65932j924
6987A331181M26562m20449j74643k25619M55157j4582j11239q2825N2668L9561
6977A275772j09596Q4248o25664J62725J375470j90938l37432J80753j64288l94338
6967A256712J63021L00161m02291k83270Q19034k17922j096236L6125J031972
6958A607306K40275p07802j20971Q36655K85705Q7337J57253l91934M51083P92997
$$ y = [3527369, 3073646, 3428186, 3051226, 2931085, 2576639, 2189200, 1841874, 1368965, 1811721, 1522316, 2344248, 2249717, 2318482, 2071398, 2213975, 2309308, 2031290, 1902832, 3244909, 3101394, 2450543, 1990401, 2333197, 1464640, 1217563, 1997154, 1918916, 2011510, 2260969, 1743318, 715804, 1625219, 1724879, 1335595, 886741, 1922608, 1909805, 1167173, 1333105, 1331181, 1757743, 1337294, 1162651, 937032, 1392189, 1377607, 1266368, 1183543, 1236211, 1275772, 1166176, 1250424, 624760, 787485, 2162955, 1972017, 1634585, 1815338, 1651050, 1256712, 1419733, 1719894, 1317603, 1034333, 1853367, 1635445, 539209, 575334, 1607306, 1847581, 1139779, 1018808, 1855463, 2141168, 2228505, 2385758, 1993824, 2444907, 3237904]
6948C237904l90783j448157M91263L09531N49846o39995O27453k20461l3176J28665
6938B612090l48303R87168O49496O25626M22909M77757k57259L82866K86389K31607
6928F070346Q3588K40993K52475j97078Q04238j076043r11542k72892J036514
6919F030599m84245r89775j52929M79075M36832p53042l35208m18445N33594L32394
6909D678850k39563r79812P43348J211484m42739j308598Q57142O58177p35112
6900D443177j94875j98275O6880R0849N43911k14428j155150P6946L93033l12326
6890C539742k14337l37517Q80386J76441j72739L17562k48609L23136J74113N03250
6880D941428n75076j42017J406531O40931q8727k58701R50501r8092j0209m85209
$$ y = [3237904, 2847121, 1398964, 1890227, 2199758, 2749604, 2109609, 2737062, 2516601, 2483425, 2612090, 2263787, 3250955, 3900451, 4526077, 4948986, 5426743, 5169484, 5552350, 5838739, 6070346, 6153934, 6394927, 6647402, 6450324, 7254562, 6178519, 5266977, 4994085, 6030599, 5546354, 4556579, 4403650, 4882725, 5319557, 4566515, 4231307, 3812862, 4346456, 4678850, 4439287, 3459475, 4202823, 5414307, 4971568, 3662970, 4520112, 5178289, 4443177, 4248302, 4050027, 4116907, 4207756, 4751667, 4537239, 3382089, 3459035, 3852068, 3539742, 3325405, 2987888, 3868274, 4044715, 3871976, 4189538, 3940929, 4264065, 4438178, 4941428, 4366352, 4224335, 5630866, 6271797, 6183070, 5924369, 6874870, 6776778, 6766569, 6281360]
6870F281360q87194N94004Q02348n22877j101438l384N33871p30020N592K53646
6860E225908r68303O47377j959j001988n81068O36105R14008o97063n734P20611
6850D887894n2138M82135L06615j04219k34933J51607J249351l56964m23884L60469
6840F265933J013246o66659m86521Q87647o6267P93662j14304p9573o03241J051132
6830G995055P06005l39086n3199M70200N41748M06490l42212J31998J183657L71862
6820A1072518O20213L51296J524377N72377R43509J923445Q95437J559289K399482
6811B1861943L384738L476788M971749P609209R211346Q887927R277561R862045
6803G8543306O174290M686372M593299K749120J243273L005310K705891R65738
$$ y = [6281360, 5394166, 5988170, 6790518, 6267641, 5166203, 5162819, 5696690, 4966670, 4972262, 5225908, 4257605, 4904982, 4903023, 3901035, 3319967, 3956072, 4870080, 4173017, 4167283, 4887894, 4835756, 5317891, 5624506, 5520287, 5285354, 5436961, 6686312, 6329348, 5905464, 6265933, 7279179, 6612520, 6125999, 7013646, 6947379, 7741041, 7626737, 7547164, 6943923, 7995055, 8701060, 8361974, 8308775, 8778975, 9320723, 9727213, 9385001, 9516999, 10700656, 11072518, 11692731, 12044027, 13568404, 14140781, 15084290, 17007735, 17903172, 19462461, 21861943, 25246681, 28723469, 33695218, 41304427, 50515773, 59403700, 68681261, 78543306, 84717596, 89403968, 93997267, 96746387, 97989660, 100994970, 103700861, 104666599]
6795A04666599K19251j910277l482386m626715n949262p604667p195770p621452
6787F6495321p391873o981186n261274m134001l037861k216388j901414j857109
6779C3714215m30868Q8854m51598J418212J685392K292229K223759M245381M414882
6770D9200458O743013R849026J2193703J3351584J3649760J5341696J2260037
6763A32589277Q199205O626390O597894M742605O596258P213337P797324R119122
6755A89481412M969906K302776P09781m771973r712136j0005867j1120324j0254101
6747A51599474r432985j0586470p143893n618891q701037r830921p419841q637217
6739H4228219r506048p920875p556371o073210n980626m739004l391555k750665
$$ y = [104666599, 104885850, 102975573, 99493187, 94866472, 88917210, 81312543, 74116773, 66495321, 59103448, 52122262, 46860988, 42726987, 39689126, 37472738, 35571324, 33714215, 33283347, 33372201, 32920603, 34338815, 36024207, 38316436, 40540195, 44785576, 49200458, 55943471, 65792497, 77986200, 91337784, 104987544, 120329240, 132589277, 140788482, 147414872, 154012766, 158755371, 165351629, 172564966, 180362290, 189481412, 194451318, 196754094, 197463875, 192691902, 182979766, 172973899, 161853575, 151599474, 142166489, 131580019, 124436126, 118817235, 110116198, 100285277, 92865436, 84228219, 74722171, 66801296, 59244925, 53171715, 47191089, 42452085, 39060530, 36309865]
6731C6309865j658029j053788j006082j055512l65863L60213L60558L02087J208760
6722C3402209K418306K145227M655972O774529R084233J0625767P554917Q461956
6714H5123116R069449M792926J457435K085098J552956K070289J814471j296404
6706A06669336K15643J351404m435307p470417n667072q497770r720203q448383
6698F3997231q020440p871454o878605n564865m426032l560958k389377j849438
6690B3436062k235819j012800p53178k032783j208040n44207j51905r50407j9465
6681A4527458Q96817q1175L51043J148092j35152o86429R87178N28324n04210
6672A7031946j123988l5981j287140j286357l89439l17923j012469k16962K98949
$$ y = [36309865, 34651836, 33598048, 32591966, 31536454, 31170591, 31530804, 31891362, 32193449, 33402209, 35820515, 37965742, 42621714, 49396243, 58480476, 69106243, 76661160, 85123116, 94192565, 98985491, 100442926, 102528024, 104080980, 106151269, 107965740, 106669336, 106884979, 108236383, 103801076, 96330659, 90663587, 82165817, 72445614, 63997231, 55976791, 48105337, 41226732, 35661867, 31235835, 27674877, 25285500, 23436062, 21200243, 20187443, 19434265, 17401482, 16193442, 15649235, 15497330, 14546923, 14527458, 15424275, 15343100, 15694143, 16842235, 16707083, 16020654, 17007832, 17536156, 17031946, 15907958, 15871977, 14584837, 13298480, 12909041, 12591118, 11578649, 11361687, 11660636]
6663A1660636n75380m32178O32849J119778j68579m75030P88191L34553m0441
6654A2844399J33282n129K04323O76176n86452m61674o43880J74691k0510r32091
6644A1383135o42460K77392L06760n73608j060035R2694P41863r55584N2552K06540
6634I829249l79202N13988Q6436p27593k63610J063479R13886r2281O25163R79771
6624A2549286j04210N42295J300987o8899J487918R06129J142617k33950J305355
6615A8827528K027259Q06435J431572J844386L023871L377689M119240M677028
6607D0135008O055286Q697502J0524032J0667465J1797646J4216721J4209440
6600A16303100J1562861R514470R530089N326132J380777p00320l366703o532191
$$ y = [11660636, 11085256, 10653078, 11285927, 12405705, 12237126, 11762096, 12550287, 12884840, 12844399, 12977681, 12972552, 13176875, 13853051, 13266599, 12804925, 12161045, 12335736, 12315226, 11383135, 10740675, 11018067, 11324827, 10751219, 9691184, 9783878, 10525741, 9570157, 9622709, 9829249, 9450047, 9964035, 10050471, 9322878, 9059268, 10122747, 11036633, 10944352, 11569515, 12549286, 12445076, 12987371, 14288358, 14219459, 15707377, 16613506, 17756123, 17522173, 18827528, 20854787, 21661222, 23092794, 24937180, 27961051, 31338740, 35457980, 40135008, 46190294, 54887796, 65411828, 76079293, 87876939, 102093660, 116303100, 127865961, 137380431, 146910520, 152236652, 153617429, 152917109, 149550406, 143018215]
6592A43018215q606314j0461205j2108276j2406256j1758046j2128570j0679332
6585F4870216p370924n918033n856459m231399k977614k735982j345281j061351
6577C3373173j72885M6843O1099R60278O29473J518854K531613L777396M740179
6568D7466023N193687Q355843J2620915J9442591L6201813M8383873K5500706
6561B03165451l865001j0175801p774295q970725p912342p133577p058161q713140
6553A41562409j0558693j0170785j1433825j0286247j1054846r966399r082412
6546F9009202q021904o934581p178257o341044l651277l257138k982238q22888
6538B9819875j632846j387458j022008p65384j068080q23619K25359k83127n89472
$$ y = [143018215, 134411901, 123950696, 111842420, 99436164, 87678118, 75549548, 64870216, 57499292, 51581259, 45724800, 41493401, 38515787, 35779805, 34434524, 33373173, 33200288, 33247131, 33308230, 34268508, 34897981, 36416835, 38948448, 42725844, 47466023, 52659710, 61015553, 73636468, 93079059, 129280872, 177664745, 203165451, 199300450, 189124649, 181350354, 172379629, 164467287, 157333710, 150275549, 141562409, 131003716, 120832931, 109399106, 99112859, 88058013, 78091614, 69009202, 60987298, 54052717, 46874460, 40533416, 36882139, 33625001, 30642763, 29819875, 28187029, 26799571, 25777563, 25012179, 23944099, 23120480, 23345839, 23062712, 22473240]
6529B2473240j097789l66529k91478J013673r24923r66792P90669l50335P77660
6520B1057396N51647Q97177O57866O33390m7227M31385j60792N45695K97211j53073
6510B4710675l36481r31665q40841j899540p32663p2293j123224m08390L30284
6501A8695862k33388o01071M63876O46480O53342Q26980L12341N82736J450089
6492B2797247J366702K141425K798326L257746L190043M852577N286733P354689
6484E3045488Q689295N936027L911236K944599o72736j389932K244185O201882
6476H0910044M703300L712514K990156j166267j593560j607125j176610j922669
6468H4849783l488668n172606p648762q798395p980084n991251m851878m665709
$$ y = [22473240, 21375451, 21008922, 20717444, 21731117, 20806194, 19839402, 20630071, 20279736, 21057396, 21609043, 22506220, 23164086, 23797476, 23750249, 24181634, 24020842, 24566537, 24863748, 24710675, 24374194, 23442529, 22601688, 20702148, 19969485, 19897192, 18773968, 18365578, 18695862, 18462474, 17861403, 18325279, 18971759, 19625101, 20452081, 20764422, 21347158, 22797247, 24163949, 26305374, 29103700, 32361446, 35551489, 40404066, 45690799, 53045488, 61734783, 67670810, 71582046, 74526645, 73853909, 72463977, 74708162, 80910044, 85613344, 89325858, 92316014, 91149747, 89556187, 87949062, 86772452, 84849783, 81361115, 76188509, 68539747, 59741352, 51761268, 45770017, 40918139, 36252430]
6460C6252430l637695k298111k643641j020678j161554j626064L98939Q12611
6452B5076237M67918O63476L026210K357747K676446L775026N305719O191061
6444D9539840N083861L338880J202859r36558l34700J617820M367080L537591
6436F7416673K417250K456646q36340k584033n39764r96383j943078k924129m395724
6427E8071118o071858o965120o018129n514704m678534k890324k640471k875174
6419B0416804j955120j506686k217883j140745p61815j004092n02174p80893k65051
6410A0282345j640996n15879J38944n72133o47086q843l00501L15837k89401r56294
6400E805993j010477k95917J508297n35889m09461N8640J099j176071J05985K04196
$$ y = [36252430, 32614735, 30316624, 27672983, 26652305, 25490751, 23864687, 24263626, 25076237, 25544155, 26207631, 29233841, 31591588, 34268034, 38043060, 43348779, 49539840, 54623701, 57962581, 59165440, 58228882, 57894182, 59512002, 63879082, 67416673, 69833923, 72290569, 71454229, 68870196, 68330432, 67334049, 65390971, 62466842, 58071118, 51999260, 45034140, 39016011, 33501307, 28822773, 25932449, 23291978, 20416804, 18461684, 16954998, 14737115, 13596370, 12834555, 11830463, 11328289, 10547396, 10282345, 8641349, 8125470, 8264414, 7692281, 7045195, 7036352, 6735851, 7051688, 6762287, 5805993, 4795516, 4499599, 6007896, 5472007, 5062546, 5121186, 5122285, 3946214, 4052199, 4256395]
6390D256395L09974m19370Q73421K88614q80466L32452Q8804M0155l47145L08365
6380D851199L64642K87372K20363q453q65460m28975J170055K35810q57957q17804
6370D150792Q45064P06052r28603p80181l65514N32194m44979Q1942K18599k37726
6360C777640M09733L81605j292663j35869M97281R28182l64192L8213L24081p62241
6350C801770Q26217k92883o16104L60553N60118j11959J95514n03726p67847J75824
6340C627477N86518M6512j411076P43484J42239m33482j00958j80192M31577n29385
6330B922714j05312j14246k67160q67283Q82302M05361p41356l053L7273n36026
6320A613214p09830R68770m4144l88947Q13657N0326o93068k96382J43927R43898
$$ y = [4256395, 4566369, 4146999, 5020420, 5309034, 4428568, 4761020, 4849824, 4889979, 4542834, 4851199, 5215841, 5503213, 5723576, 5715123, 4849663, 4420688, 5590743, 5826553, 4968596, 4150792, 4995856, 5701908, 4773305, 3993124, 3627610, 4159804, 3714825, 3796767, 4015366, 3777640, 4187373, 4568978, 3276315, 3140446, 3637727, 4565909, 4201717, 4239930, 4564011, 3801770, 4627987, 4335104, 3719000, 4079553, 4639671, 4527712, 4723226, 4219500, 3451653, 3627477, 4213995, 4260507, 2849431, 3592915, 3735154, 3301672, 3200714, 3020522, 3452099, 2922714, 2817402, 2703156, 2435996, 1568713, 2451015, 2856376, 2115020, 2111967, 2149240, 1613214, 903384, 1872154, 1828010, 1439063, 2252720, 2303046, 1609978, 1313596, 1457523, 2401421]
6310B401421J64357r5961l87062Q60320j19094j419037P79197O4100J30228k98985
6300B079484J2006p83091m30142R46152r7267n39814K28331N61631n99614m71797
6290I05879J9343L69947k68235r82974J086943o54639m04058j72816O30076m40478
6280H8988r35759J104296k85425N14545K10424K17183r42734O07358M64125n73526
6270D69475J0537N0009K75685j99664m45554J68245N1677K82946n71020M66503
6260E58839K40765K15696j57601K24960j94890P0968K37360k41252j33700p0210
6250G50935l45065K73851N66179l89049j29742K7381k15411p9015K89581M99949
6240A249594n8573J23181N17303j516114M93928N48828k21809j25474l73742Q47403
$$ y = [2401421, 2565778, 2469817, 2082755, 2943075, 2823981, 1404944, 2184141, 2248241, 2378469, 2079484, 2091490, 1308399, 878257, 1824409, 1727142, 1187328, 1415659, 1977290, 1377676, 905879, 925222, 1295169, 1026934, 43960, 1130903, 476264, 72206, -100610, 529466, 88988, -846771, 257525, -27900, 486645, 697069, 914252, -28482, 578876, 1043001, 469475, 480012, 530021, 805706, 606042, 160488, 328733, 380410, 663356, 92336, 558839, 799604, 1015300, 857699, 1082659, 887769, 958737, 1196097, 954845, 821145, 750935, 405870, 679721, 1245900, 856851, 727109, 754490, 539079, 460064, 749645, 1249594, 1191021, 1314202, 1831505, 315391, 809319, 1358147, 1136338, 1010864, 637122, 1484525]
6230A484525m70506l56701J68607l20067O39424q9279l81284L29572M341j31457
6220H77175K44263o29499J27955N83243j85959j50183k51033J137738o90601l17163
6210G45936M42280q64171k82013Q42912m31200K27723L31618q95910k8212K78523
6200C67486m9675n39046O24408R68693o73239j08896O23987r52900Q35994J61163
6190A257975j85343R1993j44416O17979j076934j43233L29333M42622J63871m86459
6180H67388K87418l87059l4184l23908M80519k95929j01773L50865l00511q59365
6170c16539P54503o1280L31923m03421J94503M3586R2012J92680K65486l39491
6160G53962j87836M01867j61854o4807p76757R2662M28672l88788O8857R3091
$$ y = [1484525, 1014019, 657318, 825925, 505858, 1145282, 1056003, 674719, 1004291, 1008632, 877175, 1121438, 491939, 619894, 1203137, 1017178, 866995, 615962, 1753700, 1063099, 745936, 1188216, 324045, 42032, 884944, 453744, 681467, 1013085, 117175, 88963, 367486, 317811, -221235, 403173, 1371866, 698627, 589731, 1213718, 260818, 1096812, 1257975, 1072632, 1164625, 1020209, 1638188, 561254, 418021, 747354, 1189976, 1353847, 867388, 1154806, 767747, 733563, 409655, 890174, 594245, 492472, 843337, 542826, -316539, 437964, 376684, 708607, 305186, 499689, 543275, 635287, 827967, 1093453, 753962, 566126, 967993, 806139, 741332, -35425, 57237, 485909, 97121, 165978, 259069]
6150B59069l945p8140k05175L83368j44867K91265J095259j421946j28758O05129
6140F51259L74380q34910k50891K79187M69807r1177j44611k16272l5900N72054
6130G72926m64752J49619L74034O2785J23619p14019j71035J03042O60232l04400
6120E92051p64421R65057k52963L38118k75059M43492j81635M26564J63531N73813
6110B028548m08035J26034n93189M77790k79992K08889p0341J8774q59084p4025
6100E75369m73368o36048L61855P0264R4375r74232L54721j01606k41101J36956
6090h32815K17151L32846O51957O44027K86669r14477R6211R44596l1764l22750
6080A071651l64473O67022l96767j99695k47070m91344J79306Q59825l15320m97141
$$ y = [259069, 255124, 176984, -28191, 355177, 210310, 501575, 1596834, 174888, 46130, 651259, 1025639, 190729, -60162, 219025, 688832, 597655, 453044, 236772, 200872, 772926, 308174, 457793, 831827, 894612, 1018231, 304212, 133177, 236219, 896451, 592051, -172370, 792687, 539724, 877842, 602783, 1046275, 864640, 1291204, 1454735, 2028548, 1620513, 1746547, 1153358, 1631148, 1351156, 1560045, 1489704, 1508478, 649394, 575369, 102001, -534047, -172192, -101928, -7553, -981785, -627064, -728670, -969771, -832815, -615664, -282818, 369139, 1013166, 1299835, 385358, 481569, 1426165, 1394401, 1071651, 707178, 1374200, 977433, 777738, 530668, 39324, 218630, 1078455, 763135, 265994]
6070B65994Q04310J28453o7844p90667K80752M86958J9133K39029k99161L30204
6060A397161k69585M9934L6045J59758l26499j79569j6644r263J9885o51336j68276
6049D1611M86322n2468n81629j86299k33025L43931j84292m99144J23398N47820
6039a93775K40873n5891p63577N31286P23367K71891l02800m44718Q30283k93038
6029E43901n78309O60197j97851o48798K31306j2740j136644J93080L21222N99720
6019b4916j324423M84455N98642m43698N39776J30184L34321p2338P79339l0437
6009I70905j16046o54526J378708j35027n93707L46272M70731l17368j310618
6000C9324l867L58142L48290k66920M74132n75308n99531M03738l05258l09997
$$ y = [265994, 1070304, 1198757, 1130913, 340246, 620998, 1107956, 1127089, 1366118, 1066957, 1397161, 1127576, 1177510, 1213555, 1373313, 1046814, 867245, 850601, 841338, 861223, 209887, 41611, 527933, 475465, -106164, -292463, -525488, -181557, -365849, -864993, -741595, -193775, 47098, -8793, -772370, -241084, 482283, 754174, 451374, 6656, 836939, 543901, -34408, 625789, 427938, -220860, 10446, -2294, -1138938, -945858, -624636, -24916, -1349339, -864884, -266242, -709940, -170164, -39980, 294341, 222003, 1001342, 970905, 854859, 200333, 1579041, 1444014, 850307, 1196579, 1667310, 1349942, 39324, 35457, 393599, 741889, 474969, 949101, 373793, -225738, 178000, -127258, -437255]
5990d37255k07600P57202N87109r73347K48648p1021o51170J67775P69770j8694
5980A71417M7983M64550K78645q42101o41776L49251N86542l55438n4709J75846
5970A80210l01469l57090k95566Q8289l65728P94567P30812l07073r014K6165
5960A84103n18151r0165N43596L65384J42194q1894K87232o53624l54743R8487
5950g7581N00174J11168J88202n97929K4688q4655O6435k76762q3920J77734J06702
5939E4256K56364n05270j74282o22314N56208j31419Q00062l60201l63845L75308
5929a15133m14961O50420n9654J49486M13103L9494L6554p00734O31959P14974
5919A345508n05041m04030l50610K77521p1474J14528j013606J63946k48372O61387
$$ y = [-437255, -644855, 112347, 699456, -273891, -25243, -96264, -747434, -579659, 190111, 171417, 219400, 683950, 962595, 120494, -521282, -172031, 414511, 59073, 4364, 180210, -121259, -478349, -773915, -685626, -1051354, -256787, 474025, 166952, 157938, 184103, -334048, -424213, 119383, 484767, 626961, 545067, 832299, 178675, -176068, -77581, 422593, 533761, 721963, 124034, 148722, 64067, 130502, -146260, -230180, -52446, 54256, 310620, -194650, -368932, -991246, -435038, -566457, 233605, -126596, -490441, -115133, -530094, 120326, 60672, 210158, 623261, 662755, 699309, -1425, 630534, 1345508, 840467, 436437, 85827, 363348, 291874, 406402, -607204, -443258, -691630, -30243]
5909c0243R7098q50688O94515m92452N39443L80562q7090P9077j59831K73735
5899D44126k09757o36914L55922K71217n35574r8146o64219j2993J187435o81962
5889e80865m43784l6631M14301Q27748L46475k64134o2408L18473J35298k8248
5879F26225k8085M67095k50578N7168J31892p60598K71919L18257p24756K65280
5869C73819j58726k30313K39751m78717K57523o58924N93681k2786j52361k22371
5859d59424n3607L01893M58304k82014l0017J74694k90143k63195j0401J05619
5849c48291O41841j64333l41624j48642j53142k8337k2589P34595J29656p9419
5839B19715P5012n10032l33429K20166N60940r8324l09917N40004M22499j057185
$$ y = [-30243, 66855, -783833, -89318, -581770, -42327, 338235, 251145, 330222, 170391, 444126, 234369, -402545, -46623, 224594, -310980, -409126, -1073345, -1086338, 101097, -580865, -1024649, -1061280, -646979, 180769, 527244, 263110, 200702, 519175, 654473, 626225, 598140, 1065235, 814657, 871825, 1003717, 243119, 515038, 833295, 108539, 373819, 215093, -15220, 224531, -254186, 3337, -655587, -61906, -84692, -237053, -459424, -513031, -211138, 247166, -34848, -64865, 109829, -180314, -443509, -453910, -348291, 293550, 129217, -212407, -361049, -514191, -542528, -565117, 169478, 299134, 219715, 294727, -215305, -548734, -328568, 232372, 134048, -175869, 364135, 786634, -270551]
5829b70551k4985N70351p2522k4016L08259N01877q14790j20612L76600p73772
5819c44161Q5612Q87150m19623n59892p6469P20182k15339l73856m546J30098
5809a70844o82116J92168L88711k85707N0301L4324l55327p99837Q06546J528053
5799G06272r00287l34247Q05956J81430j40112L53879n42915n41711R0351M18557
5789I7173j98702m97490N19096j67471r62235j85879J024069K24469n32352L25746
5779c53576M68456l7372L59637M31584m55231j023780P03088N62857k21392o5675
5769C68596m57999j31758q8927J02022M73412j17987k78014L80176J6653o66230
5759d00056J16274N23436K8658q10936m7680O39111k56714n52348l21466K68290
$$ y = [-270551, -295536, 274815, 202293, 178277, 486536, 988413, 173623, 53011, 429611, -344161, -258549, 628601, 208978, -350914, -427383, 292799, 77460, -296396, -300942, -170844, -852960, -660792, -272081, -557788, -507487, -473163, -828490, -1628327, -821781, 706272, -194015, -528262, 277694, 459124, 319012, 672891, 129976, -411735, -321384, 97173, -101529, -599019, -79923, -247394, -1209629, -1395508, -371439, -146970, -679322, -353576, 114880, 77508, 437145, 868729, 413498, -610282, 92806, 655663, 434271, 368596, -89403, -221161, -310088, -208066, 265346, 147359, -130655, 249521, 266174, -400056, -283782, 239654, 268312, -542624, -590304, 48807, -207907, -760255, -1081721, -813431]
5749h13431P63322K33683k08605K07443o36631N30541r451k10628N18298L7286
5739D11827k35725p58181O0281K83878l10757k67883K92983k56868O48757m8824
5729a80512O1972K00042K9502l1910J83430L39640m43930k92282J36001J54665
5719A56618j43774M39420j61573k43950L02390l84700K69996j41335K9992K62900
5709C85984m09090q6259k56211K51655m14318k66453J19080j08991l51193N20752
5699f15044K82248j75578K97651K75895N92207Q3831o52817N07077j11325J41462
5689F25607l66726L909L20932k23986j17604o93752l18011M51389J49951l99517
5679e67808J01538N94856J18836J3721o57026J44606n7030l71020L24523O34299
$$ y = [-813431, -50109, 183574, -25031, 182412, -454219, 76322, 66871, -143757, 374541, 411827, 176102, -582079, -521798, -237920, -548677, -816560, -523577, -780445, -131688, -180512, -118540, 81502, 111004, 79094, 262524, 602164, 158234, -134048, 1953, 156618, 12844, 452264, 290691, 46741, 349131, -35569, 234427, 93092, 123084, 385984, -23106, -109365, -365576, -113921, -528239, -794692, -675612, -784603, -1135796, -615044, -332796, -508374, -210723, 65172, 657379, 741210, 88393, 595470, 484145, 625607, 258881, 262790, 583722, 359736, 242132, -451620, -769631, -318242, -168291, -567808, -466270, 128586, 247422, 261143, -395883, -251277, -308307, -679327, -354804, 279495]
5669B79495K74142R8678l35691P858o17331k22602K55958L93753j66668M06182
5659C73774p5433j08516m75906o24550L66387p36134N74054P13557o76537J35973
5649e33331L73788m38736m30169R07853Q66749m84725l29325O46668L968m62348
5639A20392L96054n22196p1393L72382k80265r2567k72220N67194l2089j173539
5629i88247P21929L31790o9541k04394K97704J56139P4366m22028K74604r53880
5619g81558P82116M89187J08470k2704O04770m70206o73949l38834N37357n3411
5609A81238k2644J96281l65990p09502N5010k33049j57328N86O76138L20759j97894
5598b56395L15149P65087o77974K57747L29462m00719k65266l01771J33259q52695
$$ y = [279495, 553637, 652315, 316624, 324482, -292849, -515451, -259493, 134260, -32408, 373774, 298341, 189825, -286081, -910631, -544244, -1280378, -706324, 7233, -669304, -533331, -159543, -598279, -1028448, -120595, 746154, 261429, -67896, 578772, 582740, 120392, 516446, -5750, -77143, 295239, 14974, -77593, -349813, 217381, 185292, -988247, -266318, 65472, -4069, -208463, 89241, 245380, 319746, -102282, 172322, -781558, 558, 489745, 598215, 575511, 1180281, 710075, 36126, -302708, 234649, 181238, 158594, 354875, -11115, -720617, -665607, -898656, -1055984, -1055398, -379260, -58501, -256395, 58754, 823841, 145867, 403614, 733076, 332357, 67091, -234680, -101421, -954116]
5588i54116l74730L91499J26952o09626m9939q37369O38199N66403K91777Q57189
5578D6239k45328M82498K79070n70118n59538M5282Q07028J36895p09125M37566
5568A50469L31777o06146m9473m02324L16989Q40936o1163j78383J39297r08896
5558d26917J119092r44356p5321O91228m26363k63571m98290K5351N18474o29604
5548i10277P59193j05434k24587N8825j80943n11646O92087K06365l70904K98063
5538b89258k33409M17216p59691L14255J221486k17180j57202O82497o34609N968
5528C50073K53177K37144K01585j104564M29386j033142p93052J022334l75917
5519h12976k59481Q85273k0110J7966q83662j02398J426615l82245L41488K15472
$$ y = [-954116, -1328846, -937347, -810395, -1420021, -1469960, -2307329, -1669130, -1102727, -810950, 46239, -199089, 283409, 562479, -7639, -567177, -521895, 285133, 422028, -287097, 150469, 482246, -123900, -173373, -575697, -258708, 582228, 521065, 342682, 481979, -426917, 692175, -252181, -327502, 363726, -62637, -326208, -824498, -799147, -280673, -910277, -151084, -256518, -481105, -422280, -603223, -1114869, -422782, -216417, -587321, -289258, -522667, -105451, -865142, -550887, 670599, 453419, 296217, 978714, 344105, 350073, 603250, 840394, 1041979, -62585, 366801, -666341, -1459393, -437059, -812976, -1072457, -187184, -207294, -189328, -1072990, -1175388, 251227, -131018, 210470, 425942]
5509D25942k9231j47965o40863k40656O6729K64016J03861l21324j115059J494381
5499a40169J46415m53190Q63136m16713L37359M8023l05669K92709j68709N23536
5489G26728k63360o56914M85989r43614n33886L86136O1041k55368J54694j29068
5479i67622q5859J4285K39439M11995n03281M14229P09540n82748R4863R82797
5469G27638L50887l59596m00839O63201j49641m86410R64869j277379j25246O69021
5459E76505k75023j396823j55213O73336n96683k31614k77801M23166j77190N66907
5449h70433j01143K00439J3380K35011K08064k53073k56273R54086q891n36075
5439d14908L20849l52594l23547k7376M41058l86786m43627N30213N93743n53261
$$ y = [425942, 396711, 248746, -392117, -632773, -566044, -302028, -198167, -519491, -1634550, -140169, 6246, -446944, 416192, -521, 336838, 384861, 79192, 371901, 203192, 726728, 463368, -193546, 292443, -651171, -1185057, -798921, -737880, -993248, -838554, -967622, -1053481, -1039196, -799757, -387762, -891043, -476814, 232726, -350022, -255159, 727638, 1078525, 718929, 318090, 981291, 831650, 345240, 1310109, 32730, -92516, 576505, 301482, -1095341, -1250554, -577218, -1173901, -1405515, -1683316, -1260150, -1437340, -870433, -971576, -771137, -757757, -522746, -314682, -567755, -824028, 130058, 121167, -414908, -94059, -446653, -770200, -797576, -356518, -743304, -1186931, -656718, -62975, -616236]
5429f16236L57814L9933P1840L33957k55314k20336M45072J84440J88107m09529
5419A19748k24444J14258K6758k35634J63848J1815N62180m69094q8015J22051
5409A03471p38540O91138k6696k20252m89240M24455l51817m65014K03037J06688
5399g62770j04335N71450P22648q25100J6596P61289L61123l69497J29034k43977
5389B56461J53399o71648j70272l51626M99246n3392n84966R6817L9459J56558
5379f29964J81310p9603n69290J131875N28251n56858n87058J36049J29633l99648
5369g15303J39150k05181R7309Q8134p395n79608n15667L35988L32784N54448
5359d75341j55109l43243J133624l01232n32935m02089R4271J476734K45796m34093
$$ y = [-616236, -258422, -218489, -146649, 187308, -68006, -288342, 156730, 341170, 529277, 119748, -104696, 9562, 36320, -199314, -35466, -23651, 538529, 69435, -18580, 103471, -635069, 56069, 29373, -190879, -680119, -255664, -607481, -1072495, -869458, -762770, -867105, -295655, 426993, -398107, -381511, 379778, 740901, 371404, 500438, 256461, 409860, -261788, -432060, -783686, -284440, -337832, -922798, -825981, -786522, -629964, -448654, -528257, -1097547, 34328, 562579, 5721, -581337, -445288, -315655, -715303, -576153, -781334, -684025, -595891, -603286, -1182894, -1698561, -1362573, -1029789, -475341, -630450, -973693, 159931, -141301, -674236, -1076325, -982054, 494680, 740476, 306383]
5349C06383p28236l00382N81909K2312n0732m74822Q43661L96697n97116j234508
5339a234834J97617O18002M9171N02378l97699J47750j93182K1631m69445l35300
5329a093911O52493P93414J89647q34947n04328j47827n8984p7996R3470o2872
5319a051841K86497L86377j66160l2604l54804j57849J333680K83332J08910n30833
5309A04705O65616N77117j321121L75115m82811N11148p7263K23941p30533P892
5299a46194L00748K95900j118309o3370P20583L32645n04901q67393J85204Q20058
5289d5029q17167J46231N47390m2311J54267k9970k07704k5298M07485L54954
5279D42848j9917j60795K03277k11552o73130k11518n39390O53719k01904l44781
$$ y = [306383, -421853, -722235, -140326, -118014, -168746, -643568, 200093, 596790, -326, -1234834, -1037217, -419215, -370044, 132334, -265365, -117615, -310797, -289166, -758611, -1093911, -441418, 351996, 541643, -293304, -797632, -945459, -1004443, -1082439, -988969, -1051841, -765344, -378967, -545127, -577731, -932535, -1090384, 243296, 526628, 635538, 104705, 770321, 1347438, 26317, 401432, -81379, 429769, 352506, 576447, -154086, -146194, 154554, 450454, -667855, -731225, -10642, 322003, -182898, -1050291, -865087, -45029, -862196, -715965, -168575, -210886, -56619, -86589, -294293, -319591, 87894, 442848, 422931, 262136, 465413, 253861, -419269, -630787, -1170177, -516458, -718362, -1063143]
5269a063143N70306l34324l59004l13633P97550k3217j30767N78660p9917j07108
5259d64597k58519K11991k99476k34871K12416M01403L21942k11581K73109J04712
5249E6529m14427L92943M16393K9414m16127M06199k10406q53585J32512j76881
5239f37436j28466P5675M28122l02368l35907J22037K16037l0984N11171M74302
5229C92183o7261M17033n27324r60137L56094J21079k66633k67584M56482l41643
5219f87711o12447K52333Q02057n90622K57656M12635j40678N26184J21180n76899
5209b36312N7662M76787Q50294q33269j255025N01644M90290o1120p57457J29560
5199f36946R84769q93p72512n37442M19818M89648Q38218r06584J67917J42533
$$ y = [-1063143, -492837, -827161, -1186165, -1499798, -702248, -725465, -856232, -277572, -357489, -464597, -723116, -511125, -810601, -1045472, -833056, -431653, -109711, -321292, -48183, 56529, -357898, 35045, 451438, 480852, 64725, 470924, 260518, -593067, -460555, -637436, -765902, -690227, -262105, -564473, -900380, -778343, -562306, -593290, -82119, 392183, 324922, 741955, 214631, -745506, -389412, -268333, -534966, -802550, -346068, -687711, -1300158, -1047825, -245768, -836390, -578734, -166099, -306777, 219407, 340587, -236312, -178650, 298137, 1148431, 315162, -939863, -438219, 52071, -9049, -766506, -636946, 347823, 346930, -425582, -963024, -543206, -53558, 784660, -121924, 45993, 188526]
5189A88526O90834j31713l48221L0887L96350L95015k94728r34540K09431P946
5179B09787k50928l8927l49373p68253j96889L22164k98832k73896J164416O98986
5169B18255j16056m12097l58293J72246K50670L67326j69777J54660K68623l37594
5159C7963k01908r36579r64506R20009N27406K95077j43063O92556m25459j4032
5149b12536l6772K04576N62757N03078r0145q17712L26490k73491q88709L46083
5139c76381m44326p5473O77550l53882k68878N9720K51107l99157K85008J258940
5129F14228n04321n58662j76953n177p0357l3311J006999j33421m16474l02963
5119e80412L16788l01876N729P85807L83823R4297L98856J54299j192467n889
$$ y = [188526, 879360, 747647, 399426, 430313, 826663, 1221678, 926950, -7590, 201841, 209787, -41141, -80068, -429441, -1197694, -1394583, -1072419, -1371251, -1645147, -480731, 218255, 102199, -309898, -668191, -495945, -245275, 122051, -47726, 106934, 375557, 37963, -163945, -1100524, -2065030, -1145021, -617615, -322538, -465601, 226955, -198504, -212536, -249308, -44732, 518025, 1021103, 930958, 113246, 439736, 166245, -722464, -376381, -820707, -896180, -218630, -572512, -841390, -781670, -530563, -929720, -644712, 614228, 109907, -448755, -625708, -630885, -701242, -734553, 272446, 139025, -277449, -580412, -263624, -565500, -559771, 226036, 609859, 704156, 1103012, 1257311, 64844, 58955]
5109E8955O71889J84620n49288M38293k5345p5340o30968L96310o3336R5675p5172
5098D26293l82743l77691K96860n3084N04197R6757m85070j53982o01077O96050
5088c3490K0128n59974K62825M19394N85307q32464p80711N58903P43075J56308
5078E39301k69265j38807j467P50804j094224J04537p5121P16759K42160j229345
5068d54668M7200Q64422p56440k6464P7633J43621K63071q59919N14417j21429
5058c08556j77496j15861l15048J37981N26491p59426L97021J44748N7789P7729
5048c34628n53043l34987R31109J96927l11460o38016M69697K70105j080090l256
5038a387642O26832o51043q1788M32879K80427l09753k24534Q91938j45302J60970
$$ y = [58955, 730844, 915464, 366176, 804469, 779124, 703784, 72816, 469126, 405790, 501465, 426293, 43550, -334141, -37281, -90365, 413832, 510589, 25519, -128463, -729540, -33490, -13362, -573336, -310511, 108883, 694190, -138274, -918985, -360082, 382993, 539301, 270036, 131229, 129762, 880566, -213658, -109121, -184242, 532517, 774677, -454668, -407468, 456954, -299486, -325950, -248317, -104696, 158375, -701544, -187127, -308556, -486052, -601913, -916961, -778980, -252489, -1011915, -614894, -470146, -412357, -334628, -887671, -1222658, -291549, -94622, -406082, -1044098, -574401, -304296, -1384386, -1387642, -760810, -1411853, -1493641, -1060762, -780335, -1090088, -1314622, -422684, -567986, -407016]
5028d07016N97777o368J30759N39866k23656l76697M74752P7925o65861o31712
5018d90231L61228J22224k73344j47991q6737R9164M65945k51820m79770N10463
5008a70869N60412o10576l16575O88283O74543j282101p12406O61854q5358J22058
4998d70735j98046j6560J90849J97765J3117p41969M0455J063665o4771n31404
4988e17634n54059M93110m92869K50147p62912J025389J5056J17618L07303o81738
4978h00589K01668L06151K11967O29639j98503j52445m18400j16521m54649m71919
4968a263601j01909O63038o65746O19076l1703j97861L82929K61214r6926J34223
4958b97266R5552J069187j72649J7787j43750p69452N967l52787M45665j72532
$$ y = [-407016, 190761, 184393, 315152, 855018, 631362, 254665, 729417, 807342, 141481, -490231, -129003, -6779, -280123, -428114, -514851, -415687, 50258, -201562, -681332, -170869, 389543, -221033, -537608, 150675, 825218, -456883, -1169289, -507435, -592793, -470735, -668781, -685341, -494492, -296727, -283610, -1025579, -985124, 78541, 13770, -517634, -1071693, -578583, -1071452, -821305, -1584217, -558828, -543772, -426154, -118851, -800589, -598921, -292770, -80803, 548836, 350333, 197888, -220512, -337033, -791682, -1263601, -1365510, -702472, -1368218, -749142, -780845, -978706, -595777, -334563, -431489, -297266, -201714, 867473, 694824, 712611, 568861, -200591, -194624, -547411, -101746, -274278]
4948b74278L34727l273N51402j041137J10212J82446K30428N56304q37575r693
4938b00437R7309O8851m27724n87772J073612Q3551l68314m16582K74960k85204
4928f87750M78844P78518l43758l14565N61214l96069q93299Q1850J165439l26930
4918A03494m65541P84209j60958n52481p0251K4428J90484J72911k29320M31755
4908B28730l78060P0313j6070l21585j69968o51464Q65018K56516n21834M2576
4898e95828Q59089n07448J30232j73409J74622J80665L67944N04125r25626l86725
4888c72359N45070l24514q2211j31855J78447M43321j013750m70919O45877O002
4878e76891J183615k48153p6018L66854k11609M66317k50896R19466j41103m4114
$$ y = [-274278, 60449, 57176, 608578, -432559, -322347, -139901, 90527, 646831, -190744, -200437, -103128, -34277, -462001, -1049773, 23839, 107390, -260924, -677506, -402546, -687750, -208906, 569612, 225854, -88711, 472503, 76434, -816865, -735015, 430424, 103494, -362047, 422162, 261204, -291277, -361528, -337100, -146616, 26295, -203025, 228730, -149330, -79017, -95087, -416672, -586640, -1238104, -373086, -116570, -638404, -595828, 263261, -244187, -113955, -287364, -112742, 67923, 435867, 939992, 14366, -372359, 172711, -151803, -234014, -365869, -187422, 255899, -757851, -1228770, -582893, -576891, 606724, 358571, 282553, 649407, 437798, 904115, 653219, 1572685, 1431582, 1387468]
4868A387468M3977n49766o09784L2322M74044p69123l80091L31489m56385j057908
4858a553757K23800J8837j48965O97558Q00026k66095k70513K5794N44008K92822
4848C63515R4886N91257O0316k69960j88658k03280L29664q68627l3843K62086
4838A37356L07349j15818r9481K34616n45977k92025P76096O76942r8674q5546
4828H94838J37734l65322n15908M49468P1046n63477j48905K90153p16498n79539
4818a046410j32140N62197j041611O92468K07222O09736n22462k65222M11916
4809e24306M03240K9905L16981j18694n7238k93235k84396J78391J70927o6666
4799b45091l93809k60446M6602P28194k37464K34254q9905M37530O01901o88726
$$ y = [1387468, 1431445, 881679, 271895, 304217, 778261, 9138, -370953, -39464, -495849, -1553757, -1329957, -1311120, -1460085, -762527, 37499, -228596, -499109, -473315, 70693, 363515, 458401, 1049658, 1109974, 840014, 651356, 448076, 777740, -90887, -124730, 137356, 444705, 328887, 229406, 464022, -81955, -373980, 402116, 1079058, 980384, 894838, 1032572, 667250, 151342, 600810, 671856, 108379, -40526, 249627, -466871, -1046410, -1178550, -616353, -1657964, -965496, -758274, -148538, -671000, -936222, -524306, -121066, -91161, 225820, 107126, 49888, -243347, -527743, -349352, -178425, -245091, -638900, -899346, -852744, -124550, -362014, -127760, -217665, 219865, 821766, 133040]
4789A33040Q8010M65067M3464m62367M09262M61742k72314q66862m90419N97586
4779A06209q9950L19986q70386K54817L47233n52256q0684J62428M15660L30388
4769C43445L53461l57637O34680P8059k05377n92992L1851O40862K99528k08742
4759A017138k63575n75478j66980n00520n24106J069884K35690m13692M3558M20834
4749C42753j78482o1972l20489Q13397j63461L9827L97362j47719n26889l18468
4739a24141L37823n71151m19547M15512K99778j003677j8259P64820k36027J71753
4729c83116J32319K56735n85783J91938R79527m38472p43156N87875N43158n05501
4719C5524k69458n3207J80127l10646K22492J16069J18569k40657K24575j34783
$$ y = [133040, 221050, 686117, 729581, 267214, 676476, 1138218, 865904, -958, -491377, 106209, 16259, 336245, -534141, -279324, 67909, -484347, -565031, -402603, 13057, 343445, 696906, 339269, 973949, 1052008, 846631, 253639, 285490, 926352, 1225880, 1017138, 753563, 178085, 11105, -489415, -1013521, 56363, 292053, -121639, -78081, 342753, 164271, 102299, -218190, 595207, 431746, 471573, 868935, 721216, 194327, -124141, 213682, -357469, -777016, -361504, -61726, -1065403, -1083662, -318842, -554869, -383116, -250797, 5938, -579845, -387907, 591620, 153148, -590008, -2133, 541025, 35524, -233934, -287141, -107014, -417660, -195168, -79099, 39470, -201187, 23388, -111395]
4709a11395q86286j06328O20391K04758q10693J2054Q40630n54565m31858K94239
4699i29053K75948k62416P37462M82128k35717j03804L4269j79062n31266K95055
4689d16456M9221K02135o84877K58034J75548j20370l10814N55028n3662J45399
4679b00814M11166J30523o77966O4535K49225l09219j3941m11917J06346Q6702
4669e65360l34130j65356L23840K23815M05143o55223J59691K83930J11963O14636
4659D02949n56296J09810J99638K37600p33833m37461K49138N81406R4391m35301
4649b87959r9961l29047P49505p35129K2769M01481k50865J20050p22429M01005
4639g30580n14627N59365J01766j72721k10173O34378p7243O7584J018078l01570
$$ y = [-111395, -997681, -1104009, -483618, -278860, -1089553, -1077499, -236869, -791434, -1223292, -929053, -653105, -915521, -178059, 304069, 68352, -35452, -1183, -180245, -711511, -416456, -367235, -165100, -849977, -591943, -416395, -536765, -847579, -292551, -346213, -200814, 210352, 340875, -337091, -272556, -23331, -332550, -346491, -758408, -652062, -565360, -899490, -1064846, -741006, -517191, -112048, -767271, -607580, -323650, -211687, 402949, -153347, -43537, 156101, 393701, -340132, -777593, -528455, 52951, 147342, -287959, -387920, -716967, 32538, -702591, -679822, -278341, -529206, -409156, -1131585, -730580, -1245207, -685842, -584076, -756797, -966970, -332592, -409835, -342251, 675827, 374257]
4629C74257J30136k49095N32979n71831p11443L67722R0457l31516n01122m94123
4619a363579N36657q72712M96381J83798j22198O94018L42212m05679M5558L04694
4609a60850Q72103n06374m49648O29355l69238l81548J0329j66207m0059J09392
4599d52745l34643j68261o09314R60468J67784k33227J94551L02155Q4584k68286
4589c56934l41696Q63883J60733n6504P51128m71363J28147j59974J46142n21351
4579A42211k31360Q61376j14214n74944M88321j53769r32790O3072J52987m59270
4569g58380k35010P4186K60614j61210N33581j224540L11767M15675Q9776L68350
4559c25191q6093J65542J53582N26037m47670j87507P81541K94723j124293J78010
$$ y = [374257, 504393, 255298, 788277, 216446, -494997, -127275, -36818, -368334, -869456, -1363579, -826922, -1699634, -1203253, -1019455, -1141653, -447635, -105423, -511102, -465544, -160850, 711253, 204879, -244769, 384586, 15348, -366200, -355871, -522078, -562137, -452745, -787388, -955649, -1564963, -604495, -436711, -669938, -475387, -173232, -88648, -356934, -698630, 165253, 325986, 269482, 1020610, 549247, 677394, 517420, 663562, 142211, -89149, 772227, 658013, 83069, 571390, 417621, -515169, -452097, -299110, -758380, -993390, -919204, -658590, -819800, -286219, -1510759, -1198992, -783317, -693541, -325191, -411284, -245742, -92160, 433877, -13793, -201300, 580241, 874964, -249329, -71319]
4549g1319N96992k22524k403r7092r30603J80978J35051P199l39952k34472J50155
4538h27990N28284R5473m03711k16661Q74496k3839J99297M48000j45246n98684
4528g0581M07667o17891k96525L32812O5855K49983m07248p52514J51926M46484
4518d90032q22557K34236L53651P97939r29124J050152Q9434j010101M31896Q07092
4508E12586o8736N5262L29494l84946K68572m77874N24463k92433m58040K35369
4498B43717Q5450K35294j575366L43317L63760l27865k55578M41083J89521p03590
4488i60257M63557o82239L07388M59287R19939N1455p17128l32335Q33374j56923
4478A86118m65664J20667R03885l9892j52236n32660k81058l99493M31933K21747
$$ y = [-71319, 525673, 303149, 300746, 203654, -726949, -545971, -410920, -403721, -743673, -978145, -827990, -299706, -204233, -607944, -824605, 49891, 26052, 225349, 673349, 528103, -70581, 337086, -280805, -577330, -244518, -178663, 71320, -335928, -1088442, -936516, -490032, -1312589, -1078353, -724702, 73237, -855887, 194265, 283699, -726402, -294506, 512586, 443850, 499112, 828606, 443660, 712232, 234358, 758821, 466388, 8348, 243717, 329167, 564461, -1010905, -667588, -303828, -631693, -887271, -446188, -256667, -960257, -496700, -1178939, -871551, -412264, 507675, 559130, -157998, -490333, 343041, 186118, -279546, -158879, 745006, 705114, 552878, 20218, -260840, -660333, -228400, -6653]
4468f653p94729P47034j67989k02615m90776q9548M31272k17832J28565k48888
4458i12159q9099O04536L11121m68983j51526K42648j33469J31744j26221M30706
4448a60702j26150M8609L01910m23967J85410k3763K39219r0057l98922N18810
4438G0397R7994o82023M8967P18574n56331p93606L96684l22130m25690P81539
4428f65625N90104m04037J9991N37583j048040p3119J651127J08800m86971O80946
4418I10759k68400o78761j57984K38105K48018L77182K4092l50252m74725L56519
4408B24553p13626J3226L71041M07209K61430j076642p8002M15953l39406J60639
4398c53625L75760K61356o1018p9527R6912l19680M08149O83169j198481M40497
$$ y = [-6653, -801382, -54348, -222337, -424952, -915728, -1005276, -574004, -791836, -663271, -912159, -1001258, -396722, -85601, -554584, -706110, -463462, -596931, -465187, -591408, -160702, -286852, -238243, 63667, -360300, -174890, -198653, 40566, -49491, -448413, 70397, 168391, -513632, -464665, 253909, -302422, -1096028, -699344, -1021474, -1447164, -665625, -75521, -479558, -459567, 78016, -970024, -1043143, 607984, 716784, 229813, 910759, 642359, -36402, -194386, 43719, 291737, 668919, 693011, 342759, -131966, 224553, -489073, -475847, -104806, 302403, 563833, -512809, -590811, -174858, -514264, -353625, 22135, 283491, 222473, 142946, 239858, -79822, 328327, 1011496, -186985, 253512]
4388B53512L06481o92374K4920L57327L733r6105q23464Q3822K3058N2841N27540
4377B1291p82668M99141j62155k3001k0969k74103L54587N22263o76759M94194
4367d8179J08260m8919j4035l00125M00391m91262k2827j10298m31545l28389
$$ y = [253512, 559993, -132381, -107461, 249866, 253599, 157494, -665970, -582148, -559090, -506249, 21291, -761377, -262236, -424391, -447392, -468361, -742464, -387877, 134386, -542373, -48179, 60081, 11162, -2873, -302998, 97393, -393869, -416696, -526994, -958539, -1286928]
$$ [...]
##END NTUPLES=NMR SPECTRUM
##END=
