##TITLE=1H_DE-80H_X3
 200.13MHz, d2o
 8 sc
 
 19ns.26.2.2025
##JCAMPDX= 6.0         $$ Bruker NMR JCAMP-DX V2.0
##DATA TYPE= NMR SPECTRUM
##DATA CLASS= NTUPLES
##ORIGIN= UXNMR, Bruker Analytische Messtechnik GmbH
##OWNER= pz
$$ XWIN-NMR		Version 3.5
$$ Wed May  6 12:50:53 2026 Russian Standard Time (UT+4h)  Yarkov@DPX200
##.OBSERVE FREQUENCY= 200.1313
##.OBSERVE NUCLEUS= ^1H
##.ACQUISITION MODE= SIMULTANEOUS
##.ACQUISITION SCHEME= undefined
##.AVERAGES= 8
##.DIGITISER RES= 18
##SPECTROMETER/DATA SYSTEM= spect
##.PULSE SEQUENCE= zg30
##.SOLVENT NAME= DMSO
##.SHIFT REFERENCE= (INTERNAL, DMSO, 0, 18.0299)
##AUDIT TRAIL= $$ (NUMBER, WHEN, WHO, WHERE, WHAT)
$$ ##TITLE= Audit trail, XWIN-NMR		Version 3.5
$$ ##JCAMPDX= 5.01
$$ ##ORIGIN= Bruker BioSpin GmbH
$$ ##OWNER= Yarkov
$$ C:/Bruker/XWIN-NMR/data/yarkov2/nmr/H-C/1/pdata/1/auditp.txt
$$ ##AUDIT TRAIL=  $$ (NUMBER, WHEN, WHO, WHERE, WHAT)
(   1,<2026-05-06 12:49:36.18 +0400>,<Yarkov>,<DPX200>,
      <created by zg, POWCHK disabled, PULCHK disabled
       configuration hash MD5:
       00 E9 B6 7A A2 85 ED C7 34 08 36 98 17 FE 4E 26
       data hash MD5: 16K
       29 D4 EA AE 3A 37 DE BD 85 51 B1 FC C1 B2 38 76>)
(   2,<2026-05-06 12:49:48.57 +0400>,<Yarkov>,<DPX200>,
      <Start of raw data processing
       efp BC_mod = 2 LB = 0.25 FT_mod = 6 PKNL = 1 PHC0 = -5669.716 PHC1 = 11.42193 SI = 16K 
       data hash MD5: 16K
       77 4B E3 CB EC 8D 21 E9 42 B2 18 B7 77 1B D3 8D>)
(   3,<2026-05-06 12:50:30.84 +0400>,<Yarkov>,<DPX200>,
      <abs ABSG = 5 
       data hash MD5: 16K
       FC B3 AF 80 2A 5A A0 27 82 83 C3 56 00 FE 80 80>)
$$ ##END=
$$ 
$$ hash MD5
$$ 6D 87 66 A3 02 F3 6F A4 39 0C 60 AA 6D 93 AB 5A
##$RELAX= 
##$RELAX= 
##$RELAX= 
##$RELAX= 
##$RELAX= 
##$RELAX= 
$$ Bruker specific parameters
$$ --------------------------
##$DU= <C:/Bruker/XWIN-NMR>
##$EXPNO= 1
##$NAME= <H-C>
##$PROCNO= 1
##$TYPE= <nmr>
##$USER= <yarkov2>
##$AMP= (0..31)
100 100 100 100 100 100 100 100 100 100 100 100 100 100 100 100 100 100 
100 100 100 100 100 100 100 100 100 100 100 100 100 100 
##$AQSEQ= 0
##$AQ_mod= 1
##$AUNM= <au_zg>
##$AUTOPOS= <>
##$BF1= 200.13
##$BF2= 200.13
##$BF3= 200.13
##$BF4= 200.13
##$BF5= 200.13
##$BF6= 200.13
##$BF7= 200.13
##$BF8= 200.13
##$BYTORDA= 1
##$CFDGTYP= 0
##$CFRGTYP= 5
##$CHEMSTR= <none>
##$CNST= (0..31)
1 1 145 1 1 1 1 1 1 1 1 1 1 1 1 1 1 1 1 1 1 1 1 1 1 1 1 1 1 1 1 1 
##$CPDPRG= <>
##$CPDPRG1= <>
##$CPDPRG2= <>
##$CPDPRG3= <>
##$CPDPRG4= <mlev>
##$CPDPRG5= <mlev>
##$CPDPRG6= <mlev>
##$CPDPRG7= <mlev>
##$CPDPRG8= <mlev>
##$CPDPRGB= <>
##$CPDPRGT= <>
##$D= (0..31)
0 0.7 0 0 0 0 0 0 0 0 0 0.03 0 0 0 0 0 0 0 0 0 0 0 0 0 0 0 0 0 0 0 0 
##$DATE= 1778057375
##$DBL= (0..7)
120 120 120 120 120 120 120 120 
##$DBP= (0..7)
150 150 150 150 150 150 150 150 
##$DBP07= 0
##$DBPNAM0= <>
##$DBPNAM1= <>
##$DBPNAM2= <>
##$DBPNAM3= <>
##$DBPNAM4= <>
##$DBPNAM5= <>
##$DBPNAM6= <>
##$DBPNAM7= <>
##$DBPOAL= (0..7)
0.5 0.5 0.5 0.5 0.5 0.5 0.5 0.5 
##$DBPOFFS= (0..7)
0 0 0 0 0 0 0 0 
##$DE= 6
$$ [...]
##$SUBNAM3= <"">
##$SUBNAM4= <"">
##$SUBNAM5= <"">
##$SUBNAM6= <"">
##$SUBNAM7= <"">
##$SUBNAM8= <"">
##$SUBNAM9= <"">
##$SW= 18.0517328524113
##$SWIBOX= (0..15)
0 0 2 0 0 0 0 0 0 0 0 0 0 0 0 0 
##$SW_h= 3612.71676300578
##$TD= 16384
##$TD0= 1
##$TE= 0
##$TE2= 300
##$TE3= 300
##$TEG= 300
##$TL= (0..7)
0 120 120 120 120 120 120 120 
##$TP= (0..7)
150 150 150 150 150 150 150 150 
##$TP07= 0
##$TPNAME0= <>
##$TPNAME1= <>
##$TPNAME2= <>
##$TPNAME3= <>
##$TPNAME4= <>
##$TPNAME5= <>
##$TPNAME6= <>
##$TPNAME7= <>
##$TPOAL= (0..7)
0.5 0.5 0.5 0.5 0.5 0.5 0.5 0.5 
##$TPOFFS= (0..7)
0 0 0 0 0 0 0 0 
##$TUNHIN= 0
##$TUNHOUT= 0
##$TUNXOUT= 0
##$USERA1= <user>
##$USERA2= <user>
##$USERA3= <user>
##$USERA4= <user>
##$USERA5= <user>
##$V9= 5
##$VALIST= <valist>
##$VCLIST= <CCCCCCCCCCCCCCC>
##$VD= 0
##$VDLIST= <DDDDDDDDDDDDDDD>
##$VPLIST= <PPPPPPPPPPPPPPP>
##$VTLIST= <TTTTTTTTTTTTTTT>
##$WBST= 1024
##$WBSW= 4
##$XGAIN= (0..3)
0 0 0 0 
##$XL= 0
##$YL= 0
##$YMAX_a= 292283
##$YMIN_a= -192636
##$ZGOPTNS= <>
##$ZL1= 120
##$ZL2= 120
##$ZL3= 120
##$ZL4= 120
##$ABSF1= 18.02987
##$ABSF2= -0.02202606
##$ABSG= 5
##$ABSL= 3
##$ALPHA= 0
##$AQORDER= 0
##$ASSFAC= 0
##$ASSFACI= 0
##$ASSFACX= 0
##$ASSWID= 0
##$AUNMP= <proc_1d>
##$AZFE= 0.1
##$AZFW= 0.1
##$BCFW= 0
##$BC_mod= 2
##$BYTORDP= 0
##$COROFFS= 0
##$CY= -3
##$DATMOD= 1
##$DC= 0
##$DFILT= <>
##$DTYPP= 0
##$F1P= 0
##$F2P= 0
##$FCOR= 1
##$FTSIZE= 16384
##$FT_mod= 6
##$GAMMA= 0
##$GB= 0
##$INTBC= 1
##$INTSCL= 3.241238e-09
##$ISEN= 128
##$LB= 0.25
##$LEV0= 0
##$LPBIN= 0
##$MAXI= 10000
##$MC2= 0
##$MEAN= 0
##$ME_mod= 0
##$MI= 1.114404
##$NCOEF= 0
##$NC_proc= -8
##$NLEV= 6
##$NOISF1= 3.799351
##$NOISF2= 2.8
##$NSP= 0
##$NTH_PI= 0
##$NZP= 0
##$OFFSET= 18.02987
##$PC= 1
##$PHC0= -5669.716
##$PHC1= 11.42193
##$PH_mod= 1
##$PKNL= yes
##$PPARMOD= 0
##$PSCAL= 0
##$PSIGN= 0
##$REVERSE= no
##$SF= 200.129498048811
##$SI= 16384
##$SIGF1= 3
##$SIGF2= 2
##$SINO= 0.751879
##$SIOLD= 32768
##$SREGLST= <19F.Aceton>
##$SSB= 0
##$STSI= 16384
##$STSR= 0
##$SW_p= 3612.71676300578
##$SYMM= 0
##$S_DEV= 0
##$TDeff= 16384
##$TDoff= 0
##$TI= <>
##$TILT= no
##$TM1= 0
##$TM2= 0
##$TOPLEV= 0
##$USERP1= <user>
##$USERP2= <user>
##$USERP3= <user>
##$USERP4= <user>
##$USERP5= <user>
##$WDW= 1
##$XDIM= 16384
##$YMAX_p= 528740859
##$YMIN_p= -3852144
$$ End of Bruker specific parameters
$$ ---------------------------------
##NTUPLES= NMR SPECTRUM
##VAR_NAME=  FREQUENCY,     SPECTRUM/REAL,   SPECTRUM/IMAG
##SYMBOL=    X,             R,               I
##VAR_TYPE=  INDEPENDENT,   DEPENDENT,       DEPENDENT
##VAR_FORM=  AFFN,          ASDF,            ASDF
##VAR_DIM=   16384,         16384,           16384
##UNITS=     HZ,            ARBITRARY UNITS, ARBITRARY UNITS
##FACTOR=    0.220516191357247, 1,           1
##FIRST=     3608.30864878409, 0,            0
##LAST=      -4.4081142216869, 0,            0
##MIN=       -4.4081142216869, -3852144,     0
##MAX=       3608.30864878409, 528740859,    0
$$ Real data points
##PAGE= N=1
##DATA TABLE= (X++(R..R)), XYDATA
$$ [...]
3204B6201541r21752j832379p48765j56650j051043l504650j569005J898673l74264
3195A7941706k666202j210087J156131J79368j797363l31021Q5427O04312p25446
3186A3236825n52472j13145N27697L32664J425372m57523k685208l447369J52690
3177H419531J578706M7405K51141p8820m4380K17539j422790o27754o04381J154927
3167H891124q23698j090510o56397p69895j18945J974892J124290k572114j602856
3158D355891K715067l71303j645473q2146J549909J30943j640231j81665J41658
3149D972650n33768k99852K426891j66063p66727j436478N15910Q33091j188874
3140D356780N2328N90433l84893j0112r74389P12427k2454Q94611j028678j162662
$$ plain form
3204 26201541 25279789 23447410 22698645 22541995 21490952 17986302 16417297 18315970 17941706
3195 17941706 15275504 14065417 15221548 15400916 13603553 13272532 13357959 13962271 13236825
3186 13236825 12684353 12571208 13098905 13431569 14856941 14399418 11714210 8266841 8419531
3177 8419531 9998237 10045642 10296783 10217963 10173583 10391122 8968332 8340578 7736197 8891124
3167 8891124 8067426 6976916 6320519 5550624 5431679 7406571 8530861 5958747 4355891
3158 4355891 7070958 6699655 5054182 4972036 6521945 6652888 5012657 4830992 4972650
3149 4972650 4438882 4139030 6565921 6399858 5633131 4196653 4712563 5545654 4356780
3140 4356780 4409108 4999541 4614648 4604536 3630147 4342574 4320120 5214731 4186053 3023391
3130C023391N34153k00430l05483j10312O97571P74164Q6423K46763k421146j368883
3120I56211J283077O96748j246768L16970K485138j52826j264572j076048L98438
3111B396368l2363K52708p6124Q2804q15534p3018P74661J68324M64346J47442
3101C289614r37082m43629q9220M28872J026721R05324j128574j505254p50642
3092G96130J910120k90104j692098J306348J791990j427457j677993J207935K00893
3083B125764m95204o75965n3210o3032n18818K254225J684148m81677r35726j327514
3073A512991J621576q46300k805720J14854L418624p6795j73365R80966l32222
3064C414609j524065q11131P35688j321997q99570K160626j56573M79465j098510
$$ plain form
3130 3023391 3557544 3357114 3051631 2941319 3638890 4413054 4499477 4746240 2325094 956211
3120 956211 2239288 2936036 1689268 2006238 4491376 4338550 3073978 1997930 2396368
3111 2396368 2364005 2616713 2540589 2623393 1807859 1734841 2509502 2677826 3142172 3289614
3101 3289614 2352532 1908903 1819683 2248555 3275276 4180600 3052026 1546772 796130
3092 796130 2706250 2416146 724048 2030396 3822386 2394929 716936 1924871 2125764
3083 2125764 1630560 954595 901385 838353 319535 2573760 4257908 3776231 2840505 1512991
3073 1512991 3134567 2288267 -517453 -402599 3016025 2939230 2765865 3746831 3414609
3064 3414609 1890544 1079413 1815101 493104 -406466 1754160 1597587 2077052 978542
3055I78542N4155p09471P44643P11283j680190m02133K40861j93695K206720Q54180
3045B804895n52655j214629J321458P73138n53382j213161L54810j327343p97912
3036d04781M02239J217331J327241K74792J295831o74687k297343p01557J018918
3027A457984K39662j032680J86379P70713l96283M48808K75482o9410j134270
3018G46385J358538q20473l8909p7621L43811n47107L89827N80731N39776q83569
3008A591389n39717r14337L61507Q86799J618496p54433J74904j02043n7034j445765
2998H19766l73187R12008M54988n58914M24160P8058r0725J311254Q44159j446624
2988B374943q42192q31922J07187J091848L96664L68494r67726K4271J28291Q5868
$$ plain form
3055 978542 1032697 323226 1067869 1779152 98962 -303171 -62310 -256005 1950715 2804895
3045 2804895 2252240 1037611 2359069 3132207 2578825 1365664 1720474 393131 -404781
3036 -404781 -2542 1214789 2542030 2816822 4112653 3437966 1140623 439066 1457984
3027 1457984 1697646 664966 851345 1622058 1225775 1674583 1950065 1880655 746385
3018 746385 2104923 1284450 1245541 1167920 1511731 964624 1354451 1935182 2474958 1591389
3008 1591389 1051672 137335 498842 1385641 3004137 2249704 2424608 2322565 2265531 819766
2998 819766 446579 1358587 1813575 1254661 1678821 1756879 1666154 2977408 3821567 2374943
2988 2374943 1532751 700829 808016 1899864 2296528 2665022 1697296 1721567 1849858 1935726
2978A935726L69058p6291k64703J681830m06818j557906j11364K25942K2050J005157
2968B822681M68554r60913j229089P00432Q54593k3038j824227J140487J210472
2959C159952J137996j341028k527876N45051J773812j265137q12048n17659P17287
2950H70350M56689j677177K96067J062892k81835L92538N5833k79316J645156
2941B541197j111586L73110m52048q61844J4128o1947L07132Q78278J11170O37455
2931B375045J913326j638253k2329R53471N304J36097k285044j6884M55047J705495
2921C581275p07948l77626l87274K36894L90271j063514K38876m56569N47032
2912B001417N43121J34381p17643J531031l20963j349908m71432o84103L12830
$$ plain form
2978 1935726 2304784 2228493 1963790 3645620 3238802 1680896 1569532 1795474 1817524 2822681
2968 2822681 3291235 2330322 1101233 1801665 2656258 2633220 808993 1949480 3159952
2959 3159952 4297948 2956920 429044 974095 2747907 1482770 670722 153063 870350
2950 870350 1327039 -350138 -54071 1008821 726986 1119524 1175357 896041 2541197
2941 2541197 1429611 1802721 1350673 488829 502957 441010 748142 1626420 1737590 2375045
2931 2375045 4288371 2650118 2627789 3581260 3586564 3722661 1437617 1420733 1875780 3581275
2921 3581275 2873327 2495701 2108427 2345321 2735592 1672078 1910954 1454385 2001417
2912 2001417 2544538 2678919 1961276 3492307 3171344 1821436 1350004 665901 978731
2903I78731M841n94919K159831j5191o4491k43711r83142N80687O74248o00312
2893A896572l91068m10256o1929O88048L25716j9659L95766L48039o9014O9010
2883B771225o48986L44413J41057m87614J550191M83527r80105K62743o90324
2874B746127j74857n73093o29792k94553M30229J138675O79162j678415Q23957
2865B467440L25784m70306j69578n86234R9236L33696J78580q68897O15335R98017
2855B923073N16658j235253k43612k97636k07975J009509O74910j012338m21101
2846A706235N68394o72542K93778J541811o8038j264292j924935J558626M35874
2837B174911q62642J089604m10213K98201N5894m76468N05024m55860n72186J072289
$$ plain form
2903 978731 983572 388653 2548484 2533293 2468802 2225091 1241949 1822636 2496884 1896572
2893 1896572 1505504 1095248 1033319 1721367 2047083 2027424 2423190 2771229 2702215 2771225
2883 2771225 2122239 2466652 2607709 2120095 3670286 4153813 3173708 3436451 2746127
2874 2746127 2571270 1998177 1368385 1073832 1504061 2642736 3321898 1643483 2467440
2865 2467440 2793224 2322918 2153340 1567106 1666342 2000038 2178618 1309721 1925056 2923073
2855 2923073 3439731 2204478 1960866 1663230 1455255 2464764 3139674 2127336 1706235
2846 1706235 2274629 1602087 1895865 3437676 3369638 2105346 180411 1739037 2174911
2837 2174911 1312269 2401873 1991660 2289861 2345755 1869287 2374311 1918451 1346265 2418554
2827B418554K49986o69385r90682R31468R54807M54718j434293k40446k21426
2818A453301J67412j76566n90237l87278J735537N02501r51844P33634p05602
2809A780858k36336j90957q94780P07340p7025k79323m62164M62433R91110K7357
2799A828513j255066J054835Q37j084013J281495J42882q26385p26055O53990
2790A071033n30254P32382L61361Q33215O70881j469866p26272J96613O26313
2781A765406R97852p31374K29019M36773q23819J2536m4549j725978J714958m40772
2771A390052l10427m66009o409P00692J106064j775731K316n61729m12289j80581
2761e14051L64649J272388M74580j208807k82361N28658N60268n26883k1967k14648
$$ plain form
2827 2418554 2668540 1999155 1008473 1939941 2894748 3349466 1915173 1674727 1453301
2818 1453301 1620713 1444147 853910 466632 2202169 2704670 1752826 2486460 1780858
2809 1780858 1544522 1353565 458785 1166125 1089100 809777 347613 810046 1801156 1828513
2799 1828513 573447 1628282 1629119 545106 1826601 1969483 1143098 417043 1071033
2790 1071033 540779 1273161 1634522 2467737 3138618 1668752 942480 1139093 1765406
2781 1765406 2763258 2031884 2260903 2697676 1873857 1886393 1841844 115866 1830824 1390052
2771 1390052 1079625 613616 607207 1307899 2413963 638232 640548 78819 -333470 -514051
2761 -514051 -149402 1122986 1597566 388759 106398 635056 1195324 668441 646474 431826
2751D31826R99108M83474R7762J640344J39863k84813j31558m19952j534492k37770
2741A183792m16201J939483N7712Q68928L13860j156718J91457j560618j855546
2732d33851J247712J261362R52678q78891N79243J1266q41911k247003J176183
2723H26788n51541J628354K93026K48m60629M53058J45292M92402N25086J8539
2713C370623j825890j162203R06470Q87257K6314J188695m93183q38125q14503
2704A245455q3138K8168O87601P07728P23353p03980o68797L14926R81341J45192
2694C377849j083582o86591J95445M31689M85171J140771J22003M38541p33498
2685C687798n90042m61649M42507o51544R12223J086112N13588j736035j43768
$$ plain form
2751 431826 1430934 1914408 2012170 3652514 3792377 3507564 3376006 2956054 1421562 1183792
2741 1183792 767591 2707074 2764786 3633714 3947574 2790856 2982313 1421695 -433851
2732 -433851 813861 2075223 3027901 2149010 2728253 2739519 1897608 -349395 826788
2723 826788 275247 1903601 2196627 2196875 1736246 2189304 2334596 2826998 3352084 3370623
2713 3370623 1544733 382530 1289000 2176257 2202571 3391266 2898083 2059958 1245455
2704 1245455 1162317 1190485 1878086 2585814 3309167 2605187 1936390 2251316 3232657 3377849
2694 3377849 2294267 1607676 1803121 2234810 2719981 3860752 3982755 4421296 3687798
2685 3687798 3097756 2636107 3078614 2427070 3339293 4425405 4938993 3202958 3059190
2676C059190J482825l35372k095664R25609R12795J664270k613975J71569j64433
2667C006814L95143n28403l98336O40265Q78183n01960n28590K02056K467587
2658E632759j38990K88939r29876N59574n35872L89481M52064P23766q4197P90811
2648G148459J036308L52167Q4269j348457K79663J635699J67421q69938l1885
2639H453706p28025J090460j475760M52047O45983M76296Q23066L73631k94726
2630I816678L22483j1198L89013M86203j147776k83988P88812k36134J374760
2621A1498853j46050j50459k137k41452K95348N97278j603402o24718n49085K02819
2611I276995P07519Q77529o90801Q0595r42937o78521j67413J57562r8654J267738
$$ plain form
2676 3059190 4542015 4206643 2110979 3036588 3949383 5613653 2999678 3171247 3006814
2667 3006814 3401957 2873554 2475218 3115483 3993666 3491706 2963116 3165172 5632759
2658 5632759 5493769 5782708 4852832 5412406 4876534 5266015 5718079 6441845 6357648 7148459
2648 7148459 8184767 8536934 8621203 7272746 7552409 9188108 9355529 8485591 8453706
2639 8453706 7725681 8816141 7340381 7792428 8438411 8914707 9737773 10111404 9816678
2630 9816678 10139161 10127963 10516976 11003179 9855403 9571415 10360227 10124093 11498853
2621 11498853 11352803 11202344 11200207 10958755 11254103 11851381 10247979 9623261 9074176 9276995
2611 9276995 9984514 10862043 10171242 10251837 9308900 8630379 8462966 8620528 8521874 9789612
2601I789612q55277L5151j403870k74801J541693p14860j214421j092788n74L37196
2591F147061R482Q50099K66174N48206k948789N31248K71599R59203j807929j625155
2581C201199J184271O97377j428854O19828R34198p86359O28876l90885k76057
2572D383594j730585l62251J275471J347092j044697m94888k22940J905809j287939
2563C768666k499868Q88022J876642j058796J13047J886999L96507k317557L71050
2554C424712L78335N55926j349891L99520K56206K50626j097477l78352J073606
2545C513211K458794p89885j777623m41365Q7794j28444l70976J02692J442615
2536D096813Q21649r55643j242632J15276M77154j351963l64690O92551J095707
$$ plain form
2601 9789612 8934335 8969486 7565616 7290815 8832508 8117648 6903227 5810439 5809865 6147061
2591 6147061 6156543 7006642 7272816 7821022 4872233 5403481 5675080 6634283 4826354 3201199
2581 3201199 4385470 5082847 3653993 4273821 5208019 4421660 5050536 4659651 4383594
2572 4383594 2653009 2290758 3566229 4913321 3868624 3373736 3150796 5056605 3768666
2563 3768666 1268798 2156820 4033462 2974666 3087713 4974712 5371219 3053662 3424712
2554 3424712 3803047 4358973 3009082 3408602 3664808 3915434 2817957 2439605 3513211
2545 3513211 5972005 5182120 3404497 2963132 3050926 2922482 2551506 2654198 4096813
2536 4096813 4918462 3962819 2720187 2835463 3312617 1960654 1595964 2288515 3384222
2527C384222j243990N10637J152617O10643j417267r33738J986746k85050j806191
2518A958629P11725K573215Q0745q76442K57837j29724o73318q07756j20294M29957
2508C404574r71202J80941K092647J132164j115533j996246O59078J677930j709540
2499C354813j105319k87926R30854K87815L57977n06658J073453Q1336M36063
2490D622408Q97939j302158j067716J14278J371620N52674j619598l43327M86347
2481C712467l04722n49347J28710o34580J271092O29065j196719Q84273N76244
2472D516483O09372l1091q23368m75159M36130p33063Q62924m33599K96880k25393
2462D000116m08948O19292K564640p39405l31840k87066P0689k85831j967798
$$ plain form
2527 3384222 2140232 2650869 3803486 4414129 2996862 2063124 4049870 3764820 1958629
2518 1958629 2670354 5243569 5324314 4447872 4705709 4575985 3902667 3094911 2974617 3404574
2508 3404574 2433372 2614313 4706960 5839124 4723591 2727345 3386423 5064353 3354813
2499 3354813 2249494 1961568 2892422 3180237 3538214 3031556 4105009 4186345 4622408
2490 4622408 5520347 4218189 3150473 3264751 4636371 5189045 3569447 3226120 3712467
2481 3712467 3407745 2858398 2987108 2352528 3623620 4252685 3055966 3940239 4516483
2472 4516483 5125855 5094764 4271396 3796237 4232367 3499304 4362228 3928629 4225509 4000116
2462 4000116 3591168 4210460 6775100 6035695 5703855 5416789 5487478 5201647 3233849
2453C233849j33622J643049j168160p39341J580158O42442n62980Q06247R74375
2444F276017R80710k050792m99650J30207J373857R34226r53413j304314J033769
2435E920617j92429P2948J058550p31473p20014Q0887P23317J36779J6882p45930
2425E620134J416798j041180r274r66923O03324J135875j948452o84523K637525
2416F763304P21038j385587j89187Q60233j87711j109906R0799J398591O92113
2407G653687o03637q09932p60612Q19234Q0666N50193J840388m06834j688321
2398F674832p6428J266515J53269N15517L9135N47160J276441M33688J394985
2389A2225114p87313k4060K607968J475467J2896N97552J875355L935259M50097
$$ plain form
2453 3233849 3100227 4743276 3575116 2835775 4415933 5058375 4495395 5301642 6276017
2444 6276017 7256727 5205935 4706285 4836492 6210349 7144575 6191162 4886848 5920617
2435 5920617 5728188 5801136 6859686 6128213 5408199 5489086 6212403 6349182 6366064 5620134
2425 5620134 7036932 5995752 5986478 5019555 5622879 6758754 4810302 4125779 6763304
2416 6763304 7484342 6098755 5909568 6769801 6582090 5472184 5562983 6961574 7653687
2407 7653687 7050050 6240118 5479506 6298740 6379406 6929599 8769987 8363153 6674832
2398 6674832 6598404 7864919 8018188 8533705 8572840 9120000 10396441 10830129 12225114
2389 12225114 11437801 11413741 14021709 15497176 15510072 16107624 17982979 21918238 22368335
2380B2368335m6236K520899O32021P62093l25971k802799k122511j676260K31123
2371A9540694J872332j166390k70192j277955o89290K328312J599900K292301
2363B4229712Q24603L61232R20312O81983n09471j383124j84496J320201k672726
2354B3588226k143460j289569R6129j315078k144841k69581j984288o47903J570744
2345A5460379J644818n16845k032856j775741K297168N59565Q84745j257652j135129
2336A4128452M74011K89668K78023K203516K147425J435661n5351P67689K945170
2327B4614264L041722K000368L068380R82310Q47764N31363J95186n25852l85463
2318C4370042k681732k563388k523012q56097P12861N11054n30517O5775k7462
$$ plain form
2380 22368335 22322099 24842998 25475019 26237112 25911141 23108342 20985831 19309571 19540694
2371 19540694 21413026 20246636 19976444 18698489 18009199 20337511 21937411 24229712
2363 24229712 25054315 25415547 26335859 27017842 26508371 25125247 24940751 26260952 23588226
2354 23588226 21444766 20155197 20251326 18936248 16791407 16521826 14537538 13889635 15460379
2345 15460379 17105197 16588352 14555496 12779755 15076923 15636488 16521233 15263581 14128452
2336 14128452 14602463 14892131 15170154 17373670 19521095 20956756 20901405 21669094 24614264
2327 24614264 27655986 29656354 32724734 33707044 34554808 35086171 35281357 34755505 34370042
2318 34370042 31688310 29124922 26601910 25745813 26458674 26969728 26439211 26504986 26477524
2309B6477524J466476J951460K115484J302110r57034n42384j210620m67112k437755
2300B7698149r62689k456957j686076o2374k553041j488763P98018o4586j581079
2291A7640602q75346J88777q30512n71027J353305k74614k389346J28152P99035
2282A5169026P35895j066587n20834k094771O92472L66328j847650K65467J482172
2273A3181518Q49369J3199J30271p61714j545821L21186P71892j678099l30708
2264A0951093J523672M38304k7235k21803J186144m73828n08578M2122j168954
2255A1740937K89393K86931K78865J481938O50886n6205m76435l37286M20220
2246A4279244j707513Q518l05089m11616M51230J193114N75003j213174P68658
$$ plain form
2309 26477524 27944000 29895460 32010944 33313054 32356020 31813636 30603016 30135904 27698149
2300 27698149 26735460 24278503 22592427 22530053 19977012 18488249 19286267 19221681 17640602
2291 17640602 16765256 16954033 16123521 15552494 16905799 16631185 14241839 14369991 15169026
2282 15169026 15904921 14838334 14317500 12222729 12915201 13281529 11433879 11699346 13181518
2273 13181518 14030887 14044086 14174357 13412643 11866822 12188008 12959900 11281801 10951093
2264 10951093 12474765 12913069 12885834 12664031 13850175 13376347 12867769 12909891 11740937
2255 11740937 12030330 12317261 12596126 14078064 14728950 14672745 14196310 13859024 14279244
2246 14279244 12571731 12580249 12275160 11863544 12314774 13507888 14082891 12869717 13638375
2237A3638375J245534p20258n14466O81113L56942M36405p29418Q27091R6856
2228A5318174K1906P53450p94938M33645R32273p21449J136744Q87455N09682
2219A8476942J318372J409265J097403K142384K647308J670538L773170K750402
2211C5285784l74914J223654J558758O58057k782674r51231m99667r92697q67302
2202C2257768J698516o7311J293149L250962j328849J59842J305221K776244K857181
2193D4202723K352721K028062N02024p65817j087560k887182k908540k901158
2185C8535273l026335k589212j148587j152520j243260J549601Q85939l45254
2177C1465645n10947K7889m11433j7880p42596j395890J19042j462801o9922N10453
$$ plain form
2237 13638375 14883909 14163651 13649185 14330298 14687240 15123645 14394227 15221318 15318174
2228 15318174 15340080 16093530 15298592 15732237 16664510 15943061 17079805 17967260 18476942
2219 18476942 19795314 21204579 22301982 24444366 27091674 28762212 32535382 35285784
2211 35285784 34910870 36134524 37693282 38351339 35568665 34617434 34117767 33125070 32257768
2202 32257768 33956284 33888973 35182122 38433084 37104235 37264077 38569298 41345542 44202723
2193 44202723 46555444 48583506 49085530 48319713 47232153 44344971 41436431 38535273
2185 38535273 35508938 32919726 31771139 30618619 29375359 30924960 31810899 31465645
2177 31465645 30954698 30982587 30571154 30553274 29810678 28414788 28533830 27071029 27001107 27511560
2167B7511560p70601j248574j176836N52690P15828J66702J428016K474759L095509
2158C2749053L719597Q0095J558338M240806M381013K457772J507463N09003k139946
2149D9063194j213585r79386l004898k536158r79633j423601Q68185o73883L40285
2140C9460520J744154J625880L178148Q03987r25016K335891m43996j62840j530075
2131D6086653l192464k548631j408880j109510l482000m781918l300314j200805
2123B5062131k61791j820125L39160j5708k39351J86751l038613k215910r95594
2114A7000950L18389R54509j378415j299296M46231Q05860O42277m6249j648028
2105A5796228j049071r9319J74725N97156l69294n98106J51145O07365j957250
$$ plain form
2167 27511560 26740959 25492385 24315549 24868239 25584067 25750769 27178785 29653544 32749053
2158 32749053 36468650 36548745 38107083 42347889 46728902 49186674 50694137 51203140 49063194
2149 49063194 47849609 46870223 43865325 41329167 40349534 38925933 39794118 39120235 39460520
2140 39460520 41204674 42830554 46008702 46812689 45887673 48223564 47779568 47616728 46086653
2131 46086653 42894189 40345558 38936678 37827168 34345168 29563250 26262936 25062131
2123 25062131 24800340 22980215 23319375 23303667 23064316 23251067 20212454 17996544 17000950
2114 17000950 17319339 18273848 16895433 15596137 16042368 16848228 17490505 17444256 15796228
2105 15796228 14747157 14647838 14822563 15419719 15050425 14452319 14603464 15210829 13253579
2096A3253579j98432j83411l9858J525208q79304Q00191n57004p83887J142231
2087A4079313J97856q78250l29676j798857J572466J477698o12501N88756q8111
2078A4208694Q66570p78984j35559K07955n29271J200711K33405J424210P21407
2069A7419138l78003k29849o85112q70269o03444J53587K499654J634598J080342
2060B0020642J19131r62707j781603M24152R23478p60061R47339j259633O72549
2051A8343287l40313j41262K573211R82305Q63255r19707R78110R59947J104902
2042B4403735K250820L609505K682366K598960M078938K012627K507452L144763
2034D7289166K350364m40082j032213j194625k615990k246768k504149l381387
$$ plain form
2096 13253579 13055147 12871736 12831878 14357086 13477782 14277973 13720969 12937082 14079313
2087 14079313 14277169 13398919 13069243 11270386 12842852 14320550 13708049 14296805 14208694
2078 14208694 15075264 14296280 14160721 14368676 13839405 15040116 15273521 16697731 17419138
2069 17419138 17041135 16811286 16126174 15255905 14652461 14806048 17305702 18940300 20020642
2060 20020642 20139773 19177066 17395463 17819615 18743093 17983032 18930371 17670738 18343287
2051 18343287 18002974 17861712 20434923 21417228 22280483 21360776 22338886 23298833 24403735
2042 24403735 26654555 30264060 32946426 35545386 39624324 41636951 44144403 47289166
2034 47289166 49639530 49199448 48167235 46972610 44356620 42109852 39605703 36224316
2026C6224316K41762j271268n33616j692016k97229j208024j582881J193043j372778
2017B9701309l274129k47938O65600J0543m57806J271769j67817J87893K67179
2008B7956603L78248N70294K051748L79169K342513O70527K192458J913175L679308
1999D2134043L179917K119129K745945J487323j158017n96692r56368j672139
1991D7283141q96091j725877p03494j51240j93080j441819l57680J319412m94846
1982D2638426J551062J026750o3265R92621R46990m50583r52520M98784P0556
1973D6258821k233687j942370K029010p24780J702561K179049K100235J532991
1965E0901830j13286j662976j237027j935899l074314k965468p56115j831658
$$ plain form
2026 36224316 36466078 35194810 34661194 32969178 32671949 31463925 29881044 31074087 29701309
2017 29701309 26427180 26179242 26844842 26855385 26397579 27669348 27501531 27689424 27956603
2008 27956603 28334851 28905145 30956893 31336062 33678575 34349102 36541560 38454735 42134043
1999 42134043 45313960 47433089 50179034 51666357 50508340 49911648 48955280 47283141
1991 47283141 46387050 44661173 43957679 43806439 43613359 42171540 41813860 43133272 42638426
1982 42638426 44189488 45216238 45152973 46145594 47092584 46642001 45689481 46188265 46258821
1973 46258821 44025134 42082764 44111774 43386994 45089555 47268604 49368839 50901830
1965 50901830 50788544 49125568 47888541 45952642 42878328 39912860 39156745 37325087
1957C7325087j357357l71344N40747j437581l87383o52476l81622K16183L11093
1948C3805347o48101R41766K033431J662413J724035L114716J468217R41792J046099
1939D6089715k56353M2609K86877k15111J076292J486866K033423l11883M54605
1930E0687040M03707q32372q51267r83314j566212N37306j276867l083237q07035
1921D2227749J90795O87674J00354O06435k52913j419870J476477J318010l49419
1912D4585292J542411O41244R44410l75435r89445j058771j465778K62772j914107
1903D2172593k376151j060459j624965p43368n02736q63704j393971J17637J64109
1894C3888985k48148j049340j284141j170292J124049M90704j880761J80115J349938
$$ plain form
1957 37325087 35967730 35596386 36137133 34699552 34312169 33659693 33278071 33494254 33805347
1948 33805347 33157246 34099012 36132443 37794856 39518891 42633607 44101824 45043616 46089715
1939 46089715 45833362 45875971 46162848 45947737 47024029 48510895 50544318 50232435 50687040
1930 50687040 51090747 50258375 49407108 48423794 46857582 47394888 46118021 43034784 42227749
1921 42227749 42418544 43106218 43206572 43813007 43560094 42140224 43616701 44934711 44585292
1912 44585292 46127703 46768947 47713357 47337922 46348477 45289706 43823928 44086700 42172593
1903 42172593 39796442 38735983 37111018 36367650 35864914 35001210 33607239 33724876 33888985
1894 33888985 33640837 32591497 31307356 30137064 31261113 31751817 29871056 30051171 31401109
1885C1401109P93382j110373m306J567908j201185O60491J311444m84434J114136
1876C4048172M47961J049819R15195n19238j375888j482021r43773M62663k332999
1867C0269891j084434n91629k066812k000592l64824m98313j182297P81060m20251
1858B2841799j796905k025547p11024J293497l64017j10117J81239j123639m89904
1849A7695382N6510k72630n58928J07813N03839M22855k162034r13978Q78493
1840A5757322R82107j97890r0382q83205M87038m16390K79616j073620j52423
1831A4692173q74785K286233m86028j011380r05614o6230Q80846p13339m08585
1822A3393291R28028n83488K69880j172764N45256L48190N84455m76151M71914
$$ plain form
1885 31401109 32194491 31084118 31079812 32647720 31446535 32107026 33418470 32934036 34048172
1876 34048172 34496133 35545952 36461147 35941909 34566021 33084000 32140227 32602890 30269891
1867 30269891 29185457 28593828 26527016 24526424 24161600 23663287 22480990 23262050 22841799
1858 22841799 21044894 19019347 18308323 19601820 19237803 19127686 19308925 18185286 17695382
1849 17695382 17751892 17479262 16920334 17028147 17531986 17954841 15792807 14878829 15757322
1840 15757322 16739429 16541539 16451157 15567952 16054990 15638600 15918216 14844596 14692173
1831 14692173 13817388 16103621 15617593 14606213 13700599 13634369 14515215 13801876 13393291
1822 13393291 14321319 13737831 14007711 12834947 13380203 13728393 14312848 13836697 14308611
1813A4308611N01665m12484l06827J62399j26275k39520J53267k75871M90127
1804A4255092O67521P16052j521432p91781O42719R45194K91694o16518j458839
1795A3129702J240452m04487J24471j084042K151269l75297Q07559j30859j030063
1786A4428705j527617J738690Q34801q71010p57753J224060P0932O13279R0608
1777A5844695j360943O22380J363570o23486p44361N33019R50844m79743K95294
1768A6401269M87632q22310q29935L88555L56586J408321J97660j140039N93514
1759A7041253k13311k0989j003654J671354j21175m3222m35362O92590N70068
1750A8137552O83344M68678Q36256M00086K12933m06836O22094j68310P03808
$$ plain form
1813 14308611 14810276 14397792 14090965 14253364 14127089 13887569 14040836 13764965 14255092
1804 14255092 14922613 15638665 14117233 13325452 13968171 14913365 15205059 14588541 13129702
1795 13129702 14370154 13965667 14090138 13006096 15157365 14782068 15589627 15458768 14428705
1786 14428705 12901088 14639778 15474579 14603569 13845816 15069876 15140808 15754087 15844695
1777 15844695 14483752 15106132 16469702 15846216 15101855 15634874 16585718 16105975 16401269
1768 16401269 16888901 16066591 15236656 15625211 15981797 17390118 17587778 16447739 17041253
1759 17041253 16827942 16806953 15803299 17474653 17353478 17310256 16874894 17567484 18137552
1750 18137552 18820896 19289574 20125830 20525916 20738849 20332013 20954107 20785797 21489605
1741B1489605M98382j077068r80688P25907j224467j167077n86144J815124m43753
1732A9049821j170876J119663R41004N28142k163877o54227J519624P79147o00898
1723A9347523k57093M51671k70739j158516J56719P66895P73113Q81086R55453
1714B1646112q3694J70678l18449J013112J144961j12148l27375j61417P84865
1705B3756645Q2596k61987J883369j353699K36858K21908n29098l54761Q37431
1696B4519262O02117R93267O88540L25139N56528r6029k25676J00815K43705J665836
1686B9373504m4331O74277J767724k08279O32481J525816J682178J991161J479197
1677C8873728N03667J420514L545060K021398J853836J904075J915197K572569
$$ plain form
1741 21489605 21987987 20910919 19930231 20656138 19431671 18264594 17678450 19493574 19049821
1732 19049821 17878945 18998608 19939612 20467754 18303877 17649650 19169274 19948421 19347523
1723 19347523 19090430 19542101 19271362 18112846 18269565 19036460 19809573 20690659 21646112
1714 21646112 21562418 21733096 21414647 22427759 23572720 23460572 23133197 22971780 23756645
1705 23756645 23839241 23577254 25460623 24106924 24343782 24565690 24036592 23681831 24519262
1696 24519262 25121379 26114646 26803186 27128325 27684853 27588824 27363148 27463963 27707668 29373504
1686 29373504 29329173 30003450 31771174 31562895 32195376 33721192 35403370 37394531 38873728
1677 38873728 39377395 40797909 44342969 46364367 48218203 50122278 52037475 54610044
1669E4610044L673585L129511L919621K196496M030721N242874M468585P455800
1661H8727237P633718J1649798J7246392K4517167L8523469N1466763N8771244
1654B98535788O4086580N6364260K4128263j5685060l3899633l8332518l9342694
1647C15854986m2371258l5533339k9744713k4130829j9557543j7862555j5012581
1640A31642168j2291918r722700p205614o541103o816447m862764k573636m055312
1632G7572674j782575k196806k533532j441869j785222j967194j555718l069933
1624F1239825k224254r82962o68978r15097j651259j96154m11349q73677j279539
1615E2036556r430j119256M02834k34536J70957j09757L63258J055809K76215
$$ plain form
1669 54610044 58283629 61413140 65332761 67529257 71559978 76802852 81271437 88727237
1661 88727237 96360955 108010753 125257145 149774312 188297781 239764544 298535788
1654 298535788 362622368 418986628 443114891 427429831 393530198 355197680 315854986
1647 315854986 273483728 237950389 208205676 184074847 164517304 146654749 131642168
1640 131642168 119350250 109627550 102421936 95880833 89064386 84201622 81627986 77572674
1632 77572674 75790099 73593293 71059761 69617892 67832670 65865476 64309758 61239825
1624 61239825 59015571 58032609 57363631 56448534 54797275 54601121 54189772 53316095 52036556
1615 52036556 52027126 50907870 51310704 51076168 51247125 51137368 51500626 52556435 52832650
1606E2832650k32233m63897R30527P26004N08518J454448R83429R99361J120337
1597E8859144L147665J913872L098424M800923N137308O050521P449021Q704562
1589I9161440P284967P252534M418891K606807K221985M696130L354840K063848
1581A33061442J593353J279217j71066k124551k454069j623440q4844k768408
1573A26707634n42625l07038l563038k944412j491801o71618k899310m122063
1565A10165729l175878m240311o067396n516660p472049m973470n045544n146120
1557F8528301l092161o062242m977596l230991o5889k574618n043849j399134
1549D2081821J516049k450172k134171r08127r11700j370790k166487L71314o50671
$$ plain form
1606 52832650 52600417 52136520 53067047 53793051 54301569 55756017 56739446 57738807 58859144
1597 58859144 62006809 63920681 67019105 71820028 76957336 83007857 90456878 99161440
1589 99161440 106446407 113698941 118117832 120724639 122946624 127642754 130997594 133061442
1581 133061442 134654795 135934012 135762946 133638395 131184326 129560886 129476042 126707634
1573 126707634 126165009 125857971 122294933 119350521 117858720 117187102 114287792 110165729
1565 110165729 106989851 102749540 96682144 91165484 83693435 78719965 73674421 68528301
1557 68528301 65436140 59373898 54396302 51165311 51099422 48524804 43480955 42081821
1549 42081821 43597870 41147698 39013527 38105400 37193700 35822910 33656423 34027737 33377066
1540C3377066q41915K96199P6575q80696j341146l18705J925952k43412j444130
1531C0605788J139964O58302j90662j118789m86297q39994o84781j507072l6038
1522B7540421j62567r03814r68920j085695P56399j649689J38499N55699K0804
1513B4241137o9132j278471m70759K10801M28279L35141k198855Q74972k11018
1504B1862095m96153J260829o78121m48956P3785M85529K16792K1190q76266J9925
1494B1440649n19955O16821o41910j114207K447339J526103r18707l23354P02411
1485B3215190K12149N8978N28815j399743j176751O17300J604359n77060m11872
1476B2671365J477423J115599m41000P9609K79817J179813p27679r71246N57916
$$ plain form
1540 33377066 32535151 32831350 32907925 32027229 30686083 30367378 32293330 32049918 30605788
1531 30605788 31745752 32404054 32213392 31094603 30608306 29768312 29083531 27576459 27540421
1522 27540421 27377854 26474040 25505120 24419425 25175824 23526135 23664634 24220333 24241137
1513 24241137 24172005 22893534 22422775 22633576 23061855 23396996 21198141 22073113 21862095
1504 21862095 21365942 22626771 21948650 21499694 21573479 22059008 22275800 22296990 21420724 21440649
1494 21440649 20920694 21537515 20895605 19781398 22228737 23754840 22836133 22512779 23215190
1485 23215190 23427339 23486317 24015132 22615389 21438638 22055938 23660297 23083237 22671365
1476 22671365 24148788 25264387 24823387 24902996 25182813 26362626 25634947 24663701 25221617
1467B5221617R86308L39879n8248L14686M32667l59402n68940P82888J493431
1458B8584886N78056j758661N26184J155566L37969j2829R02118M33658j532748
1449B9214199m69698J469650o26097K69084r4420K20840n06339P52789J359742
1440C1589750l73108L53411J127078K37702j991449K35933M4185J66741Q34429
1431C2224672J361414J310881n37228P26148J16563J172410J48997p98345k386501
1422C3339011K940023J761917n66940o92649K69130J012703j427644j5276l76996
1413C6243279j48837M70702L72068n87348M59532Q74980K29179J404577K40324
1404C9558456j217570j193254J820877R89552J44566m8500p25795K52916l2112
$$ plain form
1467 25221617 26207925 26547804 26489556 26804242 27236909 26877507 26308567 27091455 28584886
1458 28584886 29162942 27404281 27930465 29086031 29424000 29411171 30313289 30746947 29214199
1449 29214199 28744501 30214151 29588054 29857138 29762718 29983558 29477219 30230008 31589750
1440 31589750 31216642 31570053 32697131 32934833 30943384 31179317 31223502 31390243 32224672
1431 32224672 33586086 34896967 34359739 35085887 35202450 36374860 36523857 35725512 33339011
1422 33339011 36279034 38040951 37474011 36781362 37050492 38063195 36635551 36620275 36243279
1413 36243279 36094442 36565144 36937212 36349864 36809396 37684376 37913555 39318132 39558456
1404 39558456 38340886 37147632 38968509 39958061 40102627 40054127 39328332 39581248 39549136
1395C9549136n15433M5368K97906k57589M94577M29274J7910k151247J774139
1386C9684041J541796K76507j505627P68197Q27506J082468j60030n81316K66718
1377D2200260K53081o67072J603764J638017J00808l9499J306297K083610K59030
1368D8738296m89246J754076J238005J892197J291976O3848J474949J857736J313719
1359E9135556n06474p71654M44215J243388K155528k62932M07338J265418j40826
1350F2969557J016261J457373K1613O53127J011764J737840j064234j518866K195384
1341F8479819j13366Q28686n87223j473952J402814J595175l49447K13620l16804
1332F9679322R73572K68410k49836j057260k737042k035305n96661k792908k299556
$$ plain form
1395 39549136 39033703 39079071 39376977 39119388 39613965 40043239 40061149 37909902 39684041
1386 39684041 41225837 41502344 39996717 40764914 41592420 42674888 42514858 41933542 42200260
1377 42200260 42453341 41786269 43390033 45028050 45128858 45089359 46395656 48479266 48738296
1368 48738296 48249050 50003126 51241131 53133328 54425304 54489152 55964101 57821837 59135556
1359 59135556 58629082 57857428 58301643 59545031 61700559 61437627 61844965 63110383 62969557
1350 62969557 63985818 65443191 65464804 66117931 67129695 68867535 67803301 66284435 68479819
1341 68479819 68366453 69195139 68607916 67133964 68536778 70131953 69782506 69996126 69679322
1332 69679322 70652894 70921304 70671468 69614208 66877166 64841861 64245200 61452292 59152736
1323E9152736O87067M00113j18242j852296j53954J258489r34699k50429k42003
1314E7946782J05503k537943p8768N16197M53874M18397N51298l66767j045553
1305E5963020K96837J88568m17603K65925j11145r13552o01139m170j150113k05879
1295E3310749q2648j246589o97490J23405P15374R1865p98187J58874j023243
1286E0552110k11646j102622P63929r84268j048774N2300o19542R04427L08840
1277D8614754L69567l90799j199169o45063J158909P60718K42422l361537j587633
1268D3962169P80843j515982k660148L04350M26065o14860j936419O2222O7705
1259C8875945J05145J111725m44358n54211j253347o93595N04905J089474R13034
$$ plain form
1323 59152736 59839803 60239916 60121674 58269378 58115424 59373913 58439214 58188785 57946782
1314 57946782 58052285 55514342 55435574 55951771 56405645 56824042 57375340 57008573 55963020
1305 55963020 56259857 56448425 56030822 56296747 56185602 55272050 54670911 54666741 53516628 53310749
1295 53310749 53228101 51981512 51284022 51407427 52122801 52214666 51416479 51575353 50552110
1286 50552110 50340464 49237842 50001771 49017503 47968729 48021029 47401487 48305914 48614754
1277 48614754 48984321 48593522 47394353 46749290 47908199 48668917 48911339 45549802 43962169
1268 43962169 44743012 43227030 40566882 40871232 41297297 40682437 38746018 38808240 38875945
1259 38875945 38981090 40092815 39648457 39094246 37840899 37147304 37652209 38741683 39654717
1250C9654717k623070P35759j68740j258966l51944M75464R1171m22917k15179
1241C5916295L23137n13853j251322j41687o09884o49458p14106L86819L43141
1232C3089082k84132l94951J473164P72759k11424Q74516P12044j083172j103718
1223C3844168r12709K77720P32761J353885J212531O31593M88897J641465n33049
1214C8737262m68348M28587j36177K89962j350590L6498J043982n11127k93366
1205C7776683M84934Q14431Q92163r54428J9231K063383M64826R27102K015700
1196D4504025J647882J069282J319301J529234J420719M50211K710824K878816
1188E7530294J793254L585754J716310N056594L167030L007376K640474L312678
$$ plain form
1250 39654717 37031647 37767406 37598666 36339700 35987756 36463220 36554391 36131474 35916295
1241 35916295 36239432 35725579 34474257 34332570 33722686 33073228 32359122 32745941 33089082
1232 33089082 32804950 32409999 33883163 34655922 34444498 35319014 36031058 34947886 33844168
1223 33844168 32931459 33209179 33941940 35295825 36508356 37139949 37628846 39270311 38737262
1214 38737262 38268914 38697501 38561324 38851286 37500696 37537194 38581176 38070049 37776683
1205 37776683 38261617 39076048 39968211 39013783 39033014 41096397 41561223 42488325 44504025
1196 44504025 46151907 47221189 48540490 50069724 51490443 51940654 54651478 57530294
1188 57530294 59323548 62909302 64625612 69682206 72849236 75856612 78497086 81809764
1180H1809764M129421K809951M944667M503561K642910K618549M124628L624520
1172A11207971L193325K178703M120871L406130K657207M760381K218216K804832
1164A36547636K131287K579510K332465K89375L74026J474949j683031j440988
1156A42605229j555792j83784n38086j502443n17633o28722j339288k829670r73941
1147A32535870j077733q39219k642211l715289l010187l710948l738249k854769
1139A10947265l407720l917585k529383m005386k341472l263040l351759k631813
1131H5499107j564293j073558j328964k5068m73720N50897p05569P90396Q96513
1122H2565741J492664J823177J947236N33022J231745Q41694K715715M090631
$$ plain form
1180 81809764 85939185 88749136 93693803 98197364 100840274 103458823 107583451 111207971
1172 111207971 114401296 116579999 120700870 124107000 126764207 131524588 133742804 136547636
1164 136547636 138678923 141258433 143590898 143880273 144254299 145729248 144046217 142605229
1156 142605229 141049437 140865653 140327567 138825124 138307491 137678769 136339481 133509811 132535870
1147 132535870 131458137 130618918 127976707 124261418 121251231 117540283 113802034 110947265
1139 110947265 107539545 103621960 101092577 97087191 94745719 91482679 88130920 85499107
1131 85499107 83934814 82861256 81532292 81507224 81033504 81584401 80878832 81669228 82565741
1122 82565741 84058405 85881582 87828818 88361840 89593585 90435279 93150994 97241625
1114I7241625J43627J221927K808460J294218L31754j044290R58485M49358m07196
1105A02997968M58748M31424j001495L73540p14111j07455N64023L1348j674025
1096A01359965j032678j922460k603303l004971j472753j013166k406851k436804
1088H5466979j818779j346829r04882j772335k234116j581715k69893P36103l9052
1079G6235481p4940O94898j169051o31616l90063J068311J170336M91924J530653
1070G8925933R35132J192460p394J31659M09368J334285l97756J50122o244K006189
1060H4673754J511100J508314Q06369K06867J689450N21252K55988O11820p94907
1051I0990007J230676J697676K097576K603265k42636R0143L50951j200049M21629
$$ plain form
1114 97241625 97385252 98607179 101415639 102709857 103041611 101997321 102955806 103405164 102997968
1105 102997968 103456716 103888140 102886645 103260185 102546074 102438619 103002642 103033990 101359965
1096 101359965 100327287 98404827 95801524 92796553 91323800 90310634 87903783 85466979
1088 85466979 83648200 82301371 81396489 79624154 77390038 75808323 75538430 76274533 76235481
1079 76235481 76160541 76855439 75686388 75054772 74664709 75733020 76903356 77395280 78925933
1070 78925933 79861065 81053525 81046131 81177790 81587158 82921443 82523687 82673809 82667565 84673754
1060 84673754 86184854 87693168 88499537 88706404 90395854 90917106 91173094 91784914 90990007
1051 90990007 92220683 93918359 96015935 98619200 98376564 98466707 98817658 97617609 98039238
1042I8039238k06825Q20510J756636K30664n23704j010426j825601j775207j624425
1033I3880860k294189p94905l033142k67943N51320j001616j706905k069663j957010
1024H1306807j499396n79565j872871k087590L06652k99997p50202O41626J651594
1015G6817058P49085m75270P67501J09539r40877K780292M634601K143171L156808
1006H9741908J932711O53632L255373J550405J604855K464098K709439K314831
998A06227252K1330K627832J525917J690839K055965O80669J89601K016753J543791
989A18579949l87886J63184J998164J006816m08463M62579m10269o08963N38837
980A20933948k634121o87808p50324j320994l074881j492753q20122l021802l291341
$$ plain form
1042 98039238 97832413 98652923 100409559 100640223 100116519 99106093 97280492 95505285 93880860
1033 93880860 91586671 90791766 87758624 87490681 88042001 87040385 85333480 83263817 81306807
1024 81306807 79807411 79227846 77354975 75267385 75574037 75274040 74523838 75165464 76817058
1015 76817058 77566143 77090873 77858374 77967913 77027036 79807328 84441929 86585100 89741908
1006 89741908 91674619 92328251 95583624 97134029 98738884 101202982 103912421 106227252
998 106227252 106248582 108876414 110402331 112093170 114149135 114829804 115019405 117036158 118579949
989 118579949 118192063 118355247 120353411 121360227 120951764 121414343 121004074 120395111 120933948
980 120933948 118299827 117612019 116861695 115540701 112465820 110973067 110152945 107131143 103839802
971A03839802p22419j239370j104018j079187O52971K504911L340500M193865
963A10387055O604635R137643Q830550R220606P854995O71586m847758m849673
955A43009639n874342n777544n135312n377915m001373q35028r10086l241289
947A11856750j943864q01330j271704J666790J954132K843746M062990R670546
939A28038056Q449016L758205K333409J643843l079125l757788m879507n772764
931A26733345n034968l818845j672647j717263k327681k040191k076355k241467
923A05803928k361631k881967M7402R3750j162346j717479k508169o66554j194783
914I3452151q54830j897566j489533M22087p79404M78326P85609J51206j846J309940
$$ plain form
971 103839802 103117383 101878013 100773995 99694808 100347779 102852690 106193190 110387055
963 110387055 116991690 126129333 134959883 144180489 152035484 152707070 147859312 143009639
955 143009639 137135297 131357753 126222441 120844526 116843153 116008125 115098039 111856750
947 111856750 109912886 109111556 107839852 109506642 111460774 114304520 118367510 128038056
939 128038056 136487072 140245277 142578686 144222529 141143404 137385616 132506109 126733345
931 126733345 121698377 117879532 116206885 114489622 112161941 110121750 108045395 105803928
923 105803928 103442297 100560330 100607732 100701482 99539136 97821657 95313488 94646934 93452151
914 93452151 92597321 90699755 89210222 89632309 88852905 89331231 90116840 90268046 90266200 91576140
904I1576140J41121M84129k38616L1466l38548q85062n61440j54370r9226N26554
894I0482148k18426K101602K591176P26001K561521L940246M597186L686583P316374
885A17784411R715756J4196630J8114393K1196580K2816937K3362774K2968340
878B50155821J8533634J1868499J664519p547663j3076538j7101270j9418959
871B25078043k0587103j5706739j5733901j4592055j2622932r487463r683318
864A26664532q781939n413359m586298n300461k175137k454747j355173k995410
856I3602008q56144J117759P98952l96491N20538L24832M99411J365116Q47179
847I7823160K82374M99003l05561j583748k447712p97356P13752k238433l197555
$$ plain form
904 91576140 91717261 92201390 91962774 91994240 91655692 90770630 90209190 90054820 89955594 90482148
894 90482148 90263722 92365324 94956500 95682501 98244022 102184268 106781454 110468037 117784411
885 117784411 127500167 141696797 159811190 181007770 203824707 227187481 250155821
878 250155821 268689455 280557954 282222473 274674810 261598272 244497002 225078043
871 225078043 204490940 188784201 173050300 158458245 145835313 136347850 126664532
864 126664532 117882593 112469234 107882936 102582475 100407338 97952591 96597418 93602008
856 93602008 92745864 93863623 94662575 94266084 94786622 95111454 95610865 96975981 97823160
847 97823160 98105534 98604537 98298976 96715228 94267516 93470160 94183912 91945479 88747924
838H8747924k494643j880240k506713j671044k180775j300077k316618l902081
830G0495733l8827J23816j422143J24048m42582J233418j787650q11318p06214
821F6768281j280852j423629N76692o66056n3636J00411M42428j393364K35513
812F3305788j373634q5270N29464j87431J73037m90089L26505J508285N74211
803F4280866K30020j448827j544958J138072K008130p66822J477000P38221J076335
794F7188037l700L86206J127985Q8454Q56686K10882o89107J223098J393236P79320
784G2561097m57423J229151n29018k068350k56302j6924o5886j246159L62020
775F9512206j75757O87433k46266j276832J94095j89466L17216j050086O28918
$$ plain form
838 88747924 86253281 84373041 81866328 80195284 78014509 76714432 74397814 70495733
830 70495733 70456906 70580722 69158579 69282627 68840045 70073463 68285813 67474495 66768281
821 66768281 65487429 64063800 64640492 63974436 63920800 64021211 64463639 63070275 63305788
812 63305788 61932154 61846884 62376348 62188917 62361954 61871865 62198370 63706655 64280866
803 64280866 64510886 63062059 61517101 62655173 64663303 63896481 65373481 66111702 67188037
794 67188037 67184337 67570543 68698528 68786982 69643668 69854550 69165443 70388541 71781777 72561097
784 72561097 72103674 73332825 72803807 70735457 70479155 70462231 70396345 69150186 69512206
775 69512206 69336449 70023882 69777616 68500784 68694879 68505413 68822629 67772543 68401461
766F8401461J639402m71914j52597R45062J088699j17112K361908J457640J136781
757G6289330j297382J656307J962479J77877m89929n2008l37489R49039n1696
748G8806528J172568N18698J704764N28827r45661O21364K281890M271002M247221
739I3207201L790590N811913N008095M284323O65468q82551n221915n420963m156725
730I7085436m278612l302995l678648o07282k954943j515146m38752j458698j777538
721G7072822j82325j60037j421507O42252J084469q35601O88791P45633P05635
712G8340132O09187J996515J700322K833711L634782K733802K314627M963135
704I9126213N148522K085299R12443L515842L134078L992058K187768J117632
$$ plain form
766 68401461 70040863 69568949 69416352 70361414 71450113 71333001 73694909 75152549 76289330
757 76289330 74991948 76648255 78610734 78788611 78298682 78246674 77909185 78858224 78806528
748 78806528 79979096 80497794 82202558 82731385 81785724 82407088 84688978 88959980 93207201
739 93207201 96997791 102809704 107817799 112102122 112767590 111885039 106663124 101242161 97085436
730 97085436 92806824 89503829 85825181 85217899 82262956 80747810 80309058 78850360 77072822
721 77072822 76890497 76730460 75308953 75951205 77035674 76200073 76888864 77634497 78340132
712 78340132 78949319 80945834 82646156 85479867 89114649 91848451 94163078 99126213
704 99126213 104274735 106360034 107272477 110788319 113922397 117914455 120102223 121219855
696A21219855L279294J497543K102507M65120K089999Q49564p010j8851j634680
687A29843341M07112R25887k12044j580422j315875j037629m150936l487144j397056
678A17995234j308607l163367j527415k418090m13299Q27529K30228J065676J546065
669A12833954K793874L865231M321391M229801M302616O485437P504575P722019
661A54058898P400127Q806764J0373555J0025319J3265367J5261523J7292254
654B36483807K1187516K6900266L1030788L0963130K7485686K4014550J5418145
647D13483888L061997n365487r498110j0529604j1638371r712738p301425n090716
639C57409434k857180j39213P94663j156564n267376q445322j1559302j3185588
$$ plain form
696 121219855 124499149 125996692 128099199 128564319 130654318 131503882 131496872 131478021 129843341
687 129843341 130250453 131176340 130964296 129383874 128067999 127030370 122879434 119392290 117995234
678 117995234 116686627 113523260 111995845 109577755 109164456 109991985 110222213 111287889 112833954
669 112833954 115627828 119493059 123814450 128044251 132346867 138832304 146336879 154058898
661 154058898 161459025 170265789 180639344 190664663 203930030 219191553 236483807
654 236483807 257671323 284571589 315602377 346565507 374051193 398065743 413483888
647 413483888 416545885 411180398 401682288 391152684 379514313 369801575 362500150 357409434
639 357409434 354552254 354413041 355207704 354051140 348783764 340338442 328779140 315593552
631C15593552j2798295j4183471j0993847j0632972q637741o266897m713700j467582
623B45899047L35570K780858O348855R270560J3014864K0012704K4440897L1038749
615C53142104L7488705L9109429L6538338K5552768J4461255r01092j2789362
608D92602145j8259436k0323344j9595419j9858061j9149796j6899202j5161422
601C63355465j2413122j0919473j0755342r708604r505486r124084p356228m888000
593B88685126k316223q30151K6403L783146M730335P010012J1532146J4006915
585C26627709J7068058J9862704K3131456K5886510K9102737K9869058K7062447
578D98610679J9523981J0103535N02664q212430j0099898j2104666j2938878q674074
$$ plain form
631 315593552 302795257 288611786 277617939 266984967 258347226 252080329 247366629 245899047
623 245899047 246234617 249015475 255364330 264634890 277649754 297662458 322103355 353142104
615 353142104 390630809 429740238 466278576 491831344 506292599 505391507 492602145
608 492602145 474342709 454019365 434423946 414565885 395416089 378516887 363355465
601 363355465 350942343 340022870 329267528 319558924 310053438 300929354 293573126 288685126
593 288685126 286368903 285538752 285565155 289348301 294078636 301088648 312620794 326627709
585 326627709 343695767 363558471 386689927 412576437 441679174 471548232 498610679
578 498610679 518134660 528238195 528740859 520528429 510428531 498323865 485384987 476710913
570D76710913m153613K832617L995153N371399O33363o474276j3183483k0689339
562D45042734k3792115k7531541k7708283k6930459k5851177k3823713k1673191
555B67732255j8296284j7377313j5633176j4720481j0553821r769187r118329
548A72263664o809711o271475n961911p545855l953944l428802k468500l067740
540A32755726l715193j854657k443032m29520m17031k534697q49625m09550o00798
531A19501623R55110L28757J231147K924480L574386K714731R42460l00897R98666
522A32870463k097162k864199q50964m03047P09715J21778o4044j401870l067799
513A22952871n449149l530747l681552m618870l409335k551919k739555k549005
$$ plain form
570 476710913 472557300 475389917 479385070 484756469 485389832 478915556 465732073 445042734
562 445042734 421250619 393719078 366010795 339080336 313229159 289405446 267732255
555 267732255 249435971 232058658 216425482 201705001 191151180 181381993 172263664
548 172263664 165453953 159182478 153220567 145674712 141720768 138291966 135823466 132755726
540 132755726 129040533 127185876 124742844 124313324 123896293 121361596 120511971 120102421 119501623
531 119501623 120456733 120785490 122016637 124941117 128515503 131230234 132172694 131871797 132870463
522 132870463 130773301 127909102 127058138 126655091 127364806 127486584 127422540 126020670 122952871
513 122952871 117503722 113972975 110291423 105672553 102263218 99711299 96971744 94422739
505I4422739k539046j103611o83522L4739O97257J904394O71844J764315J608714
496I6777823L335427K992286m14302n09795N67589j279035L82835J182336K069040
487A05104204j211713j724052j146563l447085m806099l281322k165091l035379
479H4286900l439256j704257N21798j645255j725971N70372L413277K291663J308142
470H3877413K871635N043451L231589L321057L422265L407896J827651J47543
462A07150500j067309l113475n081792l895164k041045m173996m773799l985979
454G9017941l079914k220150k089941k044560J16295j591916l499829j319438
446F3288488j350477J002509l94743J178398J634547n41131l21906J154074J202608
$$ plain form
505 94422739 91883693 90780082 90096560 90131299 90828556 92732950 93404794 95169109 96777823
496 96777823 100113250 103105536 102691234 102181439 102749028 101469993 101852828 103035164 105104204
487 105104204 103892491 102168439 101021876 97574791 92768692 89487370 87322279 84286900
479 84286900 80847644 79143387 79665185 78019930 76293959 76864331 80277608 82569271 83877413
470 83877413 86749048 91792499 95024088 98345145 101767410 105175306 107002957 107150500
462 107150500 106083191 102969716 97887924 93992760 91951715 87777719 83003920 79017941
454 79017941 75938027 73717877 71627936 69583376 69699671 68107755 64607926 63288488
446 63288488 61938011 62940520 62545777 63724175 65358722 64817591 64495685 65649759 66852367
437F6852367N87072K235171J777513K175095J916536J993846L682472M674003
429H5894075L505019L264331M421302N506094O762465O464835Q164179J1380292
421A35362592J3703862J6165131J6315142J9003128K3995081K3251957K2345779
414B70142672J9808361J4772885R405806K389568L62389l246447j999771K55048
406C11890511N183277Q585569J1402868J6320726J5580907J0884242M563745k588625
398C81823220j0656693j6514232k2596827k4874833k5336484k4211457k1841272
391B35791422k1531401j8246042j5598722j5905457j3933605j3552593j0422920
384A26600682q127328p075688p326205o846571n561111l176425l924213l159474
$$ plain form
437 66852367 67439439 69674610 71452123 73627218 75543754 77537600 81220072 85894075
429 85894075 89399094 92663425 97084727 102590821 109353286 115818121 123982300 135362592
421 135362592 149066454 165231585 181546727 200549855 224544936 247796893 270142672
414 270142672 289951033 304723918 314129724 316519292 316881681 313635234 311635463 311890511
406 311890511 317073788 325659357 337062225 353382951 368963858 379848100 384411845 381823220
398 381823220 371166527 354652295 332055468 307180635 281844151 257632694 235791422
391 235791422 214260021 196013979 180415257 164509800 150576195 137023602 126600682
384 126600682 118473354 111397666 104071461 97224890 91663779 88487354 84563141 81403667
376H1403667m435148l225008l644076l701349k245793k408503k470399l27917
368E8945474r21062k606209l278745l10797m4473k433587j715991j092282j540528
359D5001800m54139K94383k711421j295294q93301N3871j095365j232801l88434
350C7279299j356872j41199j061198p44645J004065O72737m77910j225964k203437
341C1744876j873683O65919n95767m61594j447627j342730j26469N00855J87228
332B7251008m01260j05511L23526k128694r70179P75225j969870m66571J292150
323B3599824j262553l143510J298941L12134j452722n63721O02447O44965p15811
314A9319994R58154j430239q59517l43412J17224j589569Q29592N24289j826337
$$ plain form
376 81403667 76968519 73743511 70099435 66398086 64152293 61743790 59273391 58945474
368 58945474 58024412 55418203 52139458 51828661 51784188 49350601 47634610 46542328 45001800
359 45001800 44547661 44842044 42130623 40835329 39942028 39995899 38900534 37667733 37279299
350 37279299 35922427 35781228 34720030 33975385 34979450 35652187 35174277 33948313 31744876
341 31744876 29871193 30537112 29941345 29479751 28032124 26689394 26562925 27063780 27251008
332 27251008 26849748 26744237 27067763 24939069 23968890 24744115 22774245 22307674 23599824
323 23599824 22337271 19193761 20492702 20804836 19352114 18788393 19390840 20035805 19319994
314 19319994 20278148 18847909 17988392 17644980 17762204 16172635 17002227 17526516 15700179
305A5700179N32472n49264p45811P89031J475302r26843k24838L96785P60966
296A7207979o34004j320519l58943o20624M52255m38551j807025m02638L59093
287A2437023Q37550R21225k88205J71367j80681j491332j362230l25453L36249
278A1055513p88143K78358J02529r42291m22051n43186L38653J018158L8119j002399
268I133260l8949m74501J063357k57878J90519r48218j73329p72410Q3091M61918
258H266860M57846n18952m95739P60188k65156j245687J1395q97897N0272N64334
248F687464r03728o7625J035390K0191j756535r38743J262518N37543p1248J215196
238G020423o52554j298193J3829K158046J09355o95046M19906j871570p12715
$$ plain form
305 15700179 16232651 15683387 14937576 15726607 17201909 16275066 16050228 16447013 17207979
296 17207979 16573975 15253456 14894513 14273889 14726144 14287593 12480568 12077930 12437023
287 12437023 13274573 14195798 13907593 14078960 13898279 12406947 11044717 10719264 11055513
278 11055513 10267370 10545728 10648257 9705966 9283915 8740729 9079382 10097540 10135659 9133260
268 9133260 9094311 8619810 9683167 9425289 9615808 8667590 8494261 7721851 7804942 8266860
258 8266860 8724706 8205754 7710015 8470203 8205047 6959360 6970755 6072858 6123130 6687464
248 6687464 5783736 5716111 6751501 6771692 5015157 4076414 5338932 5876475 5805227 7020423
238 7020423 6367869 5069676 5083505 7241551 7350906 6655860 7075766 5204196 4491481
229D491481J019132K31480R65219J7355J82310k07723j440233j181643N11697
220D589075N5368j08098j119304o2974K168974J77243J71014m41610m7682q1642
210E300364k87894j240862q58256Q41593j79383J018158m7857k64482J371319
201E652700P20602L20862j998037j457453J880770P87947j476130r48508O91453
192D174206L00620K52130m42050J09879J24948N26971J21135p77869j024797M62181
182C827354l51626K09748K12815o98725j876094K502172K79419p26279m74238
173B904546J63105m1825j228407L61888J443097m43994R84698M51918Q1542j066472
163C610096k6520l52214L72645r70993j329997J002941K132988K66456k97600
$$ plain form
229 4491481 5510613 5742093 6707312 6724667 6906977 6699254 5259021 4077378 4589075
220 4589075 4644443 4536345 3417041 3354067 5523041 5700284 5871298 5429688 5382006 5300364
210 5300364 5012470 3771608 2913352 3754945 3575562 4593720 4545863 4281381 5652700
201 5652700 6373302 6694164 4696127 3238674 5119444 5907391 4431261 3482753 4174206
192 4174206 4474826 4726956 4284906 4394785 4519733 5046704 5167839 4389970 3365173 3827354
182 3827354 3475728 3685476 3898291 3199566 1323472 3825644 4105063 3378784 2904546
173 2904546 3067651 3025826 1797419 2159307 3602404 3158410 4143108 4595026 4676568 3610096
163 3610096 3583576 3231362 3604007 2633014 1303017 2305958 4438946 4705402 4407802
154D407802n4633q59652l46907o66804J99503l7466j173248P27318J236833j068918
144B363828o1525K69919J052497l22391k600540k7069J522970m63328j25749J054620
134B663232M69796r99808l29283N79871R68723p53844Q04312M17165j009934j153856
124A656374J144278L81829L26304m99221l77583L85316J341416n43604J414m6687
114C769836K4322j007227q86246L92003O41403q30274R04636k18760l60911p42583
104A686199K09725K33822L4590p00562P46843o63253k84582J38209R52136m32367
94A920760m24262L09105j156179o35571l62577J571090k70201L6188O22373J40541
84A751267Q4439n75944m18043m02943L49556j56246K28111J80246q21536o04880
$$ plain form
154 4407802 4353169 3493517 3146610 2479806 2679309 2641843 1468595 2195913 3432746 2363828
144 2363828 2302303 2572222 3624719 3302328 701788 674719 2197689 1734361 1608612 2663232
134 2663232 3133028 2133220 1803937 2383808 3352531 2598687 3402999 3820164 2810230 1656374
124 1656374 2800652 3182481 3508785 3009564 2631981 3017297 4358713 3815109 3816523 3769836
114 3769836 3794158 2786931 1900685 2292688 2934091 2103817 3008453 2789693 2428782 1686199
104 1686199 1895924 2129746 2164336 1463774 2210617 1547364 1262782 1400991 2353127 1920760
94 1920760 1496498 1805603 649424 13853 -348724 1222366 952165 988353 1610726 1751267
84 1751267 1835706 1259762 841719 438776 788332 632086 860197 1040443 218907 -385973
74c85973J316269J616620j352150n35970J199152O05940j110532r19297R09586
65A343645N91015k93526j094820l10109P25121N77268L87834m14443q9177p16924
55G05884l56592Q16750l26399m97822P39237k89729k55620m75042N14246J000039
45A574952j047782k24203Q65853j121692q9321O18521P74935m61226m85608P14240
35A118669N39870o41542o43231m79323M33300j08972Q33619Q7464L66791p86848
25G19797j479295K10366J101891j41807q57535o9410M55540n6192j082091Q39535
15c59201K015412j126825l55761q83198j56906L61431k64976J050504k38788j57185
5a15493J44799o03270k03306p66005J97602
$$ plain form
74 -385973 930296 2546916 1194766 658796 1857948 2463888 1353356 434059 1343645
65 1343645 1934660 1641134 546314 236205 961326 1538594 1926428 1511985 1422808 705884
55 705884 349292 1166042 839643 341821 1081058 791329 535709 60667 574913 1574952
45 1574952 527170 302967 1168820 47128 -42193 576328 1351263 890037 404429 1118669
35 1118669 1658539 1016997 373766 -105557 327743 218771 1052390 1139854 1506645 719797
25 719797 -759498 -549132 552759 410952 -446583 -515993 -60453 -116645 -1198736 -359201
15 -359201 1656211 529386 173625 -709573 -866479 -505048 -770024 280480 41692 -115493
5 -115493 29306 -573964 -777270 -1543275 -1345673
0a345673
$$ plain form
0 -1345673
$$ Imaginary data points
##PAGE= N=2
##DATA TABLE= (X++(I..I)), XYDATA
16383c1372618p14366J3260J266321L49259m44405j27894J430825n99775j90158
16374c0389551N51015R81938J06338m30468J477752K36870o55501O7043J99965
16365b7854599O91364n32212L12410O40736m5436R2051K63114J011233R93279
16356b4428060q8859l12529L38936J442252o8066j113938M42366J412109M78975
16347b1896814l19070j60354Q98884o30375K96849J296316p55987M63164J110082
16338a9697305J324761j547102r84582K083664J34585n04500K16091Q56571J41986
16329a7975831j021876l0349J064675J717073l18578l82886O15375Q53078K55626
16320a5223693p60537Q70383O2200n60057j9382O69103L25285O00573O7129M64530
$$ plain form
16383 -31372618 -32086984 -32073724 -30807403 -30458144 -30902549 -31030443 -29599618 -30199393 -30389551
16374 -30389551 -29838536 -28856598 -28750260 -29180728 -27702976 -27466106 -28121607 -28054564 -27854599
16365 -27854599 -27163235 -27695447 -27383037 -26742301 -26787737 -26695686 -26432572 -25421339 -24428060
16356 -24428060 -24516919 -24829448 -24490512 -23048260 -23116326 -24230264 -23787898 -22375789 -21896814
16347 -21896814 -22215884 -22376238 -21477354 -22107729 -21810880 -20514564 -21270551 -20807387 -19697305
16338 -19697305 -18372544 -19919646 -20904228 -18820564 -18685979 -19190479 -18974388 -18117817 -17975831
16329 -17975831 -18997707 -19028056 -17963381 -16246308 -16564886 -16947772 -16332397 -15479319 -15223693
16320 -15223693 -15984230 -15113847 -15051647 -15611704 -15631086 -14961983 -14636698 -14036125 -13968996 -13504466
16310a3504466L43519j027797J29274O66587J029825j93722l84697L61843M30056
16301a2149578P05726j26686K8512R1917M36305o31578O72803L10433P71526o12980
16291a0503600K142311L51869j448709N5047J295814J40774j077561L49908R16182
16282g777965m66859J34404J312574J09067j391597k84520N45167Q5024n56296
16273h291001O61035m22366R02340n86822R35992K24451L90795J15283J196174
16264d874119l80850j910468P2880J478200J762554k125661J043461J115071O4018
16255c754914o90771N22796P8980m39608k84582J43432P38398M60170L32359k29763
16245c123503n83602j45254l25401J879456L56866l7448m63027J877827j337932
$$ plain form
16310 -13504466 -13160947 -14188744 -14059470 -13392883 -12363058 -12556780 -12941477 -12579634 -12149578
16301 -12149578 -11443852 -11570538 -11542026 -11450109 -11013804 -11645382 -10972579 -10662146 -9890620 -10503600
16291 -10503600 -8361289 -8009420 -9458129 -9403082 -8107268 -7966494 -9044055 -8694147 -7777965
16282 -7777965 -8244824 -8110420 -6797846 -6688779 -8080376 -8364896 -7819729 -7734705 -8291001
16273 -8291001 -7629966 -8052332 -7149992 -7736814 -6800822 -6576371 -6185576 -6070293 -4874119
16264 -4874119 -5254969 -7165437 -7092557 -5614357 -3851803 -5977464 -4934003 -3818932 -3754914
16255 -3754914 -4445685 -3922889 -3843909 -4283517 -4568099 -4424667 -3686269 -3226099 -2893740 -3123503
16245 -3123503 -3707105 -3852359 -4177760 -2298304 -1941438 -1978886 -2441913 -564086 -1902018
16236a902018k13039N26945P51480p39724M17905m59614M20243m98781J341822
16227c54781l25651J64552k34653o6396l97630L93905J00986M84019N90540k40852
16217A14039L1680N87507n79979j70537M76248m46721k85869J345108N72448k4240
16207A619684j06313l95025L5663l37179o5043k40430M63514J378257r18083k44811
16197A190234M99096l99445K98795O87655J145426j551365Q66743p75764n22312
16188A439063P19549J329736p11897m57115J154373K47049q35459o19114P60173
16179C026358K91387l22520o92522l55446J658458K91430r4881n05591P93355
16170D090028r15785l48792o0002L74407L21108j99910K79100J592590K53549
$$ plain form
16236 -1902018 -2115057 -1588112 -836632 -1576356 -1158451 -1618065 -1197822 -1696603 -354781
16227 -354781 -680432 -515880 -750533 -816929 -1214559 -820654 -719668 -235649 354891 114039
16217 114039 145719 733226 153247 -17290 458958 12237 -273632 1071476 1643924 1619684
16207 1619684 1513371 1118346 1154009 816830 751787 511357 974871 2353128 1435045 1190234
16197 1190234 1689330 1289885 1588680 2276335 3421761 1870396 2737139 1961375 1439063
16188 1439063 2158612 3488348 2776451 2319336 3473709 3720758 2885299 2266185 3026358
16179 3026358 3317745 2995225 2302703 1947257 3605715 3897145 3802264 3296673 4090028
16170 4090028 3174243 2825451 2765449 3139856 3460964 3261054 3540154 5132744 5386293
16161E386293l04602r86544L47361j167774m92461J263709P09531J69095N61990
16152E486598p40842n64192j84150J280928o50674j443272J472192N92887j084904
16143D164571P46077r5683J713787k53205j723529j281206J123676K951605j027994
16134F318099k003502L40920N74018o87531J03390Q36125r1800q47365K9945J285997
16124E858296j16978r31401l16736J215486J211478j947273r93209J162721J642582
16115F784966K2806j180466J49559J262340p52299l12328j83933j204260J221899
16106E808284P65766J309195Q2179j910295Q28358r2988j615403L46147O93741
16097F214984L7365k68282m79452O20471k7883j215452J87776N47861o51983K93292
$$ plain form
16161 5386293 5081691 4095147 4442508 3274734 2782273 4045982 4755513 4924608 5486598
16152 5486598 4745756 4181564 3997414 5278342 4627668 3184396 4656588 5249475 4164571
16143 4164571 4910648 4814965 6528752 6275547 4552018 3270812 4394488 7346093 6318099
16134 6318099 4314597 4655517 5229535 4542004 4645394 5481519 5389719 4542354 4572299 5858296
16124 5858296 5741318 4809917 4493181 5708667 6920145 4972872 3979663 5142384 6784966
16115 6784966 6807772 5627306 5776865 7039205 6286906 5974578 5790645 4586385 5808284
16106 5808284 6574050 7883245 7965424 6055129 6883487 6790499 5175096 5521243 6214984
16097 6214984 6252349 5984067 5504615 6125086 6097203 4881751 5069527 5617388 4965405 5258697
16087E258697l35755J016056m16595n00185j21046J175976j320375o81278O49053
16078D724548q66740J12774J60776J22230K717195j126548l35229j441404P07321
16069D774923M39069j76333k09752R18361r39781n6600J088267L55402j164145
16060E029411q482L35256R2911j355777J492842J481761O18145l81510k272067
16051E032490K37495J016861J128435j073431p65656J91667j6184l09632K12859
16042E654904K86972N41283J195945J06474j913103m1279l46557O67073j104084
16033E047628l73070p34427J711975N90660N54742j577355m01130O16898P56089
16024F192010k16572n37625o63500N75104k93460n1635O26882Q08824j04706P50964
$$ plain form
16087 5258697 4922942 5938998 5522403 5022218 4901172 6077148 4756773 4075495 4724548
16078 4724548 3857808 3970582 4131358 4253588 6970783 5844235 5509006 4067602 4774923
16069 4774923 5213992 5037659 4827907 5746268 4806487 4749887 5838154 6193556 5029411
16060 5029411 5020929 5356185 5449096 4093319 5586161 7067922 7686067 7304557 5032490
16051 5032490 5269985 6286846 7415281 6341850 5576194 5767861 5751677 5442045 5654904
16042 5654904 5941876 6483159 7679104 7785578 5872475 5831196 5484639 6151712 5047628
16033 5047628 4674558 3940131 5652106 6242766 6797508 5220153 4819023 5435921 6192010
16024 6192010 5975438 5437813 4774313 5349417 5055957 5004322 5631204 6440028 6335322 7086286
16014G086286n82638j162880l64208K005977l38565r3829r06563Q420J80409K45304
16004F077713O26629j44347j31189L68968j254044k43025J439907k16489N81916
15995G106039n7620n19171J244585J194949j541614j053052l5251J125978j054611
15986F410232j613947J560464J880636q82700o76197J07345J92264j171923p86623
15977E019551k52130P90202p54486P60725p70312N57250r0210k19892j132900
15968C907798J225596J059486l30877K4136K63909K992j93935p63466K302110
15959G497749K5175q42312j459225n69605P85469j26364m23576N54902Q33531
15950F275744M91663J8994m59494k76890l49281j823421k2998J81148q40112j40456
$$ plain form
16014 7086286 6503648 5340768 4976560 6982537 6643972 6550143 5643580 5652000 5832409 6077713
16004 6077713 6704342 6559995 6428806 6797774 5543730 5300705 6740612 6524123 7106039
15995 7106039 7048419 6529248 7773833 8968782 7427168 6374116 6338865 7464843 6410232
15986 6410232 4796285 6356749 8237385 7354685 6678488 6785833 6978097 5806174 5019551
15977 5019551 4767421 5557623 4803137 5563862 4793550 5350800 5260590 5040698 3907798
15968 3907798 5133394 6192880 5862003 5886139 6150048 6153040 5959105 5195639 7497749
15959 7497749 7522924 6680612 5221387 4651782 5437251 5310887 4887311 5442213 6275744
15950 6275744 6767407 6786401 6326907 6050017 5700736 3877315 3854317 4035465 3195353 3054897
15940C054897K215421O79829j797641J478446J589210j303376j618948J995899
15932F293737j68786l074567P85874J818938P33171J45346r83737P11761o74648
15923E587089J26323L20444j10952p22222J25853M30539J056020K712r37569P1325
15913E949562l48895p17848M78371q39249R7780J137986M09357j003347k49180
15904D914537Q25959J41027p4171o57322j304834n80258J551000J649010j142298
15895E322650n28371M69059J023415n29975M98980q32489Q68545N49198q5815
15886F755197Q44983j275321N8559P06397n6674l59041j845197K4644R02530J393966
15876G150043j3734q0479q5823l48936j362392j163824j396018O69274K19706
$$ plain form
15940 3054897 5270318 5950147 4152506 5630952 7220162 5916786 4297838 6293737
15932 6293737 6124951 3050384 3836258 5655196 6388367 6533713 5549976 6261737 5587089
15923 5587089 5713412 6033856 5922904 5200682 5326535 5757074 6813094 6815806 5878237 5949562
15913 5949562 5600667 4882819 5361190 4521941 4619721 5757707 6167064 5163717 4914537
15904 4914537 5740496 5881523 5807352 5150030 3845196 3264938 4815938 6464948 5322650
15895 5322650 4794279 5263338 6286753 5756778 6255758 5423269 6291814 6841012 6755197
15886 6755197 7600180 6324859 6383418 7089815 7033141 6674100 4828903 4853547 5756077 7150043
15876 7150043 7136309 7055830 6970007 6621071 5258679 4094855 2698837 3368111 3587817
15867C587817K113059J345514o85093o36836J223708l77684r54578m04581r5015
15858E116311Q64414m31402J779129k99939o83057R46213l23009J17836r63757
15849F122739K56293j72385n09955N55203L62938O01215l69295o48678j079188
15840E118887J26254j100227J879019k43437j0687K69405j34081o86984Q12937
15831F031086O09969r9553r23317l5994P51440j67728m94457P31873n0220P34240
15821G087339j502346j593200L25461J321298m02428J020142P9599M65362l68747
15812F432480k36442j957891J55287J159303O66820j54530j948682M15955J135667
15803E667967N69353N09407r84588j50007L86097J94823K45949J26918q54705
$$ plain form
15867 3587817 5700876 7046390 6361297 5724461 6948169 6570485 5615907 5211326 5116311
15858 5116311 5980725 5549323 7328452 7028513 6345456 7291669 6968660 7086496 6122739
15849 6122739 6379032 6206647 5696692 6251895 6614833 7216048 6846753 6198075 5118887
15840 5118887 5245141 4144914 6023933 5780496 5769809 6039214 5905133 5218149 6031086
15831 6031086 6641055 6541502 5618185 5582191 6333631 6165903 5671446 6403319 6353099 7087339
15821 7087339 5584993 3991793 4317254 5638552 5236124 6256266 6335865 6801227 6432480
15812 6432480 6196038 4238147 4393434 5552737 6219557 6065027 4116345 4532300 5667967
15803 5667967 6237320 6746727 5762139 5612132 5998229 6193052 6439001 6565919 5711214
15794E711214J485199N16874j568137J36458k29060m43627q09575K25144J5180
15785E039670N82994J581647O73076q10651j163638j539106K36471M81503K36306
15776E318272r49232j36983J116735L02221K66545J360459k053791m38406n38903
15767D246917r91003M36602K020175J141562j36176R90037p6831k153720j32086
15758E345477R02854j51829k286050P37002J281543L02373J100646j5385j882575
15749E334056J340968j013168q77920O8028M97706P33426J19205J57057K77672
15740F637030q14274N56761m87216j471386J00777o4253J200118J236357o2894
15731F831020k93135p94706J961273p97313q55642n40913o43967J429571j019041
$$ plain form
15794 5711214 7196413 7713287 6145150 6281608 6052548 5608921 4799346 5024490 5039670
15785 5039670 5622664 7204311 7877387 7066736 5903098 4363992 4600463 5081966 5318272
15776 5318272 4369040 4232057 5348792 5651013 5917558 7278017 5224226 4785820 4246917
15767 4246917 3255914 3692516 5712691 6854253 6718077 7708114 7631283 5477563 5345477
15758 5345477 6248331 6096502 3810452 4547454 5828997 6131370 7232016 7216631 5334056
15749 5334056 6675024 5661856 4783936 4851964 5349670 6083096 6202301 6359358 6637030
15740 6637030 5822756 6379517 5892301 4420915 4521692 4457439 5657557 6893914 6831020
15731 6831020 6537885 5743179 7704452 6907139 6051497 5510584 4866617 6296188 5277147
15722E277147O0676J134285L23351j042856j94416N93101k62015j960540N73672
15713D502405J569404J61705r68384p1455J020780O8222j380833m87476P01533
15704E115901M87347O81798j970K13594j569967N96362K287315j524020M38083
15695F724443r02519l3158K84929J886860j473620p23615Q41450L90115j007042
15686E987843q54048N79723J80892m73164Q47102j216851m68623J801963l4819
15677F350018j015659M5299p53512k76465P26245O50836P0613O95856j591500
15668D901731K96336l4801M79028l48553r85809J803974l3231j44885L39524K82791
15658F556105l50214l19429j124755J38062J270993O87579j42871k3292L8405
$$ plain form
15722 5277147 5337823 6472108 6795459 5752603 5558187 6151288 5889273 3928733 4502405
15713 4502405 6071809 6233514 5265130 5193675 6214455 6282677 4901844 4414368 5115901
15704 5115901 5603248 6285046 6283076 6496670 4926703 5523065 7810380 6286360 6724443
15695 6724443 5821924 5788766 6073695 7960555 6486935 5763320 6604770 6994885 5987843
15686 5987843 5133795 5713518 5894410 5421246 6268348 5051497 4582874 6384837 6350018
15677 6350018 5334359 5379658 4626146 4349681 5075926 5726762 5797375 6493231 4901731
15668 4901731 5198067 5163266 5642294 5293741 4307932 6111906 6078675 5933790 6273314 6556105
15658 6556105 6205891 5886462 4761707 4899769 6170762 6858341 6715470 6692178 6730583
15649F730583P0320l98122m25610m14888J177650p68552j54689M22135P61673
15640G000500J392333l75786j483947o60114l36378J104600o38636M50639P43059
15631G196270j005128L34003J230387j447222j106461O3885J411519L31229L12838
15622G321320k17714L66604Q02331p56611j743447m10176J66478O2208N93477
15613F184470K45520m16182k29962J665689k95482j378036J054122M5058o98668
15604F176529k27368m85228n45782K85539R22359p02585R0761Q56530o66025n93772
15594E110958J683129Q67561r60697j074007M55375j50350J06472K41117j473773
15585D805785r11107P35460J183468p43959m99110J288261Q75901r82572l45489
$$ plain form
15649 6730583 6800903 6402781 5977171 5562283 6739933 5971381 5816692 6238827 7000500
15640 7000500 8392833 8017047 6533100 5872986 5536608 6641208 6002572 6453211 7196270
15631 7196270 6191142 6525145 7755532 6308310 5201849 5265734 6677253 7008482 7321320
15622 7321320 7103606 7470210 8272541 7515930 5772483 5362307 5528785 5590993 6184470
15613 6184470 6429990 6013808 5783846 7449535 7154053 5776017 6830139 6875197 6176529
15604 6176529 5949161 5463933 4918151 5203690 6126049 5423464 5514225 6370755 5704730 5110958
15594 5110958 6794087 7661648 6700951 5626944 6082319 5931969 6038441 6279558 4805785
15585 4805785 3894678 4630138 5813606 5069647 4570537 5858798 6734699 5752127 5406638
15576E406638j87772L14049o61481j772478J478401o7504p70889J23647J395424
15567E258035J109141j614622J18003K365857K55122k164505j85653O1214J490501
15558F693093l1152l40187J77744j064409Q106p12522N61187K1653N16688J04808
15548E935009N14195r81762j072364K51972K05945Q98845q09156k56115l75518
15539D311051J047971L24775j173459P67473p7270Q92035j55853o45682k47175
15530E043866J27880j81760R37923m34372Q54988M28822p35490N06407k47260
15521F301004J37022r51582j882976J385587J249547j006616o00068J241443J533257
15512G406618j027230j00593L36298j120916P841r45562O13769N06561o05018
$$ plain form
15576 5406638 5218866 5532915 4871434 3098956 4577357 4509853 3738964 3862611 5258035
15567 5258035 6367176 4752554 4870557 7236414 7491536 5327031 5141378 5202592 6693093
15558 6693093 6661941 6321754 6499498 5435089 5443195 4730673 5291860 5313513 5830201 5935009
15548 5935009 6449204 5467442 4395078 4647050 4852995 5751840 4942684 4686569 4311051
15539 4311051 5359022 5683797 4510338 5277811 5200541 6092576 5936723 5291041 5043866
15530 5043866 5171746 4989986 5927909 5493537 6348525 6777347 6041857 6548264 6301004
15521 6301004 6438026 5486444 3603468 4989055 6238602 5231986 4631918 5873361 7406618
15512 7406618 6379388 6278795 6615093 5494177 5502018 4556456 5170225 5676786 5071768
15503E071768R23657M18288L36328k419378O740K445958O8794j262569J277667
15494F867253P52206k37679k99543m05389R25420j97675k262943n82163K013485
15485F572972J719296l71156J319878j91334j319011j393098P54950J10025j853613
15476E348909J647094P22493m06155o13426N31453n0050q17547q71549J02252
15467E593474K0756P67148m84286L5841K41646k83287P80854m37098O61805L30582
15457G227435j013781j067606r30211J562102J140091M73334k69962l60176j112292
15448E648934Q52316R7639p45223L92404P49456P21904q31347k32319q92032J85582
15438E947314j46940P03740k56188j476627J13509J620826P26959j061226l19291
$$ plain form
15503 5071768 5995425 6413713 6750041 4330663 4337403 6783361 6852155 5589586 6867253
15494 6867253 7619459 7381780 7082237 6676848 7602268 7404593 5141650 4559487 6572972
15485 6572972 8292268 7921112 9240990 9049656 7730645 6337547 7092497 7202522 5348909
15476 5348909 6996003 7718496 7312341 6698915 7230368 7180318 6362771 5491222 5593474
15467 5593474 5614230 6381378 5897092 5932933 6174579 5891292 6672146 6235048 6896853 7227435
15457 7227435 6213654 5146048 4215837 5777939 6918030 7391364 7121402 6761226 5648934
15448 5648934 6501250 6598889 5853666 6246070 6995526 7717430 6886083 6653764 5761732 5947314
15438 5947314 5800374 6504114 6247926 4771299 4884808 6505634 7232593 6171367 5852076
15429E852076P57407j54493l20329j317871n07985L46364J792340L84428q77378
15420E954559l11392P86457j164789J10921J14155o93221p68092J165882R62614
15411F157094j09407j138596O81768J51444n53498j169779j92571m42494J66851
15402C550812J746620O70537m59763P6633k4964N49108o12275k24065J35858j891401
15392C517100J087448J051780L31181n19068L49513m09407J241490L83104j32828
15383F900313j258195j123483J085785O83217j761386N51863J121932M21261J18855
15374F740162N57545j364343M65627r58031J657187p23648j229540M85656J15481
15365E746096M2487P65155j985307M96961J002670m61294p08557n19787R77737
$$ plain form
15429 5852076 6609483 6454990 6134661 4816790 4308805 4655169 6447509 6831937 5954559
15420 5954559 5643167 6429624 5264835 5375756 5489911 4796690 4028598 5194480 6157094
15411 6157094 6047687 4909091 5590859 5742303 5188805 4019026 3826455 3383961 3550812
15402 3550812 5297432 5967969 5508206 5584839 5559875 6108983 5496708 5272643 5408501 3517100
15392 3517100 4604548 5656328 5987509 5468441 5817954 5408547 6650037 7033141 6900313
15383 6900313 5642118 4518635 5604420 6287637 4526251 5078114 6200046 6621307 6740162
15374 6740162 7297707 5933364 6398991 5440960 7098147 6374499 5144959 5630615 5746096
15365 5746096 5788583 6553738 4568431 5065392 6068062 5606768 4898211 4378424 5356161
15356E356161K82668N84202K60009l69277j764589l07289M85499J936746j0340
15347F453790j443504L17899J763762p5053q52920l9087J3811n85092J913905
15338G467511m38741J65657l96976l66007Q22219n17352j092719O70857J019929
15329G334378R26513j548370n20994N86662N53504j83400Q93136j227936p62084
15320F051409K3607j7292R38447N0471P51360l10282n82729j080675p83572J091161
15310F131905K26776p23107R92122Q83966n08718j478917j02985J333539l12941
15301F441640k21265O54818l14169j89117J72292O2208K1242K75917p2185O62161
15291G493542j072344O38623K23463o65433K77986J076237n52551j219130m83514
$$ plain form
15356 5356161 5638829 6223031 6483040 6113763 4349174 4041885 4527384 6464130 6453790
15347 6453790 5010286 5328185 7091947 7016894 6163974 6124887 6138698 5553606 7467511
15338 7467511 7028770 7194427 6797451 6431444 7253663 6736311 5643592 6314449 7334378
15329 7334378 8260891 6712521 6191527 6778189 7331693 7148293 8041429 6813493 6051409
15320 6051409 6075016 6057724 6996171 7046642 7798002 7487720 6904991 5824316 5040744 6131905
15310 6131905 6358681 5635574 6627696 7511662 7002944 5524027 5421042 6754581 6441640
15301 6441640 6220375 6875193 6561024 6371907 6544199 6606407 6627649 6903566 6831381 7493542
15291 7493542 6421198 7059821 7283284 6617851 6895837 7972074 7419523 6200393 5716879
15282E716879N40282O39657K49932K21615j82520k34916j58963m26078j223782
15273E142106Q56602N56773M91181K3166R6946j242669o08192O90549K94893N92349
15263F893704k25379l83798Q50536K71259J35916j269805M69117Q91622p31730
15254F901442k051615M86914P81070j19316J067141R44088j33963k277731r83990
15245D614040J352730J032481q20782J32361j13653j58134j96978l57607M57839
15236E942297O27308k575L77816L39523j161155q91562J559776J060221L42567
15227H194216k159198J69267J178771j506616j405030J740445N43591J036959
15219G792405o979j153825o32697p31878J410915j67711j043388R92019Q32378
$$ plain form
15282 5716879 6257161 6896818 7146750 7368365 7185845 6950929 6791966 6365888 5142106
15273 5142106 5998708 6555481 7046662 7069828 7166774 5924105 5315913 6006462 6301355 6893704
15263 6893704 6668325 6284527 7135063 7406322 7542238 6272433 6741550 7633172 6901442
15254 6901442 4849827 5336741 6117811 5998495 7065636 8009724 7875761 5598030 4614040
15245 4614040 5966770 6999251 6178469 6310830 6197177 6039043 5842065 5484458 5942297
15236 5942297 6569605 6567030 6944846 7284369 6123214 5231652 6791428 7851649 8194216
15227 8194216 6035018 6204285 7383056 5876440 4471410 6211855 6755446 7792405
15219 7792405 7785426 6631601 5998904 5267026 6677941 6510230 5466842 6458861 7291239
15210G291239j202945K28036O83826j097291Q90399K39105M12105o74767j08781
15201F660926n8641j010155O8477M87429J08894o6792L64203J90225n43075N91545
15191F793036n94544j216649J064048K6483l59784r32567Q65088J429397j757369
15182E317139m29644K109377N686r98307K33030N94267n12759r74338J363769
15173F708220p8613j420902J353152P3083k01515r43255p53238J351361O89412
15164F777705J76212j096416j546186K210415O1016l97190n08722r27393J5072
15155D764513R53541L67955p81227j88135J284273J435440k314014j884908P13151
15146D350589K887162K52267j189592J41359n59017K94801k2568O28112n6300
$$ plain form
15210 7291239 6088294 6316330 7000156 5902865 6793264 7032369 7444474 6769707 6660926
15201 6660926 6602285 5592130 5660607 6148036 6256930 6190138 6554341 6744566 6201491 6793036
15191 6793036 6198492 4981843 6045891 6072374 5712590 4780023 5645111 7074508 5317139
15182 5317139 4887495 6996872 7002558 6004251 6237281 6831548 6318789 5344451 6708220
15173 6708220 6629607 5208705 6561857 6634940 6433425 5490170 4736932 6088293 6777705
15164 6777705 6953917 5857501 4311315 6521730 6582746 6185556 5676834 4749441 4764513
15155 4764513 5718054 6086009 5304782 5116647 6400920 7836360 5522346 3637438 4350589
15146 4350589 7237751 7490018 6300426 6441785 5882768 6177569 6155001 6783113 6726813
15137F726813q36930Q34912K70256L98070n64114j600115J021374K119216j062046
15128G307436k400991J471949P37930p61557j033078Q03877J200575n62543J67676
15119F931274r0927p42698l48458r79960K035058R9981l83863j351275J388573
15110F557705Q53866n6969j80851P27028K44497k745191m84110P75201N88939
15101F280115o21870l77285J522507j456873n93533J264245N75158o79800L84063
15092F296727L93507q37887j468273r829J786557N90400k05492p25792O93454
15083F513372N9444N41742j70914J747824j009541k36070O60622n39914j420997
15074F145568O6574O03087M11580m05228l64348L33789L09618Q759J77425n31042
$$ plain form
15137 6726813 5889883 6724795 6995051 7393121 6829007 5228892 6250266 8369482 7307436
15128 7307436 4906445 6378394 7116324 6354767 5321689 6125566 7326141 6763598 6931274
15119 6931274 6840347 6097649 5749191 4769231 6804289 6904270 6520407 5169132 6557705
15110 6557705 7411571 7354602 7173751 7900779 8145276 5400085 4915975 5691176 6280115
15101 6280115 5658245 5280960 6803467 5346594 4753061 6017306 6592464 5912664 6296727
15092 6296727 6690234 5852347 4384074 4374245 6160802 6751202 6545710 5819918 6513372
15083 6513372 6572816 7114558 6943644 8691468 7681927 7445857 8106479 7566565 6145568
15074 6145568 6212142 6815229 7226809 6821581 6457233 6791022 7100640 7109399 7286824 6755782
15064F755782K73959Q84754j550720q65962M19669O6144M15724n91490P06081
15055F513941J89951M12721j176271K85880O45745J104911j357098k444413J583510
15046E758877j03955M4822j53814J642708J82233j089751P40870Q3027m88073
15037F616944j020856K53075P03039n82466r06036O78575P89612N39251n45553
15028F525585j027131m25606J088077q7615n96441n82140J455973k20622j237302
15019D892778J084815m73307q57916j06694q2763p73348J447852J995820p82421
15010F344816j67091M71057k23170q68924M62331j20359j585860P74872M01609
15001E489281l35595M89362J369684M22954k85336J001099j253474j568353o27515
$$ plain form
15064 6755782 7029741 7914495 6363775 5497813 5917482 5983626 6399350 5807860 6513941
15055 6513941 6703892 7116613 5940342 6226222 6871967 7976878 6619780 4175367 5758877
15046 5758877 5654922 5699744 5545930 7188638 7370871 6281120 7021990 7105017 6616944
15037 6616944 5596088 5849163 6552202 5969736 5063700 5742275 6531887 7071138 6525585
15028 6525585 5498454 5072848 6160925 6073310 5476869 4894729 6350702 6130080 4892778
15019 4892778 5977593 5504286 4646370 4539676 4456913 3683565 5131417 7127237 6344816
15010 6344816 6177725 6648782 6425612 5556688 6019019 5898660 4312800 5087672 5489281
15001 5489281 5153686 5643048 7012732 7435686 7150350 8151449 6897975 5329622 4702107
14992D702107O3778K01876N02273K81774j91910J411729r08301q2138P11356j387836
14982E304708N86066N07522N35834j564810q07035J317657k23404L04320K63444
14973F224302r71553q09716K634123K30369M1389L2400m26743P05929J36209j225772
14963F570937j640690Q1339J501825p6098J60421q50392k76896R79164P46128
14954G195738j425695k34966R73493Q37253q24224O36960k256015o30861K334224
14945F605907M69747j517144j091507J050342J518663J232862O244j128640n86720
14936F559754O06896j236211K28181P87926p2781K02871J204891j561445r23467
14927E796615Q38020P36746N34785j422194N29879l28585K77678N33963j481507
$$ plain form
14992 4702107 4765885 4967761 5470034 5751808 5559898 6971627 6063326 5981188 6692544 5304708
14982 5304708 5890774 6398296 6934130 5369320 4562285 5879942 5656538 5960858 6224302
14973 6224302 5252749 4443033 7077156 7307525 7348914 7381314 6954571 7660500 7796709 6570937
14963 6570937 4930247 5011586 6513411 6437313 6597734 5747342 5470446 6449610 7195738
14954 7195738 5770043 5535077 6508570 7345823 6521599 7158559 4902544 4271683 6605907
14945 6605907 7075654 5558510 4467003 5517345 7036008 8268870 8275114 7146474 6559754
14936 6559754 7166650 5930439 6158620 6946546 6873765 7076636 8281527 6720082 5796615
14927 5796615 6634635 7371381 7906166 6483972 7013851 6685266 6962944 7496907 6015400
14918F015400Q90758m76454j098223N58956Q21192l47094K85397J277052j573459
14909F353525n26331j86772O84797L8550j249056J93873P10030J252985j31727
14900G139874j623432k03122J062140p02571j387688J339128J80412L79976o15946
14891E568771m28922J543989m39774j29305J694613k164614L33959j01395L27940
14882F205262Q71553o56643k04051p89030L57474M23236l5300n01210Q56101k92460
14872F234932j413042m67949J685574R8421J297026r11194j729851R40963J019029
14863F753909m47840q73658m47937J636466J46469j138626J306480Q40614n77864
14854G198013N28051j287540N59105k011228P41123J242520k26723o26818J339093
$$ plain form
14918 6015400 6906158 6429704 5331481 5890437 6711629 6364535 6649932 7926984 6353525
14909 6353525 5827194 5640422 6325219 6363769 5114713 5308586 6018616 7271601 7139874
14900 7139874 5516442 5313320 6375460 5672889 4285201 5624329 5804741 6184717 5568771
14891 5568771 5139849 6683838 6244064 6114759 7809372 5644758 5978717 5877322 6205262
14882 6205262 7076815 6420172 6216121 5427091 5784565 6207801 6172501 5671291 6527392 6234932
14872 6234932 4821890 4353941 6039515 6137936 7434962 6523768 4793917 5734880 6753909
14863 6753909 6306069 5432411 4984474 6620940 6767409 5628783 6935263 7775877 7198013
14854 7198013 7726064 6438524 6997629 4986401 5727524 6970044 6743321 6116503 7455596
14845G455596M58585j08709k11810M4813j759124j285823N88694R24692L46914
14836F453828p01606J485470N82066p50363j255162K2837J030123L67947j717429
14827E517711M05016Q77336L3683l81236R78234J302785j628278m13723L69107
14818G060635q2325q05358M96929J153903N50662M86846J17133k98640k291574
14809F388211N93304q25607P9686J278227Q1224m56381L00862M84373j78797n35456
14799G209646n49747J410052r72345J03273K2459j78431J170368M19955q55219
14790G780011j95397j738259q57784J244638N32444J220300Q7798N01675Q83531
14781I458957j312850k278394m29954M1793P20426l54820k336N24350k50259J033343
$$ plain form
14845 7455596 7914181 7805472 7593662 7638475 5879351 4593528 5182222 6106914 6453828
14836 6453828 5752222 7237692 7819758 7069395 5814233 5837070 6867193 7235140 5517711
14827 5517711 5922727 6800063 6833746 6452510 7430744 8733529 7105251 6691528 7060635
14818 7060635 6978310 6172952 6669881 7823784 8374446 8861292 8978425 8679785 6388211
14809 6388211 6981515 6155908 6235594 7513821 7595045 7138664 7439526 7923899 7745102 7209646
14799 7209646 6659899 8069951 7097606 7200879 7223338 7044907 8215275 8635230 7780011
14790 7780011 7584614 5846355 4988571 6233209 6765653 7985953 8073751 8575426 9458957
14781 9458957 8146107 5867713 5437759 5479552 6199978 5845158 5842822 6367172 6116913 7150256
14771G150256J362269r5048j873491r63359o72654j042164K493926J237202R99855
14762H596792q95936J45888k72592k310612j025248J124585J252040r53016J0281
14753E672182M46957L87859j87994J67348J808599j018014p57936j260447M89108
14744E747662Q36346j189544n9203K153600R74780k453966m47946M72610N81881
14735F616220j525726O76573K056842j538748r60880O20750L12867m88547j017286
14726D752065R46346L64620j167554o618L14089M15853p29408O06820K13442L0727
14716E740382m83444N2737M76275L3567J031154o34839l01396N47464M90274j369284
14706E582890j11400P70980p27113Q27165l25147o09726j09155J346586l50462
$$ plain form
14771 7150256 8512525 8417477 6543986 5580627 4907973 3865809 6359735 7596937 8596792
14762 8596792 7700856 7846744 7574152 5263540 4238292 5362877 6614917 5661901 5672182
14753 5672182 6119139 6506998 6319004 6486352 8294951 7276937 6519001 5258554 5747662
14744 5747662 6584008 5394464 5335261 7488861 8463641 6009675 5561729 6034339 6616220
14735 6616220 5090494 5767067 7823909 6285161 5324281 5945031 6257898 5769351 4752065
14726 4752065 5698411 6063031 4895477 4888859 5202948 5618801 4889393 5496213 5709655 5740382
14716 5740382 5256938 5309675 5785950 5819517 6850671 6215832 5914436 6461900 6952174 5582890
14706 5582890 5471490 6242470 5515357 6342522 6017375 5407649 5298494 6645080 6294618
14697F294618j214935j38450O65606J53381l69281Q14100k71152j69349K15582
14688E980120k59466p18288j21235R02131O82733n50782k78294J515877l17798
14679F834998O72747K06569k33395q69479r48081M04643q1452K16593M47948q96040
14669E755051J742707K47172o42262j53145N53812N13855k131496M51283P41090
14660G078067k088105j57514K001890J306196l04455k246092R64324R63127p34685
14651F782753l10720l03895J756192K09642j999047K052289l10603L485n66707
14642G313389O22963K46881k513303k12737K054770M07209n575j137558J433500
14633H209539O27549p86325j218552j70432q18659O53819n5718L80835r8677J17345
$$ plain form
14697 6294618 5079683 4941233 5606839 5760220 5390939 6205039 5933887 5764538 5980120
14688 5980120 5720654 5002366 4881131 5783262 6465995 5915213 5636919 7152796 6834998
14679 6834998 7507745 7714314 7480919 6611440 5663359 6068002 5986550 6203143 6651091 5755051
14669 5755051 7497758 7744930 7102668 6949523 7503335 8017190 5885694 6336977 7078067
14660 7078067 4989962 4832448 6834338 8140534 7836079 5589987 6554311 7517438 6782753
14651 6782753 6472033 6168138 7924330 8133972 6134925 8187214 7876611 7880096 7313389
14642 7313389 7936352 8183233 5669930 5457193 7511963 7919172 7913597 6776039 8209539
14633 8209539 8837088 8050763 6832211 6661779 5843120 6496939 6441221 6822056 6723379 6840724
14623F840724J408362j08584p66342k81408K24480M7054r46038M1433Q10726O62864
14613G933271r87201J57901R47015o8321j310528r02803R61405Q43624j322965
14604F251398N55700J169091L35135q25098k018573O92959m68185o91945O49519
14595E650001K150522K19301j156164k06239M44068p47661j272552j2967O01655
14586E669964n32134P4498r5145J424070K1233L9122p39777K50288n81031M29094
14576E960182j45766l45242J76005R83214Q55869j491703j97895l57704j50774
14567E286186M47335J9874R90232j050460K35301M49619q4191O88678j108689
14558E873885l45489M81893o32280o95483j76406L97991J408890o83959j00500
$$ plain form
14623 6840724 8249086 8140502 7374160 7092752 7317232 7364286 6418248 6459681 7270407 7933271
14613 7933271 6946070 7103971 8050986 7982665 6672137 5769334 6730739 7574363 6251398
14604 6251398 6807098 7976189 8311324 7486226 5467653 6160612 5692427 5000482 5650001
14595 5650001 7800523 8019824 6863660 6657421 7101489 6353828 5081276 5068309 5669964
14586 5669964 5137830 5212328 5117183 6541253 6562486 6601608 5861831 6112119 5531088 5960182
14576 5960182 5814416 5469174 5645179 6628393 7484262 5992559 5794664 5436960 5286186
14567 5286186 5733521 5753395 6743627 5693167 5928468 6378087 6293896 6982574 5873885
14558 5873885 5528396 6010289 5378009 4682526 4506120 4904111 6313001 5629042 5528542
14549E528542n72261m66761K881883M63712j126286p84180m69363R53549j26501
14540F282334q169K29728j16509J667445J31377l30206j791293K83046R07302
14531G255055J33445j210106j126561J090044J174893R1464j265699j123668k80421
14522D738446J809714m63062j111912L37712M82869M08824k20855L66965k04848
14513F143853q22518Q49419o2325O91612L6963P42888r95768r90785J355576l02635
14503F646280n4807k27946l02431J155436j51066K70950J46499K04619n95958
14494G091576L9709r16141L45538o65184O22689K446845l98733j343739j246929
14485E975631J220062K35393J1138j740633J119871M30938M49556J125508K75291
$$ plain form
14549 5528542 4956281 4489520 7371403 7835115 6708829 5924649 5455286 6408835 6282334
14540 6282334 6274165 6503893 6387384 8054829 8186206 7856000 6064707 6347753 7255055
14531 7255055 7388500 6178394 5051833 6141877 7316770 7408234 6142535 5018867 4738446
14522 4738446 6548160 6085098 4973186 5310898 5793767 6202591 5981736 6348701 6143853
14513 6143853 5321335 6170754 6108429 6800041 6837004 7579892 6584124 5593339 6948915 6646280
14503 6646280 6591473 6363527 6061096 7216532 7065466 7336416 7482915 7687534 7091576
14494 7091576 7131285 6215144 6560682 5895498 6518187 8965032 8566299 7222560 5975631
14485 5975631 7195693 7431086 7442224 5701591 6821462 7252400 7701956 8827464 9102755
14476I102755j059213k23185j007519L80033j301332M62492P47752l4450J443607
14467H510940J428854j692693K86089k2851L8789j278110j11049l63619J26539
14458F922889J378313q92989p80469J521987J283446j030210j302939J43229j017218
14449F226039m91882Q93061R59851J119318j36999r10276j099610J213811l56735
14440G416578j20525q46055K106592r05015j09485l50331J237371m73735n97975
14431G357420j549509J095906L27834j031615p07835K371570p66537l40417j141603
14422E615214k01704K90653K40251M92j013853l57835K190876p05501k97617Q7529
14412E848505r09905j60471J305483m57693R7057K71296J520629l95581j141548
$$ plain form
14476 9102755 8043542 7820357 6812838 7192871 5891539 6354031 7101783 7067333 8510940
14467 8510940 9939794 8247101 8533190 8510339 8549128 7271018 7159969 6796350 6922889
14458 6922889 8301202 7408213 6627744 8149731 9433177 8402967 7100028 7243257 6226039
14449 6226039 5734157 6627218 7587069 8706387 8569388 7659112 6559502 7773313 7416578
14440 7416578 7296053 6449998 8556590 7651575 7542090 7191759 8429130 7955395 7357420
14431 7357420 5807911 6903817 7231651 6200036 5492201 7863771 7097234 6756817 5615214
14422 5615214 5413510 5704163 5944414 5944906 4931053 4573218 6764094 6058593 5760976 5848505
14412 5848505 4938600 4778129 6083612 5625919 5722976 5994272 7514901 7119320 5977772
14403E977772J360310l80611p54492l10123J076890j620812n13517R80051K465869
14394H281337q29558o2706k145295m79589M34954J163255K75075j001834o35057
14385E000582k9773k90178L90760r4810o21775J847106Q37760j818262j91514
14376E029896l7458Q03141k60274j034698J14211j17620q893J777276j062324
14367E203257L60678J78815m55662R13741m51304l15967L01591n58475L27919
14358E504593J704002P81070r20167q09946m2940j09768K41997Q31957K22552
14349G403350O74806j525039j58438q98634P67777N64382L97101o41718k34742
14340F348845j453311L62324R80458r91427J056140o69990L87935O00637j43239
$$ plain form
14403 5977772 7338082 6957471 6202979 5892856 6969746 5348934 4835417 5815468 8281337
14394 8281337 7451779 7389073 5243778 4764189 5199143 6362398 6637473 5635639 5000582
14385 5000582 4970809 4680631 5071391 4976581 4354806 6201912 7039672 5221410 5029896
14376 5029896 4992438 5795579 5535305 4500607 4614818 4497198 4488305 6265581 5203257
14367 5203257 5563935 5742750 5287088 6200829 5749525 5433558 5735149 5176674 5504593
14358 5504593 7208595 7989665 7069498 6259552 6216612 6106844 6348841 7180798 7403350
14349 7403350 8078156 6553117 6394679 5496045 6263822 6828204 7225305 6583587 6348845
14340 6348845 4895534 5257858 6238316 5246889 6303029 5633039 6020974 6621611 6478372
14331F478372l90328J590393J335274q20204j713598l27775P60221J10531M04292
14322G427178Q07697N42926O22847j027183q06193j198663k71767l16097J442096
14313G222841O49279p98219o33668J598174K1383l43039q84870j006539O97287
14304F522629k92949l88557R58055Q47961Q72119q06490n31777l2442p54117j0311
$$ plain form
14331 6478372 6088044 7678437 9013711 8193507 6479909 6152134 6912355 7022886 7427178
14322 7427178 8234875 8777801 9400648 8373465 7567272 6368609 6096842 5780745 7222841
14313 7222841 7872120 7073901 6440233 8038407 8059790 7716751 6831881 5825342 6522629
14304 6522629 6229680 5841123 6799178 7647139 8519258 7712768 7180991 7148549 6394432 6384121
$$ [...]
##END NTUPLES=NMR SPECTRUM
##END=
