##TITLE=1H_DE-80H_X3
 200.13MHz, d2o
 8 sc
 
 19ns.26.2.2025
##JCAMPDX= 6.0         $$ Bruker NMR JCAMP-DX V2.0
##DATA TYPE= NMR SPECTRUM
##DATA CLASS= NTUPLES
##ORIGIN= UXNMR, Bruker Analytische Messtechnik GmbH
##OWNER= pz
$$ XWIN-NMR		Version 3.5
$$ Wed May  6 12:45:09 2026 Russian Standard Time (UT+4h)  Yarkov@DPX200
##.OBSERVE FREQUENCY= 200.1313
##.OBSERVE NUCLEUS= ^1H
##.ACQUISITION MODE= SIMULTANEOUS
##.ACQUISITION SCHEME= undefined
##.AVERAGES= 8
##.DIGITISER RES= 18
##SPECTROMETER/DATA SYSTEM= spect
##.PULSE SEQUENCE= zg30
##.SOLVENT NAME= DMSO
##.SHIFT REFERENCE= (INTERNAL, DMSO, 0, 18.0299)
##AUDIT TRAIL= $$ (NUMBER, WHEN, WHO, WHERE, WHAT)
$$ ##TITLE= Audit trail, XWIN-NMR		Version 3.5
$$ ##JCAMPDX= 5.01
$$ ##ORIGIN= Bruker BioSpin GmbH
$$ ##OWNER= Yarkov
$$ C:/Bruker/XWIN-NMR/data/yarkov2/nmr/H-C/1/pdata/1/auditp.txt
$$ ##AUDIT TRAIL=  $$ (NUMBER, WHEN, WHO, WHERE, WHAT)
(   1,<2026-05-06 12:43:15.06 +0400>,<Yarkov>,<DPX200>,
      <created by zg, POWCHK disabled, PULCHK disabled
       configuration hash MD5:
       00 E9 B6 7A A2 85 ED C7 34 08 36 98 17 FE 4E 26
       data hash MD5: 16K
       01 FC 7E 26 4A FD 29 27 9D 80 09 71 83 48 BF F3>)
(   2,<2026-05-06 12:43:22.82 +0400>,<Yarkov>,<DPX200>,
      <Start of raw data processing
       efp BC_mod = 2 LB = 0.25 FT_mod = 6 PKNL = 1 PHC0 = -5511.716 PHC1 = 11.42193 SI = 16K 
       data hash MD5: 16K
       0B CA 51 AA 6E F3 AC 47 45 93 34 B4 EC CA 29 D5>)
(   3,<2026-05-06 12:43:52.75 +0400>,<Yarkov>,<DPX200>,
      <pk PHC0 = -158.0001 PHC1 = 0 
       data hash MD5: 16K
       84 D4 24 17 B6 C3 5E D6 1D 18 2F 11 05 13 C2 92>)
(   4,<2026-05-06 12:43:56.62 +0400>,<Yarkov>,<DPX200>,
      <abs ABSG = 5 
       data hash MD5: 16K
       C9 65 5D 17 5A F5 D8 7B E0 09 0C AA 2C 84 85 3C>)
$$ ##END=
$$ 
$$ hash MD5
$$ 1C 29 5B 9C C9 69 9B AD 63 A2 0C C3 FD 5B 26 B2
##$RELAX= 
##$RELAX= 
##$RELAX= 
##$RELAX= 
##$RELAX= 
##$RELAX= 
$$ Bruker specific parameters
$$ --------------------------
##$DU= <C:/Bruker/XWIN-NMR>
##$EXPNO= 1
##$NAME= <H-C>
##$PROCNO= 1
##$TYPE= <nmr>
##$USER= <yarkov2>
##$AMP= (0..31)
100 100 100 100 100 100 100 100 100 100 100 100 100 100 100 100 100 100 
100 100 100 100 100 100 100 100 100 100 100 100 100 100 
##$AQSEQ= 0
##$AQ_mod= 1
##$AUNM= <au_zg>
##$AUTOPOS= <>
##$BF1= 200.13
##$BF2= 200.13
##$BF3= 200.13
##$BF4= 200.13
##$BF5= 200.13
##$BF6= 200.13
##$BF7= 200.13
##$BF8= 200.13
##$BYTORDA= 1
##$CFDGTYP= 0
##$CFRGTYP= 5
##$CHEMSTR= <none>
##$CNST= (0..31)
1 1 145 1 1 1 1 1 1 1 1 1 1 1 1 1 1 1 1 1 1 1 1 1 1 1 1 1 1 1 1 1 
##$CPDPRG= <>
##$CPDPRG1= <>
##$CPDPRG2= <>
##$CPDPRG3= <>
##$CPDPRG4= <mlev>
##$CPDPRG5= <mlev>
##$CPDPRG6= <mlev>
##$CPDPRG7= <mlev>
##$CPDPRG8= <mlev>
##$CPDPRGB= <>
##$CPDPRGT= <>
##$D= (0..31)
0 0.7 0 0 0 0 0 0 0 0 0 0.03 0 0 0 0 0 0 0 0 0 0 0 0 0 0 0 0 0 0 0 0 
##$DATE= 1778056994
##$DBL= (0..7)
120 120 120 120 120 120 120 120 
##$DBP= (0..7)
150 150 150 150 150 150 150 150 
##$DBP07= 0
##$DBPNAM0= <>
##$DBPNAM1= <>
##$DBPNAM2= <>
$$ [...]
##$SUBNAM3= <"">
##$SUBNAM4= <"">
##$SUBNAM5= <"">
##$SUBNAM6= <"">
##$SUBNAM7= <"">
##$SUBNAM8= <"">
##$SUBNAM9= <"">
##$SW= 18.0517328524113
##$SWIBOX= (0..15)
0 0 2 0 0 0 0 0 0 0 0 0 0 0 0 0 
##$SW_h= 3612.71676300578
##$TD= 16384
##$TD0= 1
##$TE= 0
##$TE2= 300
##$TE3= 300
##$TEG= 300
##$TL= (0..7)
0 120 120 120 120 120 120 120 
##$TP= (0..7)
150 150 150 150 150 150 150 150 
##$TP07= 0
##$TPNAME0= <>
##$TPNAME1= <>
##$TPNAME2= <>
##$TPNAME3= <>
##$TPNAME4= <>
##$TPNAME5= <>
##$TPNAME6= <>
##$TPNAME7= <>
##$TPOAL= (0..7)
0.5 0.5 0.5 0.5 0.5 0.5 0.5 0.5 
##$TPOFFS= (0..7)
0 0 0 0 0 0 0 0 
##$TUNHIN= 0
##$TUNHOUT= 0
##$TUNXOUT= 0
##$USERA1= <user>
##$USERA2= <user>
##$USERA3= <user>
##$USERA4= <user>
##$USERA5= <user>
##$V9= 5
##$VALIST= <valist>
##$VCLIST= <CCCCCCCCCCCCCCC>
##$VD= 0
##$VDLIST= <DDDDDDDDDDDDDDD>
##$VPLIST= <PPPPPPPPPPPPPPP>
##$VTLIST= <TTTTTTTTTTTTTTT>
##$WBST= 1024
##$WBSW= 4
##$XGAIN= (0..3)
0 0 0 0 
##$XL= 0
##$YL= 0
##$YMAX_a= 685589
##$YMIN_a= -689200
##$ZGOPTNS= <>
##$ZL1= 120
##$ZL2= 120
##$ZL3= 120
##$ZL4= 120
##$ABSF1= 18.02987
##$ABSF2= -0.02202606
##$ABSG= 5
##$ABSL= 3
##$ALPHA= 0
##$AQORDER= 0
##$ASSFAC= 0
##$ASSFACI= 0
##$ASSFACX= 0
##$ASSWID= 0
##$AUNMP= <proc_1d>
##$AZFE= 0.1
##$AZFW= 0.1
##$BCFW= 0
##$BC_mod= 2
##$BYTORDP= 0
##$COROFFS= 0
##$CY= -3
##$DATMOD= 1
##$DC= 0
##$DFILT= <>
##$DTYPP= 0
##$F1P= 0
##$F2P= 0
##$FCOR= 1
##$FTSIZE= 16384
##$FT_mod= 6
##$GAMMA= 0
##$GB= 0
##$INTBC= 1
##$INTSCL= 3.241238e-09
##$ISEN= 128
##$LB= 0.25
##$LEV0= 0
##$LPBIN= 0
##$MAXI= 10000
##$MC2= 0
##$MEAN= 0
##$ME_mod= 0
##$MI= 1.114404
##$NCOEF= 0
##$NC_proc= -6
##$NLEV= 6
##$NOISF1= 3.799351
##$NOISF2= 2.8
##$NSP= 0
##$NTH_PI= 0
##$NZP= 0
##$OFFSET= 18.02987
##$PC= 1
##$PHC0= -5669.716
##$PHC1= 11.42193
##$PH_mod= 1
##$PKNL= yes
##$PPARMOD= 0
##$PSCAL= 0
##$PSIGN= 0
##$REVERSE= no
##$SF= 200.129498048811
##$SI= 16384
##$SIGF1= 3
##$SIGF2= 2
##$SINO= 0.751879
##$SIOLD= 32768
##$SREGLST= <19F.Aceton>
##$SSB= 0
##$STSI= 16384
##$STSR= 0
##$SW_p= 3612.71676300578
##$SYMM= 0
##$S_DEV= 0
##$TDeff= 16384
##$TDoff= 0
##$TI= <>
##$TILT= no
##$TM1= 0
##$TM2= 0
##$TOPLEV= 0
##$USERP1= <user>
##$USERP2= <user>
##$USERP3= <user>
##$USERP4= <user>
##$USERP5= <user>
##$WDW= 1
##$XDIM= 16384
##$YMAX_p= 488191197
##$YMIN_p= -1694698
$$ End of Bruker specific parameters
$$ ---------------------------------
##NTUPLES= NMR SPECTRUM
##VAR_NAME=  FREQUENCY,     SPECTRUM/REAL,   SPECTRUM/IMAG
##SYMBOL=    X,             R,               I
##VAR_TYPE=  INDEPENDENT,   DEPENDENT,       DEPENDENT
##VAR_FORM=  AFFN,          ASDF,            ASDF
##VAR_DIM=   16384,         16384,           16384
##UNITS=     HZ,            ARBITRARY UNITS, ARBITRARY UNITS
##FACTOR=    0.220516191357247, 1,           1
##FIRST=     3608.30864878409, 0,            0
##LAST=      -4.4081142216869, 0,            0
##MIN=       -4.4081142216869, -1694698,     0
##MAX=       3608.30864878409, 488191197,    0
$$ Real data points
##PAGE= N=1
##DATA TABLE= (X++(R..R)), XYDATA
$$ [...]
3232D8081277j791186j176080j496229j503697j291370j597671j527962j481765
$$ 48081277 46290091 45114011 43617782 42114085 40822715 39225044 37697082 36215317
3224C6215317j398870j662174j409680j089162j136199j499069r30554q49357
$$ 36215317 34816447 33154273 31744593 30655431 29519232 28020163 27089609 26240252
3216B6240252p15888p46829q34279n71131m50301p55730l60308l06970m18301
$$ 26240252 25524364 24777535 23943256 23372125 22921824 22166094 21805786 21498816 21080515
3207B1080515l39163k86668j74548j98837k09981j69142m69960j00905k04538
$$ 21080515 20741352 20454684 20280136 20081299 19871318 19702176 19232216 19131311 18926773
3198A8926773l76945j31476k76160k99682k47098k12558L2133K45355r6709K5382
$$ 18926773 18549828 18418352 18142192 17842510 17595412 17382854 17414987 17660342 17563633 17589015
3188A7589015O4892N4809O5958j65814l21929J55415j0145J6252J36662n75055
$$ 17589015 17653907 17708716 17774674 17608860 17286931 17442346 17432201 17448453 17585115 17010060
3178A7010060n66352n18516k56627j96733p2489j71801k32952k11085J33612j06842
$$ 17010060 16443708 15925192 15668565 15471832 15399343 15227542 14994590 14783505 14917117 14810275
3168A4810275k79773j45598l82801M180N5716O5604J00189l16119n6430J74865
$$ 14810275 14530502 14384904 14002103 14006283 14061999 14127603 14227792 13911673 13855243 14030108
3158A4030108j46943j42050J38616k8545N0741Q6670r1843l30535L34257L60974
$$ 14030108 13883165 13741115 13879731 13851186 13901927 13988597 13896754 13566219 13900476 14261450
3148A4261450j30358J01116O1289M54867M44706L03019J47484J42503K10085K78145
$$ 14261450 14131092 14232208 14293497 14748364 15193070 15496089 15643573 15786076 15996161 16274306
3138A6274306J53297J66757M68787P90349L20400K39550O27487M17301K08141
$$ 16274306 16427603 16594360 17063147 17853496 18173896 18413446 19040933 19458234 19666375
3129A9666375L94299L81274L53128N86340Q12390L23512M35404N91839K53143
$$ 19666375 20060674 20441948 20795076 21381416 22193806 22517318 22952722 23544561 23797704
3120B3797704P24431L77272O01168O15169N23498M19265M05738M01458L24028
$$ 23797704 24522135 24899407 25500575 26115744 26639242 27058507 27464245 27865703 28189731
3111B8189731P67321P06886L20221L91540R07823K72414P79408M79713K62885
$$ 28189731 28957052 29663938 29984159 30375699 31283522 31555936 32335344 32815057 33077942
3102C3077942M90196O55909K56170O79350L57051K00820M06459P57922N56270
$$ 33077942 33568138 34224047 34480217 35159567 35516618 35717438 36123897 36881819 37438089
3093C7438089J36522K28274M19357N18225L38425Q1864j5828N23327R58741N87702
$$ 37438089 37574611 37802885 38222242 38740467 39078892 39160756 39144928 39668255 40626996 41214698
3083D1214698m28039J10738M64290M69372L31615O111j76128L10588L66213J342
$$ 41214698 40786659 40897397 41361687 41831059 42162674 42168785 41992657 42303245 42669458 42670800
3073D2670800n18731n04232m31104K19588M07417l42386l092J38307l57057P2717
$$ 42670800 42152069 41647837 41216733 41436321 41843738 41501352 41498260 41636567 41279510 41352227
3063D1352227j20147m30699L2749k3795j66823q03757n98746j41599o49344p20588
$$ 41352227 41232080 40801381 40834130 40810335 40643512 39839755 39241009 39099410 38450066 37729478
3053C7729478l95841l10681n20059k1862k30732m75740q69159k86840l77194m68146
$$ 37729478 37333637 37022956 36502897 36481035 36250303 35774563 34905404 34618564 34241370 33773224
3043C3773224l75947l65095r17240j50661k80526j054535o35100m93155m81863
$$ 33773224 33397277 33032182 32114942 31964281 31683755 30629220 29994120 29500965 29019102
3034B9019102o87774n66108p22305n01682l03180o80423p45539n04014n78463
$$ 29019102 28331328 27765220 27042915 26541233 26238053 25557630 24812091 24308077 23729614
3025B3729614m67445j4566n73377r59402m59057o47204o11025n15226m05449m88112
$$ 23729614 23262169 23247603 22674226 21714824 21255767 20608563 19997538 19482312 19076863 18588751
3015A8588751l84939l96262m32333r99256m15600j47453p43764l77269k22490
$$ 18588751 18203812 17807550 17375217 16375961 15960361 15812908 15069144 14691875 14469385
3006A4469385m02905o27676l89684n65999m92153j79998k61926l5958l28860k25508
$$ 14469385 14066480 13438804 13049120 12483121 11990968 11810970 11549044 11513086 11184226 10958718
2996A0958718n91692j94896m70899m69574j88863j36107P4376N0361l14756p91978
$$ 10958718 10367026 10172130 9701231 9231657 9042794 8906687 8981063 9031424 8716668 7924690
2986G924690j18973R970j89876m47903P4053p9701m86126O978q6388k32124n23795
$$ 7924690 7805717 7815687 7625811 7177908 7251961 7172260 6686134 6693112 6606724 6374600 5850805
2975E850805O111n57910M6965K38056J6174P2246k59049k73034m5703j7901j69476
$$ 5850805 5856916 5299006 5345971 5584027 5600201 5672447 5413398 5140364 5094661 5076760 4907284
2964D907284J22611k09702l38088J46077J15256j40111j98761j21712j07067j42592
$$ 4907284 5029895 4820193 4482105 4628182 4743438 4603327 4404566 4282854 4175787 4033195
2954D033195O4617L23069n298l22488k40416r7680M29034k93506j0473m33471
$$ 4033195 4097812 4420881 4415583 4093095 3852679 3754999 4184033 3890527 3880054 3446583
2944C446583J44606L57612l09519k43311j57679O2394L54788J05367o77164K80666
$$ 3446583 3591189 3948801 3639282 3395971 3238292 3300686 3655474 3760841 3083677 3364343
2934C364343K66445p1736o1737j39101l6286O0901L84571k62795n33885L3417
$$ 3364343 3630788 3559052 3497315 3358214 3321928 3382829 3767400 3504605 2970720 3004137
2924C004137L06815j1630K08069m39142k48040M17079M3843J54833k96303j99480
$$ 3004137 3310952 3299322 3507391 3068249 2820209 3237288 3281131 3435964 3139661 2940181
2914B940181P4454m2146J67603l24846o6393K4499M1371Q4502K63343m77502k59215
$$ 2940181 3014635 2972489 3140092 2815246 2748853 2773352 2814723 2899225 3162568 2685066 2425851
2903B425851J39602J02543J45690j40272j25958m5193L45639r3073j76124j64535
$$ 2425851 2565453 2667996 2813686 2673414 2547456 2502263 2847902 2754829 2578705 2414170
2893B414170R9770M0681M26264Q7019k05758n1986j86054o8377J71451j81975
$$ 2414170 2513940 2554621 2980885 3067904 2862146 2810160 2624106 2555729 2727180 2545205
2883B545205l43042J35652K51087J17167L35j42768j22458k64078L4215K29827
$$ 2545205 2202163 2337815 2588902 2706069 2706404 2563636 2441178 2177100 2211315 2441142
2873B441142k32761K53596J40686j31898J29500j15334j02389m6965q2020P9417
$$ 2441142 2208381 2461977 2602663 2470765 2600265 2484931 2382542 2335577 2253557 2332974
2863B332974j4507J19050J17100k56903J7129j96812M3684L13383j55233l29588
$$ 2332974 2318467 2437517 2554617 2297714 2314843 2118031 2161715 2475098 2319865 1990277
2853A990277L43272N00198l30891l07140j75310j99466K75561K22917l60027l02252
$$ 1990277 2333549 2833747 2502856 2195716 2020406 1820940 2096501 2319418 1959391 1657139
2843A657139K12556K12445K1645r3737j16814j06857J91617J49252j82030K02409
$$ 1657139 1869695 2082140 2103785 2010048 1893234 1786377 1977994 2127246 1945216 2147625
2833B147625j1206M1669n1801M9933l27529J91384J95220m4898k27239L65541
$$ 2147625 2136419 2178088 2126287 2176220 1848691 2040075 2235295 2190397 1963158 2328699
2823B328699K04845l69758J05764k55960j25884M27814L85970l39633l391P7104
$$ 2328699 2533544 2163786 2269550 2013590 1887706 2315520 2701490 2361857 2358466 2435570
2813B435570o3030O3537l7064m6702r2573P5942L52421j24616k92679J20123k46024
$$ 2435570 2372540 2436077 2399013 2352311 2259738 2335680 2688101 2563485 2270806 2390929 2144905
2802B144905j45394L90689j8657k4383j56744J56208J27927j14093O3881j31246
$$ 2144905 1999511 2390200 2371543 2347160 2190416 2346624 2474551 2360458 2424339 2293093
2792B293093K3377l4391k50312J81742P6859j78097o7713j4987J1975L43460k08827
$$ 2293093 2316470 2282079 2031767 2213509 2290368 2112271 2044558 2029571 2041546 2385006 2176179
2781B176179k1334l39558L58016R7251m02551J73463P9316p7477m7582L26288
$$ 2176179 2154845 1815287 2173303 2270554 1868003 2041466 2120782 2043305 1995723 2322011
2771B322011J50120o6180J18062R4939j16649L13428j30297l61440M69794l13054
$$ 2322011 2472131 2405951 2524013 2618952 2502303 2815731 2685434 2323994 2793788 2480734
2761B480734j65565K64378L04075j10496O906j12226l07125J73995k7080n4866
$$ 2480734 2315169 2579547 2883622 2773126 2780032 2667806 2360681 2534676 2507596 2452730
2751B452730j70428N46872k07277J03330J47891l23096n1397J78848p8976K58694
$$ 2452730 2282302 2829174 2621897 2725227 2873118 2550022 2498625 2677473 2598497 2857191
2741B857191R8715j55570J19292J6022k03858n12536J88139N99925j4777K16096
$$ 2857191 2955906 2800336 2919628 2935650 2731792 2219256 2407395 3007320 2992543 3208639
2731C208639R266k70700j32952j37360m41212K91933n5653j09930M07461r4922
$$ 3208639 3217905 2947205 2814253 2676893 2235681 2527614 2471961 2362031 2769492 2674570
2721B674570J2053N5540l46955O0492K46635n3861j8476r4620N9958q7241k89907
$$ 2674570 2686623 2742163 2395208 2455700 2702335 2648474 2629998 2535378 2595336 2508095 2218188
2710B218188J16033p1177j07379K45823j697l3517j0282r5966o3678P9604j66399
$$ 2218188 2334221 2263044 2155665 2401488 2399791 2366274 2355992 2260026 2196348 2275952 2109553
2699B109553m1672m6661M81822N5880q4746L54883j9457k17093J97534j39218
$$ 2109553 2067881 2021220 2503042 2558922 2474176 2829059 2809602 2592509 2790043 2650825
2689B650825J6149K15802k88745o9609J74368N4641k36564k18540K47386j30591
$$ 2650825 2666974 2882776 2594031 2524422 2698790 2753431 2516867 2298327 2545713 2415122
2679B415122k84745J78100k26230k26087K01517O8245j42498L8442L37067p9498
$$ 2415122 2130377 2308477 2082247 1856160 2057677 2125922 1983424 2021866 2358933 2279435
2669B279435j17407K15221j30285l76831K13310O61945m06045l01238J0317k47354
$$ 2279435 2162028 2377249 2246964 1870133 2083443 2745388 2339343 2038105 2048422 1801068
2659A801068r4092L30470L5951j11803n9867L13030J64962P0445q4465r5737j43322
$$ 1801068 1706976 2037446 2073397 1961594 1901727 2214757 2379719 2450164 2365699 2269962 2126640
2648B126640J66023L11555j37630j68553P6466Q6175j99623n2629L09294K8849
$$ 2126640 2292663 2604218 2466588 2298035 2374501 2460676 2261053 2208424 2517718 2546567
2638B546567O0703P0898j42248j2678K1998k51899j44731r2054K97386K90383
$$ 2546567 2607270 2678168 2535920 2523242 2545240 2293341 2148610 2056556 2353942 2644325
2628B644325k28485K9689L4015k7061J13913p9395k51836J35515j400k9618p4676
$$ 2644325 2415840 2445529 2479544 2452483 2566396 2487001 2235165 2370680 2369280 2339662 2264986
2617B264986n9100l19492m6952l3635K712J57889L54551m80440J56564n4236l96993
$$ 2264986 2205886 1886394 1839442 1805807 1808519 1966408 2320959 1840519 1997083 1942847 1545854
2606A545854m8699P12127R4554k01447P9224J0349Q6597L40448k8145o41462J30201
$$ 1545854 1497155 2209282 2303836 2102389 2181613 2191962 2278559 2619007 2590862 1949400 2079601
2595B079601L41089q6251K1596M9664M79n1156R1663J74585N0509k15326j41279
$$ 2079601 2420690 2334439 2356035 2405699 2406178 2355022 2446685 2621270 2671779 2456453 2315174
2584B315174K4692o4720l80088N8129L87262j83038j12792J5577Q331L82231J73674
$$ 2315174 2339866 2275146 1895058 1953187 2340449 2157411 2044619 2060196 2068527 2450758 2624432
2573B624432k46134k24037M07115J93833k52621j12956r5980J69532j25711k79992
$$ 2624432 2378298 2154261 2561376 2755209 2502588 2389632 2293652 2463184 2337473 2057481
2563B057481J01641L16106m45647N4179j19258L15436m18480k32386j63552J78845
$$ 2057481 2159122 2475228 2029581 2083760 1964502 2279938 1861458 1629072 1465520 1644365
2553A644365K63894K31884J8223J82764o4668n49260j68885J31588M41721K66989
$$ 1644365 1908259 2140143 2158366 2341130 2276462 1727202 1558317 1689905 2131626 2398615
2543B398615l88834p8271M23175J33625k6080N2917j17982l67131J53785P46668
$$ 2398615 2009781 1931510 2354685 2488310 2462230 2515147 2397165 2030034 2183819 2930487
2533B930487j54203p00060j53514J22910O51415L56875l32212k04320M58138Q3592
$$ 2930487 2776284 2076224 1922710 2045620 2697035 3053910 2721698 2517378 2975516 3059108
2523C059108l10266l39257P3009N15812j23112l16957l62445J49444K24845m44067
$$ 3059108 2748842 2409585 2482594 2998406 2875294 2558337 2195892 2345336 2570181 2126114
2513B126114J46146O08242q6639r3941J72336j63733J77409r4335j937j43223
$$ 2126114 2272260 2880502 2793863 2699922 2872258 2708525 2885934 2791599 2789662 2646439
2503B646439N0840p939r092j40063L78813m36984l86945J9621K50445l8575k35236
$$ 2646439 2697279 2689340 2680248 2540185 2918998 2482014 2095069 2114690 2365135 2326560 2091324
2492B091324k94150K96999K06225l004L70251Q9661l56020l99580O07319J59325
$$ 2091324 1797174 2094173 2300398 2297394 2667645 2757306 2401286 2001706 2609025 2768350
2482B768350l10780q2347K93313k51852M41121k32076n14681J52181N18688j84313
$$ 2768350 2457570 2375223 2668536 2416684 2857805 2625729 2111048 2263229 2781917 2597604
2472B597604l42102L2059K96779J24608j73780r4389j04525K29768j6020R4593
$$ 2597604 2255502 2287561 2584340 2708948 2535168 2440779 2336254 2566022 2550002 2644595
2462B644595J53950R0747N2065j6356k9608K0444o354k06179k28339k14853O7826
$$ 2644595 2798545 2889292 2941357 2925001 2895393 2915837 2909483 2703304 2474965 2260112 2327938
2451B327938L9370J96958j01275l74613J89962K48692K82647j33654l36667k7445
$$ 2327938 2367308 2564266 2462991 2088378 2278340 2527032 2809679 2676025 2339358 2311913
2441B311913L7762K55162j6503j27812j47854P8671M7747J27560k1006J3354P3641
$$ 2311913 2349675 2604837 2588334 2460522 2312668 2391339 2439086 2566646 2545640 2558994 2632635
2430B632635l7646L57863j69222j78333l8777R7563j27853K75088N3963K17044
$$ 2632635 2594989 2952852 2783630 2605297 2566520 2664083 2536230 2811318 2865281 3082325
2420C082325j34943j36069L4546j54988R629m3942J37281J7091j17818J75686
$$ 3082325 2947382 2811313 2845859 2690871 2700500 2656558 2793839 2810930 2693112 2868798
2410B868798j31754j09022j28832J94047l5297K54323j33426l22929K211K07399
$$ 2868798 2737044 2628022 2499190 2693237 2657940 2912263 2778837 2455908 2458119 2665518
2400B665518K09052k65380l5726j20626K14049L29297O0950m22834j04049j47508
$$ 2665518 2874570 2609190 2573464 2452838 2666887 2996184 3057134 2634300 2530251 2382743
2390B382743J15986o1757j11701l5428j67407L87099R9579k78497J39042K28464
$$ 2382743 2498729 2436972 2325271 2289843 2122436 2509535 2609114 2330617 2469659 2698123
2380B698123m4206k25581J12779N5837N1881O8854j00012k05395K42926N44169
$$ 2698123 2653917 2428336 2541115 2596952 2648833 2717687 2617675 2412280 2655206 3199375
2370C199375k55469k96088j09442j19978J31391n8829j638j53249K76231L60359
$$ 3199375 2943906 2647818 2538376 2418398 2549789 2490960 2489322 2336073 2612304 2972663
2360B972663p1004o67988j2212k5312L26959K38502l67210p4364J98144m0427
$$ 2972663 2901659 2233671 2221459 2196147 2523106 2761608 2394398 2320034 2518178 2477751
2350B477751j77566l04872j8254K56658M47967J12133k22352l06686K10294r6767
$$ 2477751 2300185 1995313 1977059 2233717 2681684 2793817 2571465 2264779 2475073 2378306
2340B378306p4224J94986l14517O84217N60416k00779l71918J34836j94264L71401
$$ 2378306 2304082 2499068 2184551 2868768 3429184 3228405 2856487 2991323 2797059 3168460
2330C168460j88469l49631p8088L22114L01068l69081J81359j39698O2250L33352
$$ 3168460 2979991 2630360 2552272 2874386 3175454 2806373 2987732 2848034 2910284 3243636
2320C243636M341m08959J46962L8122k97546K87361l20343l7878N7653K38572
$$ 3243636 3247977 2839018 2985980 3024102 2726556 3013917 2693574 2655696 2713349 2951921
2310B951921j54470j14541J24976O4235j53821q9243j20362k9137J70052o6719
$$ 2951921 2797451 2682910 2807886 2872121 2718300 2629057 2508695 2479558 2649610 2582891
2300B582891p9149K16559o0251K2452L50864Q7745J6151p4023J60542J47075j10642
$$ 2582891 2503742 2720301 2660050 2682502 3033366 3121111 3137262 3063239 3223781 3370856 3260214
2289C260214j77416L4708o0525J32583J4341j40378Q9272j16459J23948k83285
$$ 3260214 3082798 3117506 3056981 3189564 3203905 3063527 3152799 3036340 3160288 2877003
2279B877003p5184L79290L39021j91825j8973P1388O023M90012R3788k23653m71454
$$ 2877003 2801819 3181109 3520130 3328305 3309332 3380720 3386743 3876755 3970543 3746890 3275436
2268C275436J19010M31320J92799l19991j26717Q3789L05691K26509k70286o841
$$ 3275436 3394446 3825766 4018565 3698574 3571857 3655646 3961337 4187846 3917560 3910719
2258C910719l3499J42480K48489k23403J19823K65368K88629p6692K68319J43253
$$ 3910719 3877220 4019700 4268189 4044786 4164609 4429977 4718606 4641914 4910233 5053486
2248E053486J20932K00561O14201K62597O4275O87996L23992M99720L98645M80068
$$ 5053486 5174418 5374979 5989180 6251777 6316052 7004048 7328040 7827760 8226405 8706473
2238H706473P22786M66705M86049Q22910J91814L03363O20773j12939K76105N19509
$$ 8706473 9429259 9895964 10382013 11204923 11396737 11700100 12320873 12207934 12484039 13003548
2228A3003548Q04215J96343K6194L09996O3964J22097J22027P7343m35399K53457
$$ 13003548 13807763 14004106 14030300 14340296 14404260 14526357 14648384 14725727 14290328 14543785
2218A4543785M19678j28348J68256l54709N7520L49911R1528o0241n012o9386
$$ 14543785 14963463 14835115 15003371 14648662 14706182 15056093 15147621 15087380 15082368 15012982
2208A5012982J56427j0578l41428n71951l85997M5627o00488o7807l72879q0109
$$ 15012982 15169409 15158831 14817403 14245452 13859455 13905082 13304594 13236787 12863908 12783799
2198A2783799M5485j22355k35161L23594J89500J50752L72812j97317O97481N15910
$$ 12783799 12829284 12706929 12471768 12795362 12984862 13135614 13508426 13311109 14008590 14524500
2188A4524500O30626N77484K50627Q84517Q66742J017921P39894O62705P48142
$$ 14524500 15155126 15732610 15983237 16867754 17734496 18752417 19492311 20155016 20903158
2179B0903158O86478L99694O16583j020J68086Q61640L38192J75534q539K68938
$$ 20903158 21589636 21989330 22605913 22604893 22772979 23634619 23972811 24148345 24139806 24408744
2169B4408744K12326J03365n35451l35192k20999J61651M86794k99108j09054
$$ 24408744 24621070 24724435 24188984 23853792 23632793 23794444 24281238 23982130 23873076
2160B3873076j29844J8260m04918l41648l96395m97390o55603k61432l45281p30649
$$ 23873076 23743232 23761492 23356574 23014926 22618531 22121141 21465538 21204106 20858825 20128176
2150B0128176n90719p45979o82582n94763n83854n36007n89510j36470p63051
$$ 20128176 19537457 18791478 18108896 17514133 16930279 16394272 15804762 15668292 14905241
2141A4905241n69043m5335k74460j34745J36981J76940J25641J37498n302L01931
$$ 14905241 14336198 14290863 14016403 13881658 14018639 14195579 14321220 14458718 14453416 14755347
2131A4755347J90783K12760k18536l25788K16164M14259j28723l09461M01735
$$ 14755347 14946130 15158890 14940354 14614566 14830730 15244989 15116266 14806805 15208540
2122A5208540J96179j6344M290K773k16361J52995J60358l17967M12918m2936
$$ 15208540 15404719 15388375 15392665 15395438 15179077 15332072 15492430 15174463 15587381 15544445
2112A5544445J28787r5878J59852l4566P4458L72804L60516k38k80820j96952
$$ 15544445 15673232 15577354 15737206 15702640 15777098 16149902 16510418 16510180 16229360 16032408
2102A6032408m1846K87766m83987n50490o8754L7981j0912l23171m59132k74875
$$ 16032408 15990562 16278328 15794341 15243851 15175097 15213078 15202166 14878995 14419863 14144988
2092A4144988K07599k93348k5208m72737J14469J21191J7835k1020j55061k55048
$$ 14144988 14352587 14059239 14034031 13561294 13675763 13796954 13814789 13793769 13638708 13383660
2082A3383660o6459j10389k50925O3763k00711M17324L6816k2018Q5838k18672
$$ 13383660 13317201 13206812 12955887 13019650 12818939 13236263 13273079 13251061 13336899 13118227
2072A3118227J28843L55062k63063l4195N67106N44710L7257J46318O17664m0017
$$ 13118227 13247070 13602132 13339069 13304874 13871980 14416690 14453947 14600265 15217929 15177912
2062A5177912K62994P90239m2150M84800N57426l39984q0094Q93136J40313K68612
$$ 15177912 15440906 16231145 16188995 16673795 17231221 16891237 16811143 17704279 17844592 18113204
2052A8113204L39865N55117N64790R47939M44122P9109L56492K42879P661M22968
$$ 18113204 18453069 19008186 19572976 20520915 20965037 21044146 21400638 21643517 21651178 22074146
2042B2074146K50587k18250Q5749p3469k48954n3272m27614k72315r8054m92221
$$ 22074146 22324733 22106483 22192232 22118763 21869809 21816537 21388923 21116608 21018554 20526333
2032B0526333n23216k26703k05722m11053n47013m15826P7344J68883j46906l57478
$$ 20526333 20003117 19776414 19570692 19159639 18612626 18196800 18274144 18443027 18296121 17938643
2022A7938643J0400n5941j77446m8851M0507k30230K02404M27629K12592L10308
$$ 17938643 17949043 17893102 17715656 17666805 17707312 17477082 17679486 18107115 18319707 18630015
2012A8630015N56515L24691M11470P75662L52335n12459M19483L39368Q3357K17826
$$ 18630015 19186530 19511221 19922691 20698353 21050688 20538229 20957712 21297080 21380437 21598263
2002B1598263N9618r249o2045N9215l82897j81850J03104N777k83542o5927J3047
$$ 21598263 21657881 21648632 21586587 21645802 21262905 21081055 21184159 21189936 20906394 20840467 20853514
1991B0853514o70215k07317l50923k59828m95107J77280j62909k86975n20738
$$ 20853514 20183299 19975982 19625059 19365231 18870124 19047404 18884495 18597520 18076782
1982A8076782k52821p49055n24457m63367j065045n07023r74384p14444q82978
$$ 18076782 17823961 17074906 16550449 16087082 15022037 14515014 13540630 12826186 11943208
1973A1943208m66219l56367l86488p80709m38856o01642k00369J03277m29737
$$ 11943208 11476989 11120622 10734134 9953425 9514569 8912927 8712558 8815835 8386098
1964H386098j79488j59988o10693K73664j26325l47163k87777k2891J83110j03308
$$ 8386098 8206610 8046622 7435929 7709593 7583268 7236105 6948328 6925437 7108547 7005239
1954G005239j61476K5681n43438M4851K48239o24418K03011J09227j3630k39698
$$ 7005239 6843763 6869444 6326006 6370857 6619096 5994678 6197689 6306916 6293286 6053588
1944F053588j37894J62014k6315j10073j00212j40391k23643M31237j12834K62157
$$ 6053588 5915694 6077708 6051393 5941320 5841108 5700717 5477074 5908311 5795477 6057634
1934F057634n5689N1105K29628J18900m3550q5546P9707P1941O3560j46937m0838
$$ 6057634 6001945 6053050 6282678 6401578 6358028 6272482 6352189 6424130 6487690 6340753 6299915
1923F299915k96270N2343K21478q4975K73670J32137n2018J67312K3033J89451
$$ 6299915 6003645 6055988 6277466 6192491 6466161 6598298 6546280 6713592 6736625 6926076
1913F926076o3883P0643L81034N53144J4327P2815n4214P57874M23333K68284
$$ 6926076 6862193 6932836 7313870 7867014 7881341 7954156 7899942 8657816 9081149 9349433
1903I349433K68630O74157R44393Q12448M95249L26403Q21081J294262J042655
$$ 9349433 9618063 10292220 11236613 12049061 12544310 12870713 13691794 14986056 16028711
1894A6028711M51557N65073O83522Q87390Q08185L22881L66609L04528Q2121L09444
$$ 16028711 16480268 17045341 17728863 18616253 19424438 19747319 20113928 20418456 20500577 20810021
1884B0810021N6366j34466P7282R2764m37848l22402J8814P2252l19788n07425
$$ 20810021 20866387 20731921 20809203 20901967 20464119 20141717 20160531 20232783 19912995 19405570
1874A9405570P1884K5630J53763J24282l64749o28940j4938L80926R8587Q2737
$$ 19405570 19477454 19503084 19656847 19781129 19416380 18787440 18772502 19153428 19252015 19334752
1864A9334752L71784J3439J53524P13816N71340Q18711N32438P26798P25405Q79219
$$ 19334752 19706536 19719975 19873499 20587315 21158655 21977366 22509804 23236602 23962007 24841226
1854B4841226J008225R20091P05497P66924J252463P80949P21409R06886N24545
$$ 24841226 25849451 26769542 27475039 28241963 29494426 30275375 30996784 31903670 32428215
1845C2428215M44900P20613R4128N63564J475965J100394M27072L42212M18083
$$ 32428215 32873115 33593728 33687856 34251420 35727385 36827779 37254851 37597063 38015146
1836C8015146L71700L88052j47125l75965q09922l93547k74348n27418p02998
$$ 38015146 38386846 38774898 38627773 38251808 37441886 37048339 36773991 36246573 35543575
1827C5543575j186892j147923r84416p41913n64510o90029j025214n53716q27169
$$ 35543575 34356683 33208760 32224344 31482431 30917921 30227892 29202678 28648962 27821793
1818B7821793l51734n57316j51193k6529n46966Q9496M84039n0517n5320K54111
$$ 27821793 27470059 26912743 26761550 26735021 26188055 26277551 26761590 26711073 26655753 26909864
1808B6909864p8724M19964L45618J009129J114456P72421P68081J079271M77687
$$ 26909864 26831140 27251104 27596722 28605851 29720307 30492728 31260809 32340080 32817767
1799C2817767J126459O16496j81982L65063K14106J60043k14436k56499n0901
$$ 32817767 33944226 34560722 34378740 34743803 34957909 35117952 34903516 34647017 34596116
1790C4596116q45272n08791m02107o00998n30935o35975p14109l83294m03525
$$ 34596116 33750844 33242053 32839946 32238948 31708013 31072038 30357929 29974635 29571110
1781B9571110k98166n11529n52172P6127n39517q49895l92502o39477j315409
$$ 29571110 29272944 28761415 28209243 28285370 27745853 26895958 26503456 25863979 24548570
1772B4548570p68782p31361j172631q88253p31278o14438j046076k76987q11716
$$ 24548570 23779788 23048427 21875796 20987543 20256265 19641827 18595751 18318764 17507048
1763A7507048p67030j47912p1826m37323k52700L10979j24040j77476n2577M53972
$$ 17507048 16740018 16592106 16520280 16082957 15830257 16141236 16017196 15839720 15787143 16241115
1753A6241115K38230M43153K6476J01972K62511N37964K26549J29224L2982N7672
$$ 16241115 16479345 16922498 16948974 17050946 17313457 17851421 18077970 18207194 18240176 18297848
1743A8297848K55435R3265l14495n13887m63814m10210o05782n78021r57652q01068
$$ 18297848 18553283 18646548 18332053 17818166 17354352 16944142 16338360 15760339 14802687 14001619
1733A4001619n47245n47504p36877p16919j57047k20952p87066m97096n15694
$$ 14001619 13454374 12906870 12169993 11453074 11296027 11075075 10288009 9790913 9275219
1724I275219l95903J65363m30192o70567l70427k71934L1430n14787j85654k43088
$$ 9275219 8879316 9044679 8614487 7943920 7573493 7301559 7332989 6818202 6632548 6389460
1714F389460m37865J28310j12026k85872J4558j2582j55019k4904m5884N3080
$$ 6389460 5951595 6079905 5967879 5682007 5696565 5683983 5528964 5504060 5458176 5511256
1704E511256j97750j08795j67599k03297J76251Q2920j89791j57263j40534l02925
$$ 5511256 5313506 5204711 5037112 4833815 5010066 5092986 4903195 4745932 4605398 4302473
1694D302473K78159J7027j05313K5001J22177o730k19883k852m42101p0976K03147
$$ 4302473 4580632 4597659 4492346 4517347 4639524 4632794 4412911 4410059 3967958 3896982 4100129
1683D100129L10667k30838J41529o603R5969L5822o9383l25288j40347k012n0322
$$ 4100129 4410796 4179958 4321487 4314884 4410853 4446675 4377292 4052004 3911657 3909645 3859323
1672C859323j5254j26466Q2943k12666J87154l13058p2300L18623Q1175M2132
$$ 3859323 3844069 3717603 3800546 3587880 3775034 3461976 3389676 3708299 3789474 3831606
1662C831606K5292r8043j59879J14460K5138l00271j91106J14575m0757L33463
$$ 3831606 3856898 3758855 3598976 3713436 3738574 3438303 3247197 3361772 3321015 3654478
1652C654478K25467l8997K16625J65971L9174l8084K43871K66878L17599M27875
$$ 3654478 3879945 3840948 4057573 4223544 4262718 4224634 4468505 4735383 5052982 5480857
1642E480857M74622L93983L40886k35123n51888k93674m59766k05365J62223k23041
$$ 5480857 5955479 6349462 6690348 6455225 5903337 5609663 5149897 4944532 5106755 4883714
1632D883714n11345N8371j03064l81766j17019L7455m27968K43487L23114l15406
$$ 4883714 4372369 4430740 4327676 3945910 3828891 3866346 3438378 3681865 4004979 3689573
1622C689573k31294N2445k34077j53843J0067k00852J60268o8017k10085j29841
$$ 3689573 3458279 3510724 3276647 3122804 3132871 2932019 3092287 3024270 2814185 2684344
1612B684344J24361j12514J21694J55592j13518j94789L49225K28661j37174K01054
$$ 2684344 2808705 2696191 2817885 2973477 2859959 2665170 3014395 3243056 3105882 3306936
1602C306936r3880k09813L95891K60562l11057o7501O204k67351m92741O3556
$$ 3306936 3213056 3003243 3399134 3659696 3348639 3281138 3287342 3019991 2527250 2590806
1592B590806J6459j11032J44534K0093j4434M17007J09020J24795M5381l74475
$$ 2590806 2607265 2496233 2640767 2660860 2646426 3063433 3172453 3297248 3342629 2968154
1582B968154L83424J21206J71347K47730j65780n08320r3699J74659k3841j09599
$$ 2968154 3351578 3472784 3644131 3891861 3726081 3217761 3124062 3298721 3274880 3165281
1572C165281K62910j76568l27836L22427r7854L4187L68183l74901l16791N97218
$$ 3165281 3428191 3251623 2923787 3246214 3148360 3182547 3550730 3175829 2859038 3456256
1562C456256L03190q1532J74533L8735Q7280M70601K26087j07576m21261K62422
$$ 3456256 3759446 3677914 3852447 3891182 3978462 4449063 4675150 4567574 4146313 4408735
1552D408735L1636N0848n9706m460p1566N2461k3940l76686j07506J08120O09069
$$ 4408735 4440371 4491219 4431513 4427053 4355487 4407948 4384008 4007322 3899816 4007936 4617005
1541D617005J39703J6710J47186M29806M36268M3848m73124j26886L80279K14497
$$ 4617005 4756708 4773418 4920604 5350410 5786678 5830526 5357402 5230516 5610795 5825292
1531E825292K0047k63634L6799K7000J73287O9819k28303k6745K07187o3563j29724
$$ 5825292 5845339 5581705 5618504 5645504 5818791 5888610 5660307 5633562 5840749 5777186 5647462
1520E647462K68003j26727l42028K36308J26658j45831J98256K98356K36844l5628
$$ 5647462 5915465 5788738 5446710 5683018 5809676 5663845 5862101 6160457 6397301 6361673
1510F361673J12325K748N5994K22725R600k91336L40035K57847J02613K32501
$$ 6361673 6473998 6476746 6532740 6755465 6765065 6473729 6813764 7071611 7174224 7406725
1500G406725M8872K96237J99493k9429K20474L53117L96570L85318L87013M40467
$$ 7406725 7455597 7751834 7951327 7921898 8142372 8495489 8892059 9277377 9664390 10104857
1490A0104857N36961N74641J245235N99412P23711Q74729Q96723J462093J509440
$$ 10104857 10641818 11216459 12461694 13061106 13784817 14659546 15556269 17018362 18527802
1481A8527802J336644J544935K629703K944425L333828L111076L579927M093124
$$ 18527802 19864446 21409381 24039084 26983509 30317337 33428413 37008340 41101464
1473D1101464M066777L579192L844064M082973L800440L918662L621975K924206
$$ 41101464 45168241 48747433 52591497 56674470 60474910 64393572 68015547 70939753
1465G0939753K354030K251932N74844l53882m78809j560500j909725k210948k817570
$$ 70939753 73293783 75545715 76120559 75766677 75287868 73727368 71817643 69606695 66789125
1456F6789125l550040l716494l925532m223598m103641l630381l858871l326646
$$ 66789125 63239085 59522591 55597059 51373461 47269820 43639439 39780568 36453922
1448C6453922l015839k931693k364263j692733k058394j969893j186329j143311
$$ 36453922 33438083 30506390 28142127 26449394 24391000 22421107 21234778 20091467
1440B0091467j247416p85011j187869j290599m05875k50966r20795o45548k97580
$$ 20091467 18844051 18059040 16871171 15580572 15174697 14923731 14002936 13357388 13059808
1431A3059808p12274l97520n54224m76792j92498r0521k22577k58325o6596j80005
$$ 13059808 12347534 11950014 11395790 10918998 10726500 10635979 10413402 10155077 10088481 9908476
1421I908476m76647m52668m88071J97662p8067m73255J51305j85821m74979j32216
$$ 9908476 9431829 8979161 8491090 8688752 8610685 8137430 8288735 8102914 7627935 7495719
1411G495719m09705m57035K19677K18517k25443K5076J6779l20929l19867k80253
$$ 7495719 7086014 6628979 6848656 7067173 6841730 6866806 6883585 6562656 6242789 5962536
1401E962536n5514j10527L32303M57356k63641l92022l88907R8733K62288k01051
$$ 5962536 5907022 5796495 6128798 6586154 6322513 5930491 5541584 5640317 5902605 5701554
1391E701554l94465K79982K37861J57339p5888k17151k26960K39646K48353o4670
$$ 5701554 5307089 5587071 5824932 5982271 5906383 5689232 5462272 5701918 5950271 5885601
1381E885601K73871M19927j04398l81897L7761k90400j54161K52652P1466k10940
$$ 5885601 6159472 6579399 6475001 6093104 6130865 5840465 5686304 5938956 6010422 5799482
1371E799482k20454m3833l1400r4782l07386j79514k19455j8072K42356p0609
$$ 5799482 5579028 5535195 5503795 5409013 5101627 4922113 4702658 4684586 4926942 4856333
1361D856333k14822r7469R8150q9924J2629K21519l3615m06951R2133R4182l62040
$$ 4856333 4641511 4544042 4642192 4552268 4564897 4786416 4752801 4345850 4437983 4532165 4170125
1350D170125K41168m3695k64639r4093K41421J45051j07475J4994j2909j30919
$$ 4170125 4411293 4367598 4102959 4008866 4250287 4395338 4287863 4302857 4289948 4159029
1340D159029p4378J71277m24989J36403K3094J22735J62460j3758K7526J32506
$$ 4159029 4084651 4255928 3830939 3967342 3990436 4113171 4275631 4261873 4289399 4421905
1330D421905J55894P9552K22858l12494o046J23267m0825j85940R4065J23398
$$ 4421905 4577799 4657351 4880209 4567715 4561669 4684936 4644111 4458171 4552236 4675634
1320D675634o9486n0469J50046K39098k94359K96191j17382m0556J00426K6368
$$ 4675634 4606148 4555679 4705725 4944823 4650464 4946655 4829273 4788717 4889143 4915511
1310D915511m05210L6811J83148j41078l20943J60306M17258m13993r8359J03505
$$ 4915511 4510301 4547112 4730260 4589182 4268239 4428545 4845803 4431810 4333451 4436956
1300D436956r4261L8118l4901l5987J14541J69201K03601n2443j78724K770N5499
$$ 4436956 4342695 4380813 4345912 4309925 4424466 4593667 4797268 4744825 4566101 4568871 4624370
1289D624370K29353M58184k1092m06485L9805M32034m3416L4914j03133M3007
$$ 4624370 4853723 5311907 5290815 4884330 4924135 5356169 5312753 5347667 5244534 5287541
1279E287541j11619J91289K65158k24928K21168j43769k88645N51172M41564j33711
$$ 5287541 5175922 5367211 5632369 5407441 5628609 5484840 5196195 5747367 6188931 6055220
1269F055220k13658K34662L83603J07046L0386J38154K47815J31980K01176K75979
$$ 6055220 5841562 6076224 6459827 6566873 6597259 6735413 6983228 7115208 7316384 7592363
1259G592363K69264M27364J06777K81209M67167Q54126N84292N25105R85002J171800
$$ 7592363 7861627 8288991 8395768 8676977 9144144 9998270 10582562 11107667 12092669 13264469
1249A3264469R52320J012827J366590J670696J363890J650586J876738J651251
$$ 13264469 14216789 15229616 16596206 18266902 19630792 21281378 23158116 24809367
1241B4809367J310497J551844J367322P88834Q31441N64737L31865K20633l26723
$$ 24809367 26119864 27671708 29039030 29827864 30659305 31224042 31555907 31776540 31449817
1232C1449817q84373r48908q29437q45264j562931j005796n86846p02542o61986
$$ 31449817 30565444 29616536 28787099 27941835 26378904 25373108 24786262 24083720 23421734
1223B3421734r3271M84726k37J58745O26619Q81470J304632J142185O72399P23614
$$ 23421734 23328463 23813189 23812952 23971697 24598316 25479786 26784418 27926603 28599002 29322616
1213B9322616R74888P66346O40873K80927K9156l04096q0914o69976j066255r31266
$$ 29322616 30297504 31063850 31704723 31985650 32014806 31710710 31629796 30959820 29893565 28962299
1203B8962299j659726j657175j199288j449655j531799r99922j199745j140812
$$ 28962299 27302573 25645398 24446110 22996455 21464656 20464734 19264989 18124177
1195A8124177j211078p02158o89526r18435o15159m92512j77362n88124m40472
$$ 18124177 16913099 16210941 15521415 14602980 13987821 13495309 13317947 12729823 12289351
1186A2289351k23603m08251n61619K71j58039q9385j58204m23671k38618J53258
$$ 12289351 12065748 11657497 11095878 11096149 10938110 10848725 10690521 10266850 10028232 10181490
1176A0181490p4284k52729k52028p730J28417J22629K13299l90348q6152k30413
$$ 10181490 10107206 9854477 9602449 9594719 9723136 9845765 10059064 9668716 9582564 9352151
1166I352151k64935L24979J59541n01757L11291K40034Q521j06848j99183q314
$$ 9352151 9087216 9412195 9571736 9069979 9381270 9621304 9629825 9522977 9323794 9315480
1156I315480K12785N7418k73577K84504M03484k307n34087J50344O2298j90274
$$ 9315480 9528265 9585683 9312106 9596610 10000094 9997787 9463700 9614044 9676342 9486068
1146I486068K53125N3486L89432L95934l69578L9250K55187K66590j03751m95204
$$ 9486068 9739193 9792679 10182111 10578045 10208467 10247717 10502904 10769494 10665743 10170539
1136A0170539M5631K66010J45609K38406k78039j83004J58297j88971L39420L90550
$$ 10170539 10216170 10482180 10627789 10866195 10588156 10405152 10563449 10374478 10713898 11104448
1126A1104448J6452j6554N27786J56037k3618r8027J34595K61796L31677L81762
$$ 11104448 11120900 11104346 11632132 11788169 11764551 11666524 11801119 12062915 12394592 12776354
1116A2776354K82828R04844N59628j5583L23901M86267L76723P71800N99024M13400
$$ 12776354 13059182 13964026 14523654 14508071 14831972 15318239 15694962 16466762 17065786 17479186
1106A7479186N64962N96326M91738O00926Q19928R75754N28888Q38999J285063
$$ 17479186 18044148 18640474 19132212 19733138 20553066 21528820 22057708 22896707 24181770
1097B4181770Q87053R09500J167624J260057J386513J290275J609628J779375
$$ 24181770 25068823 25978323 27145947 28406004 29792517 31082792 32692420 34471795
1089C4471795J948953J983525J554906J450078J502397J721154J892682J402884
$$ 34471795 36420748 38404273 39959179 41409257 42911654 44632808 46525490 47928374
1081D7928374J170588J229855J430693J957517J541619J492284J614287J771589
$$ 47928374 49098962 50328817 51759510 53717027 55258646 56750930 58365217 60136806
1073F0136806K291986K065421J856062K183966K224828K004985J946439J369641
$$ 60136806 62428792 64494213 66350275 68534241 70759069 72764054 74710493 76080134
1065G6080134J619131J047428L67837o2373j80810o9934L6856o8702m44921p79396
$$ 76080134 77699265 78746693 79114530 79052157 78871347 78801413 78838269 78769567 78324646 77545250
1055G7545250l99432j27471m89270l71813j019729r96728j040331j496462j835054
$$ 77545250 77145818 77018347 76529077 76157264 75137535 74140807 73100476 71604014 69768960
1046F9768960k256852k413217k304800k217398j902935j598879j594330j913196
$$ 69768960 67512108 65098891 62794091 60576693 58673758 57074879 55480549 53567353
1038E3567353k024488j758616j088725j183682p24954l28589n56273o1376K73876
$$ 53567353 51542865 49784249 48695524 47511842 46786888 46458299 45902026 45840650 46114526
1029D6114526k4024N37036O35730K87867J044793J493190J475710J477643J337890
$$ 46114526 46090502 46627538 47263268 47551135 48595928 50089118 51564828 53042471 54380361
1020E4380361J495974J648519J800119J892029K115755K051086K254432K020557
$$ 54380361 55876335 57524854 59324973 61217002 63332757 65383843 67638275 69658832
1012F9658832K015897J595789J603503J295045P69434O59158M75929M74222N92579
$$ 69658832 71674729 73270518 74874021 76169066 76938500 77597658 78073587 78547809 79140388
1003G9140388J57132k09046m42820p44419j80069n32771q76349p17457q61375
$$ 79140388 79297520 79088474 78645654 77901235 77721166 77188395 76312046 75594589 74733214
994G4733214j112394j305560j954463j986128j863409j990754k050490k249856
$$ 74733214 73620820 72315260 70360797 68374669 66511260 64520506 62470016 60220160
986F0220160k068913j668093j429110j526161j569089j401370q88276r52320q21894
$$ 60220160 58151247 56483154 55054044 53527883 51958794 50557424 49669148 48716828 47894934
977D7894934o31618n63787n18986k77393L10921l6840j05903K4783k2591j13196
$$ 47894934 47263316 46699529 46180543 45903150 46214071 46177231 46071328 46096111 46073520 45960324
967D5960324N43442K87319L24100M26846M53814M25912L38009N00006P97441N66742
$$ 45960324 46503766 46791085 47115185 47542031 47995845 48421757 48759766 49259772 50057213 50623955
957E0623955L28657P22746Q61333M03511J9562M32085J84250k26018N0447K3689
$$ 50623955 50952612 51675358 52536691 52940202 52959764 53391849 53576099 53350081 53400528 53424217
947E3424217j77627j15635j98370j78972j76372j83863n27808q04872m55268o0076
$$ 53424217 53246590 53130955 52932585 52753613 52577241 52393378 51865570 51060698 50605430 50545354
937E0545354m86624j079806n43538j91376l25504p40227l75194l16457n32289
$$ 50545354 50058730 48978924 48435386 48244010 47918506 47178279 46803085 46486628 45954339
928D5954339o09266j79649l41561k54230k66510j67600N4929N15942M64663l0599
$$ 45954339 45345073 45165424 44823863 44569633 44303123 44135523 44190452 44706394 45171057 45140458
918D5140458K16620N19157P98385N42425Q30584Q11116N71511P34398J238766
$$ 45140458 45357078 45876235 46674620 47217045 48047629 48858745 49430256 50164654 51403420
909E1403420J336502Q74953N26123J146309J162319J061292O23537M73577P00110
$$ 51403420 52739922 53614875 54140998 55287307 56449626 57510918 58134455 58608032 59308142
900E9308142P41179P05759P98321P88730Q42069P57781N06055O51354J180362
$$ 59308142 60049321 60755080 61553401 62342131 63184200 63941981 64448036 65099390 66279752
891F6279752N82594p6577Q71216Q30191N80527k29538j53057K9009M32239N28565
$$ 66279752 66862346 66785769 67656985 68487176 69067703 68838165 68685108 68714117 69146356 69674921
881F9674921j03090k57643M66542L60663j2725M85105k25358j81071N42339P30443
$$ 69674921 69571831 69314188 69780730 70141393 70128668 70613773 70388415 70207344 70749683 71480126
871G1480126O73795R08361K97426P65279Q27125R68207P62982O05260J014622
$$ 71480126 72153921 73062282 73359708 74124987 74952112 75920319 76683301 77288561 78303183
862G8303183N02398N38592J121287J024094N93235K44575M0690L56792M05416
$$ 78303183 78805581 79344173 80465460 81489554 82082789 82327364 82368054 82724846 83130262
853H3130262j30048k92929j45009J1704N7585j90417J14690J76660N79539O39827
$$ 83130262 83000214 82707285 82562276 82573980 82631565 82441148 82555838 82732498 83312037 83951864
843H3951864L33350R35311J140684K58629O58599O14775L03066N86884R15004
$$ 83951864 84285214 85220525 86361209 86619838 87278437 87893212 88196278 88783162 89698166
834H9698166J341728Q86856J495939J812706J307618R27893J475741O44620Q52154
$$ 89698166 91039894 91926750 93422689 95235395 96543013 97470906 98946647 99591267 100443421
825A00443421J141092J011730J043721J003201J156906L10844l48742J1007K13966
$$ 100443421 101584513 102596243 103639964 104643165 105800071 106110915 105762173 105773180 105987146
816A05987146k32445k64562k09455K6607p54073j96749j50711l06940k53106l58481
$$ 105987146 105754701 105490139 105280684 105307291 104553218 104356469 104205758 103898818 103645712 103287231
806A03287231o09480q08997o13282o46061j569892j459397p39651q36408q91460
$$ 103287231 102677751 101868754 101255472 100609411 99039519 97580122 96840471 96004063 95112603
797I5112603o5475K96521j27640N34286Q56894P28209N84707R93852J104350J265794
$$ 95112603 95047128 95343649 95216009 95750295 96607189 97335398 97920105 98913957 100018307 101284101
787A01284101J713230K124608K607304L606758M122866N037706N860796O957599
$$ 101284101 102997331 105121939 107729243 111336001 115458867 120496573 126357369 133314968
779A33314968Q160112Q207042Q367637Q590299Q286534P157238O105935M381751
$$ 133314968 141475080 149682122 158049759 166640058 174926592 182083830 188189765 192571516
771A92571516K466922R4790k007395l546869m978789n394320n888226o343123
$$ 192571516 195038438 195133228 193125833 189578964 184600175 179205855 173317629 166974506
763A66974506n181161m669354m916697m774706m560017m267426m621743m355345
$$ 166974506 161793345 157123991 152207294 147432588 142872571 138605145 133983402 129628057
755A29628057m437947m716211m359979l880114m234838m120388l880744m185478
$$ 129628057 125190110 120473899 116113920 112233806 107998968 103878580 99997836 95812358
747I5812358m056869l410095l553228m148964l469416k351140k556561k742719
$$ 95812358 91755489 88345394 84792166 80643202 77173786 74822646 72266085 69523366
739F9523366k024386j915943k063222j786425j730563j498259j316009j019407
$$ 69523366 67498980 65583037 63519815 61733390 60002827 58504568 57188559 56169152
731E6169152j204514j331384r44759j098214j200167j235673m55560r01787r44398
$$ 56169152 54964638 53633254 52688495 51590281 50390114 49154441 48698881 47797094 46852696
722D6852696q99650m29606o10630r94246m35906k91736l21341m64907l65433o03476
$$ 46852696 45953046 45523440 44912810 43918564 43482658 43190922 42869581 42404674 42039241 41435765
712D1435765l07200n41586n87547m32031j65301j61723m04736j96912j30253N15634
$$ 41435765 41128565 40586979 39999432 39567401 39402100 39240377 38835641 38638729 38508476 39024110
702C9024110l23360k89777K69821N41914L90609L32377O51485j17529J16497M56383
$$ 39024110 38700750 38410973 38680794 39222708 39613317 39945694 40597179 40479650 40596147 41052530
692D1052530M71973J11934K11689j55133k56051K43558L46095q4401o87015k13226
$$ 41052530 41524503 41636437 41848126 41692993 41436942 41680500 42026595 41942194 41255179 41041953
682D1041953l11690k51526k13306j63736m80667j38873m3160O6988O67451j1729
$$ 41041953 40730263 40478737 40265431 40101695 39621028 39482155 39438995 39505983 40173434 40161705
672D0161705J17297N22026M32554J55274M13250P29393O66469N31612L1282K7710
$$ 40161705 40279002 40801028 41233582 41388856 41802106 42531499 43197968 43729580 43760862 43788572
662D3788572L41988O71337K16137j71142R9216L16113J22936l44915j99982J30217
$$ 43788572 44130560 44801897 45018034 44846892 44946108 45262221 45385157 45040242 44840260 44970477
652D4970477J45019n1392L95386L64116M94628P02308K23854p7562J35814L75075
$$ 44970477 45115496 45064104 45459490 45823606 46318234 47020542 47244396 47166834 47302648 47677723
642D7677723L89873N48799N54846J93132M89047J091560P01678K70435L69588
$$ 47677723 48067596 48616395 49171241 49364373 49853420 50944980 51646658 51917093 52286681
633E2286681L95511O42799O4928p62008m67278k04697j42110K2816K2109k09534
$$ 52286681 52682192 53324991 53389919 52627911 52160633 51955936 51813826 51836642 51858751 51649217
623E1649217J71974P13649M72263P3496O09284O27604P30209J820532J726481
$$ 51649217 51821191 52534840 53007103 53080599 53689883 54317487 55047696 56868228 58594709
614E8594709J273898K239196K555632K181401K271028K009786J850349J522931
$$ 58594709 59868607 62107803 64663435 66844836 69115864 71125650 72975999 74498930
606G4498930J608229J163766R43147O64223L83132L15j96285k70904J14528L5045
$$ 74498930 76107159 77270925 78214072 78878295 79261427 79261742 79065457 78794553 78909081 78944126
596G8944126K03781L56086j14611M9647j13055l01315m39098m89898o32714m56619
$$ 78944126 79147907 79503993 79389382 79439029 79325974 79024659 78585561 78095663 77462949 77006330
586G7006330q87432j457362j255712j450933j364737j173945j043207n00283k23807
$$ 77006330 76118898 74661536 73405824 71954891 70590154 69416209 68373002 67872719 67648912
577F7648912J67958O19986P25904J212715K127736K316165K681924L459823L807348
$$ 67648912 67816870 68436856 69162760 70375475 72503211 74819376 77501300 80961123 84768471
568H4768471M097583N073836N554524N258646O092429O791383P415297Q320082
$$ 84768471 88866054 93939890 99494414 104753060 110845489 117636872 125052169 133372251
560A33372251J0583190J2036643J4124866J6822757J7930133J7538541J4087044
$$ 133372251 143955441 155992084 170116950 186939707 204869840 222408381 236495425
553B36495425P748020r06237p579634j1592601j2454714j2526712j1286959r941300
$$ 236495425 244243445 243337208 235757574 224164973 211710259 199183547 187896588 177955288
545A77955288r070582p941185o963603o381961o179228n376229m904743m559472
$$ 177955288 168884706 160943521 153979918 147597957 141418729 136042500 131137757 126578285
537A26578285l686980k663317k298805j891180q53818p64959j56722M52672O08359
$$ 126578285 122891305 120227988 117929183 116038003 115184185 114419226 114262504 114715176 115323535
528A15323535P99925J040911J313687J918941K974185L502815M637168N430909
$$ 115323535 116123460 117164371 118478058 120396999 123371184 126873999 131511167 136942076
520A36942076O920859P996891J0048595J2627432J5063021J8464335K0813081
$$ 136942076 143862935 151859826 161908421 174535853 189598874 208063209 228876290
513B28876290K2541052K2468877J9809278J4448380Q734499M184026J919546J254717
$$ 228876290 251417342 273886219 293695497 308143877 316878376 321062402 322981948 324236665
505C24236665M65213j40529j273396k877244m819834o723694q662949j0126363
$$ 324236665 324701878 324561349 323287953 320410709 315590875 308867181 300204232 290077869
497B90077869j0651781r858545q627275o985749m118013k125230O0492K601051
$$ 290077869 279426088 269567543 260940268 253954519 249836506 247711276 247771768 250372819
489B50372819M869376P913891J1215188J4774577J7654386K0777877K3084378
$$ 250372819 255242195 263156086 274371274 289145851 306800237 327578114 350662492
482C50662492K4023337K2593818J9997323J6758089J4527279J3266534J1430967
$$ 350662492 374685829 397279647 417276970 434035059 448562338 461828872 473259839
475D73259839R432388N498970p07887q476865j6304889k3161133k6979605k7897701
$$ 473259839 482692227 488191197 487483310 479006445 462701556 439540423 412560818 384663117
467C84663117k7199934k5806365k3253695j9959980j7666050j5355522j3274841
$$ 384663117 357463183 331656818 308403123 288443143 270777093 255421571 242146730
460B42146730j1569460r475834q065513o964191o252150n434711m807840m942766
$$ 242146730 230577270 221101436 213035923 206071732 199819582 194384871 189577031 184634265
452A84634265n089507m778105l881212l433590k988121k389558k221277k072821
$$ 184634265 179544758 174766653 170885441 167451851 164463730 162074172 159852895 157780074
444A57780074j340130j130338j231492j036515q04707m10542p9460J07470j62106
$$ 157780074 156439944 155309606 154078114 153041599 152236892 151826350 151746890 151854360 151692254
435A51692254J65405R90191J301543J659663K928925N254043P914883J0327158
$$ 151692254 151857659 152847850 154149393 155809056 158737981 163992024 171906907 182234065
427A82234065J0693135N405523k719690p801007j0470999j1464477j0667574r621706
$$ 182234065 192927200 198332723 195613033 187812026 177341027 165876550 155208976 145587270
419A45587270q414843o939010n535596n017730m698768l894381l373348l334644
$$ 145587270 137172427 130233417 124697821 119680091 114981323 111086942 107713594 104378950
411A04378950l370640k823784j925186j587500j171168j322047p51330k60157
$$ 104378950 101008310 98184526 96259340 94671840 93500672 92178625 91427295 91167138
403I1167138k72183J74371J11395N22937J436383J333105J096944P69887k29973
$$ 91167138 90894955 91069326 91180721 91703658 93140041 94473146 95570090 96339977 96110004
394I6110004j342136k349388k997383l441817l493975k659987k567897k571196
$$ 96110004 94767868 92418480 89421097 85979280 82485305 79825318 77257421 74686225
386G4686225k318807k050767j520620j262066j568095j473862j017317o95864
$$ 74686225 72367418 70316651 68796031 67533965 65965870 64492008 63474691 62778827
378F2778827j5982k93744j38556J58624Q24203J231297R32499J761286K393408
$$ 62778827 62762845 62469101 62330545 62489169 63313372 64544669 65477168 67238454 69631862
369F9631862K808561L373086M279951N019330N940886P594074R084359J0417829
$$ 69631862 72440423 75813509 80093460 85112790 91053676 98647750 107732109 118149938
361A18149938J2258817J3814069J3613538J2886704J1232020Q070427M058390
$$ 118149938 130408755 144222824 157836362 170723066 181955086 190025513 194083903
354A94083903J029296k606790n963303q306943r919515j0751912j1249761j0954317
$$ 194083903 195113199 192506409 186543106 178236163 168316648 157564736 146314975 135360658
346A35360658r934138r507783p798611p296306o582273n257393m535628m143226
$$ 135360658 125426520 115918737 108120126 100823820 94241547 88984154 84448526 80305300
338H0305300l377932k819338k246537j576719j359384j179516r83467n78640p88970
$$ 80305300 76927368 74108030 71861493 70284774 68925390 67745874 66762407 66183767 65394797
329F5394797J82149M98312N75735J359793J719135K103714K904250L520857L879085
$$ 65394797 65576946 66075258 66650993 68010786 69729921 71833635 74737885 78258742 82137827
320H2137827M915341O052732P179419Q903855J0584112J1897626J2515847J2611380
$$ 82137827 87053168 93105900 100285319 109189174 119773286 131670912 144186759 156798139
312A56798139J1862942J0331670O575386K298779p88385l428337n053661n053560
$$ 156798139 168661081 178992751 185568137 187866916 187078531 183650194 178596533 173542973
304A73542973m670929l819489j293477Q57459K178409M149799N823778N770660
$$ 173542973 168872044 165052555 163759078 164616537 166794946 170944745 176768523 182539183
296A82539183M266437K010708j718967m566678p347336r173790j1116460j1378460
$$ 182539183 186805620 188816328 187097361 182530683 175183347 166009557 154893097 143514637
288A43514637j0543009r903158r408933r095686q172954o938923n964337n295705
$$ 143514637 132971628 123068470 113659537 104563851 96390897 89451974 83487637 78191932
280G8191932m820817m938717l663602l000649l110657l294530k636469k004668
$$ 78191932 73371115 68432398 64768796 61768147 58657490 55362960 52726491 50721823
272E0721823k073076j559150j862599k182828j340355j461987k040267j647736
$$ 50721823 48648747 47089597 45226998 43044170 41703815 40241828 38201561 36553825
264C6553825j156939j075744q26443j031523j133369r90654o04529j064748r93114
$$ 36553825 35396886 34321142 33494699 32463176 31329807 30339153 29734624 28669876 27676762
255B7676762q76513j075234m80165m89575n89670q47354n62139o65218m86472
$$ 27676762 26800249 25725015 25244850 24755275 24165605 23318251 22756112 22090894 21604422
246B1604422m56355m77864n73794j82795k19112p35692k43123j31109l88166m53883
$$ 21604422 21148067 20670203 20096409 19913614 19694502 18958810 18715687 18584578 18196412 17742529
236A7742529l78129n31317j94967J47568l96303n61152l5410k37900n15537j19685
$$ 17742529 17364400 16833083 16638116 16785684 16389381 15828229 15792819 15554919 15039382 14919697
226A4919697k46077n77173k12531j53008k3363Q4540k67393n61944l34583m84535
$$ 14919697 14673620 14096447 13883916 13730908 13707545 13792085 13524692 12962748 12628165 12143630
216A2143630k79665K07261m15496l13730k64291J45763j22341j213l23910o24114
$$ 12143630 11863965 12071226 11655730 11342000 11077709 11223472 11101131 11099918 10776008 10151894
206A0151894q6748L38306K48249m15063m97678k10846j5403j93972J9750p0958
$$ 10151894 10065146 10403452 10651701 10236638 9738960 9528114 9512711 9318739 9338489 9267531
196I267531j56662R5483K37620j03892k10350k65915j74465k53167J05118K7037
$$ 9267531 9110869 9206352 9443972 9340080 9129730 8863815 8689350 8436183 8541301 8568338
186H568338j25823k49098m7508l51295l42227l76720J81503j91758p7778J9103
$$ 8568338 8442515 8193417 8145909 7794614 7452387 7075667 7257170 7065412 6987634 7006737
176G006737m15074l7885k06945j95968j06331l44852j30029j18057j15098L707
$$ 7006737 6591663 6553778 6346833 6150865 6044534 5699682 5569653 5451596 5336498 5340205
166E340205k02750k35881J3759O1555l07454N9905J30528p260j02406j44387o1193
$$ 5340205 5137455 4901574 4915333 4976888 4669434 4729339 4859867 4852607 4750201 4605814 4544621
155D544621j55610J3012j81857l39147O9771K31563k04484r9284j27466J32932
$$ 4544621 4389011 4402023 4220166 3881019 3950790 4182353 3977869 3878585 3751119 3884051
145C884051q0151N8017L16362n0647j88524o0200j81449k16503K78936l14839
$$ 3884051 3803900 3861917 4178279 4127632 3939108 3878908 3697459 3480956 3759892 3445053
135C445053J37371k5075k23097j07448m3581l83035j58461K2887K17898o8121
$$ 3445053 3582424 3557349 3334252 3226804 3183223 2800188 2641727 2664614 2882512 2814391
125B814391j6093k67441m82111Q6618Q803l80108J3165J80923Q6758k04507l04876
$$ 2814391 2798298 2530857 2048746 2135364 2144167 1764059 1777224 1958147 2044905 1840398 1535522
114A535522J30075k7313j2404K02311j25229P3334L46031l64287l36565j39798
$$ 1535522 1665597 1638284 1625880 1828191 1702962 1776296 2122327 1758040 1421475 1281677
104A281677J4336o58J05227J8001j4097l158N64k05546k69327J7582j39294J39653
$$ 1281677 1296013 1295355 1400582 1418583 1404486 1401328 1401892 1196346 927019 944601 805307 944960
92I44960j32630j97976J107j09463r2251N0829j61927J73976o820j27029J30548
$$ 944960 812330 614354 615461 505998 413747 464576 302649 476625 469805 342776 473324
81D73324j21448J89136R2134j66211p0586J37081J62481K02647j27367m8549R5848
$$ 473324 351876 541012 633146 466935 396349 533430 695911 898558 771191 722642 818490
70H18490m3420j04321K2455j67530J20681n2276k24507j63923J34406P0245k75861
$$ 818490 775070 670749 693204 525674 646355 594079 369572 205649 340055 410300 134439
59A34439m9074J10010r4749j64820L8323o5601m2054N265j42200j30883K17220
$$ 134439 85365 195375 100626 -64194 -25871 -91472 -133526 -128261 -270461 -401344 -184124
48a84124J15019j49372k54613r8619Q3476P7298M2577r1771j24060M2916n454
$$ -184124 -69105 -218477 -473090 -571709 -488233 -410935 -368358 -460129 -584189 -541273 -546727
37e46727J16466K01304j60882n9558J48282q036J2418L0481K7885M9247l1744
$$ -546727 -430261 -228957 -389839 -449397 -301115 -309151 -296733 -266252 -238367 -189120 -220864
26b20864J05079j31165j38231j9540j61706K0635K86408j45163k55787J31214
$$ -220864 -115785 -246950 -385181 -404721 -566427 -545792 -259384 -404547 -660334 -529120
16e29120M6186J30528m6325j87944n4004K74498J38957M1922j64032j64212k20570
$$ -529120 -482934 -352406 -398731 -586675 -640679 -366181 -227224 -185302 -349334 -513546 -734116
5g34116L8655O4841j28843K6307p7390
$$ -734116 -695461 -630620 -759463 -733156 -810546
0h10546
$$ -810546
$$ Imaginary data points
##PAGE= N=2
##DATA TABLE= (X++(I..I)), XYDATA
16383b9094957M81647L4183M16971M81108K68870L93873K26090J97605J88587
$$ -29094957 -28613310 -28579127 -28162156 -27681048 -27412178 -27018305 -26792215 -26594610 -26406023
16374b6406023J08943K75884M88590L65360L63060L3906K77140J83824J99996
$$ -26406023 -26297080 -26021196 -25532606 -25167246 -24804186 -24770280 -24493140 -24309316 -24109320
16365b4109320N01530K91539K2546K91479K65699q6188L33783L6504M6868M60310
$$ -24109320 -23607790 -23316251 -23293705 -23002226 -22736527 -22822715 -22488932 -22452428 -22405560 -21945250
16355b1945250M46982M72554Q8320Q9701L53014J5300kM59438L94009K82753K28200
$$ -21945250 -21498268 -21025714 -20937394 -20847693 -20494679 -20479379 -20479381 -20019943 -19625934 -19343181 -19114981
16344a9114981J61820K72066K26210J99706K39700J39529J55058L30680J23309
$$ -19114981 -18953161 -18681095 -18454885 -18255179 -18015479 -17875950 -17720892 -17390212 -17266903
16335a7266903K84786L12859O9404n1805O9738N34932M42257K43917P8404J23919
$$ -17266903 -16982117 -16669258 -16599854 -16651659 -16581921 -16046989 -15604732 -15360815 -15282411 -15158492
16325a5158492J98152J37722O5853M02379J92665k01671M97426O71653r3253K39682
$$ -15158492 -14960340 -14822618 -14756765 -14354386 -14161721 -14363392 -13865966 -13194313 -13287566 -13047884
16315a3047884N3555k50524L36277K32204K36279L1006J14373J23512r547K60828
$$ -13047884 -12994329 -13244853 -12908576 -12676372 -12440093 -12409087 -12294714 -12171202 -12180749 -11919921
16305a1919921N02418n7570K62724L77088L83994J25888l63994K36394L98861
$$ -11919921 -11417503 -11475073 -11212349 -10835261 -10451267 -10325379 -10689373 -10452979 -10054118
16296a0054118K22335J11825N822P4905M22777m9137J36612L00502J26931K14452
$$ -10054118 -9831783 -9719958 -9714136 -9639231 -9216454 -9265591 -9128979 -8828477 -8701546 -8487094
16286h487094K7724n2909L59089M01504k17134K0448L51007K69977L72709J09529
$$ -8487094 -8459370 -8512279 -8153190 -7751686 -7968820 -7948372 -7597365 -7327388 -6954679 -6845150
16276f845150l9577k61259r5781O75809K62834o5731l5264L5482R3629M55153
$$ -6845150 -6884727 -7145986 -7241767 -6565958 -6303124 -6368855 -6404119 -6368637 -6275008 -5819855
16266e819855r4874p2946r0126N54252m5721k28245O77736K08097m0579j26605
$$ -5819855 -5914729 -5987675 -6077801 -5523549 -5569270 -5797515 -5119779 -4911682 -4952261 -5078866
16256e078866K90815K04578N30580j49233J00002k6367K60871J38669j38498R3750
$$ -5078866 -4788051 -4583473 -4052893 -4202126 -4102124 -4128491 -3867620 -3728951 -3867449 -3773699
16246c773699q61J8174L3581N63275J1089p2729J07003M2927r7167L35625K22542
$$ -3773699 -3774560 -3756386 -3722805 -3159530 -3148441 -3221170 -3114167 -3071240 -3168407 -2832782 -2610240
16235b610240K07126N77676j45534k96526J23751N17529M0761m18116L49315K79674
$$ -2610240 -2403114 -1825438 -1970972 -2267498 -2143747 -1626218 -1585457 -2003573 -1654258 -1374584
16225a374584J33476j68396M5280j8020K8793K93893n8160Q2140K20462K05862
$$ -1374584 -1241108 -1409504 -1364224 -1382244 -1353451 -1059558 -1117718 -1035578 -815116 -609254
16215f09254l34113k3247p9445K72702R9113K69499K2534M9030l26187K02606
$$ -609254 -943367 -966614 -1046059 -773357 -674244 -404745 -382211 -333181 -659368 -456762
16205d56762O97842j94674l1471N9805j22778K942J12875q6351M7002j21194J10308
$$ -456762 241080 46406 14935 74740 -48038 -45096 67779 -18572 28430 -92764 17544
16194A7544L58113k46473k6560J45576p9106K03129J13329J25821o4783K69460
$$ 17544 375657 129184 102624 248200 169094 372223 485552 611373 546590 816050
16184H16050L11498j55364o1060R2799L52684K99479k96957M993N3181p2615J30683
$$ 816050 1127548 972184 911124 1003923 1356607 1656086 1359129 1364122 1417303 1344688 1475371
16173A475371M8268j02056O4819K94771k11759k57811O1333J23192K11731q8520
$$ 1475371 1523639 1421583 1486402 1781173 1569414 1311603 1372936 1496128 1707859 1619339
16163A619339k67237J72446M3068K43895K64221l10808k33915L13249L09544o5496
$$ 1619339 1352102 1524548 1567616 1811511 2075732 1764924 1531009 1844258 2153802 2088306
16153B088306K49233l62564j80663J14421L01433k94452j23096j74801L21479
$$ 2088306 2337539 1974975 1794312 1908733 2210166 1915714 1792618 1617817 1939296
16144A939296J28714j53892J98986N9901j15166K8691n1897P6828J02645K31286
$$ 1939296 2068010 1914118 2113104 2173005 2057839 2086530 2034633 2111461 2214106 2445392
16134B445392M30508m76098r0956J61287k8253K17577K05611j95655j22890J80687
$$ 2445392 2875900 2399802 2308846 2470133 2441880 2659457 2865068 2669413 2546523 2727210
16124B727210L87541n26191j9456Q9318k81789K29994N00584j26706J3460j23925
$$ 2727210 3114751 2588560 2569104 2658422 2376633 2606627 3107211 2980505 2993965 2870040
16114B870040k84369K25198j25791J85810J9755J56153O0005N738J78333q8764
$$ 2870040 2585671 2810869 2685078 2870888 2890643 3046796 3106801 3112539 3290872 3202108
16104C202108l09936J21586J81809m55696K83862J68877Q283j89017M3260l01890
$$ 3202108 2892172 3013758 3195567 2739871 3023733 3192610 3200893 3011876 3055136 2753246
16094B753246n9166M39365L51054l82295m9441M35163l15646k5900P7972k21240
$$ 2753246 2694080 3133445 3484499 3102204 3052763 3487926 3172280 3146380 3224352 3003112
16084C003112K51943K02440J5855k9299O0464J65159n7659n6713k44747O190J61221
$$ 3003112 3255055 3457495 3473350 3444051 3504515 3669674 3612015 3555302 3310555 3316745 3477966
16073C477966J80236m84152j47951j97075J60126K99953J72294k02741k11943
$$ 3477966 3658202 3174050 3026099 2829024 2989150 3289103 3461397 3258656 3046713
16064C046713O6115j44589J84360j35427r6289J71120K11546K86009L0323j05126
$$ 3046713 3112828 2968239 3152599 3017172 2920883 3092003 3303549 3589558 3619881 3514755
16054C514755j97831K50633j81046N7768j01976K35970P0306k70429J04078j69726
$$ 3514755 3316924 3567557 3386511 3444279 3342303 3578273 3648579 3378150 3482228 3312502
16044C312502j42211r6405R7235k19263J78222L9147L8970j3617j10119o5558
$$ 3312502 3170291 3073886 3171121 2951858 3130080 3169227 3208197 3194580 3084461 3018903
16034C018903j98346L84185j35420J06181N5077L39861K53348l23676k94493k99794
$$ 3018903 2820557 3204742 3069322 3175503 3230580 3570441 3823789 3500113 3205620 2905826
16024B905826L58542M2416P9475j53050O3894m9249L5704O8043k23j31121k14139
$$ 2905826 3264368 3306784 3386259 3233209 3297103 3247854 3283558 3351601 3351378 3220257 3006118
16013C006118K19491K52731j40506j84773l7062P1900m7267L47240k64821J0485
$$ 3006118 3225609 3478340 3337834 3153061 3115999 3187899 3140632 3487872 3223051 3233536
16003C233536L32410j951k93952l212K67062J26616P9857k54977J10773k56043
$$ 3233536 3565946 3563995 3270043 3266831 3533893 3660509 3740366 3485389 3596162 3340119
15993C340119K72029K57207k99377l02541j27072M54284m172n4506j84112n0143
$$ 3340119 3612148 3869355 3569978 3267437 3140365 3594649 3590477 3535971 3351859 3301716
15983C301716J71565R9376o7562m3747K04794J36313k10318m51591N40678K83615
$$ 3301716 3473281 3572657 3505095 3461348 3666142 3802455 3592137 3140546 3681224 3964839
15973C964839k35000l4295j84356k8300K44691J6764l29971j12221k20685r4644
$$ 3964839 3729839 3695544 3511188 3482888 3727579 3744343 3414372 3302151 3081466 2986822
15963B986822M08726n3341j73908K8999J55781n05773L50604L37756k58021J8471
$$ 2986822 3395548 3342207 3168299 3197298 3353079 2847306 3197910 3535666 3277645 3296116
15953C296116K14225k39767R1058P97810n71843m89112J41422L94316j15375k70613
$$ 3296116 3510341 3270574 3361632 4159442 3587599 3098487 3239909 3634225 3518850 3248237
15943C248237n7383J45219K06393m19297l41747K80837K88453P4772L03384j24371
$$ 3248237 3190854 3336073 3542466 3123169 2781422 3062259 3350712 3425484 3728868 3604497
15933C604497l02379K97921j80929k53745J46815K4909k30722K51522L45115l12757
$$ 3604497 3302118 3600039 3419110 3165365 3312180 3337089 3106367 3357889 3703004 3390247
15923C390247l27484R113J70022k83369j24283K12962L22754j6741k35266q6881
$$ 3390247 3062763 3071876 3241898 2958529 2834246 3047208 3369962 3353221 3117955 3031074
15913C031074J32893P0501J786K43113K33418J53767l21981l07232M01493J43309
$$ 3031074 3163967 3234468 3236254 3479367 3712785 3866552 3544571 3237339 3638832 3782141
15903C782141n36126k68070L79895L66857j66940j15312M6561p0732Q1534j60046
$$ 3782141 3246015 2977945 3357840 3724697 3557757 3442445 3489006 3418274 3499808 3339762
15893C339762j94114M00293J52066l70440k47494K87633M81054l78042j06773
$$ 3339762 3145648 3545941 3698007 3327567 3080073 3367706 3848760 3470718 3363945
15884C363945K1198O5130j08443J02865K39673j78592n23985K64695L15041j05859
$$ 3363945 3385143 3450273 3341830 3444695 3684368 3505776 2981791 3246486 3561527 3455668
15874C455668k0027k81022j62573L04486K47890k50426k21467J56451p010k44990
$$ 3455668 3435641 3154619 2992046 3296532 3544422 3293996 3072529 3228980 3221970 2976980
15864B976980J16121J60306j33028n5803J05191L67011K15352k44471k89693o7774
$$ 2976980 3093101 3253407 3120379 3064576 3169767 3536778 3752130 3507659 3217966 3150192
15854C150192N20846l12886k4469K46273K1987p3908J34713j04420k70382K89831
$$ 3150192 3671038 3358152 3333683 3579956 3601943 3528035 3662748 3558328 3287946 3577777
15844C577777k1491r3759L02548P4418n99346R115O6922j68117O2987J61110j29030
$$ 3577777 3556286 3462527 3765075 3839493 3240147 3249262 3316184 3148067 3211054 3372164 3243134
15833C243134N1549O49586n28301k92360L06092M6815j1704L34086k68916l22997
$$ 3243134 3294683 3944269 3415968 3123608 3429700 3476515 3464811 3798897 3529981 3206984
15823C206984M81393J7387j42525k07263j51507J67792K87576p9176k00625J1792
$$ 3206984 3688377 3705764 3563239 3355976 3204469 3372261 3659837 3580661 3380036 3391828
15813C391828l73171K64371R0194q0529K01943K1887J0511n3142J64619J71297
$$ 3391828 3018657 3283028 3373222 3292693 3494636 3516523 3527034 3473892 3638511 3809808
15803C809808j8990m53987R258Q3814M48084q9183l18789m7475j54347K14239
$$ 3809808 3790818 3336831 3346089 3429903 3877987 3788804 3470015 3422540 3268193 3482432
15793C482432q3608m5929J9955M88199j73453j80492o5721J10425k8564j57101
$$ 3482432 3398824 3352895 3372850 3861049 3687596 3507104 3441383 3551808 3523244 3366143
15783C366143K05180k29586J48714M19277j47731l76384m6123j38655J64698K55024
$$ 3366143 3571323 3341737 3490451 3909728 3761997 3385613 3339490 3200835 3365533 3620557
15773C620557j44793k29547l17857L96491Q065l04307K62558P5481j61485J82170
$$ 3620557 3475764 3246217 2928360 3324851 3332916 3028609 3291167 3366648 3205163 3387333
15763C387333J39957L7232K55830k50846r4436l37083L29801M66272m66258j43445
$$ 3387333 3527290 3564522 3820352 3569506 3475070 3137987 3467788 3934060 3467802 3324357
15753C324357j9174J64722K41516j51121j06569k01629n64090N01249R9777j93484
$$ 3324357 3305183 3469905 3711421 3560300 3453731 3252102 2688012 3189261 3289038 3095554
15743C095554K27528k4629m3753J60568N1990j98107J28424P2085J28952j50956
$$ 3095554 3323082 3298453 3254700 3415268 3467258 3269151 3397575 3469660 3598612 3447656
15733C447656J5334j1834N4756L7329k71850j04849M57256k60397L17752L49381
$$ 3447656 3462990 3451156 3505912 3543241 3271391 3166542 3623798 3363401 3681153 4030534
15723D030534m03647n09870Q9071K63747j81216m7003M5493k9606N7901K7734
$$ 4030534 3626887 3117017 3206088 3469835 3288619 3241616 3287109 3257503 3315404 3343138
15713C343138l38857N8753J05392K03426L1956k98610J20642M31230j64212m13070
$$ 3343138 3004281 3063034 3168426 3371852 3403808 3105198 3225840 3657070 3492858 3079788
15703C079788N5141k0630K66258J33232J1353k29681k90876L37198K95781n3072
$$ 3079788 3134929 3114299 3380557 3513789 3525142 3295461 3004585 3341783 3637564 3584492
15693C584492m30244R0943N52684K66961j73811j68758l41488K3711M84989j72054
$$ 3584492 3154248 3245191 3797875 4064836 3891025 3722267 3380779 3404490 3889479 3717425
15683C717425j49746r3198K92295L3254l31000j79317q0144N3932K02213J11838
$$ 3717425 3567679 3474481 3766776 3800030 3469030 3289713 3209569 3263501 3465714 3577552
15673C577552l50853j33908j41014O82863k70m73258O1658K80096R3181q2265
$$ 3577552 3226699 3092791 2951777 3634640 3634370 3161112 3222770 3502866 3596047 3513782
15663C513782j19748j05154K18407n764R9273k10267J73161K56045k58673j48063
$$ 3513782 3394034 3288880 3507287 3501523 3600796 3390529 3563690 3819735 3561062 3412999
15653C412999N4932J43113K64316j21056l54350r0765J11441Q9469P7058q9563
$$ 3412999 3467931 3611044 3875360 3754304 3399954 3309189 3420630 3510099 3587157 3497594
15643C497594r6287j01824K08726J00432l44843J3458K00465j780r8872K15428
$$ 3497594 3401307 3299483 3508209 3608641 3263798 3277256 3477721 3475941 3377069 3592497
15633C592497o8437J37356L9936O837l7490J64754J88457n9546j85555n7587k71414
$$ 3592497 3524060 3661416 3701352 3708189 3670699 3835453 4023910 3964364 3778809 3721222 3449808
15622C449808j93463K27386j31076j84936o2659j52875L1292K11316R1762j29396
$$ 3449808 3256345 3483731 3352655 3167719 3105060 2952185 2983477 3194793 3286555 3157159
15612C157159k44568K13521N57716K9721k60463K27199j92808R582M88046K8757
$$ 3157159 2912591 3126112 3683828 3713549 3453086 3680285 3487477 3497059 3985105 4013862
15602D013862m17750k51908M12442k09976J65077L88160l52299n00792J56014
$$ 4013862 3596112 3344204 3756646 3546670 3711747 4099907 3747608 3246816 3402830
15593C402830j56152K16737P8887m51366k2967j88707J59102M21935p1607m01085
$$ 3402830 3246678 3463415 3542302 3090936 3067969 2879262 3038364 3460299 3388692 2987607
15583B987607L21558J09531k7660K30244K05389M1448k73951n7106L1203J28097
$$ 2987607 3309165 3418696 3391036 3621280 3826669 3868117 3594166 3537060 3568263 3696360
15573C696360L22040l27146p5682j01508R3235J19844L1575m52498j7457k0033
$$ 3696360 4018400 3691254 3615572 3514064 3607299 3727143 3758718 3306220 3288763 3268730
15563C268730p2544J83880r8751P5383j09478o4254j08738K00643P7351J37500
$$ 3268730 3196186 3380066 3281315 3356698 3247220 3182966 3074228 3274871 3352222 3489722
15553C489722k09683k80636L48019J28774J56459j2282l18706k2302N39736J79775
$$ 3489722 3280039 2999403 3347422 3476196 3632655 3620373 3301667 3279365 3819101 3998876
15543C998876k20634q0756k19077j42880J50029J18396l14687n5738O6924J35953
$$ 3998876 3778242 3697486 3478409 3335529 3485558 3603954 3289267 3233529 3300453 3436406
15533C436406L62581J76953M0294n30516m0600J7496J77251r0425m71227J1118
$$ 3436406 3798987 3975940 4016234 3485718 3445118 3462614 3639865 3549440 3078213 3089331
15523C089331j84276K33286N7424M0970K07597m7153O4442J36346l15734J88554
$$ 3089331 2905055 3138341 3195765 3236735 3444332 3397179 3461621 3597967 3282233 3470787
15513C470787K67096k61621J81448K08104l86291L21052J52758k07506k0763j19072
$$ 3470787 3737883 3476262 3657710 3865814 3479523 3800575 3953333 3745827 3725064 3605992
15503C605992r3523L14490J64329l01646l46767j28756K1513N6015L83838m20976
$$ 3605992 3512469 3826959 3991288 3689642 3342875 3214119 3235632 3291647 3675485 3254509
15493C254509K64701J81789j06903J47360N1836k15840n06093M64410n3945j62901
$$ 3254509 3519210 3700999 3594096 3741456 3793292 3577452 3071359 3535769 3481824 3318923
15483C318923K21552K77679L6072R3276j99809l17005J43148k04843k50959O2503
$$ 3318923 3540475 3818154 3854226 3947502 3747693 3430688 3573836 3368993 3118034 3180537
15473C180537M58284K22715l2791o1503k71770J24109J25571m44312k56171N73254
$$ 3180537 3638821 3861536 3828745 3767242 3495472 3619581 3745152 3300840 3044669 3617923
15463C617923L63349k25175k73906k34411j81943k40954L99994k4860P1936K15792
$$ 3617923 3981272 3756097 3482191 3247780 3065837 2824883 3224877 3200017 3271953 3487745
15453C487745R5880r5995R3140m161k52677J21722o7631J66608J77966K8799J72754
$$ 3487745 3583625 3487630 3580770 3576609 3323932 3445654 3378023 3544631 3722597 3751396 3924150
15442C924150r6035m31913K37920K99494j3009l42116k29399K27126O3637O5172
$$ 3924150 3828115 3396202 3634122 3933616 3920607 3578491 3349092 3576218 3639855 3705027
15432C705027J29277l86413k3465l9036k54942K75865K26641n2551j14472J1968
$$ 3705027 3834304 3447891 3424426 3385390 3130448 3406313 3632954 3580403 3465931 3477899
15422C477899J85839J71530k45560j12172r8238k44051o9820J2581K62579Q9098
$$ 3477899 3663738 3835268 3589708 3477536 3379298 3135247 3065427 3078008 3340587 3429685
15412C429685k11258k34495J59063L29410N950k12471k71181J23620K56278Q9833
$$ 3429685 3218427 2983932 3142995 3472405 3478355 3265884 2994703 3118323 3374601 3464434
15402C464434j00173N311M3446K6286O0965L23806j65400j35921K78121j84327
$$ 3464434 3364261 3369572 3413018 3439304 3500269 3824075 3658675 3522754 3800875 3616548
15392C616548j53689n8514R908J67660M5527J71277k33057J52976K11294L9648
$$ 3616548 3462859 3404345 3414253 3581913 3627440 3798717 3565660 3718636 3929930 3969578
15382C969578m09063k54299K53135N5105j69023r7824M6684P5305n5373P159L32186
$$ 3969578 3560515 3306216 3559351 3614456 3445433 3347609 3394293 3469598 3414225 3421384 3753570
15371C753570k26456J38032j01524m0938k7982j33382j0452K3226P1149J53542
$$ 3753570 3527114 3665146 3563622 3522684 3494702 3361320 3350868 3374094 3445243 3598785
15361C598785L44383j98034J12311j4216m2731l91732J24931J78503l77541O0757
$$ 3598785 3943168 3745134 3857445 3843229 3800498 3408766 3533697 3712200 3334659 3395416
15351C395416L34485j56748N4903K98887m71856M0548J37974O9480k11306K22832
$$ 3395416 3729901 3573153 3628056 3926943 3455087 3495635 3633609 3703089 3491783 3714615
15341C714615k25369j45109M3583L04445r0902p5061M08366K73376k81863L4704
$$ 3714615 3489246 3344137 3387720 3692165 3601263 3526202 3934568 4207944 3926081 3960785
15331C960785j90303n04661L25490K44743l63552j69K21425Q0890J09848L1340
$$ 3960785 3770482 3265821 3591311 3836054 3472502 3472333 3693758 3774648 3884496 3915836
15321C915836j21685l03202j08321O2980l4188k14547p5055J34323J42902R8209
$$ 3915836 3794151 3490949 3382628 3445608 3411420 3196873 3121818 3256141 3399043 3497252
15311C497252K15627j19280m6605J118J78317r4857K7947K28668r3634q0087l69541
$$ 3497252 3712879 3593599 3546994 3548112 3726429 3631572 3659519 3888187 3794553 3714466 3344925
15300C344925L68958J57710J39559J96990l13278m82724J37930J91239o72293
$$ 3344925 3713883 3871593 4011152 4208142 3894864 3412140 3550070 3741309 3069016
15291C069016k46399m6408J73580J45764K59591k26468j26945J71435L50411n0733
$$ 3069016 2822617 2776209 2949789 3095553 3355144 3128676 3001731 3173166 3523577 3472844
15281C472844N1330J27266j47965J15390J15987k15637q2149J91909K16433N0681
$$ 3472844 3524174 3651440 3503475 3618865 3734852 3519215 3437066 3628975 3845408 3896089
15271C896089K45104m38274j77843o2890K27783l70426M5584L11366k37612M73310
$$ 3896089 4141193 3702919 3525076 3462186 3689969 3319543 3365127 3676493 3438881 3912191
15261C912191K8811j99422j42551m8989o7601M91547o3917j01002j04758j87012
$$ 3912191 3941002 3741580 3599029 3550040 3482439 3973986 3910069 3809067 3704309 3517297
15251C517297M2985Q3248q3225L5098K80594l02759p9772K72124l3726k41630
$$ 3517297 3560282 3643530 3560305 3595403 3875997 3573238 3493466 3765590 3731864 3490234
15241C490234j63037O6212j4085K32599k6238m03691J45491K05424q8385m3792
$$ 3490234 3327197 3393409 3379324 3611923 3585685 3181994 3327485 3532909 3444524 3400732
15231C400732K87666l7165k1527j53579L142k1139j30030l1439j00030J88890
$$ 3400732 3688398 3651233 3629706 3476127 3479269 3458130 3328100 3296661 3196631 3385521
15221C385521J73918J42993k28016J25711k76042L50070J21344R933l25634N5839
$$ 3385521 3559439 3702432 3474416 3600127 3324085 3674155 3795499 3805432 3479798 3535637
15211C535637M22747J60672j07006m16218l67955J9312N78581k06837j18779L39359
$$ 3535637 3958384 4119056 4012050 3595832 3227877 3247189 3825770 3618933 3500154 3839513
15201C839513J76235n30156J39189J27908m07156k59362N8582J21219K30120J76270
$$ 3839513 4015748 3485592 3624781 3752689 3345533 3086171 3144753 3265972 3496092 3672362
15191C672362j39115l49590K88616J11931n8622O2406K17543P4810j04426k64796
$$ 3672362 3533247 3183657 3472273 3584204 3525582 3587988 3805531 3880341 3775915 3511119
15181C511119J01145N7730m21304J24074L12437o2285K1666L19841m26818R2366
$$ 3511119 3612264 3669994 3248690 3372764 3685201 3622916 3644582 3964423 3537605 3629971
15171C629971r0598J49108k17657j96260K53224j4134M1787K5802r7048k45622
$$ 3629971 3539373 3688481 3470824 3274564 3527788 3513654 3555441 3581243 3484195 3238573
15161C238573M23721K45961M4454m75815N2507M07440O3494l82703j58550l9254
$$ 3238573 3662294 3908255 3952709 3476894 3529401 3936841 4000335 3617632 3459082 3419828
15151C419828M26541M28301q0462p3152l87183O8985j81636k63618L5391m2390
$$ 3419828 3846369 4274670 4194208 4121056 3733873 3802858 3621222 3357604 3392995 3350605
15141C350605o4091l5480L11165M92511k82284j47980l7245j80632K9786N05949
$$ 3350605 3286514 3251034 3562199 4054710 3772426 3624446 3587201 3406569 3436355 3942304
15131C942304R022j21990j45101j69290j12124K80079Q2282l9174k17265K77054
$$ 3942304 3951326 3829336 3684235 3514945 3402821 3682900 3765182 3726008 3508743 3785797
15121C785797K86594O8185J356o78149n7886k11327J83343J44808m8610k80340
$$ 3785797 4072391 4140576 4141932 3463783 3405897 3194570 3377913 3522721 3474111 3193771
15111C193771M03069L45404j64322k57959N5127J60804N2276R582o21958J72151
$$ 3193771 3596840 3942244 3777922 3519963 3575090 3735894 3788170 3797752 3175794 3347945
15101C347945K04012P1743j02585j87501L1938K24384l6912l20882q1408L84493
$$ 3347945 3551957 3623700 3521115 3333614 3365552 3589936 3553024 3232142 3150734 3535227
15091C535227L98618j44933j33281J20836k1505J02301k3330l01173j48979M38200
$$ 3535227 3933845 3788912 3655631 3776467 3754962 3857263 3833933 3532760 3383781 3821981
15081C821981K95240k22616k40308j30061l1878k2996K62120j36124j71639k9425
$$ 3821981 4117221 3894605 3654297 3524236 3492358 3469362 3731482 3595358 3423719 3394294
15071C394294K84634J49219r8876j92251l2221o2445J08262K50831j07449k20574
$$ 3394294 3678928 3828147 3729271 3537020 3504799 3442354 3550616 3801447 3693998 3473424
15061C473424J72455K9892J21260k19904j29091O1917J1951J10817j92385k92626
$$ 3473424 3645879 3675771 3797031 3577127 3448036 3509953 3521904 3632721 3440336 3147710
15051C147710J37324L60690j07432j11956K8124K55423J30917J20948o128k19634
$$ 3147710 3285034 3645724 3538292 3426336 3454460 3709883 3840800 3961748 3955620 3735986
15041C735986L12883R714j04169R5584K04101J20024l86786k21699p6686j92535
$$ 3735986 4048869 4058583 3954414 4049998 4254099 4374123 3987337 3765638 3688952 3496417
15031C496417K20887P1991j77089r8166l153K50625P5808p1718j34094p9320K43951
$$ 3496417 3717304 3789295 3612206 3514040 3510887 3761512 3837320 3765602 3631508 3552188 3796139
15020C796139K57580M5822j47787j89371K9808j60263J45871j10519K11184j56597
$$ 3796139 4053719 4099541 3951754 3762383 3792191 3631928 3777799 3667280 3878464 3721867
15010C721867o7593P2786j61317l47448o0082L70453j88227k44239J53122M62
$$ 3721867 3654274 3727060 3565743 3218295 3158213 3528666 3340439 3096200 3249322 3249784
15000C249784k2146M40311l2198l34620L27371J42502j27292J9662R0280k59507
$$ 3249784 3227638 3667949 3635751 3301131 3628502 3771004 3643712 3663374 3753654 3494147
14990C494147k63336Q9989L26827j28101M9237Q6157n31768J9123J25614k3784
$$ 3494147 3230811 3320800 3647627 3519526 3568763 3654920 3123152 3142275 3267889 3244105
14980C244105k7053J48549j75176k16331K91481J3238l9290J59308J1000J4199
$$ 3244105 3217052 3365601 3190425 2974094 3265575 3278813 3239523 3398831 3409831 3424030
14970C424030J14444L25088k16256Q750j20829j36829O9478L40827j54488j18899
$$ 3424030 3538474 3863562 3647306 3656056 3535227 3398398 3467876 3808703 3654215 3535316
14960C535316K3845P7773O9730J39945L0036j17338j95588J28803P9234M1771
$$ 3535316 3559161 3636934 3706664 3846609 3876645 3759307 3563719 3692522 3771756 3813527
14950C813527N983l52186L35399K42801j15679J16056j3165P3232J26382l93190
$$ 3813527 3819510 3467324 3802723 4045524 3929845 4045901 4032736 4105968 4232350 3839160
14940C839160l4019J94236J28165q6459j38385o8555j50671M69667J4378l93383
$$ 3839160 3805141 3999377 4127542 4041083 3902698 3834143 3683472 4153139 4167517 3774134
14930C774134j53192J93162K50168L63043P4772m82318k1589K3956k84317m74964
$$ 3774134 3620942 3814104 4064272 4427315 4502087 4019769 3998180 4022136 3737819 3262855
14920C262855L27745L49836J37985j38646k71487k06403K82290j10598l84348
$$ 3262855 3590600 3940436 4078421 3939775 3668288 3461885 3744175 3633577 3249229
14911C249229q5970M37806L39321K75844l5064l44624k03380L52586K9663K19194
$$ 3249229 3163259 3601065 3940386 4216230 4181166 3836542 3633162 3985748 4015411 4234605
14901D234605j36572k76061K1424K01061k58536n51118K3247J04166Q2651j71255
$$ 4234605 4098033 3821972 3843396 4044457 3785921 3234803 3258050 3362216 3444867 3273612
14891C273612K00708j37420j60147K91503M3023k32519Q3946Q3934o9258J04021
$$ 3273612 3474320 3336900 3176753 3468256 3511279 3278760 3362706 3446640 3377382 3481403
14881C481403J36517k45736K9951L12205J22188m64058p1871K50617m8787k73080
$$ 3481403 3617920 3372184 3402135 3714340 3836528 3372470 3300599 3551216 3502429 3229349
14871C229349j19679p7828K27663K50945l2646J53834L8819L11441j36922l60129
$$ 3229349 3109670 3031842 3259505 3510450 3477804 3631638 3670457 3981898 3844976 3484847
14861C484847j48365l5108L48150M05314O4971l47311j32679J7132L31800l71575
$$ 3484847 3336482 3301374 3649524 4054838 4119809 3772498 3639819 3656951 3988751 3617176
14851C617176k81006J62553K73754J73679K3068l07822l2458J19634j17821j27612
$$ 3617176 3336170 3498723 3772477 3946156 3969224 3661402 3628944 3748578 3630757 3503145
14841C503145K99483N10699k94073k08940L10150j97946J1681J73403k17058o6255
$$ 3503145 3802628 4313327 4019254 3810314 4120464 3922518 3934199 4107602 3890544 3824289
14831C824289K24944J71069o3144O3601l67975j32997K09496R2471n91665J79634
$$ 3824289 4049233 4220302 4157158 4220759 3852784 3719787 3929283 4021754 3430089 3609723
14821C609723M31857J43246J6046j7703m63360j41016L01520l32463k72152L09490
$$ 3609723 4041580 4184826 4200872 4183169 3719809 3578793 3880313 3547850 3275698 3585188
14811C585188K04236n88751J38328L38253j04553O540n6449r8466K36204K31663
$$ 3585188 3789424 3200673 3339001 3677254 3572701 3579241 3522792 3424326 3660530 3892193
14801C892193L0859l83100m1807N1882J00312J81308k6831j65113K72308O615
$$ 3892193 3923052 3539952 3498145 3550027 3650339 3831647 3804816 3639703 3912011 3918626
14791C918626k79451p1387j68231L12883j98981k35802k5195K25747M49479K9781
$$ 3918626 3639175 3567788 3399557 3712440 3513459 3277657 3252462 3478209 3927688 3957469
14781C957469n43410q1783J17783r0813K46954k20498K02839R1672J37429q0940
$$ 3957469 3414059 3332276 3450059 3359246 3606200 3385702 3588541 3680213 3817642 3736702
14771C736702n8068q2790o6767K15081N8045P4277j14985k8956l31901j74259
$$ 3736702 3678634 3595844 3529077 3744158 3802203 3876480 3761495 3732539 3400638 3226379
14761C226379k01822K07026M23005J70732O5094J707J04243j42027q0167k82771
$$ 3226379 3024557 3231583 3654588 3825320 3890414 3892121 3996364 3854337 3774170 3491399
14751C491399K65436J50870j47268K51596K86401j21238M5264j32222k353K49708
$$ 3491399 3756835 3907705 3760437 4012033 4298434 4177196 4222460 4090238 4087885 4337593
14741D337593j30488J48097l13147j04182J34529l83891p3319K86057l35155k76435
$$ 4337593 4207105 4355202 4042055 3937873 4072402 3688511 3615192 3901249 3566094 3289659
14731C289659J13916L90846k07382j47666J28923j21792K71716L59280k68054
$$ 3289659 3403575 3794421 3587039 3439373 3568296 3446504 3718220 4077500 3809446
14722C809446j28019K64924J41902m8727j73769j44087M0828p2459K54840k31423
$$ 3809446 3681427 3946351 4088253 4039526 3865757 3721670 3762498 3690039 3944879 3713456
14712C713456k42056J65737J69248J05026j6467k96558R2113M08112k41614l78587
$$ 3713456 3471400 3637137 3806385 3911411 3894944 3598386 3690499 4098611 3856997 3478410
14702C478410J37133J59210j51817R0387L48882j09251J45430j9782m08802j20489
$$ 3478410 3615543 3774753 3622936 3713323 4062205 3952954 4098384 4078602 3669800 3549311
14692C549311M45140q372l07504J00922N3175j53915j52220Q7109k18661J2175
$$ 3549311 3994451 3986079 3678575 3779497 3832672 3678757 3526537 3613646 3394985 3407160
14682C407160J63194O4071L0406j01661J9062J02777j04724l1190K2251M8602
$$ 3407160 3570354 3634425 3664831 3563170 3582232 3685009 3580285 3549095 3571346 3619948
14672C619948K13681M5856l70116R318J34318P3016n09145J53809K5397m4993
$$ 3619948 3833629 3879485 3509369 3518687 3653005 3726021 3216876 3370685 3396082 3351089
14662C351089M12563J42716J1442J02776J45149n5947l5686q2069k47157k29547
$$ 3351089 3763652 3906368 3917810 4020586 4165735 4109788 4074102 3992033 3744876 3515329
14652C515329K78290M14901j22647j35208j69849J98949k6605l413k30799K33743
$$ 3515329 3793619 4208520 4085873 3950665 3780816 3979765 3953160 3949747 3718948 3952691
14642C952691J80169r4423l779j39670j13697j92011O009j31148J59756L60107
$$ 3952691 4132860 4038437 4034658 3894988 3781291 3589280 3595289 3464141 3623897 3984004
14632C984004L44586o4843k45165k01577j85200J17271m2431j27181J55895K51054
$$ 3984004 4328590 4263747 4018582 3817005 3631805 3749076 3706645 3579464 3735359 3986413
14622C986413J84456j10097j22990M1641j44901N4640p7313k13377K56366l7483
$$ 3986413 4170869 4060772 3937782 3979423 3834522 3889162 3811849 3598472 3854838 3817355
14612C817355L6961r9801K17356O5640j45043P9401K07953m95817m6207P6302
$$ 3817355 3854316 3754515 3971871 4037511 3892468 3971869 4179822 3684005 3637798 3714100
14602C714100Q3356Q2116N6857j33227l58444J62377L12319J59716p1144k27662
$$ 3714100 3797456 3879572 3936429 3803202 3444758 3607135 3919454 4079170 4008026 3780364
14592C780364j63042K64142J66302m16844j57333r6462j18063N36558J57836l29108
$$ 3780364 3617322 3881464 4047766 3630922 3473589 3377127 3259064 3795622 3953458 3624350
14582C624350L5069K07658j95143Q6005J94204j55937l72818L24858J85845p6283
$$ 3624350 3659419 3867077 3671934 3757939 3952143 3796206 3423388 3748246 3934091 3857808
14572C857808N9716j98722J6105J07411k4910o7849k99738R8611p6966m75525
$$ 3857808 3917524 3718802 3734907 3842318 3817408 3749559 3449821 3548432 3471466 2995941
14562B995941J5936L84711l09516J64472P1623l6641K87571j60934k01552J37923
$$ 2995941 3011877 3396588 3087072 3251544 3323167 3286526 3574097 3413163 3211611 3349534
14552C349534J74550N0334O4624L34940P3790K2506K07315l80131j09776J59016
$$ 3349534 3524084 3574418 3639042 3973982 4047772 4070278 4277593 3897462 3787686 3946702
14542C946702j07638J77861R5003j9156j26507r4966K6383l56463N3883P4356
$$ 3946702 3839064 4016925 4111928 4092772 3966265 3871299 3897682 3541219 3595102 3669458
14532C669458K87351p3090m4097P3747J39712j18316k96077j66490M29170J97439
$$ 3669458 3956809 3883719 3839622 3913369 4053081 3934765 3638688 3472198 3901368 4098807
14522D098807j77357R1562j58507Q4934m4965k35262j17882j63221L11368J28975
$$ 4098807 3921450 4013012 3854505 3939439 3894474 3659212 3541330 3378109 3689477 3818452
14512C818452L0395k87l0319J8031L409K8310K833j43824K9307J96565J8116J93975
$$ 3818452 3848847 3848560 3818241 3836272 3839681 3867991 3870824 3727000 3756307 3952872 3970988 4164963
14500D164963J7458l71554k25220J94372K23878J11924j04934k00435J40111J15681
$$ 4164963 4182421 3810867 3585647 3780019 4003897 4115821 4010887 3810452 3950563 4066244
14490D066244K5798j93617q3410p3655K38418K34390k64926q6264o6243J67805
$$ 4066244 4092042 3898425 3815015 3741360 3979778 4214168 3949242 3862978 3796735 3964540
14480C964540K5281L6578k94001k04399M35636J54929k39447O8471k27551n4406
$$ 3964540 3989821 4026399 3732398 3527999 3963635 4118564 3879117 3947588 3720037 3665631
14470C665631L2497q851k0492q9425J33849M9686j9196K29906j47090o8873m6701
$$ 3665631 3698128 3689277 3668785 3579360 3713209 3762895 3743699 3973605 3826515 3757642 3710941
14459C710941m0737R1673J98808j64783K6160J26421n13058K75012L94820j01993
$$ 3710941 3670204 3761877 3960685 3795902 3822062 3948483 3435425 3710437 4105257 4003264
14449D003264j30324K25561k04224J34494K45528l82520l42300J91509K57284
$$ 4003264 3872940 4098501 3894277 4028771 4274299 3891779 3549479 3740988 3998272
14440C998272n5430K16421r3350m23205K31996L91421l23095p2091R91p5857K76789
$$ 3998272 3942842 4159263 4065913 3642708 3874704 4266125 3943030 3870939 3871930 3796073 4072862
14429D072862J47327n3226l67296K15590L62954m51787K2318Q1789p8912J08762
$$ 4072862 4220189 4166963 3799667 4015257 4378211 3926424 3948742 4030531 3951619 4060381
14419D060381J7931m38765q3474J52405n3214M1738J14357K07593p4479J726j66806
$$ 4060381 4078312 3639547 3556073 3708478 3655264 3697002 3811359 4018952 3944473 3946199 3779393
14408C779393K7938j70336K075j7315Q3499K28734L7646q3112n61055M9812J90348
$$ 3779393 3807331 3636995 3639070 3621755 3705254 3933988 3971634 3888522 3327467 3377279 3567627
14397C567627l2482r6004M22288m4693J44906O9314k70977q8559p1542L85741
$$ 3567627 3535145 3439141 3861429 3816736 3961642 4030956 3759979 3671420 3599878 3985619
14387C985619k03457j56651L42122J35288j63444j71895o5669P112K08502q0088
$$ 3985619 3782162 3625511 3967633 4102921 3939477 3767582 3701913 3709025 3917527 3837439
14377C837439p8884j83677J21465J04816q2307l02282q4678M30466P1858K18911
$$ 3837439 3758555 3574878 3696343 3801159 3718852 3416570 3331892 3762358 3834216 4053127
14367D053127j79294J42766r4488N3182n9147J19581l2213M9448N9605k87360
$$ 4053127 3873833 4016599 3922111 3975293 3916146 4035727 4003514 4052962 4112567 3825207
14357C825207K91864j02203k22407l60404K05131J71642j23164J048j47079j21704
$$ 3825207 4117071 4014868 3792461 3432057 3637188 3808830 3685666 3686714 3539635 3417931
14347C417931Q2693J82995j12931J07309J27437L64358j17584k33201j5160k3681
$$ 3417931 3500624 3683619 3570688 3677997 3805434 4169792 4052208 3819007 3803847 3780166
14337C780166K52773J0220q4403R403K12006K2392j35118q439j02854M11936j44945
$$ 3780166 4032939 4043159 3958756 3968159 4180165 4202557 4067439 4059000 3956146 4368082 4223137
14326D223137k63683Q3619q1431M2516k55025l00117K27317M16675O7115R0688
$$ 4223137 3959454 4043073 3961642 4004158 3749133 3449016 3676333 4093008 4160123 4250811
14316D250811k75124N6135r4177j2481l6899j54542J6251J03735J97579j23875
$$ 4250811 3975687 4031822 3937645 3925164 3888265 3733723 3749974 3853709 4051288 3927413
14306C927413l2291k07949R712J8196M2788l5690P5992M57929O5081k49472l57610
$$ 3927413 3895122 3687173 3696885 3715081 3757869 3722179 3798171 4256100 4321181 4071709 3714099
14295C714099l4101J43910J15201K5652j561l05624j94499L32128R0781l19559
$$ 3714099 3679998 3823908 3939109 3964761 3963200 3657576 3463077 3795205 3885986 3566427
14285C566427j85025Q514K10069N19711j11458m66323j9361L55902K69480j91337
$$ 3566427 3381402 3389916 3599985 4119696 4008238 3541915 3522554 3878456 4147936 3956599
14275C956599p3956O1003L44415k65058k78411L50836J94684J09358J16346k70447
$$ 3956599 3882643 3943646 4288061 4023003 3744592 4095428 4290112 4399470 4515816 4245369
14265D245369k23365p4516k20458j06248j60863N9529N685L98679K15146j89851
$$ 4245369 4022004 3947488 3727030 3620782 3459919 3519448 3525133 3923812 4138958 3949107
14255C949107j86563j2042J48335J02814j67756K13222K54002k37944q1099l36457
$$ 3949107 3762544 3750502 3898837 4001651 3833895 4047117 4301119 4063175 3982076 3645619
14245C645619J75831K89632m19551O5168L20143q2647q5423o3264o9900m9743
$$ 3645619 3821450 4111082 3691531 3756699 4076842 3994195 3908772 3845508 3775608 3725865
14235C725865J05872j29815k585M55314K52595j59314k31233k05514J32898n6352
$$ 3725865 3831737 3701922 3699337 4154651 4407246 4247932 4016699 3811185 3944083 3887731
14225C887731j0863Q4356n7551k16141J98257M15309k95523q9591J6315K09392
$$ 3887731 3876868 3961224 3903673 3687532 3885789 4301098 4005575 3915984 3932299 4141691
14215D141691q5957L1807P0507k6539k37726j38293l69807K39948Q56678J43066
$$ 4141691 4055734 4087541 4158048 4131509 3893783 3755490 3385683 3625631 4482309 4625375
14205D625375n00970k02146K45529K21611j92999n86422M7497k07355K73056L56507
$$ 4625375 4124405 3922259 4167788 4389399 4196400 3609978 3657475 3450120 3723176 4079683
14195D079683l1667l10924j47553K64788m2254J08165L08414j10558R7750P2396
$$ 4079683 4048016 3737092 3589539 3854327 3812073 3920238 4228652 4118094 4215844 4288240
14185D288240l25609k83195J42125J98813j98946j39322J24470M03428O7794j53371
$$ 4288240 3962631 3679436 3821561 4020374 3821428 3682106 3806576 4210004 4277798 4124427
14175D124427j1053r9557m6425K61120j9138R7228q9935j17910k27567j80924
$$ 4124427 4113374 4013817 3967392 4228512 4209374 4306602 4216667 4098757 3871190 3690266
14165C690266K23052j96508j64108K2353o3748n3162r9252K33293L98537j63206
$$ 3690266 3913318 3716810 3552702 3575055 3511307 3458145 3358893 3592186 3990723 3827517
14155C827517j60220l859K43803K36211j0224l25121K27361o183L28496q5970
$$ 3827517 3667297 3663438 3907241 4143452 4133228 3808107 4035468 4029285 4357781 4271811
14145D271811o31613J30820L62955k19041j6248Q4108j55876K01209L8442k49135
$$ 4271811 3640198 3771018 4133973 3914932 3898684 3982792 3826916 4028125 4066567 3817432
14135C817432l33179L41681m8610J6489M0533j88083L6631Q6814J86509k28495
$$ 3817432 3484253 3825934 3777324 3793813 3834346 3646263 3682894 3769708 3956217 3727722
14125C727722m8212L38931l8512R8073J00180L2822k0025j04686r4365k53111
$$ 3727722 3679510 4018441 3979929 4078002 4178182 4211004 4190979 4086293 3991928 3738817
14115C738817J53329L05258r9072q9087J61889J54394m0820l66946Q2395o9039
$$ 3738817 3892146 4197404 4098332 4009245 4171134 4325528 4284708 3917762 4000157 3931118
14105C931118k6904J1457J13499j0434o4865n3714k17492K57845M2804j0510j55082
$$ 3931118 3904214 3915671 4029170 4018736 3953871 3900157 3682665 3940510 3983314 3972804 3817722
14094C817722L83966p4461L8336j36746l7496J94266J15318j84402j51847J58688
$$ 3817722 4201688 4127227 4165563 4028817 3991321 4185587 4300905 4116503 3964656 4123344
14084D123344P7110m6884k09679k1153n3543J68079n0156j6870j40066j93849
$$ 4123344 4200454 4153570 3943891 3922738 3869195 4037274 3987118 3970248 3830182 3636333
14074C636333M66691m7572J84809j95020k14569K51607l9911k57089Q1531M06616
$$ 3636333 4103024 4055452 4240261 4045241 3830672 4082279 4042368 3785279 3866810 4273426
14064D273426o9172J25325n0185r3408j09291J72580l25976j38402K06077j96249
$$ 4273426 4204254 4329579 4279394 4185986 4076695 4249275 3923299 3784897 3990974 3794725
$$ [...]
##END NTUPLES=NMR SPECTRUM
##END=
