##TITLE=1H_DE-80H_X3
 200.13MHz, d2o
 8 sc
 
 19ns.26.2.2025
##JCAMPDX= 6.0         $$ Bruker NMR JCAMP-DX V2.0
##DATA TYPE= NMR SPECTRUM
##DATA CLASS= NTUPLES
##ORIGIN= UXNMR, Bruker Analytische Messtechnik GmbH
##OWNER= pz
$$ XWIN-NMR		Version 3.5
$$ Tue May  5 10:56:37 2026 Russian Standard Time (UT+4h)  Yarkov@DPX200
##.OBSERVE FREQUENCY= 200.1313
##.OBSERVE NUCLEUS= ^1H
##.ACQUISITION MODE= SIMULTANEOUS
##.ACQUISITION SCHEME= undefined
##.AVERAGES= 8
##.DIGITISER RES= 18
##SPECTROMETER/DATA SYSTEM= spect
##.PULSE SEQUENCE= zg30
##.SOLVENT NAME= CDCl3
##.SHIFT REFERENCE= (INTERNAL, CDCl3, 0, 18.0852)
##AUDIT TRAIL= $$ (NUMBER, WHEN, WHO, WHERE, WHAT)
$$ ##TITLE= Audit trail, XWIN-NMR		Version 3.5
$$ ##JCAMPDX= 5.01
$$ ##ORIGIN= Bruker BioSpin GmbH
$$ ##OWNER= Yarkov
$$ C:/Bruker/XWIN-NMR/data/yarkov2/nmr/H-C/1/pdata/1/auditp.txt
$$ ##AUDIT TRAIL=  $$ (NUMBER, WHEN, WHO, WHERE, WHAT)
(   1,<2026-05-05 10:55:16.43 +0400>,<Yarkov>,<DPX200>,
      <created by zg, POWCHK disabled, PULCHK disabled
       configuration hash MD5:
       00 E9 B6 7A A2 85 ED C7 34 08 36 98 17 FE 4E 26
       data hash MD5: 16K
       A7 8D D4 86 A1 6D 41 EF A2 E8 CA 1D 80 38 1B 8B>)
(   2,<2026-05-05 10:55:27.23 +0400>,<Yarkov>,<DPX200>,
      <Start of raw data processing
       efp BC_mod = 2 LB = 0.25 FT_mod = 6 PKNL = 1 PHC0 = -5504.716 PHC1 = 11.42193 SI = 16K 
       data hash MD5: 16K
       14 0E 9A C8 6D 13 08 2D B1 BD 53 8B 33 31 F9 E2>)
(   3,<2026-05-05 10:55:41.20 +0400>,<Yarkov>,<DPX200>,
      <abs ABSG = 5 
       data hash MD5: 16K
       15 96 84 5D 20 EF 42 EF BF 8F 41 B9 3D 23 3F E2>)
$$ ##END=
$$ 
$$ hash MD5
$$ FC 2E 08 71 9B FE 47 22 9F CB 6D 73 08 D6 A1 27
##$RELAX= 
##$RELAX= 
##$RELAX= 
##$RELAX= 
##$RELAX= 
##$RELAX= 
$$ Bruker specific parameters
$$ --------------------------
##$DU= <C:/Bruker/XWIN-NMR>
##$EXPNO= 1
##$NAME= <H-C>
##$PROCNO= 1
##$TYPE= <nmr>
##$USER= <yarkov2>
##$AMP= (0..31)
100 100 100 100 100 100 100 100 100 100 100 100 100 100 100 100 100 100 
100 100 100 100 100 100 100 100 100 100 100 100 100 100 
##$AQSEQ= 0
##$AQ_mod= 1
##$AUNM= <au_zg>
##$AUTOPOS= <>
##$BF1= 200.13
##$BF2= 200.13
##$BF3= 200.13
##$BF4= 200.13
##$BF5= 200.13
##$BF6= 200.13
##$BF7= 200.13
##$BF8= 200.13
##$BYTORDA= 1
##$CFDGTYP= 0
##$CFRGTYP= 5
##$CHEMSTR= <none>
##$CNST= (0..31)
1 1 145 1 1 1 1 1 1 1 1 1 1 1 1 1 1 1 1 1 1 1 1 1 1 1 1 1 1 1 1 1 
##$CPDPRG= <>
##$CPDPRG1= <>
##$CPDPRG2= <>
##$CPDPRG3= <>
##$CPDPRG4= <mlev>
##$CPDPRG5= <mlev>
##$CPDPRG6= <mlev>
##$CPDPRG7= <mlev>
##$CPDPRG8= <mlev>
##$CPDPRGB= <>
##$CPDPRGT= <>
##$D= (0..31)
0 0.7 0 0 0 0 0 0 0 0 0 0.03 0 0 0 0 0 0 0 0 0 0 0 0 0 0 0 0 0 0 0 0 
##$DATE= 1777964116
##$DBL= (0..7)
120 120 120 120 120 120 120 120 
##$DBP= (0..7)
150 150 150 150 150 150 150 150 
##$DBP07= 0
##$DBPNAM0= <>
##$DBPNAM1= <>
##$DBPNAM2= <>
##$DBPNAM3= <>
##$DBPNAM4= <>
##$DBPNAM5= <>
##$DBPNAM6= <>
##$DBPNAM7= <>
##$DBPOAL= (0..7)
0.5 0.5 0.5 0.5 0.5 0.5 0.5 0.5 
##$DBPOFFS= (0..7)
0 0 0 0 0 0 0 0 
##$DE= 6
$$ [...]
##$SUBNAM3= <"">
##$SUBNAM4= <"">
##$SUBNAM5= <"">
##$SUBNAM6= <"">
##$SUBNAM7= <"">
##$SUBNAM8= <"">
##$SUBNAM9= <"">
##$SW= 18.0517328524113
##$SWIBOX= (0..15)
0 0 2 0 0 0 0 0 0 0 0 0 0 0 0 0 
##$SW_h= 3612.71676300578
##$TD= 16384
##$TD0= 1
##$TE= 0
##$TE2= 300
##$TE3= 300
##$TEG= 300
##$TL= (0..7)
0 120 120 120 120 120 120 120 
##$TP= (0..7)
150 150 150 150 150 150 150 150 
##$TP07= 0
##$TPNAME0= <>
##$TPNAME1= <>
##$TPNAME2= <>
##$TPNAME3= <>
##$TPNAME4= <>
##$TPNAME5= <>
##$TPNAME6= <>
##$TPNAME7= <>
##$TPOAL= (0..7)
0.5 0.5 0.5 0.5 0.5 0.5 0.5 0.5 
##$TPOFFS= (0..7)
0 0 0 0 0 0 0 0 
##$TUNHIN= 0
##$TUNHOUT= 0
##$TUNXOUT= 0
##$USERA1= <user>
##$USERA2= <user>
##$USERA3= <user>
##$USERA4= <user>
##$USERA5= <user>
##$V9= 5
##$VALIST= <valist>
##$VCLIST= <CCCCCCCCCCCCCCC>
##$VD= 0
##$VDLIST= <DDDDDDDDDDDDDDD>
##$VPLIST= <PPPPPPPPPPPPPPP>
##$VTLIST= <TTTTTTTTTTTTTTT>
##$WBST= 1024
##$WBSW= 4
##$XGAIN= (0..3)
0 0 0 0 
##$XL= 0
##$YL= 0
##$YMAX_a= 24324
##$YMIN_a= -32370
##$ZGOPTNS= <>
##$ZL1= 120
##$ZL2= 120
##$ZL3= 120
##$ZL4= 120
##$ABSF1= 17.78635
##$ABSF2= -0.2655411
##$ABSG= 5
##$ABSL= 3
##$ALPHA= 0
##$AQORDER= 0
##$ASSFAC= 0
##$ASSFACI= 0
##$ASSFACX= 0
##$ASSWID= 0
##$AUNMP= <proc_1d>
##$AZFE= 0.1
##$AZFW= 0.1
##$BCFW= 0
##$BC_mod= 2
##$BYTORDP= 0
##$COROFFS= 0
##$CY= -3
##$DATMOD= 1
##$DC= 0
##$DFILT= <>
##$DTYPP= 0
##$F1P= 0
##$F2P= 0
##$FCOR= 1
##$FTSIZE= 16384
##$FT_mod= 6
##$GAMMA= 0
##$GB= 0
##$INTBC= 1
##$INTSCL= 3.241238e-09
##$ISEN= 128
##$LB= 0.25
##$LEV0= 0
##$LPBIN= 0
##$MAXI= 10000
##$MC2= 0
##$MEAN= 0
##$ME_mod= 0
##$MI= 1.114404
##$NCOEF= 0
##$NC_proc= -10
##$NLEV= 6
##$NOISF1= 3.799351
##$NOISF2= 2.8
##$NSP= 0
##$NTH_PI= 0
##$NZP= 0
##$OFFSET= 18.08519
##$PC= 1
##$PHC0= -5504.716
##$PHC1= 11.42193
##$PH_mod= 1
##$PKNL= yes
##$PPARMOD= 0
##$PSCAL= 0
##$PSIGN= 0
##$REVERSE= no
##$SF= 200.129486978805
##$SI= 16384
##$SIGF1= 3
##$SIGF2= 2
##$SINO= 0.751879
##$SIOLD= 32768
##$SREGLST= <19F.Aceton>
##$SSB= 0
##$STSI= 16384
##$STSR= 0
##$SW_p= 3612.71676300578
##$SYMM= 0
##$S_DEV= 0
##$TDeff= 16384
##$TDoff= 0
##$TI= <>
##$TILT= no
##$TM1= 0
##$TM2= 0
##$TOPLEV= 0
##$USERP1= <user>
##$USERP2= <user>
##$USERP3= <user>
##$USERP4= <user>
##$USERP5= <user>
##$WDW= 1
##$XDIM= 16384
##$YMAX_p= 456481723
##$YMIN_p= -24673395
$$ End of Bruker specific parameters
$$ ---------------------------------
##NTUPLES= NMR SPECTRUM
##VAR_NAME=  FREQUENCY,     SPECTRUM/REAL,   SPECTRUM/IMAG
##SYMBOL=    X,             R,               I
##VAR_TYPE=  INDEPENDENT,   DEPENDENT,       DEPENDENT
##VAR_FORM=  AFFN,          ASDF,            ASDF
##VAR_DIM=   16384,         16384,           16384
##UNITS=     HZ,            ARBITRARY UNITS, ARBITRARY UNITS
##FACTOR=    0.220516191357247, 1,           1
##FIRST=     3619.37976045801, 0,            0
##LAST=      6.66299745222796, 0,            0
##MIN=       6.66299745222796, -24673395,    0
##MAX=       3619.37976045801, 456481723,    0
$$ Real data points
##PAGE= N=1
##DATA TABLE= (X++(R..R)), XYDATA
16383 -24541182 -24673395 -20895315 -17815815 -18560229 -16092306 -17389544 -18083106 -14391767
16375 -14391767 -9570507 -10187856 -6063793 -98832 577102 4607270 8294196 9567385
16367 9567385 15181641 19586634 23687329 30594609 38722883 44494026 50043496 51929830
16359 51929830 54234083 58574525 64816937 75337951 90038265 110397165 143387513
16352 143387513 194015958 255894955 329560407 400164009 453791508 456481723 409099920
16345 409099920 318645671 243212603 194115573 147002380 98912660 59719936 35260749
16338 35260749 19802001 13450307 6707719 6038190 5221221 4270528 2187361 608954
16330 608954 -1475680 -2648973 -5026259 -5222155 -4421219 -4126013 -7527881 -6323347 -6350764
16321 -6350764 -5306434 -6463865 -10121079 -7619938 -7356386 -7763312 -6987427 -3011647 -4275866
16312 -4275866 -4314542 -3618711 -5591178 -6748452 -7368597 -4579534 -2699680 -1788360 -1518155
16303 -1518155 -2078542 -2305516 -3885197 -3586152 -3472408 -1884357 -3031922 1284771 2088676
16294 2088676 1527941 1414555 679439 405768 -2079981 -621535 1276194 3949136 4543500
16285 4543500 3388334 3072203 3301784 2989081 3757272 4247457 4721020 3297556 2659663
16276 2659663 1252049 -1189273 -1640666 -1093265 635068 4119861 3078523 5756060
16268 5756060 6544112 2433940 1591800 -70858 -817707 756654 3597111 5700241 6255315
16259 6255315 3680250 3213517 4252478 2498434 2690184 2773578 4038306 6165884 4318026
16250 4318026 5176533 4475486 4333031 4207176 5629011 4354399 6528715 4917696 4676758
16241 4676758 5458839 5307381 5096523 4739256 7286137 4783328 4585688 5255423 3898289
16232 3898289 2337499 2608551 2312093 3392598 5504289 5450111 7450568 4069227 1738527
16223 1738527 4962345 4535497 3312712 1946480 1241391 4242293 4232284 6890193 7026797
16214 7026797 3044476 5389190 5939355 4893189 4840001 1625794 844450 5441943 4966099
16205 4966099 8520205 9057028 6246782 5490922 4925917 1212363 1872464 2411603 4388380
16196 4388380 6138355 2702628 2888558 3012911 2838222 4426914 4277144 4725899 5867831
16187 5867831 4804821 4368275 2965139 2058157 4828353 4601163 2745285 3374959 2751117
16178 2751117 2516428 742341 867223 1371165 -302166 3710014 3327468 2737331 4586911
16169 4586911 2884893 216496 2550606 1897092 -487759 3045613 2970519 3083952 4142284
16160 4142284 2281951 5007208 4271998 6164909 4090131 1541420 79501 4104769
16152 4104769 2101760 945784 4052175 823247 795503 1543450 450384 -1758259 236975
16143 236975 25950 346205 1349461 -1790138 878143 2242696 4909085 4201125 2597193
16134 2597193 2962259 1540678 5165999 3621013 3121638 1290841 2673211 1981310 3660590
16125 3660590 215755 1619855 507310 -779772 -121596 -2173080 -1402347 541439
16117 541439 999834 2825814 3367996 3893322 3780011 5389865 1134958 1005249 3088177
16108 3088177 4550165 2833984 3226535 4771077 1853235 540737 -676979 -3013210
16100 -3013210 -4616846 -3135908 292781 2672830 1711675 2509207 2323635 690830 -974359
16091 -974359 -237977 -1591333 382360 1941912 1143241 3204354 3379404 136998 2168655
16082 2168655 -86816 -4910248 -2240295 679964 1535599 4396709 7273122 5730496
16074 5730496 3416951 3050686 963344 1040165 4946086 4251929 3387142 3786245 6158938
16065 6158938 6137480 7953185 6052506 3418929 3329498 2170549 4180063 5792290 8201340
16056 8201340 6423924 5513940 6464575 3689805 619377 664156 -1011897 149250 3266854
16047 3266854 2065485 1187752 2341795 1795534 2964982 -337211 3082384 2455847 4261901
16038 4261901 2666927 3731923 2725809 3746757 4302891 6616070 8489072 7418080
16030 7418080 8490502 7787592 5241341 5437702 3970329 5434180 5521798 3961777 4296088
16021 4296088 1874842 2202454 3186990 1369531 2412673 3144398 -89348 4321143 3075079
16012 3075079 -28687 1589741 1337269 1406098 4750310 1777114 2186041 5972873 3016583
16003 3016583 1203564 1801100 -1165449 2444613 5276118 4406234 3086114 5130595
15995 5130595 2410646 1447425 817842 122273 -843022 186247 2594148 4822208 3410135
15986 3410135 2564988 1650506 1199353 897938 -139816 1829485 3415380 2581651 4066489
15977 4066489 3723415 1241147 1894945 130510 -691541 -1121929 -339942 -1460948 859012
15968 859012 1559023 -1499886 -413862 -2046373 -3593053 -1682523 -2524073 -2920953 -1775787
15959 -1775787 894933 1213686 1006981 904589 1447542 -805388 -1130807 1190258 1832397
15950 1832397 2273887 2578291 751780 817806 1955190 -413000 279740 1745699 1132097
15941 1132097 -695785 -513635 153037 -810243 -1969272 34815 797113 1129324 -2644882
15932 -2644882 358921 594211 3724773 207186 -790037 1791825 -292299 5880 307181
15923 307181 -1102027 -3502946 -2255533 -2848469 -1343329 -1046375 302142 1633769 1168772
15914 1168772 723118 -3115820 430864 -895909 -810281 982420 -2060040 -4094224 -3533460
15905 -3533460 -4075831 -5225828 -2147334 -4092191 144848 3150028 2433278 5835532
15897 5835532 3806294 -724522 -1459112 357052 1687846 3368697 5112107 5223764
15889 5223764 4580075 634976 -739556 -1966904 1317491 759432 4836829 5375804 2676866
15880 2676866 3315374 -1034478 -3869107 -4367633 -3521879 -3626433 910736 305247 -480210
15871 -480210 563453 -2876374 -2601686 -2936895 -986850 603782 -889004 -496517 -928478
15862 -928478 -3335008 1478756 1000780 1653681 4505108 4610229 3282754 5839013 166784
15853 166784 -1528360 -1087387 -2646932 -555175 1993320 687038 2254264 -1270536
15845 -1270536 -2973793 -522970 -2361748 -2267752 143767 -1543950 385626 1338228 1601875
15836 1601875 -1520892 -116749 1850800 -44166 402365 1247406 -906250 192044
15828 192044 3037824 482263 1930779 162522 -1824527 -2730062 -1659114 -3811085
15820 -3811085 -1584913 839442 781332 263572 2414945 3416892 -1717909 -3060414 3279258
15811 3279258 1039778 2686014 2019424 -722670 1491799 1411265 -55483 1344849 -58228
15802 -58228 -957628 4476484 4391240 3362102 5896047 4056484 3899283 1326545 911543
15793 911543 2085903 1900723 -268217 807548 -358720 -3424745 -510801 -737046 -2577376
15784 -2577376 -1378672 -1154408 -2316564 -1361780 -1963863 -3142508 2856702 584956 -173201
15775 -173201 1456462 1409483 -1966 887488 -429634 -421561 522357 448635 3998463 1843628
15765 1843628 593373 2289433 790022 -1794217 -366580 -792858 -69840 479639 1261558
15756 1261558 1427569 2752585 -296778 -634619 295042 -1546062 -2149292 -1462806 45360
15747 45360 3139525 5309354 3181901 5024401 -282203 -2767557 -1772105 -2929900 -1446576
15738 -1446576 1368047 915366 -232360 93975 26616 -1040816 1974642 -2608172 -3103286
15729 -3103286 -1179709 -3048999 -2353680 -366654 -2308158 3464443 4780840 1347544
15721 1347544 4576653 4655394 3123288 4896544 3100867 680148 1800624 -1423337
15713 -1423337 30327 550411 -222573 837711 875503 -2901656 -4210755 -4816433 -2781907
15704 -2781907 -2995967 1905194 2192930 711800 -863746 330867 -2894191 -2219658 -451809
15695 -451809 426872 2228192 2245536 1911257 -898881 -821186 763041 -1919990 492555
15686 492555 921945 -3054150 -7857 1011223 -4540204 11181 3993952 2607858
15678 2607858 1402191 1044454 281648 -1820239 -870989 -2606988 -2046016 359889 -161579
15669 -161579 -278735 1812290 -2348495 -2110519 725125 -246578 643831 -286931 2181916
15660 2181916 2516610 -975549 81892 -1259539 -2532416 2339599 2231102 410271
15652 410271 2467153 1318051 -2224470 -1407282 -2956364 -2430380 -2657655 -4111973 -534493
15643 -534493 -2053156 -693749 -416321 -1579696 -202982 637705 -397454 2957526 3473969
15634 3473969 2296228 4656342 7126851 8329773 4823180 3958835 1110786 -3257628
15626 -3257628 -1189722 -575606 325295 3155224 3500937 2015386 113926 -4035852 -5137668
15617 -5137668 -2807357 -4045509 -929091 -1053832 669663 -720013 -2103475 -1229112
15609 -1229112 -686991 382042 4827660 4030267 3804824 3340005 1327301 -929144 -254545
15600 -254545 -122038 2050251 3347648 2512238 676293 -3748288 -3929098 -4999591 -2731946
15591 -2731946 -1710233 -651501 -2347127 2840008 923948 -4541277 -1506402 211360
15583 211360 -1229698 1004699 2832362 2134235 1851449 4058367 2914243 5304288 2644053
15574 2644053 633622 -649224 1071702 -1697850 -1210951 782182 211850 76253 3781373
15565 3781373 2991278 -427079 239703 -124167 471440 1564107 -2156648 2452245 2206225
15556 2206225 -987888 -1519651 -1800229 -1812601 47960 29907 1180773 3648365 214157
15547 214157 258167 350512 -1995648 -3379017 -1936627 1582843 1402393 1740358 2080831
15538 2080831 1018368 -1190296 -2425933 468011 -1779165 1574267 410898 1330884
15530 1330884 -266465 -747115 -5088301 -1063274 716748 1993696 2390509 -438334
15522 -438334 -1011978 810897 44825 1412655 4028426 571835 -430752 1270278 -2179807
15513 -2179807 -688556 124138 -563225 414670 1233980 708816 140979 785288 -348118
15504 -348118 -3417017 -1772491 206413 -5048522 -2957680 -2119260 -5537671 -2776091
15496 -2776091 3157897 2431973 1421840 1039572 2739306 2836781 1573823 -2664102 1923857
15487 1923857 1988484 -89867 -2177152 -862716 -1168317 -2624826 -628287 -1936114 -3041946
15478 -3041946 -506692 3046902 4849796 3188664 334583 202838 319277 1050832 -1115242
15469 -1115242 1549351 3069350 1928808 2097873 2351099 -2830947 -3832259 -692496
15461 -692496 -1406987 -1923021 523082 -2019399 75733 -183370 -3055380 -1853470 1417712
15452 1417712 -1444602 -1139766 1162428 -1182811 923246 1217436 431554 1236349 449284
15443 449284 -2562431 -1238988 -934038 -417172 708904 2611442 2720275 1114529 -375165
15434 -375165 -1685238 -2326288 -824169 2760926 3434891 3540419 5163339 2535518 1560667
15425 1560667 -96005 -1506064 1408049 2715395 -2593424 -1641059 -166159 -2498628
15417 -2498628 -198345 -1070065 -4848215 -523419 1913192 -3085804 -268135 937678
15409 937678 -298643 4512887 4729473 1047872 2395254 -1421586 -1789889 -3409923 -3550910
15400 -3550910 -2348259 -307440 521713 2632367 -1202165 -225391 -1183283 -2346238 597116
15391 597116 2944810 2824805 2983899 1874142 1629590 803858 609998 1906603 2540994
15382 2540994 3430670 772978 -933741 -1119424 -3540141 -4527669 113643 -1968421 -519087
15373 -519087 373337 350822 568763 -2517606 -4585056 -349171 -2860675 -606382 2258512
15364 2258512 1832655 2029650 1769187 -1621497 -981343 -2024887 -2713092 1031355 1477297
15355 1477297 -2505636 518486 498689 -20388 1646161 5800675 5002394 1386720 1849166
15346 1849166 377399 -4780220 -3788674 -199968 -164187 30676 -413335 -1564464 -3865768
15337 -3865768 -1917826 -1965790 2628095 1498986 -2997943 -520557 -82898 -4663742 -2180948
15328 -2180948 3229538 1950769 4297395 4501090 2361012 -601358 -1657982 -2015444
15320 -2015444 -3467486 -1993639 -640556 2522734 1824439 1485087 -766957 -593743 -3002598
15311 -3002598 -4933510 -3422122 -654439 -1200519 1193035 5944148 6387088 5978317 3493765
15302 3493765 2429509 171149 871546 -173950 2262445 1810428 3287347 1569561
15294 1569561 282364 -2393681 -2685649 -2201183 -5689542 -6472081 -4711839 -4926418 -2678248
15285 -2678248 -943959 2252376 7063691 4026336 2415375 3618652 -596850 734246
15277 734246 2438196 2020482 522514 1359889 -633361 609986 -123461 -923531 4357412
15268 4357412 1976328 1461825 1446863 2409778 -2912623 -1749475 -243487 4474471 1369462
15259 1369462 3976711 2153163 1060451 2012844 -1757154 -1360527 1103790 124864 1500109
15250 1500109 4117341 2520175 1030493 2448595 668870 -1725791 -4157231 -1707575
15242 -1707575 -2299494 1785260 3595980 2070530 4517874 3071491 -359772 -1402721
15234 -1402721 -3348275 -4675029 -1802095 -2941329 -1057826 2321277 967387 3823238
15226 3823238 3281457 -1917710 -1591582 -2079520 -2834502 -226125 3065504 5207799 1280719
15217 1280719 940635 214399 -4309434 -3099390 -2519468 -2118302 3685508 3715429 -61952
15208 -61952 645946 -1154493 -2851280 -1832695 523905 1058571 -719096 -716695 2758697
15199 2758697 -2203275 -1090971 108207 256970 -812828 -868474 -2105020 -2574143 -367057
15190 -367057 3102894 3910683 1544576 511632 490027 -1613606 -5161481 -4855464 182207
15181 182207 -14881 1768361 221126 1135179 -2174512 -3552686 -4087534 -3197101 -1884169
15172 -1884169 1672085 4000361 2065419 3484464 -51583 -1160478 -1482842 -2173932
15164 -2173932 -1116118 4083839 3097714 1901796 3155851 -1076047 -1913040 1641659
15156 1641659 152786 -291553 -1780655 -3540750 -1810628 -92353 -4904088 -2950566
15148 -2950566 -2796292 -1996653 1037781 251123 2188682 4955671 2641902 974804 2191443
15139 2191443 864377 1439471 3737293 4458187 2196106 310657 -2542053 -1661288 -3033087
15130 -3033087 -1832393 -2819133 -1951544 -1901274 -2281012 -2317556 -1029498 -917172 -697680
15121 -697680 364899 -1406338 114421 -1066442 -1230191 -756109 -2235560 217703 1263192
15112 1263192 3385125 2896247 1602288 1589022 -1427565 -3574952 1453567 2540491 -329335
15103 -329335 4276214 3471055 -631287 -108950 -1606150 -5420075 -1539744 54447 1854595
15094 1854595 3611820 2895966 1807949 596696 -1567993 -520350 1133496 3778217
15086 3778217 4750259 4060473 640076 -870317 -3010545 1210600 5506640 719939
15078 719939 1093401 1021027 -2056418 -3223620 -3596152 -5645094 -5060303 -1819538 -960533
15069 -960533 375907 -1021687 -2464994 -2126188 1558605 536912 4007613 6038909
15061 6038909 2718952 1727502 2595766 2965778 1593426 4123874 3142393 4382655 3844210
15052 3844210 2375748 1210513 435824 -3004482 -1395570 635001 -3285813 -1882090
15044 -1882090 -378179 -2256457 -1374859 -162490 -1259862 -453507 -1159963 -2205043 -1235488
15035 -1235488 -764628 21230 -826766 -1567230 -2136197 -839283 -955723 -1802542 -927556
15026 -927556 1660326 927374 2225819 2197130 3341037 683235 -1157501 618675 -2936887
15017 -2936887 -2549701 -66770 1696550 1265851 3007818 2139102 417557 -141940 -1707392
15008 -1707392 -3177900 558016 -894135 -1238951 -816555 -2851833 -1514147 -1426206 -320297
14999 -320297 1529186 -147185 -2058195 867465 1896613 1539131 4993589 1604787
14991 1604787 -549161 -870144 -2418947 -1777752 384413 920575 1492939 2751976 1076331
14982 1076331 1121447 2578352 240449 -3074448 9496 -229656 -1806029 1659943 352450
14973 352450 478588 595165 -456943 -193542 3689281 208814 -2190515 2573850 -207999
14964 -207999 -2368027 -756455 1056902 -357036 2294932 1240948 1157572 1906727 1650621
14955 1650621 2009029 2175583 1365003 -2471629 -448920 -3006528 -1828933 -883597 -1745548
14946 -1745548 -101836 -1329698 -966300 -1504625 907096 855597 2135509 2742923 3378158
14937 3378158 654016 -1040996 551463 -1459077 -2961152 2625924 4966370 6224153
14929 6224153 5205512 791947 -1784307 776044 -4611840 -4730908 -1203860 -3506916
14921 -3506916 -2072469 -648957 -3141009 -1725207 2530985 -1005364 885908 5899624
14913 5899624 3291849 3892223 3560257 1023305 -1442505 -953328 -2772206 -136850 -1826678
14904 -1826678 -1566996 2741161 -1531215 -2315928 -2032196 -1654994 -96930 2234021 -1272649
14895 -1272649 304108 373483 -1482659 -3459735 -3054110 -2507378 531230 2005808 1541716
14886 1541716 170818 24308 -588429 -1452952 -4420723 -2046506 -1049554 -459290 2080512
14877 2080512 2544872 1511813 960083 557425 1540009 147576 26877 1083434 1222287
14868 1222287 -1720585 -1198791 -619755 157872 410986 -1742434 -2741517 -3113164 -559815
14859 -559815 -1642375 -403506 564943 1171329 3561832 5827600 -95996 -2239384 -1437454
14850 -1437454 -2461861 1269338 1713881 859916 1692583 712282 1005372 -894083 -1366312
14841 -1366312 -1916796 940772 -2848990 -549926 -1787651 -4358164 -3066258 -1975391
14833 -1975391 768604 2906474 4349458 4051095 3207087 50001 -2154192 -1034093
14825 -1034093 1813812 -124821 121538 1377674 -3990162 -3422006 -2985435 -4493754 -1016146
14816 -1016146 1149327 3259775 3693488 4145593 2073255 1428207 793526 -3268752 -1241432
14807 -1241432 2547934 2617828 1661910 -313440 -2295163 -4804037 -3192965 -4100280 -1925704
14798 -1925704 -2504938 -5016818 -5428355 -1532393 -1164499 -1693087 1164289 2552727 2538587
14789 2538587 5133834 3050545 206524 3044518 1568542 -968658 2157318 1668274
14781 1668274 382683 410060 533987 -4243977 -3117268 -189169 -3263288 126854 2572240
14772 2572240 277574 1275851 3816610 -2620129 -485777 3345290 979799 861536
14764 861536 1812563 -2153892 -271032 543520 -776404 -1308264 -1366766 2113764 893761
14755 893761 -1186508 -816931 -1216355 -1688194 -1558606 -581055 74882 -603819 1269101
14746 1269101 2107371 -263310 788110 281389 -78433 1288843 1537181 3605811 2195643
14737 2195643 -406739 326876 -1416858 -3811036 1306123 -220655 2041652 2935096
14729 2935096 -1140260 1307154 3148792 -3431462 205139 1669050 -1866595 148820
14721 148820 -168325 -1502524 -1846210 2255472 -446651 -783935 -1041582 -1148302 -2827376
14712 -2827376 -3553703 -4399110 -3299344 -569453 -353047 -348989 115330 755635 -2097179
14703 -2097179 -2143392 2166830 3344417 3739267 6149236 4870510 2675115 5950036 -1636902
14694 -1636902 845618 1537317 -894441 2185369 2219947 -2743170 473670 816751 -2193657
14685 -2193657 -22035 -2222228 -1317566 -3211974 -2982307 -4254070 -2466422 -2101716 3145178
14676 3145178 3055932 2179864 3878990 747835 1677712 1509337 -2019 286392 1451665
14667 1451665 56199 -66830 545566 -756642 -657951 -1951785 -4906725 -5644294 -2657321
14658 -2657321 -5166314 -2673613 -3202902 -2960036 512732 -221205 259368 1465852 1571365
14649 1571365 910071 2019636 -2548432 646788 1229492 2003250 5596961 1198457 312543
14640 312543 414149 -2409342 -1176266 1164737 1698307 3000978 1121063 1550159 539296
14631 539296 -2824755 -2367365 -1888930 -3110570 -1108283 -1557354 566674 -1409213 -3127934
14622 -3127934 -448344 -1621616 -965652 1805180 -189816 -2812600 421911 -3091592
14614 -3091592 -2325055 -1295834 -2686460 1902548 2482066 4726018 3354247 3641150 2168997
14605 2168997 244539 -267711 -1138277 -2155872 -232583 -680736 -2460957 1230087 -2488337
14596 -2488337 -564664 -2815 555144 -388222 3962234 3264012 1728306 -100060 133343
14587 133343 2300966 -394238 349619 955669 -5649 -1711210 -1994636 1343404 1721215
14578 1721215 1495076 3402506 2052379 1263397 -213484 -2969601 -1806540 -2739962 -5171414
14569 -5171414 230855 1687068 572866 1869162 4241837 372701 -448385 2568584
14561 2568584 4051804 3729985 981739 -1286134 -2168157 -3874457 -1481963 -1190424 1699707
14552 1699707 475358 1911980 7999707 4290585 2056326 1129477 800905 2386550
14544 2386550 1629908 53603 -217680 -1098661 -144039 416335 1498183 1329728 -220499
14535 -220499 -752551 -946331 -2352024 -2818758 -611045 -395860 -1193844 713987 -476201
14526 -476201 -616493 -354038 783141 525759 794553 4275667 3318302 4433019 3363880
14517 3363880 69905 -2450556 -4020547 -3070341 -1450969 -1252393 -1497851 -1256173 1828333
14508 1828333 1851943 1211075 2024446 1979407 -490457 2854123 2844080 -249870 766899
14499 766899 2613757 1071709 1343724 3129374 1034648 -413313 -318595 -1358052 -2256751
14490 -2256751 -1079679 -2810386 -5456047 -2929507 -1495770 -4330170 -1920940 -3613307
14482 -3613307 -5314931 180628 1765736 1773155 4212996 2240607 2039390 318312 -4290160
14473 -4290160 -1251045 2674059 -1884702 1246267 2489336 -1781735 -238122 439346
14465 439346 -520738 494152 428515 -1498707 1256402 1473138 -853980 -1503165 873825
14456 873825 -337182 267310 1508993 857319 1457303 -92225 -257224 -1634879 313297
14447 313297 -749836 268830 -163469 -2065136 -1927518 -1182068 2129334 651038 3242724
14438 3242724 4411533 -224575 64990 -420681 -3212738 -1582764 523440 -1440040
14430 -1440040 2923321 1188690 -1808672 137628 22680 -743134 1018147 1733118 -668259
14421 -668259 1481382 3767693 641403 377415 -281011 3894666 4257371 3511239 203710
14412 203710 -1032975 -360482 -2388310 -2739629 -1709067 -744409 64443 1770688 -696859
14403 -696859 -1678559 -1638134 -2541878 1561962 -497113 1228835 3639702 4528757 2859737
14394 2859737 2368437 -96560 -2372575 630785 -3493184 -1647517 -3679638 -2401285
14386 -2401285 -2905543 1806028 1461282 -94591 1058845 -2066863 -3617788 -2718645 -3936171
14377 -3936171 -2603390 1049867 767137 -206833 1439684 -904919 230630 193433 -2137115
14368 -2137115 -1746282 1121604 1764329 3334061 1984098 -3011514 2507667 1718174 -984157
14359 -984157 -1126402 1094834 1156982 1680765 775857 1491331 695267 -3371226 970613
14350 970613 1538561 -730020 -507379 -3237178 -3689128 -214028 -568394 1080019 3756428
14341 3756428 3971107 5598728 5910680 1190234 -1190283 -2565564 -3186868 -5225330 -1957525
14332 -1957525 -1436561 1038464 2545329 -555240 -2445023 562863 -3108154 -3680148
14324 -3680148 -655916 -3746813 1151365 4592051 750377 2002838 -426148 -926431
14316 -926431 3463065 2576528 -1341889 201694 -1091342 1245029 1184145 -1174712 -586203
14307 -586203 60549 -3044107 -3789238 -3057902 -4598207 1032376 3294448 3947306 5238356
14298 5238356 3863453 2278015 3077127 1611179 -1550912 3479802 2362657 212957
14290 212957 3212613 -843674 -2896979 -4155160 -2261277 -2228798 877405 -1758115 884089
14281 884089 -295701 -222021 -2390231 -1640799 1842420 213672 1038741 3368800 2278207
14272 2278207 1549418 1581835 2715488 298328 1667205 1547901 718401 -4406495 -4485353
14263 -4485353 -5357443 -1777404 -294286 -2391735 -2576960 -2069058 -436487 80922 466982
14254 466982 -1534923 444754 2516123 2329528 385822 -1479144 708104 -145703 -1990415
14245 -1990415 851017 1445302 2264466 717862 1479575 -250237 -466321 -1981451 -2170180
14236 -2170180 474982 -297107 -888492 -1141648 -1495415 -3438189 -3245123 -599505 -963585
14227 -963585 3481422 781932 1855217 3087904 1691413 -1358038 1937560 -916283
14219 -916283 662247 2372464 633113 4441116 1239923 996283 222603 1311757 56099
14210 56099 926233 204544 482514 750980 -2125382 -607355 -1129210 -3896948 -3475489
14201 -3475489 -1749361 854797 1573930 1704304 2049479 2863557 -3498430 -77823 -2707581
14192 -2707581 -1353826 -184582 -1587624 -1362204 564270 659153 -1876312 773607 -3803551
14183 -3803551 -3798768 732856 723837 -672277 3202639 1970352 280683 623448 418223
14174 418223 -2262712 1092682 681301 -902882 1452207 2109956 806006 4409194 1784073
14165 1784073 -1110076 -68023 -2388429 -2783859 -589321 -2332935 106464 2465078
14157 2465078 2069139 1158485 -241400 -2550936 582108 -496037 994967 2379460
14149 2379460 183138 -1645244 -3273943 -5039791 -2380884 -4447948 -3201559 735259
14141 735259 -915489 1935151 2223854 -3622819 -3391089 -18295 -1538399 3387445 4645966
14132 4645966 -1225186 1516142 142221 -4184461 -3851063 610063 -81824 576719 1370674
14123 1370674 -2626032 816128 -501751 -2052875 -2762092 307897 1857657 4492390
14115 4492390 3393615 2625425 2205246 2339987 7091967 4566385 2757944 1865752 -989440
14106 -989440 -2376742 -1447466 -2373746 -3907558 43035 -3508900 -1028790 -226984 -1795424
14097 -1795424 -946970 81375 -2194928 -2151725 275314 67416 1980283 2167652 1495905
14088 1495905 3001506 3266539 2254602 1245400 -528321 -2203892 -1796645 -1671428 -1025031
14079 -1025031 -1260187 -51533 919974 -133460 788103 524333 -997243 -825287 -2054051
14070 -2054051 -680973 1404656 4989041 3840913 3927003 2396201 -201013 283691 601822
14061 601822 374820 -74505 -1521137 -4709331 -3527742 -2760675 -2830093 416820 -197976
14052 -197976 280702 1022124 155518 888907 974838 10680 2819108 3739410 3588890 4642968
14042 4642968 2967216 3159659 -1348891 -2435889 -1767220 -2717415 -1109960 -1129005 -1092433
14033 -1092433 749847 -423786 -4654225 -2742166 -1454631 -2714640 -433944 22779
14025 22779 2151188 3127283 3678180 5231455 6487440 3542569 4063072 3016950 -394185
14016 -394185 1443744 1829693 -880065 -778917 585625 -2017678 -3143713 -1336160 -4117458
14007 -4117458 -5016296 -1730422 -2426557 -3545383 -3397057 -2450997 -1517621 831076 3091795
13998 3091795 2185791 -1211288 1575239 3260585 79887 3910091 1773884 -4134
13990 -4134 4958249 604873 -4455715 -1305433 -2129125 -3558405 -1447648 -2543577 -2285406
13981 -2285406 2149564 4334685 4607458 2726197 1510748 -11599 -41794 778059 -248387
13972 -248387 -945714 2679619 644782 -1949689 -1965106 -2209421 -4058765 -1274565 853507
13963 853507 -1652026 -2258180 1661482 -1222020 -18479 1215699 -1988972 -2960278 88762
13954 88762 -1678548 -681724 -331319 338024 2314454 2392110 552033 1638656 3181088
13945 3181088 3848 -1257856 -350545 771082 1228337 3537740 1765771 -59827
13937 -59827 -607040 1044713 488239 3660376 -3568802 -5080706 -2927238 -3741685 -5889559
13928 -5889559 -2988674 -3676920 -2891750 1531495 1450359 -140281 1006542 3516990 4293265
13919 4293265 2382295 2655951 629297 86706 1732173 2451358 2913891 6009728 3493676
13910 3493676 1049861 -1101574 -3656406 -5839138 -2481238 -2453892 -3307410 -2122861 -3110013
13901 -3110013 -2010875 -2905805 -4277673 -4272411 360348 2166813 4799111 1009922 3721159
13892 3721159 1224695 2944215 5704112 4059520 667825 -938541 -1000099 -3072178
13884 -3072178 -1945808 -1165624 -1305912 335782 2013603 -2233350 -3131775 -1778765 -3675291
13875 -3675291 -3377281 -1378642 424223 543143 4269328 2567072 330623 -240897 2518516
13866 2518516 524027 75403 3628480 -2837846 -2861437 -698108 -1803951 -3935422 -300719
13857 -300719 -4745396 -3111043 90776 -1374473 -1820118 -1421862 -46780 67489 -877237
13848 -877237 -1521550 714219 -1051658 480603 -367570 -1087931 1639771 419115 455989
13839 455989 3260103 2076463 -2249416 2002828 -610333 -2712251 -618522 -825864
13831 -825864 -307937 1147383 574329 -1019725 21158 -3702516 -507935 26168 -1281495
13822 -1281495 3056314 1696056 2353882 2922026 -964547 -2290637 572895 -842452
13814 -842452 -1457378 165509 1790407 1416200 -425005 520612 364861 -849614 -140824
13805 -140824 -3101693 -4923247 -3797721 -2166758 -3147739 401478 -295371 -339972 2646848
13796 2646848 3321739 412528 -1305959 2064324 -3697757 706625 2902566 -439374
13788 -439374 1024309 1070681 -1643488 51835 -1124470 -1252626 1574848 1829095 4102509
13779 4102509 1668826 -1775067 -54956 -3959688 -1120670 -141765 -2182374 529187
13771 529187 1422890 -5027350 -2007387 -1641188 -1819141 815096 233007 2964578 2869109
13762 2869109 -563038 -1404905 -615211 -2021519 -1009137 2776518 3412153 2358580 1736345
13753 1736345 -1247626 -4196726 21574 -627174 -1351778 2863947 584653 1014702 1002159
13744 1002159 -3935280 -1238737 -666083 -2014 2596004 2514759 2452197 541938 -1105159
13735 -1105159 768575 1411001 77169 3248569 943702 1196449 3115102 -1768052
13727 -1768052 -2229771 435210 -432657 -313042 -558369 -1352236 -1968917 -777850 -306101
13718 -306101 -1186626 -2474412 287919 -2664537 -1342879 1811821 -1529779 -2009153 -983153
13709 -983153 -1758360 574057 84305 790044 -2004380 -3542971 -1317506 -1893664 -2442508
13700 -2442508 2640202 54209 1183011 5514530 1754513 141998 -85795 363556
13692 363556 640253 3458326 2134644 1343150 2460915 736468 1154414 1263366 3456601
13683 3456601 -104212 1017406 995775 -496076 1328555 2147483 1093342 -1073146 2410483
13674 2410483 -1262951 -2001419 -1249985 -2928624 -5007781 -1119079 1588039 -499912
13666 -499912 619020 -157649 458080 -129867 -1825365 -1793047 -2572683 -239167 2221250
13657 2221250 2345633 3378797 2400470 1043407 -1721867 -1774940 -2902995 38949 2063628
13648 2063628 1130290 -3133547 -3251233 -2603575 -4149942 -2056815 -38148 912464 2253689
13639 2253689 1257187 -66803 1028250 274072 -1043 3083321 -585259 1670226 502274
13630 502274 -1134921 -1533904 -2560513 -2843489 -1760078 -3197754 -4408710 -847396 -1675425
13621 -1675425 -2019792 -27644 1490587 2233933 5679148 4396011 2942953 1365376
13613 1365376 53322 -3276196 -1452308 780075 2406582 -860269 -1101412 -4156127
13605 -4156127 -3834425 -2794799 -2899400 -3230594 768400 -1227434 178429 2775477 4189555
13596 4189555 186668 2587226 -1191973 488680 400511 981025 980208 1188632 -323407
13587 -323407 467554 1831692 -875827 -1266509 -2682165 -3208146 -1634655 -802356 315625
13578 315625 -1196750 -346164 701746 2445348 1683784 2400413 3080441 1114072 2520379
13569 2520379 890599 2000243 -903286 557552 -2460785 -654701 -2577028 -1351045
13561 -1351045 1241738 998853 -455086 870547 -307091 1937023 2292952 -387792
13553 -387792 1436174 3803793 425135 284703 1327462 474547 -131064 2303086 195181
13544 195181 -4520172 -1173807 -1150654 -4386838 -722398 2411563 -331545 1664170 720038
13535 720038 -3499181 -1295443 353030 -823936 297984 4508799 1634454 747867
13527 747867 3792672 -2100994 -3762506 1752763 682528 362479 -588130 -464066 -464105
13518 -464105 2288261 -2427147 -197803 -2154088 -1132558 -1334549 2510974 1654262 -340626
13509 -340626 3981833 3377499 1525555 -150610 -382353 -3087235 -455501 -3539092 -2897154
13500 -2897154 1346080 -1215159 -1818953 -734898 -1653548 -3851959 -989475 -1158704 -1739647
13491 -1739647 3147006 4679709 4121196 1253829 1338057 -241350 1750342 1130313 514214
13482 514214 -369822 1022034 -1287251 -2153592 -2184327 -2848140 -769534 -617414 563436
13473 563436 -118726 1545629 2219488 1681990 -33911 2224578 3450192 2490579 1248979
13464 1248979 3137027 -440406 -19023 161137 -2062632 2083711 1524500 -1883912 -536830
13455 -536830 -347902 -2498086 -1527096 -3321391 -3782807 -1054313 1293732 1578292 -156025
13446 -156025 851857 1156211 340668 1590030 33279 619691 3338695 3942944 -2441802
13437 -2441802 -98226 -2851378 -272139 2118676 1006812 -1164346 -996459 -1414070
13429 -1414070 504305 2161210 2148916 4206466 4349975 2273459 1616570 375117 -3720640
13420 -3720640 -351267 631556 -3423658 -820263 1845226 -3465299 -2920527 -1593262
13412 -1593262 -4195451 702495 2894224 -2501306 -2476044 -2210052 -3145316 1446865 4131522
13403 4131522 2561047 1318468 3476417 2023608 -1133310 -824568 -2593827 -2624114 2781260
13394 2781260 263067 -1762250 -1327710 -1802440 -1729984 322537 999648 2865900 1002290
13385 1002290 4502514 2678330 2528789 3061807 3074787 1184907 3170424 1856735 675963
13376 675963 1844744 -1366109 -1013593 -2337024 -3271238 -2507574 -223607 -2776079 -4239366
13367 -4239366 -4810397 -1889510 -1643603 -2902190 -913172 2473855 -11312 2131424
13359 2131424 3851048 2068184 1139567 2390866 831997 1637998 468767 675885 946838
13350 946838 -17021 783189 -700853 -404625 342627 -2927484 -1841305 439448 -112356
13341 -112356 -2212056 -2021563 -3535011 -4090301 -1867490 2732929 -379475 -591299 3303434
13332 3303434 -1614897 142403 2905077 1275246 -738324 2507614 353577 1221475
13324 1221475 4466444 -263207 -2296622 -2934664 443430 -1163566 4517336 3072766
13316 3072766 3314442 3156216 775793 -2545741 -1318210 -2087862 -2308791 356501 761353
13307 761353 1289342 2300008 -3446236 -1595534 1947167 2179625 3182344 4172497 1843933
13298 1843933 2032347 1609664 -1135724 485105 4268293 5657758 5820318 3050661 555957
13289 555957 -1079896 -968296 -1102983 -2740478 -836226 -477457 -1104095 -1652998 -2954481
13280 -2954481 -4187935 -767613 -1228533 -391316 1261906 2490770 -1947891 -1601178 1220791
13271 1220791 -316492 -117131 2942375 450723 -1992436 -1624088 -734609 -1556923 -2706155
13262 -2706155 -3959009 -1221503 -2038971 -438252 -818102 141025 -206040 -1669978 -2321295
13253 -2321295 2594542 713770 1637820 4623818 6143519 3109745 4115287 4630262
13245 4630262 2782296 -2696432 -3411574 -172614 -3087533 -2689871 -1549418 -2099624 -2286087
13236 -2286087 -3373514 -724589 1175566 -2704516 -2634735 1278206 2987288 3025511 4543026
13227 4543026 2390646 1925251 -1334961 198007 71225 -702979 -1446493 -1644316 1144258
13218 1144258 -7874 -1684937 -1120715 -526770 -917174 1269850 48110 697046 49385
13209 49385 -1017351 3353116 2222290 2731713 4885439 1257794 -82090 -842698 -2859167
13200 -2859167 -1417639 1792612 -1241726 2057901 -1632168 -3079361 -1740083 -4318609
13192 -4318609 -3005641 2007187 2830555 3895791 4749606 2608763 892983 904337 839548
13183 839548 -609599 -1234638 -487194 -999215 2419758 783652 -1958347 -331002 -2503783
13174 -2503783 -4888055 -4609533 -2290279 -2821986 -480476 1842345 1388017 90921 3666676
13165 3666676 2862250 -52460 2980111 297694 55199 4706561 915395 670044 1040915
13156 1040915 -48957 -805452 174081 -4744438 -3746044 -4040526 -1344876 -2306251 967312
13147 967312 601673 224216 698223 -810036 -2919671 -2113265 -2692874 1146007 2452566
13138 2452566 1808982 2760662 2363721 -434839 -198485 -4162180 -5392340 -2272127 461638
13129 461638 1121254 -378475 -2131862 -173511 277123 1294478 -435798 -2639901 2038285
13120 2038285 -1230289 652130 4164295 1991075 1477274 4811555 175782 -2436596
13112 -2436596 -1561514 -1912494 -242721 -3234534 -2520378 1056207 -2590769 -1001617 197063
13103 197063 -3809190 -2823939 3060105 689082 476258 -160389 79797 2128335 347153
13094 347153 -724368 -391387 -370128 -675033 22700 429664 1431402 -663007 687567
13085 687567 1262428 -1955997 -3065601 -942858 -336686 -5174060 -2498668 -2386934 -1365560
13076 -1365560 -646601 -1952877 220816 3457710 75507 210132 1466453 -2421674
13068 -2421674 -1488479 2219484 -1820721 178653 1291421 587402 1897109 453726
13060 453726 -167062 3897440 441891 -1333954 3135091 2273882 1413169 2305667 -431884
13051 -431884 -1109160 22209 -3840351 -2538958 2469886 2096567 544571 1921928 792258
13042 792258 -2741973 -1564531 -2053524 -3361637 -1578296 864638 1839303 2487488 396370
13033 396370 -590197 735612 -1045071 -1535647 -1024325 1395236 3183624 2223060 2629071
13024 2629071 757709 -693111 782387 1607855 -436894 248354 376757 -1657264 2148068
13015 2148068 738344 -2143457 -1553312 245711 -3778399 -3022248 -229312 -395642 -335052
13006 -335052 706321 -901907 -270055 2760474 -2062715 170604 2024217 -761693
12998 -761693 2241562 1478314 666697 -311591 762369 -224355 755360 -3941467 -2575997
12989 -2575997 -1123845 -1250059 201797 -3392302 -1455087 -1556560 -2685518 -3421620 -827286
12980 -827286 -3584868 -1387642 2985087 1984297 2091435 4771574 5217349 3515479 2808432
12971 2808432 166883 -450754 1705751 -573454 -34840 301063 -28099 -1648005 -1957030
12962 -1957030 -2487374 -3479954 -2975399 -2131220 -1721534 -824074 -1721260 -2227258 3368910
12953 3368910 3615697 918171 3510769 1942074 -2769669 -1690755 -3328170 -2478227
12945 -2478227 1371293 3340491 1768036 1032633 1024594 -609693 -5276984 -1732439 -3310182
12936 -3310182 -2815935 2129922 1621108 979331 4533644 1003235 -352623 1392934 1164532
12927 1164532 2100264 2065880 701255 -1012632 -671061 317959 -4187056 -2379876 281946
12918 281946 -2420660 -2777015 -1657089 -1709872 -1195633 2240587 322204 1629316 365167
12909 365167 3023404 4484711 -1039981 -133445 1964591 258680 2570627 2643819 -1296577
12900 -1296577 -1075875 -3671958 -3051233 -2418607 -4993673 -4577823 -1513545 2083444 -1500323
12891 -1500323 755792 -143196 -2247119 -3807499 308183 -307464 946491 3976186
12883 3976186 2161334 826834 -990323 829307 1133521 -158882 -804046 -635948 1472041
12874 1472041 620072 -2545183 -4636014 -2300935 -2225507 262816 931044 -736489 -2322942
12865 -2322942 -572047 2378326 2167062 726270 754888 1037352 -1992217 -2901300 -200466
12856 -200466 -780632 -1789016 5900 246901 968734 888912 372424 -1286900 -1154406
12847 -1154406 -3367669 2506449 -751245 -1836643 -1928118 -1168159 1046904 967906 -306845
12838 -306845 3210739 3597917 -654110 2120654 1799564 1099625 757900 325614 2969623
12829 2969623 1459573 1364811 -1219212 -4057187 -2211498 -3046951 -2272756 -278568 134731
12820 134731 -1791000 1664259 -1495248 -3982490 -5613942 -3328140 -3603261 -491902
12812 -491902 2230779 1751180 1884139 3206137 -142673 227699 2078739 -1020813 1657347
12803 1657347 3722331 -351620 -1059489 -1061601 -1736097 1336619 1145944 2285651 4587760
12794 4587760 2934137 -1389291 -451346 -785640 -1183571 780863 4010081 4787018 3502593
12785 3502593 2651785 1317176 -3862112 -2398699 -4446065 -1982592 1671340 629314
12777 629314 -67325 984789 -2105802 -1458797 1282021 -1873199 -2928432 1524448 1556184
12768 1556184 -858311 125599 -632208 -3018130 -774299 -1851669 -2468247 -150971 -2850428
12759 -2850428 -3856847 -1521049 799612 -1209320 3358629 2380648 423304 1910601
12751 1910601 1419581 906824 1605658 1808076 670983 4235869 3831581 1279605 831495
12742 831495 -1247143 -2426549 -1316774 705399 -1207248 -2277835 -5136503 -2026929
12734 -2026929 -1665300 -3690635 -3425336 -3990627 -3400531 -600847 1931843 199440 5540890
12725 5540890 4714377 1512368 2001708 2209134 1286396 1046991 3932519 1016286 1739251
12716 1739251 508744 -818123 -3503759 -1210041 -2196573 -499539 764964 -3763746
12708 -3763746 -4539791 -1307309 -1571626 525175 4678499 1889022 898028 2745681 1598876
12699 1598876 -299341 226304 543872 347475 3553887 2620049 -1731918 -97 -4125924
12690 -4125924 -5056403 -2509675 -1585290 -2296487 -97728 609383 38136 -5286387 -5126502
12681 -5126502 -2413358 -2735221 -1055537 2139052 1162688 5726830 3210127 532234
12673 532234 324825 947186 661856 2336156 1765923 2592208 2304919 31864 4894597
12664 4894597 -867192 -4111589 -3634951 -2715191 -2482229 3446768 2227690 2376693 2292253
12655 2292253 -1627166 -2962158 -1484835 -1820471 -2562461 1277057 2916897 362644
12647 362644 1643036 3120697 1871858 -354966 -157379 -3078965 -2037163 -2619190 -3165374
12638 -3165374 -1129272 -929783 1330099 -642584 -925169 -1759585 -406649 -565074 -219357
12629 -219357 -1847081 -2169210 133314 2406128 2063000 3675314 2826930 822934 936868
12620 936868 1711421 -720301 699307 1086332 -2780613 -960854 248098 -3341815 -3508985
12611 -3508985 -1609089 -4243672 903562 461831 -1451795 501415 -355961 -1201442 1948530
12602 1948530 1897224 803156 1425205 -1118050 -2129242 -127393 -27846 1202874 2900981
12593 2900981 1591929 -870516 -492253 -2153875 -2262425 -3132034 -4167465 -3684896 -3237603
12584 -3237603 -1464667 -3032934 -1924843 -2375907 -2357668 -356004 1418030 -1293638 256459
12575 256459 698668 -524585 2348732 3038164 2388439 5153174 7289972 5656963 1728482
12566 1728482 839852 -341465 2290159 2987732 -164369 -1573563 -581569 670217 -1848580
12557 -1848580 -1603751 -1010108 488604 900875 1216774 -774890 -2562785 -817621 -1730945
12548 -1730945 534798 2443234 268498 -1772837 425074 -19802 -984471 1403726
12540 1403726 -655847 -1047315 -331243 564659 -792505 -145455 1325144 897273 -3422266
12531 -3422266 -2323617 73611 -1594441 394691 -298429 396469 3973469 4157272 1312616
12522 1312616 1122548 -909908 -2094588 385131 -40014 -1316409 1998350 1897107 423721
12513 423721 853446 1088398 -632853 572916 725845 -561070 632434 -2226618 -3096506
12504 -3096506 -2327599 -2461865 -955282 -178093 -1897764 281479 350545 -3471559 -476671
12495 -476671 -1106153 -1315514 -1345042 -1596814 1354757 1456294 1195724 -1199661 678148
12486 678148 1472716 780288 1821257 2181181 952885 109313 -233408 -1208219 -302290
12477 -302290 704288 -1612206 -2144151 -1347363 -339497 -2676320 1816272 399853 -2005028
12468 -2005028 3615736 3643010 930727 3840489 4673120 1075065 2261192 2205829 790480
12459 790480 -1290699 567809 558072 1437507 2141432 -3206847 -3317905 -3750526 -4772156
12450 -4772156 -4445331 -2753613 -2628834 -411050 -420908 880623 1820647 -238962 580838
12441 580838 218514 1189508 5124861 3900013 2372827 3249311 -1038758 -1788700 488031
12432 488031 -766357 -22911 187337 1324950 2699733 -554285 -2827736 -1502219 -3406802
12423 -3406802 -4146047 -1676364 -1274625 -349877 -630240 777633 1453944 1443759 -545457
12414 -545457 -1191724 2047153 813723 2274104 3357373 173000 1094623 2026632 936120
12405 936120 -31586 557389 -432720 2237101 -1671598 -3567600 -3386803 -2713719 -2254248
12396 -2254248 -3554806 -2118452 -2607091 -3617919 -1204402 -2286604 -2604836 -61639
12388 -61639 2326104 2464270 3810515 229213 2237624 2370926 391624 1475940 612599
12379 612599 2520108 884480 1410378 1832517 -971657 -1983226 1843687 1848160 -176581
12370 -176581 868218 -1407034 -2537118 -3695757 -2764431 -1654216 -2799521 1180202
12362 1180202 2615688 1077777 1757987 -1069522 -752989 -989149 -2247374 -2136524 3554
12353 3554 -705078 -2746243 419689 274987 -2452931 -2428873 1523832 -370035 1389410
12344 1389410 3098852 1444768 464056 547280 -2139997 -2430554 -939266 -922087 897308
12335 897308 3549672 1757374 1452174 1021935 -1245654 -4088909 -2403957 245232 1181748
12326 1181748 2661077 884711 -1233628 775499 1849288 1364046 1988272 2485818 1841617
12317 1841617 1644288 1470105 2840940 2346780 -2046559 -3306112 -5468018 -4697987 -3562909
12308 -3562909 -2455615 -3623946 -1445814 -2713751 567744 -1593444 206446 -1150546
12300 -1150546 -1438806 445104 225997 965010 1929351 4006743 2971965 4529316 3477984
12291 3477984 2569298 -1300352 -1533400 -2630432 312789 813918 -154419 271593 225642
12282 225642 -397347 -3708319 -2126034 -2917750 -950400 -359001 -511923 3003905 1340121
12273 1340121 1151029 1587111 2900265 -1294294 656127 -1001509 537914 -2940159
12265 -2940159 785134 1450197 3077068 4306443 4640287 2472464 3039592 -326023 -2277872
12256 -2277872 -318907 -2104883 -664340 1201456 399540 -416561 -406716 -1317689 -1758541
12247 -1758541 -2762116 -964453 -2939463 -2270588 1724331 -423187 2257650 4371111
12239 4371111 1071413 3780308 3464601 87752 426854 2946694 998793 3033276
12231 3033276 -321640 1255238 838562 1672691 -1157401 -107679 -4059759 -2843723
12223 -2843723 -4096031 -5171252 -2615274 -271907 -248723 -1843646 923208 -1159102
12215 -1159102 -4031 2165382 920373 -670610 -77315 -39039 -1033430 -553079 -329537
12206 -329537 848077 -733000 3320539 1712956 1534607 -122902 -2300212 -1750078 1586031
12197 1586031 2274857 -1577228 3735543 1514656 444071 1403432 1706264 -4338654 -2687855
12188 -2687855 -1355036 -2436552 221680 1427637 1217190 445376 2328219 -69600
12180 -69600 2057415 984401 -2135755 -504439 1918334 2288825 1055434 4181671 843401
12171 843401 1178685 487951 718405 133201 -2077417 -1160561 677380 -35966 -1944717
12162 -1944717 -3521198 -3781315 539606 -525945 -2393830 -1511635 -1496780 -2770688 -1320420
12153 -1320420 -2178025 -2434180 1006731 -844030 1967306 2735213 -150401 5810360 2635270
12144 2635270 869624 2095753 -1649013 -138705 2773468 1127657 1045776 230393 -467491
12135 -467491 -359120 -269058 -1867317 -2066479 -418797 598157 -1194088 -8711 -377849
12126 -377849 -1367824 -456335 -1102335 -1017097 1395549 967297 -3520958 -269078 -1307098
12117 -1307098 -248194 1385968 3047011 2332795 421454 1565801 -949608 -1029317 -2411615
12108 -2411615 -582135 62944 455626 -1038280 -1459617 -996462 1339730 4148932 -733710
12099 -733710 -94301 -2987357 -1603999 -307411 -1987180 -396683 1937305 1060328 716084
12090 716084 1154409 -519588 1962685 915126 -2256339 3796327 2793696 915143
12082 915143 1943721 -1105301 -4081619 -4898646 -4463127 -1020879 683375 1211677 -251077
12073 -251077 -1057720 -1078757 -1673448 -528457 -195325 -1235500 1101892 2227389 1336004
12064 1336004 1584014 1589016 1344050 975170 -103196 1449303 1750274 -1336233 1371572
12055 1371572 -2657874 -3409063 -1571259 -243391 837217 223664 328703 1348500 2916135
12046 2916135 2440286 259010 2217416 1101516 1039498 1304730 1886357 249306 498024
12037 498024 684045 -335006 15316 -1519518 612720 -541373 -2265271 -2042871 2416051
12028 2416051 607861 1510883 -1734573 -3225568 -1265997 -1794588 -206859 -1627755
12020 -1627755 -2446227 687659 1212305 -627590 1088394 936165 273515 1468158 1201035
12011 1201035 -1494206 138598 2035609 2198631 3504252 2726419 -227823 2610330
12003 2610330 651483 -3079521 129729 1483932 -3007067 -1849848 -2394003 -4271142
11995 -4271142 -2695708 -695330 -1364455 -2004208 -1279939 1271692 182706 1839513 -884829
11986 -884829 -1879202 -511754 -1655050 621950 2691878 2527910 2906335 1660677 -2397892
11977 -2397892 -1812233 -1083172 -1980765 -1815436 2949163 3146459 3112989 1718865 856299
11968 856299 -1583089 1136089 711570 -343635 2561574 1860243 -1721397 969273 -2667379
11959 -2667379 -2297139 -1507104 -419758 -773875 -3213117 -1683708 1989442 315806 -2491930
11950 -2491930 -1456056 207865 3419311 1104907 640583 1708153 1037568 -1138095
11942 -1138095 136416 1107375 -1086790 28506 1092484 412111 -23747 1117062 2214683
11933 2214683 -488781 -2199548 -4734108 -1231380 -2947664 -2966204 -206329 -763855 -774402
11924 -774402 246472 254272 -1198554 -1356667 -1630314 -1646075 -1700129 -995016 -1778841 -719430
11914 -719430 640581 -1757664 1854638 2219151 630051 -1939904 974431 -666326
11906 -666326 -3075914 -2280032 -559961 1825258 834821 204374 -364975 -1017663 -437156
11897 -437156 -2275378 439843 -1237256 1006225 4069440 4550983 4727183 4060910 941526
11888 941526 931697 1165514 -1908209 -471363 1554654 1385769 3459885 2850947 -2087106
11879 -2087106 -3256013 -1762351 -3653581 -2274437 -1837641 -728142 1105454 2439509
11871 2439509 504071 -3421351 2465461 683188 -1073509 -425962 2345416 1929679
11863 1929679 5048909 1204384 78137 -1050327 696887 -400376 -1176026 -133767
11855 -133767 -1028295 2179125 1548413 -2803713 -3510390 -783056 277204 -1247759 2228116
11846 2228116 1547512 1295960 3966811 1442088 -1768789 620693 -1138329 55169
11838 55169 2519894 -716178 -433902 2052413 -842055 -5141736 -339882 -97310 1230648
11829 1230648 508164 83480 1090015 -2776749 -1904090 -3311248 -3909892 -2086915 -1467892
11820 -1467892 -1682368 -477800 -1054553 -2255566 -527886 -3054817 -194227 615879 -879442
11811 -879442 236109 53841 52381 1815138 2262103 -53517 -425353 -492756 1157926
11802 1157926 1114267 -1023544 -1397315 965948 2425401 3022060 2870119 2911543 3183856
11793 3183856 262300 -4099892 -1717682 -2953102 -170363 1139327 -61923 438922
11785 438922 1639223 2094056 87401 -2990986 -2744845 1910697 -469213 -2158493 -76545
11776 -76545 1047892 -613028 224634 -3394893 -2837126 -345178 -4037216 -668519 -522593
11767 -522593 -2601353 -1328743 751431 -964904 -1144978 2063488 -176702 2529337
11759 2529337 -1690380 -585399 1487337 759856 2276995 3067242 1446706 2746347
11751 2746347 2155929 975263 1976113 -401955 312246 919353 -406428 1027136 16009
11742 16009 166909 1606203 2501428 -1006552 -1650853 -3432540 -4335090 -3661296 313123
11733 313123 262172 -1139503 418785 1836010 -1863813 -877388 -64955 506365 4299272
11724 4299272 2137080 1503766 2447079 628393 -1915815 -1189871 -705925 1174126 -454897
11715 -454897 3750673 2695218 -1272846 1514821 1091048 -2477153 -178831 1541061
11707 1541061 -1162461 2162389 2523498 -680016 381358 -716108 -795373 681816 1139743
11698 1139743 -2037988 -1388223 523579 -846562 -3561811 -241523 -185293 -1013221 638873
11689 638873 -101478 -1639690 -508857 -849316 146630 174491 -593977 986404 1559809
11680 1559809 -586969 -1012621 -3217893 -2311353 -1000450 -2002288 -1408127 -257761 558087
11671 558087 -3261217 -2830996 -1051276 -2789337 -1735152 672636 421600 359519 1826977
11662 1826977 1071755 1431345 1863912 -1640930 877772 2549253 1832360 -737608 -124825
11653 -124825 619310 -389662 -929040 1348937 -2612325 -982966 265578 -3404452 -332557
11644 -332557 -448576 -205278 -437802 1157671 -1625730 -2341858 -376382 -2702295 501691
11635 501691 4018282 4337124 -352312 444411 -1108978 -1853073 93607 -1097260 -758760
11626 -758760 -416705 1193935 -2406765 -1285846 146701 423589 1349668 3371183 3470612
11617 3470612 4169368 3991589 4146157 2522713 -824008 -327 506528 -70102 -2091500
11608 -2091500 -252794 -2526280 220322 -2222692 126157 296680 -305352 609015 3127173
11599 3127173 2353239 994886 2980706 1762458 3024877 179883 1484955 -78337
11591 -78337 -1417700 -1002346 -309888 -483566 -1017915 -4562815 -3386639 -1694015 -2854126
11582 -2854126 -1658663 -1461165 -4119685 -559798 376754 1367410 2619410 4645625 2656457
11573 2656457 3263892 1926254 1891578 3546839 5316364 3823516 2257583 -861404 -2063157
11564 -2063157 348159 -1842599 -2895881 -558519 -2865486 -290919 391898 -2601610
11556 -2601610 -1035000 -745707 443742 827870 -663757 -988682 -967846 -449000 -217382
11547 -217382 -250977 2344421 3539375 -1541105 -1141034 -2847440 -5259606 -2199138 -3040431
11538 -3040431 -2049442 -470395 -809677 -910759 -87316 -3225365 -805135 1637713 1016852
11529 1016852 -1200215 -2924935 -241340 323275 851363 4385528 2210522 2305608 2077084
11520 2077084 -903381 -475775 1810471 -2643990 -7018 2145710 1591890 2437956 2084695
11511 2084695 -904424 353460 -353155 -3545130 -1354440 -600335 -697727 -558294 -2058464
11502 -2058464 -657431 -3540682 -3483276 -3840990 -2793634 -4132715 -3462299 -3701244 -2510607
11493 -2510607 -2477171 -3028028 -1629110 2901310 1067408 2663045 3613397 422706 934241
11484 934241 -2509320 -3239117 -447453 1643623 3426200 4545596 -237412 -140713 549862
11475 549862 -1082604 -3303755 -1812575 1241352 4531074 4763565 2060807 753904
11467 753904 1356707 138196 -1543167 -1129630 -1733235 -2058311 241 -1849209 -334846
11458 -334846 -2376279 -404740 -169708 -2242473 -1722171 -1837333 -4149028 -545774 -1044595
11449 -1044595 -4299799 126925 -656867 629519 5478496 1589700 510367 5323890
11441 5323890 298469 -1598044 -763253 -1512124 2928450 2530311 2792795 2632706 -2439631
11432 -2439631 -1740902 375372 -2712421 -4278956 -2975254 -1619432 1320746 -476836
11424 -476836 143343 -144815 1172525 1179561 -801005 -1407289 -1105176 -2010931 442300
11415 442300 859657 1051517 2590432 -514339 -2935285 -3094706 -2949605 -4720184 -1206553
11406 -1206553 35294 1130614 180371 176563 -1810414 -2212305 -1090795 -2839874 -2353222
11397 -2353222 1665804 4468102 3880807 2346576 4019685 667900 -1027121 202921
11389 202921 -1996371 -3062482 258826 -1099289 1481865 2069589 771722 2171580
11381 2171580 762494 -576849 -497514 -16987 -184144 2303992 486587 631021 3059138
11372 3059138 1407690 -842376 60543 1166371 -593831 -315530 46903 -1660588 -729615
11363 -729615 108776 -717785 2407481 -401387 -2442944 373401 1049762 2328582 3452645
11354 3452645 1768300 531959 -725979 -1824676 -1372618 1361547 4707913 3195046
11346 3195046 1857167 -1057708 -3885699 -3738910 972576 292574 4275837 5582898
11338 5582898 5231588 5114188 2907206 2010109 1226344 -1040016 853121 1365272 575876
11329 575876 1235637 -1428191 -1439420 -456695 -2961248 -1243025 -3398288 -6312835 -4294124
11320 -4294124 -4002582 -4534069 -15031 -855677 -2516283 2308760 -1189454 -716946 1197002
11311 1197002 596976 1444523 5034364 3095546 5541277 5270848 3393690 2383058 2137658
11302 2137658 216191 553330 1714220 1152791 1041318 1597149 2617064 5319233 3609453
11293 3609453 -1336819 -1255576 -2510923 -4405081 -2402719 -1167514 -1551493 61130 -253334
11284 -253334 103592 749093 -1435125 -118438 400418 -1250096 -305258 -1701429 -700892
11275 -700892 -356995 353711 498475 -513161 -350370 2255329 1311137 1439201 2974061
11266 2974061 2302519 -1317567 -793475 -786305 862713 328372 688235 975697 -42454
11257 -42454 -1955246 -4030802 -1598639 22679 -455764 447893 3097106 1248140 -753481
11248 -753481 342341 -740319 1233757 320157 2405193 3434413 2899664 -451786 1409790
11239 1409790 1996972 -1051961 1514129 -1664040 -897285 -1947076 -1372138 -4058340 -1970964
11230 -1970964 -2518679 -2785408 1680022 -2065602 -1979798 -159744 -1463487 -3287765 -763787
11221 -763787 -1398281 2520033 1050956 643872 5448528 1402058 708432 1332993 -1369798
11212 -1369798 -3663119 -2323757 -2128598 -2259360 -998689 -1008460 442457 1557734 -310292
11203 -310292 -2855477 200224 1170566 -534356 -136473 2327102 3167201 2270740 2021085
11194 2021085 2797555 1799534 287583 1585101 -547024 -2156068 -1076894 -1063287 -1330340
11185 -1330340 -2027599 -4959139 -892727 1037252 -1826550 1118235 3599319 -359556
11177 -359556 -2108294 -732697 -314130 58296 832268 1614140 679566 533331 -293914
11168 -293914 117038 -1498597 -3577075 388285 -766177 -2034101 -2234514 -1354582 -952455
11159 -952455 1116058 -545495 4250183 2951258 386591 2070106 -494833 -1179803
11151 -1179803 668224 -31619 3842102 3824896 1743250 2998603 91344 -654599 -2980928
11142 -2980928 -6408331 -2472580 49686 -1279134 214824 2569142 225007 2661479
11134 2661479 -142615 -1102154 645145 1877584 2550932 3120198 4024310 1508778 807151
11125 807151 1176824 -247575 -2337777 -409938 -2899813 -49496 -844259 -1599241 2359225
11116 2359225 1724465 954509 1823432 -142410 -710813 924537 -1202309 -1470077 -354406
11107 -354406 -53828 1251992 800743 3316419 1893295 1015467 -113073 -1670419 -2810429
11098 -2810429 -3181025 -3815189 -3730052 -3227737 -1367317 -209598 162128 73212 5614 813665
11088 813665 1467855 -3808679 614380 588924 -2492393 2169437 1658960 2511501 3633041
11079 3633041 504087 -2084885 -69576 -4798157 -1602195 -38071 -1775353 347111
11071 347111 1812671 1652101 455914 -648619 -1601534 -297236 -2358085 -1665524 625906
11062 625906 2673197 5775892 2307928 3896502 623796 -2261556 -2733905 -5574174
11054 -5574174 -3704621 -2979922 -1600023 -223258 1853866 410628 1945644 3355600
11046 3355600 3400894 1881878 -1707217 -823185 -2182915 -2475762 660276 -1688884 66603
11037 66603 2415254 892531 -2167961 -616042 -1835443 -2239696 -1776301 255623 -757470
11028 -757470 824338 855229 -1748689 796622 1344281 698392 608988 951171 960318 -347063
11018 -347063 1524600 -1800069 272245 -26168 -533819 -950283 -3222874 -3493825 -900853
11009 -900853 2124517 -353024 2349569 1562527 4058373 4377030 2297988 -915586 587137
11000 587137 3180165 1604803 81528 -1212134 509687 -2990371 -3018935 -2402682 -1032655
10991 -1032655 1609355 -114078 1374222 -331699 -1055246 1617010 440559 601984
10983 601984 1011435 2274908 1975958 2934386 3078248 412798 2632052 2900905 428868
10974 428868 -1366405 -903092 -1909855 -1449830 -3892855 -1396235 -1908391 -2651794 -1650668
10965 -1650668 1028682 873619 -1882205 686392 1644593 -366139 -1019495 1779610 1943678
10956 1943678 1024782 1628657 -617349 -2214982 -2484029 -3273209 974442 2605574 -2886239
10947 -2886239 -1597702 1539669 -670003 -535294 -1922044 -740643 262793 -498033
10939 -498033 -887793 1735199 868158 3238658 4855156 2905465 2789355 210432 -391111
10930 -391111 488870 -3020071 -3847033 -861574 -959118 -1507392 -496650 399121 -2214404
10921 -2214404 -532728 -878963 -379305 -31398 -728606 -1473193 2022442 -3233263 -3044000
10912 -3044000 -1317845 2227479 -1547820 1711611 1316022 1067598 -631257 -197238 -853598
10903 -853598 -1711854 -472397 -4474782 -2648849 -544866 1665643 872188 2911561 -717073
10894 -717073 -2741194 -353990 -2016803 -878566 466465 1363353 2394619 2434815 -1515775
10885 -1515775 -52967 -1756328 -3801534 2310548 1484330 310454 1984534 2075922 634038
10876 634038 2259895 -1278015 2085681 603013 -1570327 -1415674 -3883170 -3948841 -1366881
10867 -1366881 1347458 5454894 1997703 1006273 3458146 -3127020 -5106333 -251602
10859 -251602 -4717316 -1928268 2688431 1422170 3568598 4747726 -46009 2867598
10851 2867598 2313624 898641 -762284 104369 1402525 -928977 337195 715491 -593765
10842 -593765 1240096 128637 -2972626 -4403885 -4913897 -1884556 2317003 2510569 925282
10833 925282 962048 1143833 869576 -1332166 386393 -59214 803706 2697827 1942669
10824 1942669 260653 2457869 -1544688 -595389 1236022 -2849528 -852144 -2623954
10816 -2623954 -3261221 -4921211 -2908975 1717376 2961031 1438749 232502 1255821
10808 1255821 1522650 453700 -2272944 -1035819 857773 -521568 2239900 2774143
10800 2774143 1744301 -964811 612932 -418497 -277684 1121206 549993 1532867 1086519
10791 1086519 -1539431 -165284 -24874 -4674404 969577 4574617 1506012 3586172
10783 3586172 2219219 3186787 1850728 1345098 -1755009 -114008 -628012 -1311491 -1963673
10774 -1963673 637105 -1270589 -2545848 1764294 -1959431 -3165303 -312301 -1454366
10766 -1454366 -1415609 -24532 -2534991 -916255 883134 -1873290 2225859 3016960 -642226
10757 -642226 22127 1350731 1290986 -2247317 1882047 2867518 2623801 1310406 -504153
10748 -504153 -2582488 -767522 -3983233 -1560967 374292 -1267788 -226894 2010078
10740 2010078 102926 2219407 688110 -1162509 -1573395 -2237784 -5719640 -435041
10732 -435041 983671 3510064 4901144 7091092 4663059 2801543 1132670 -3019227
10724 -3019227 -5382449 -3716784 -2564107 -1280004 1827956 2056106 1309971 3120341
10716 3120341 -2366005 -4190733 -2259619 -1393502 -395642 4434050 5392038 3727180 1702150
10707 1702150 -8380 -2603669 -2873886 -4349631 -1871011 859552 -73770 3775900
10699 3775900 578907 123204 3430442 78787 -4172304 -1766443 -1732320 -251944 1594587
10690 1594587 -741898 -1830464 2002399 2226339 710550 1526372 1195787 -1594237 -456874
10681 -456874 -1989956 -3796540 -438020 4941520 1220585 -157759 -1918235 -3651571
10673 -3651571 -1389679 -532974 -1484629 1425160 3345157 1891336 1046889 379309 -3310246
10664 -3310246 -1757078 1213302 171285 403637 6657005 1855124 1712296 2701594 -2342376
10655 -2342376 -841912 2008650 -1663267 -929909 1887999 -41950 2552885 1005118
10647 1005118 -1723482 1535998 147710 -290996 -766126 -955159 -1488141 914503 -599329
10638 -599329 -135419 -966127 65111 -21023 -1937198 474349 2677161 1654169 4246239
10629 4246239 5840768 1215571 1578392 -582882 -5855913 -6512754 -3411977 -1755735
10621 -1755735 -229343 2944344 2195113 2087124 -774141 -4050038 -1261133 -2348751
10613 -2348751 -1673238 -1175597 -2495865 -1972856 828706 1039884 1945847 2750893 1682884
10604 1682884 1666796 756131 -654729 -1801929 -2021571 -691842 85102 -1713568 -1224640
10595 -1224640 401742 -1760595 -764410 1039396 1772610 1883515 5777554 3338287 -384851
10586 -384851 1520260 -538799 -1046563 957669 -695370 -764279 4959748 2961757 313805
10577 313805 687108 -4305541 -3270031 -2028002 -1901039 -1062346 -995100 487764 1361114
10568 1361114 -232515 -88099 2110622 1500355 2209008 1966641 1077315 2795078 234967
10559 234967 -265915 1344410 -430354 1966320 1923560 478668 1676594 178724 -2586621
10550 -2586621 1270285 195977 1254788 2339196 105207 504188 1327245 -125754
10542 -125754 -2561891 717692 -1024904 -1090965 651201 1978678 1758661 624444 -130397
10533 -130397 -3689697 -4179554 -4098568 -3268896 -3244268 2211754 1574858 -451645 -10885
10524 -10885 -194919 -2397085 -1707129 -67538 -2119078 3950702 3657191 1549346 1571261
10515 1571261 1738839 -489632 2009846 -532848 -3550208 -312303 758114 -666509
10507 -666509 543006 -298879 3680272 3266126 -111737 -2666104 -2822548 -683523 1133167
10498 1133167 -85786 1988551 4603093 2643985 1159466 1053549 -2707442 -1303325
10490 -1303325 245860 1373698 -355937 1833708 2270253 1942441 -61231 -4386959
10482 -4386959 -4643566 -2030533 -905915 -2136067 764151 131538 1490245 2286708 1445841
10473 1445841 758439 -1746536 -816146 1524211 2067411 1976160 266453 -1912309 -634179
10464 -634179 -643769 -1585242 1019757 -2708734 -2416095 -2514127 -408824 754369 1112644
10455 1112644 1869666 2763548 358637 -981823 -4051616 -6843528 -3359785 -5228368
10447 -5228368 -3599379 284795 -652595 1241077 1727699 -3370464 -2391818 -1254325 -2561012
10438 -2561012 2386710 -163068 235430 5023917 693430 1065453 1878425 -779077 511998
10429 511998 2133996 -1007726 1949278 3440264 -1042976 -2125740 -40685 -4408350
10421 -4408350 -6028813 -99140 -988017 -1827189 1783832 1881397 3080749 2265317 290938
10412 290938 1098449 1957147 903859 -1922624 716394 -834108 -1194639 1703300 2615669
10403 2615669 679294 2020708 1394466 -1233447 -305304 -442087 -2114950 -1605093 -3606279
10394 -3606279 -1463779 -1518404 -2671508 -1817998 594989 729007 2193447 -605959 2916260
10385 2916260 342360 205771 1513205 1234874 859563 3287598 -1308970 -655242 -24921
10376 -24921 -3792094 -3120687 3132668 1013878 2154819 4616531 929769 -1669307 212021
10367 212021 -1956958 -4080568 231212 -2839739 -5038725 102526 -1597229 -1193140
10359 -1193140 2834072 -116541 231695 3114644 2063948 1010085 1592916 -1356759
10351 -1356759 2327917 217728 -637979 -2422270 -1535014 -2606155 1405261 1514231 763898
10342 763898 2397240 1813569 105149 809079 666258 1152320 976378 123948 -2674115
10333 -2674115 -1582067 -2339209 -1829254 -2567964 29377 -238559 -925191 -682456 -951543
10324 -951543 -1453511 -225907 2804143 934571 801383 -1230524 -1190372 1237377 -13640
10315 -13640 2164646 2147380 4330754 -463865 1209702 -107594 -726425 -718910 571289
10306 571289 905006 -2799345 -2582251 -1046296 -303897 651912 2387516 2967682 192711
10297 192711 209557 99238 -703205 -248885 2073971 911269 4480935 1215016 -2884529
10288 -2884529 1467370 -199059 -1826932 507742 521725 -312088 1163697 -349447 -595951
10279 -595951 -1881286 -4292047 -5028404 -2959126 -3209449 -2361613 1011220 4518418 459943
10270 459943 2723478 2133586 -1898500 -83723 847840 -1369543 158942 -419999 -582188
10261 -582188 232427 -1478903 -82404 2347262 2351226 1128265 -1129623 925036 -464047
10252 -464047 -1582361 -211450 -1749557 -1039617 1838150 -2222858 -2118614 -1766398 -2995760
10243 -2995760 726445 2915363 1312458 2696993 3844142 969107 -1986455 -861116
10235 -861116 634040 -2428402 -1922519 1456658 347667 672937 -277483 -1723912 -2793306
10226 -2793306 -1777416 -2358364 -1378957 -2551176 -1164222 -1547489 -2514736 1858780 1120223
10217 1120223 -525882 1755508 735719 -485948 4235121 5701722 2537851 3570568
10209 3570568 503696 -2338920 1425983 1556548 -3297983 -131337 567909 -2223842
10201 -2223842 -717244 -1169241 -1261470 -429557 -1189736 -3594007 -2959704 -3609191 -3651687
10192 -3651687 -1475401 -443008 1852639 -409054 1856060 873953 -982967 286431
10184 286431 3721321 1694971 2573394 5822528 1266892 -1240551 -2125140 -731368 -2230332
10175 -2230332 -408194 -236626 -161835 -2070213 -1399280 1838492 -460001 -429785 788534
10166 788534 -2438002 2204110 -149706 -3098428 3457923 4880806 1690675 3614734
10158 3614734 2531042 1204709 2211343 116276 -132335 270430 -518911 -485708 -2254911
10149 -2254911 -2866457 -3902375 -1908631 -512576 -3492969 -3190241 244820 -2694623
10141 -2694623 -1381063 1040467 -1740898 1023752 2500074 -266520 -2463638 -2543855
10133 -2543855 -1129355 -1647086 -2238811 280151 1585738 1382018 236790 799272 108164
10124 108164 -7832 2153093 4350612 614281 391025 1933961 1369968 3542613 1447959
10115 1447959 1036007 1264001 -162358 -835453 1866890 -1977757 -2296824 -2157849 -1332472
10106 -1332472 -1007240 -2986262 -2516002 -146863 -694516 -3910288 -2726623 920061 -1926159
10097 -1926159 -2394576 -98974 -694321 -266148 1682824 -124210 -2144886 -2195156 -3795505
10088 -3795505 -643428 1275530 1167829 3353900 4499816 3569743 2686968 916089 1562243
10079 1562243 -352339 -237240 2528169 2092925 1120168 -781777 227805 -126340 -2782148
10070 -2782148 -492676 1582781 676871 3329228 2022788 -1803158 532425 666672
10062 666672 -2794408 -633061 -150060 -1252589 183569 308607 -2049982 -692282 1737837
10053 1737837 18951 864137 638477 -258847 -2766082 -477775 -3062974 -2837421 -1683172
10044 -1683172 216990 -3539054 -1399739 265859 -1428378 -661109 673173 -2861606
10036 -2861606 -357322 2491556 3600159 3675650 5833868 3741218 915510 1443618 -287638
10027 -287638 -2405229 -1361886 1964186 400916 -1520794 -1338234 -920640 -1507917 -235336
10018 -235336 -3797722 -7683809 -5920554 -2501779 -3505088 1275749 3882457 5542473
10010 5542473 2807853 3479063 -1590477 -2914159 625984 960855 -287002 3247234
10002 3247234 4387319 1465535 3737703 -870343 -3066211 -2493669 -5422820 -4215552
9994 -4215552 101552 -2140250 -3751240 1895241 646308 -325367 -23474 -128875 -733695
9985 -733695 -1022395 -270595 2173857 3562489 2797782 5604988 2912682 -1498047 263860
9976 263860 48057 1670972 674291 -1898818 -836415 19682 -5485229 -2025507 -2003746
9967 -2003746 -4196906 -1343091 523788 940971 3077772 591318 774439 6065019 1304380
9958 1304380 -553500 3299864 1726856 936748 -64304 -805068 -1586719 -3150875 -1364197
9949 -1364197 -1194073 -1239815 -2257831 510336 178331 909141 -2035299 -427469 1228618
9940 1228618 2501237 1605202 232769 13379 -705735 -268321 2107071 -891856 -207172
9931 -207172 2840822 5750584 4070519 3733355 116647 -2867581 -4380880 -3529719 -950680
9922 -950680 -32398 2058223 -380583 -3009438 -3842699 -2261919 -1285334 -1360137 -2077675
9913 -2077675 -987103 -1005465 -1820287 -1289071 -1506250 -1129394 187112 1768315 942518
9904 942518 995742 2637751 3805768 2286151 5066789 5376025 2495966 4028522 1375950
9895 1375950 -422105 699128 2009272 333709 763719 -151657 310357 1123645 181366
9886 181366 -2503207 -3804909 -2227399 -520578 -942258 -1560818 -577901 -175851 742399
9877 742399 2330803 61163 -1065136 -3508473 -3660676 -3634912 -959005 2129727 2571308
9868 2571308 2551037 -935396 -4669229 -5253760 -5242691 -4553098 -1480945 2482810 4437400
9859 4437400 6193382 3637146 4484692 1452739 -1553111 -1429046 -2591720 -124352 1233789
9850 1233789 1573849 -204167 3496915 -283304 -1597353 -1879797 -810851 -266072 -2589114
9841 -2589114 1780902 278722 -1933702 -583716 -1290022 -1336716 1998204 1700491 -994330
9832 -994330 3987813 972474 -968612 1417515 2095730 -1811118 69709 2030400 -2022299
9823 -2022299 634775 -1220971 -2337692 -1912012 1340886 641027 1872760 2464507 764496
9814 764496 2717623 4487278 3478004 309376 1787819 1943016 65407 -1488609 -3245239
9805 -3245239 -3728499 -2649568 -726855 -1067692 -1585761 377361 666916 -1896213 -2528389
9796 -2528389 -643483 -892767 -249208 3410352 3052072 4226627 7168437 5252831 2026982
9787 2026982 2754793 3687 -2187727 -698134 -2514744 -1473236 154170 1971214
9779 1971214 -251303 2025994 -374953 -1905739 -914761 -996997 1572378 434065 2404862
9770 2404862 1954226 281689 -1268360 528997 -3476358 282432 5070249 2181289
9762 2181289 3517484 3763521 308323 2711161 -37579 -945008 393057 -1582662 -2293064
9753 -2293064 -1706553 -791412 960732 478370 156566 2399110 -1910694 -1176199 -1720679
9744 -1720679 -3500629 -1760427 -3481011 -620793 -73355 2453860 2265141 4627974 3294324
9735 3294324 2875561 693277 1431482 3028840 1532140 5721045 3660403 4031259 2199767
9726 2199767 -449393 -1479803 953948 -3549731 -1843318 497950 -1731291 -1221338
9718 -1221338 932212 -1809089 -284561 -45419 -867075 -2054209 -152984 -1425215 1483001
9709 1483001 3036602 840640 733419 4020481 1471292 -331124 -423579 -3201207 -1408410
9700 -1408410 -1188393 -2709970 892407 3319730 1442308 2189215 3307213 1355374 949914
9691 949914 -1136996 -3485845 -1211436 -2905994 -1927255 -742037 1746449 -593197 3415324
9682 3415324 1545415 2648034 746344 2049830 3457977 2161849 346717 -277130
9674 -277130 394344 -672897 -2000742 -3322919 -1050938 -486797 -945500 715922 1349554
9665 1349554 -1804349 -2103022 -2832824 -2729440 -6117228 -4264790 -170137 1910985 1170953
9656 1170953 4812946 3910559 3160544 2503488 2640200 4400235 5074926 3306541 481555
9647 481555 1825506 -2356427 -5597055 -268191 -1993382 -5270022 -2253794 2094354
9639 2094354 -1559634 206991 -1340157 -113156 101703 -704825 459271 -674844 -2809316
9630 -2809316 -3950198 -405137 1285998 804087 -1343812 545596 -1227278 -1875174 -51488
9621 -51488 -1016732 -1806747 -3347274 2106840 -421966 -2401840 -453530 293060 -1661563
9612 -1661563 -335868 1631985 103015 4999081 2125040 -512951 -1498538 -1595050 -1572292
9603 -1572292 1586617 -388278 -313279 3776595 3747779 1633070 993646 798621 1710874
9594 1710874 -1257658 361255 -2569715 -4906741 -4093299 1103331 -1802720 -1207945 -1240439
9585 -1240439 -809522 -739803 496831 -2261345 1515181 993075 2217594 2357925 106766
9576 106766 73423 3879469 905046 -443253 169257 -851767 3148200 3247843 3251738 202045
9566 202045 241439 -3455609 -1059778 -1819239 -1556197 -189674 1078795 865438 -1541727
9557 -1541727 -656598 -398906 1253758 3098720 1673151 4225098 4276837 4405678 822710
9548 822710 1646400 -132111 -1303963 -97660 1137622 -497796 -1327920 543553 -664392
9539 -664392 2045208 2873042 -241055 209756 1336923 -1912627 -1275131 -1198715 -691268
9530 -691268 2441179 4463143 2581510 2605560 1445325 569168 -1554376 -1331186 -3052648
9521 -3052648 -2498220 1444075 2332047 1792962 859983 -3122243 -6038137 -2907491 -3826203
9512 -3826203 -4983166 15199 1541820 304130 3362079 854484 623683 3018036
9504 3018036 1827456 -3331238 -844889 -577622 -1653123 29089 518197 -1357841 -1915743
9495 -1915743 -3608729 -5871026 -4037720 -4922937 -2658698 1686914 -1588709 -741197 -3087106
9486 -3087106 205087 -861392 -896058 -1830815 1002153 2052133 5418156 5101195 1153029
9477 1153029 696314 -1828689 -3003494 -795203 -787597 1201146 226920 1386 -1576045
9468 -1576045 244772 -2939770 -2962148 -3391896 -4276073 -1426405 1528317 3045142 2343443
9459 2343443 4104816 1653681 2600781 1311378 -556787 -702499 1475093 2250105 3892111
9450 3892111 1139855 -2442770 -2302651 -963398 -2991347 -2338029 -3194257 -474101 824075
9441 824075 1284546 270693 648811 1555216 4258389 3238132 467926 -142430 -651456
9432 -651456 -1125749 -1688223 -1506024 747770 -537290 1142198 -843703 -2036213 -4576695
9423 -4576695 -2166068 991300 -682952 1489778 3775000 2396317 3037947 4943158
9415 4943158 1709314 -1286895 -38150 -168508 646370 -606585 -2562316 1866884 3419982
9406 3419982 468511 97853 602133 -1183039 -2138447 -1877476 -2961428 -2384735 -2041829
9397 -2041829 1519442 1825545 2397759 -1599612 2208365 2302228 -3164457 -2375448 1307732
9388 1307732 2579893 1863415 1930584 1718286 -936024 -1427793 1579369 300470 -488923
9379 -488923 1186261 -24241 1671386 -1134546 -4040288 -1026463 858489 2552702
9371 2552702 4713008 4172766 -881674 729126 292457 -358179 -2398555 -2594397 146868
9362 146868 2114266 2063700 708191 299385 -746860 -2440792 -243172 -2298628 -2045337
9353 -2045337 1956417 -648101 -1544316 551922 -1882779 8818 3414954 683902
9345 683902 -1521705 -2671002 -2953606 -1683703 -2958945 -1467608 1172064 1500496 1055968
9336 1055968 2881503 913030 870980 -3653478 -2671137 948980 1768058 1686985 5481217
9327 5481217 5628823 2060164 105866 -609263 883668 848444 -1223902 -1667139 854002
9318 854002 -860079 -1889094 -1306364 -2804061 -5072800 -828072 -1006184 -640726 -1502827
9309 -1502827 -2949668 -320680 -21261 537549 412133 1502454 2665602 2514634 -97103
9300 -97103 -363487 -659331 -1911099 1737618 131783 -813187 -818048 1205582 504523 16641
9290 16641 105318 623466 3943771 3949744 6337 -853263 2166408 1235998 1275935 1126566
9280 1126566 209389 1350086 -190237 1789672 1496167 -2090541 -943942 1691029 -410848
9271 -410848 -2903153 -1094935 -1848230 183463 1495376 495880 1020687 1509398 386779
9262 386779 -1373831 -555821 -987826 440082 5362096 2266941 1859605 1312420 1462008
9253 1462008 -3157989 -2432570 -1858571 -2196913 157723 635114 2457730 897739 -705526
9244 -705526 -443406 -65395 346640 207040 1043012 143125 2078028 -768873 212336
9235 212336 -3099844 -2048737 -1465109 3298861 4998602 2775602 3607147 3196449 117845
9226 117845 -278186 -3234143 -3760012 624168 -1000626 -35782 -1137636 -1696824 -692192
9217 -692192 1113558 -632912 155656 -1786395 -3197155 -352902 -1443056 -2551827 -1083307
9208 -1083307 -612930 -1169107 -124259 -565388 -2396821 1138260 1451676 1029885 -2671121
9199 -2671121 -421026 -2772673 -166597 -1143652 -597501 1085999 3886980 2605126 2873472
9190 2873472 4333028 1679482 220340 1682004 1111050 -293989 3075961 3184609 -2844415
9181 -2844415 -1079823 -2926253 -4352833 -1939799 -641008 572201 3357260 2005772
9173 2005772 -1341930 3585012 707221 -2173254 -1296454 -1056975 -1638434 -2923776 594172
9164 594172 -476923 -1479077 -4225023 -2610534 -2855511 -2425118 1024822 719906 1126123
9155 1126123 -2105627 -1509892 -2615402 1560408 2912448 2632249 4828401 7266282 7012689
9146 7012689 1226905 -909344 -3780594 659098 -531823 -283606 548218 -1488022 -4924863
9137 -4924863 -4018982 -2090351 -1014150 335936 566949 795312 -614087 -2252781 1977354
9128 1977354 2491494 101770 499130 2129785 -2318122 -3567958 -1938980 -3269570 -1574443
9119 -1574443 -486957 2147919 3762211 2039771 -110280 -2050766 -2088865 -2370725 -807768
9110 -807768 1569172 2173312 2172811 2096991 3335277 49451 -1476115 992763 3227370
9101 3227370 1624313 4680679 170254 -2523265 -5635557 -3110880 -3515471 649387
9093 649387 430845 1917082 3058304 3407157 -647264 -141068 242402 2742548 3281227
9084 3281227 4064377 1584688 -1143759 -4940634 -4216728 -6576620 62393 3199535 5437787
9075 5437787 1684363 1306815 -4944782 -4989962 -5512157 -4937312 274208 882809 2964735
9066 2964735 2376719 -1431534 -1180393 964800 -1446016 155958 539285 951384 2245948
9057 2245948 -75274 -1544670 -63357 234708 1230418 -328774 2094619 1844880 2661201
9048 2661201 1919823 5236469 1729689 5798769 2296151 -852666 -2372967 -216878
9040 -216878 -2447190 -1709413 -1279652 588176 -2946273 1491495 -622939 -1822470 -2295167
9031 -2295167 -420379 -775739 -510167 -2140794 1351108 5985802 2176503 2151478 -633360
9022 -633360 -1162008 269108 -520775 802627 2288711 -946306 -1695210 2404039 -1285005
9013 -1285005 -532134 579669 400835 859694 -1602250 -709098 -2181225 880654 100487
9004 100487 434012 2170556 2145595 -20174 558527 -1211443 -2162330 -795501 429909
8995 429909 377287 -1666634 2014350 529743 1039359 102588 -1973861 -1248970 2837416
8986 2837416 -327626 1630811 4339969 3266752 938924 -354378 191920 -236588 -1339017
8977 -1339017 -70693 2177221 99175 2205081 899649 2549494 -605919 -3498421
8969 -3498421 491655 646572 -924624 1220673 1876151 2557468 805459 -955863 1074805
8960 1074805 812734 -461524 3839286 3372026 3578970 1098245 -478473 -1931561 -3486643
8951 -3486643 -4040498 1930572 -13373 -1631938 -939906 -311370 199368 -1636235 -2366272
8942 -2366272 -565571 -182092 -410016 1382934 2692606 3255162 1743655 4407490 2032701
8933 2032701 967056 3899569 4045615 4011034 1338101 -3111887 -2055114 170294 -4278625
8924 -4278625 -2515324 -2607347 -1306434 -636193 -3520564 -2138396 -1744344 -3675983 378192
8915 378192 719872 -1336830 461640 -1765834 2430071 4171776 995440 1993217 2187068
8906 2187068 1639214 2620285 -249220 212796 373729 -3728201 -999793 -1390872 -2455257
8897 -2455257 -1419453 -2168168 -1983496 -1057000 -877442 864735 742022 98856 2340390
8888 2340390 -837590 2862364 2134245 -553433 3888058 402605 669578 826439 770606
8879 770606 1788046 1025631 -114316 3197399 781259 263296 3970097 -560146 473542
8870 473542 328748 -2038441 -1449486 -84482 477302 2633046 -518252 -1233483 462262
8861 462262 177752 2094846 -2070132 -2442249 1199228 -3068696 1325014 -1030383 -2004013
8852 -2004013 2517625 5016014 979437 1430832 2870710 1432449 913732 679595 -2010558
8843 -2010558 -2579913 2474457 1376407 -171382 3348468 -1148215 664874 1854765
8835 1854765 -2639269 -3324324 -2284763 -4097778 -227048 419274 -1415614 3225632 663058
8826 663058 696034 -200508 -1743446 510040 1991812 394499 4501452 2788218 2464894
8817 2464894 2212601 -678236 -2562008 -1746921 -337274 550285 -1621 52414 336523
8808 336523 1339647 980164 -183076 -382664 -2462392 -4310628 -735322 -2523020 -2664185
8799 -2664185 -1492284 -1307872 725757 -854155 71153 1124727 1509633 1311200 2638798
8790 2638798 2706359 1640188 -1730646 1318035 1805465 -1592760 853652 840226 1751292
8781 1751292 2844260 2551422 343302 120368 -3049398 -2146966 700949 992979 2031321
8772 2031321 3330609 1811826 511336 -1048211 1752658 372619 512143 2916477
8764 2916477 317386 610185 3026765 -2627626 -3134972 -327952 -5185575 -2661092 -593752
8755 -593752 -1416249 -4446845 -394665 3425831 227357 2531453 3521225 666883 1582763
8746 1582763 2094583 -3181688 -1310532 2860191 -1503557 3146933 2388163 1643689 1199188
8737 1199188 1317255 -1694527 -2828298 -1028857 1205277 -144468 -1214435 1137978
8729 1137978 -2672024 615803 2658392 647761 1317669 1741376 723854 -788026 -277004
8720 -277004 -653487 -1493019 159164 2974861 1464406 2947873 1927096 -2178962 -1161823
8711 -1161823 -3075858 -2737220 1146225 1822713 1056511 753303 -2163406 -2196905 -2516077
8702 -2516077 -4350223 -2330182 -1517598 -591552 579453 -1159363 -162660 -2418251 -839890
8693 -839890 1269269 877461 515775 1355240 -1358814 -642128 -804783 -98337 2930961
8684 2930961 975691 2583475 3847776 -1215259 -4684891 -2427258 -3855740 -828922
8676 -828922 1846249 191242 3489858 2379997 -129466 207525 306404 -1682402 -1525102
8667 -1525102 2093001 -2103160 1356083 1599821 -775594 -60095 1813850 -2833717 -2786387
8658 -2786387 1037726 -2898117 -821378 -1257652 -1713226 -2215576 -1304133 -2624451 -3661323
8649 -3661323 -1872239 -3724735 -3470539 -1003749 65765 -660841 2896296 1941161 1503831
8640 1503831 1823752 389005 2155442 -211285 1042722 424005 -299572 1426693 3025791
8631 3025791 301829 279435 282194 -3394557 2215788 -2148515 -3483304 -1666516 -3242170
8622 -3242170 -1643426 -1835736 -4466049 -1444017 818271 -2945053 -1721834 -3795348
8614 -3795348 -4798436 -1322222 -2757653 -575423 3698736 2679384 2163933 2268268 -1850030
8605 -1850030 -2198214 2045337 606581 -1208576 -325623 -251003 1045354 3168044 -176963
8596 -176963 552938 90744 -2656974 -2058628 501113 1686633 2411244 2320768 3501295
8587 3501295 2830534 -1172692 853408 -30043 -1840081 1922234 2303352 87115 2683502
8578 2683502 -460519 -2056326 -80474 -944232 -1374318 979026 1150656 984663 1154926
8569 1154926 -345066 -14703 -1123611 2467377 601421 680217 3790437 1762739 -1311213
8560 -1311213 896569 258969 -593132 39889 -2491901 967473 2283951 377440 2827863
8551 2827863 198039 -1319670 640570 3209796 691402 1629085 782714 2493190 2513125
8542 2513125 -825238 -2432619 570392 1080694 3814 -1686164 -1950209 599901 -1675597
8533 -1675597 -1106142 -1447869 -340230 1428678 -76783 -2752032 -533917 117763 -859759
8524 -859759 931530 863466 655713 3082327 1680263 -985516 -1095554 -3716235 -3595661
8515 -3595661 -208887 -2284477 -685158 -63729 -1182701 -438930 1403072 635024 2046655
8506 2046655 1619474 1662793 4258238 2033097 939515 709602 762447 -1121602 1492488
8497 1492488 -359482 -454598 -1342486 -1670834 456862 -988303 119873 -1548574 -2277772
8488 -2277772 350969 2244603 -1786381 -307694 238942 -1067300 -2416001 -816528
8480 -816528 -1202710 -557207 -19369 -1561814 -1096545 -696017 -1119368 1962729 2865076
8471 2865076 1509476 539414 1105712 -3077109 -745796 122363 3321812 2766460 553029
8462 553029 84886 267627 -1242242 -565094 16337 -848438 61263 744524 880683 -31080
8452 -31080 2506206 -1275025 2538135 512232 -2630838 600897 639518 -58252 3445055
8443 3445055 3192606 320078 2736872 -875904 -1971184 -4583933 -7336325 -3819816
8435 -3819816 -3654252 -3569120 1068022 1529098 1177079 3337873 -1030037 482229 4419277
8426 4419277 -509437 -625129 2772527 2232063 1699721 4475894 2065337 -432218 2722762
8417 2722762 2128690 297504 2192935 -1326699 -1064155 766866 -2819464 -3446025 -1636240
8408 -1636240 -1221101 -281518 -129963 -1514406 -225022 -1896213 -137938 -2520520 36343
8399 36343 3560706 4990095 3203416 4910051 3711931 2482257 570744 1620889 2320237
8390 2320237 650050 2811496 2332389 720141 2883761 -1828584 -2662223 298841 -3524916
8381 -3524916 -3377336 -1838014 -2731925 -2730074 540935 1837899 169230 877989 476937
8372 476937 2764 -2279649 94160 -964435 1290834 3659000 566806 350763 -1423136
8363 -1423136 -2716589 -250693 1932080 972659 836729 1155879 993433 1323222 2263243
8354 2263243 2520334 -1341858 3234513 1173360 496262 1019593 1627912 2827917 4318426
8345 4318426 2073496 1769518 -1483725 -2664883 678146 -4802257 -3522265 845716
8337 845716 -721702 1224111 1164500 -3068931 1430801 -357325 -861431 2534099 2907389
8328 2907389 1847082 3906669 1299423 727451 -510851 -1454729 2450857 -144388 -932093
8319 -932093 3094334 787205 -295921 590036 -507636 -2263224 1876276 -1611185 -201173
8310 -201173 -714064 3378737 -1384379 3819518 3534663 352543 3364248 3896112 3048611
8301 3048611 347227 1796316 366408 1419659 -600860 1471735 -320552 -3406482
8293 -3406482 -647261 -1762348 -2313495 -107935 4278559 2595875 6014431 1545429
8285 1545429 -2823706 -1185053 -122590 -1037247 -654 3310964 2254729 4812683
8277 4812683 4430045 2469944 -455864 1487594 -373227 -765646 822942 -1480749 973366
8268 973366 3064697 60496 -2291293 -1198569 -4546836 -4300977 -2235647 -1872383 -2300318
8259 -2300318 -825442 2514992 4281827 4038388 4869666 4510381 940184 4359885 141720
8250 141720 215909 1653154 2868601 281880 4028975 893546 -3779454 -646745 -3201544
8241 -3201544 -4053452 -2361779 -506703 -1178345 -377815 -483557 189718 1289763 2426591
8232 2426591 3527117 1092390 2312719 -672619 853088 1170326 -255927 -2604007
8224 -2604007 816768 1037351 940584 902782 653247 -113836 488596 -524062 981847
8215 981847 80410 -580345 1655056 1766062 1617389 1442268 1214798 1413243 2457605
8206 2457605 1283816 -228991 243011 -1196069 531548 3665726 6054581 6012777 4800142
8197 4800142 6187230 4706912 6821573 6770448 22612485 -9607762 -22230118 -4430016
8189 -4430016 -5891510 -7251188 -5431162 -9772680 -8141705 -7414311 -7788562 -3343906 -930421
8180 -930421 -1669119 -2334279 -286224 -2522404 -4713336 -2013354 -1721131 -4193609 -195607
8171 -195607 2340225 -254502 1677848 1019488 1210110 971028 -1258962 -2730453 -4195435
8162 -4195435 -7250574 -5816905 -2293349 -3279174 494721 245067 3324455 -91829 -557691
8153 -557691 402922 914075 526455 4725546 950861 4881730 2139476 1507137 148525
8144 148525 -1412444 -5275067 1072053 -789473 -2902340 -3312416 -2009301 -1550252 -1064721
8135 -1064721 -263726 -123351 -1187975 -929770 758451 204849 -1181725 -2506691 -2400471
8126 -2400471 -16131 -2392643 421294 1211585 469835 1628698 -1150740 -371792 -11720
8117 -11720 1843239 -1541239 3073035 -8577 2026619 4216734 4141242 323572 890153
8108 890153 589954 -1274544 -1297193 -993377 -1510953 -2375975 2056550 423205 -1319307
8099 -1319307 1862790 -1726440 2205939 100198 -1798670 -1968568 756431 421792 2210451
8090 2210451 2938889 790190 -2270097 -2671780 -2119946 -3658357 -3811962 543560 -2038457
8081 -2038457 -1791892 -391208 -2215129 -3447201 6826 -247355 1370224 2885870 -1986099
8072 -1986099 1547189 2129200 44495 2726163 5271026 1507699 -59994 -2912561
8064 -2912561 -1952193 609265 869510 2675896 1445561 -860369 -2312041 -4759537 -4258310
8055 -4258310 -5328941 -2875801 1261876 460746 885021 5412817 -191716 -1787494 -1362369
8046 -1362369 -4818057 -1878469 6839 -455971 -72912 -712225 -619654 -519995 -1277087
8037 -1277087 -817179 -2328721 -1009501 369799 203885 -3874695 -1122810 -2186923 -3234983
8028 -3234983 128407 1773641 -357591 -229299 -1349771 -1533372 1046280 143553 -1146848
8019 -1146848 2789966 509460 -982205 -1602312 -1766620 171188 1184731 -286273 4206592
8010 4206592 2012201 -175100 352472 -1692414 -4051795 -2351357 -1985924 -3755070 2203758
8001 2203758 -823176 -2372805 2205916 60167 -1260579 -355082 -4009698 -1880410
7993 -1880410 616085 3122591 790235 2591167 -874940 1158362 -560438 -3532943
7985 -3532943 -2091338 1714787 -561538 1498787 1404431 -1768219 -3531548 -5723977 -5210525
7976 -5210525 -4064645 -3925397 -1532758 310699 1683926 -675527 754429 -67273 2777921
7967 2777921 1069867 4813866 2463384 -3940148 -4764529 -4980539 -2401105 -1423198 1641609
7958 1641609 1803777 1839312 -133114 -1698287 -2110571 -2596340 -3983822 -5310813 -3774083
7949 -3774083 -4768313 -1912575 552863 -678474 -501103 187222 -616080 -2425831 -2028627
7940 -2028627 -2150159 1453493 1867247 1500096 2295979 -305740 2444094 4209357 3049362
7931 3049362 1822839 3691237 244224 733407 4998612 2638568 804347 2907308
7923 2907308 719751 -3035356 -1079408 -4263387 -3022946 -3545197 -3599149 -980659 -1509146
7914 -1509146 -1264158 144880 1877837 1201057 5107378 6270113 3772416 2658039 -549763
7905 -549763 -2080086 -2416266 1266832 244967 4835681 4472160 1357275 -1538419 -1385828
7896 -1385828 -5584071 -4249040 -703726 -1250754 2448783 2874008 -307763 -175672 -2483338
7887 -2483338 -1217649 -598937 4580894 3202185 3252914 3631875 346158 -686846 1792357
7878 1792357 -325389 -2689950 1964917 -580984 -3248737 -71374 -232132 -1728983
7870 -1728983 740922 971539 -256910 1578855 -1954563 -2897514 798757 -247940 -2148756
7861 -2148756 1031615 -270062 -2201990 -490602 -2420792 -151800 499673 -1407794
7853 -1407794 1817099 1012069 -975301 -1898377 -3858582 -5390526 -2692036 -2958406 1152934
7844 1152934 -178172 -972179 2697248 1861526 -2327098 -1460254 -1375485 -170346 1805999
7835 1805999 -1407086 -1943044 -1490611 -3076256 -1380783 907589 566942 2359579 4540611
7826 4540611 2375025 122140 2457293 -1063612 -1162850 -2133069 -3698454 -2390229 -1448792
7817 -1448792 -3184160 -827352 225871 2358416 1313250 1244343 376958 253363 582991
7808 582991 620423 -1147632 5489046 3018256 1518595 1216425 982804 -2601800 -829593
7799 -829593 -1347205 -829166 -988915 2004258 1911257 -537401 -1754020 -1921023 -4260061
7790 -4260061 -3141479 -603835 147214 4614361 3264311 5782591 7069073 2322339
7782 2322339 2619383 4650311 1235269 -2045596 -776300 360763 1755065 1461108 -232425
7773 -232425 470226 665634 1451564 -337111 1342082 -240227 -3617614 359120 1768445
7764 1768445 -2499742 2668154 2063489 -1578755 -1663677 -6160980 -8063901 -2076026 -1345444
7755 -1345444 117336 4855864 3564281 1530934 1742348 -4179576 -5064495 -2304711 -2035668
7746 -2035668 611507 2363189 4889261 3151215 4213366 2598065 -294906 -807043
7738 -807043 -2883177 -2865916 -2400881 -1141684 -2682866 -3228612 -1886424 -3009648 -1389737
7729 -1389737 1749212 2662072 911580 4113382 1514138 -164837 1175115 932385 682242
7720 682242 1938646 808274 -1339749 3836923 1068476 925522 327166 -303635 167651
7711 167651 564230 -2894086 -2347257 1352318 1396563 2536486 1004741 -4755108 -4092086
7702 -4092086 -3169013 539307 2553016 4412418 1901351 4886361 2780383 1380615
7694 1380615 -1798983 -1481957 1206222 -697339 -320874 2187621 612682 358179 98081
7685 98081 -197999 -2958679 -464660 -187037 1240445 1732997 1328277 926128 -1553220
7676 -1553220 -667875 -4208257 217518 2340065 2130342 3708416 4139561 -1612134 -127281
7667 -127281 -127598 -2152918 -1660109 -591743 1213443 2358390 -1848037 -211087 -2221293
7658 -2221293 104862 311418 1629858 700822 3419932 147678 -250227 1091283 -2024277
7649 -2024277 383558 1562471 -906193 -1872491 -1874393 73062 -316362 -2408909 -1818432
7640 -1818432 1994929 2113626 1223439 -1412226 -1924552 -3149744 -2221404 -462366 -265094
7631 -265094 2470303 1225845 2075165 3415909 2714671 483614 6425746 2280250 1287759
7622 1287759 2864132 -1409802 -2986695 -581774 -1710896 1807650 1039567 1088709 387468
7613 387468 -486539 -1873012 -3033144 -3636317 -2665969 -2382545 1053239 2856310 -555419
7604 -555419 -530690 527351 -2652867 17412 445196 2164965 5675541 4746779 1511129
7595 1511129 2528990 -315860 -2096740 -2214373 -1351360 1780727 3206386 6147264 439981
7586 439981 -1098942 -3625014 -1960761 -2075910 -3486883 -2924397 -1211060 -88872 2888867
7577 2888867 402649 2939104 3731367 493768 2130895 6956280 1901018 2855756 7592581
7568 7592581 4096452 2176263 4227009 -2204211 -1353356 -1895284 -2186525 24256 -598123
7559 -598123 -427269 -1747211 -4089225 -1855665 -346201 -886379 -2202517 -4167688 -2937317
7550 -2937317 917502 2176941 -2400405 2521899 3700685 1758548 3975017 5907415
7542 5907415 3631503 4448147 2398505 -273584 404147 -148982 -3609316 -1394751 -3236190
7533 -3236190 -1132584 4772151 2293828 2346281 2730282 -3157321 -1704869 -3027257 -4104855
7524 -4104855 4327048 5151054 728286 2306789 1063917 -1737330 -648691 -762868 -29448
7515 -29448 3346461 2794507 1789053 1369750 749198 -1701526 -425065 -30735 -3406217
7506 -3406217 125598 -965455 -723479 4600438 1354165 -99144 5382182 -284239
7498 -284239 1322234 3296610 -2872422 982132 1860386 272002 1800564 770136 374786
7489 374786 3554278 -429268 1413318 591544 -1775321 488488 -2783615 -1912114 2572129
7480 2572129 383573 70191 1448364 -1972791 1949433 2200599 1856201 1769710 -1269584
7471 -1269584 276596 -3123200 -3182230 -1794854 1630115 1527916 369970 -1864464 -1458076
7462 -1458076 -873183 -626526 407441 742796 2890343 3607 2635323 4828227 3031844
7453 3031844 2960878 6677220 2983306 -334987 -53628 122095 3269900 1288883 1974400
7444 1974400 5827478 5264840 6385029 2040416 -1421123 -2867728 -2822825 -935819 1981239
7435 1981239 1045488 2320086 5141101 727510 -1342269 644788 1466596 1574821 3495510
7426 3495510 2648271 4195881 6258453 1435501 996310 822684 813102 -207894 3748289
7417 3748289 3506604 426371 3371423 4500333 4347707 -182848 -562850 160862 865491
7408 865491 2239529 1200590 4236031 2876386 3524381 3031295 4058696 3086178 3955260
7399 3955260 4817470 2591582 1257840 3543657 6110329 6271171 8794577 8247031 8924851
7390 8924851 8036030 2848273 -589234 4199399 3796925 3805991 9357680 4890635 4940548
7381 4940548 4696186 1197648 1790608 351911 2226995 2290110 5941917 7422540 7794133
7372 7794133 7934695 7757868 6444476 10037549 9815652 7565603 9979609 8433747 11218490
7363 11218490 17272703 15442659 14064437 17089938 15832383 16030984 20645312 22229383
7355 22229383 25554826 32628396 43574830 53255657 67257609 83022648 93654022 100422055
7347 100422055 102950059 99159804 98576662 94728043 97760898 102887118 106602003 110886452
7339 110886452 108128296 98995287 94329845 80068064 70004324 65853600 51122710 44941873
7331 44941873 40643276 34243489 31128957 28852487 23919768 24647819 22515286 21344341
7323 21344341 24568393 20984662 21284986 21370100 18664159 19082965 18460523 16756973 14260211
7314 14260211 13993219 11949132 11865469 11847224 13643977 11350949 15240477 13270790 15634235
7305 15634235 18912413 15125191 15656061 17424824 12228442 11184969 11335534 10882186 12910794
7296 12910794 11223756 9216736 10661911 8490409 8178743 12419814 6380259 7031395
7288 7031395 8644363 4401897 4648037 6215682 5673378 9054118 9596738 5210277 9095012
7279 9095012 9478240 7253401 9321102 12321768 8338062 6532884 6319328 2456354 6204507
7270 6204507 7197830 6389817 5287685 6810908 5074104 6070762 3234594 2974132 5364165
7261 5364165 4611380 8081519 3827918 2826780 2479657 974056 754618 7239093 5587990
7252 5587990 5670998 8558176 4065981 5182565 5468025 3378192 4151275 6535780 2954145
7243 2954145 4541467 1907147 -1684399 -2988494 -2216578 -40625 2587581 6125742
7235 6125742 6142894 3185852 5776521 3606438 -841275 2432990 1785766 2194568 9149777
7226 9149777 7723050 5938437 7233561 3785741 3407403 4055594 229225 3426737 4825263
7217 4825263 2004371 1438855 23732 -3763943 -2605250 -975081 -2309759 636423
7209 636423 1718014 1928063 2411905 4691101 -2433950 2770553 4230954 2033503 2377705
7200 2377705 4481964 1928973 2809103 -549254 -2468950 1443253 941672 2089578 -1186281
7191 -1186281 -2502526 165350 -516747 -2645891 3002732 2537938 -118377 3108990 1593803
7182 1593803 1535892 3390996 5826248 4948482 6702307 3540083 5138610 6961458 -88552
7173 -88552 1063618 3419284 498320 -1394255 122062 -2975097 940257 -1759727 -2345874
7164 -2345874 703520 -1247252 -1412671 3593592 1794168 867642 4391926 -63699 1529604
7155 1529604 1333464 -1767766 2253454 3197518 447673 2059952 3035365 -1714658 349291
7146 349291 1386673 -2767355 -2212262 -3119938 -6618601 -3212152 -2920755 -2201159 580313
7137 580313 2495410 671590 2523530 593901 -1507661 -3085521 -3397579 -3216372 -128209
7128 -128209 2979794 1639855 644677 514933 58544 1381512 380977 1860533 3326731
7119 3326731 6350478 2023200 4141838 746075 -2241902 1167595 721784 -2825368
7111 -2825368 -125060 -295588 -4678964 -2043556 -2667218 842660 1367661 681526 -1693050
7102 -1693050 1162566 498591 -1042003 -1381936 385520 1519277 1745659 2491626 1947055
7093 1947055 684447 -226 374019 -1061761 -4071841 -4244989 -1181695 -1718815 -1702928
7084 -1702928 -283344 -40369 -191284 -2095758 1977779 1700023 3433977 582995 3784628
7075 3784628 1391017 -515096 -712413 760443 1748983 -1026728 1428328 1747055 -2061566
7066 -2061566 -3382075 -1322285 1266284 2099412 596146 194349 381874 -637755 2229460
7057 2229460 988819 2768455 3991535 1535601 2645207 2299267 -431790 1514566
7049 1514566 2193991 -942038 1208490 1857067 -1882607 -2853784 -4593879 -4256685 -3421269
7040 -3421269 -207556 2264359 2054759 3208387 5523531 4114741 2816536 4818311
7032 4818311 -1189341 707547 3144849 3307986 5007792 6312891 319496 992857 1977320
7023 1977320 -2143626 1366892 1352778 -4152813 -4029882 991806 -1948454 729450 2446549
7014 2446549 923784 241023 4860070 1634759 1414367 3153329 -520444 3695913 5715080
7005 5715080 1956651 1314469 1163659 -210526 -1692827 -2697642 -1601601 382272 -128618
6996 -128618 -70173 372990 -2975422 -587395 -1401385 -1122464 908773 3777934 615467
6987 615467 -105015 368421 187652 411259 3694141 1925024 5907994 4805539 1835975
6978 1835975 1977026 -328095 -2245563 1748818 119585 2116075 1705981 451766 2329083
6969 2329083 3691791 4087522 3484635 4854141 -1381837 1928807 -304124 -466644 353375
6960 353375 923239 1911871 3847287 3480083 -887515 2840229 -1017749 -2181888 -1142704
6951 -1142704 -728717 -38593 2967385 4553113 3941964 3357920 -4893058 -2911329 -2048449
6942 -2048449 -5568838 -613402 1221416 509015 2720091 4461861 -1338969 897659
6934 897659 -949375 154143 3536883 3415682 2950694 5582037 7311952 6986863 6108608
6925 6108608 3736676 2677040 1278827 963244 -1722469 -3131463 -5049026 772658
6917 772658 -404094 -1021650 270440 1258726 -781001 2229068 1633303 3724556 4865412
6908 4865412 5290886 5157532 4273208 4163292 3569714 6545392 3898779 2630459 4809942
6899 4809942 2587700 -1329236 -888436 -109041 -108008 272281 3204168 1930550 721868
6890 721868 600578 120539 2759050 4390382 4076217 3188623 5366061 6279004 2718038
6881 2718038 5672087 1681298 2428046 4334578 4436358 3787796 4753978 3219195 1220247
6872 1220247 1386354 2586670 4425253 5836650 8929963 9904617 10956785 5921280 4781531
6863 4781531 3683281 2198292 1605500 5185418 8247475 11510315 13576842 14571784 11412683
6854 11412683 11089505 11745395 14932864 19194218 27573564 35113843 42633532 46227989
6846 46227989 46057065 45794640 40245560 38703247 40423167 40828416 43704129 48829546 49085253
6837 49085253 47854067 41724295 36886265 33515808 27984437 26816919 24279480 20845093
6829 20845093 20611615 15529383 17147299 20712736 19687675 20407207 23159375 20167284
6821 20167284 20566398 20144459 17030674 18574752 16843103 23260320 26596411 28541443
6813 28541443 30329519 37760782 41617316 49715544 58332820 67573266 71037068 72719804
6805 72719804 74933309 69422588 68111029 68217304 70106215 73795620 75495996 77410896
6797 77410896 71538553 62477517 58184487 49548974 43437563 39655098 31522041 25413691
6789 25413691 25124643 18289255 17982905 20871308 16228944 19242442 19871241 17949357 17782865
6780 17782865 15878077 18167712 16715345 15207728 16624940 17682361 14204485 15073594
6772 15073594 12876618 13963323 12210110 12923662 14422785 11275446 13329155 12296048
6764 12296048 12601090 9593548 8205296 8551152 11559344 11451966 12774628 13779496 9385966
6755 9385966 10081537 7310719 8765642 9788533 6719868 7474085 10031842 6933971 9135215
6746 9135215 7487091 8972347 10809688 9989127 11946443 14627353 11836730 11122834 10569613
6737 10569613 9390898 10398062 12741855 12355501 9885054 10177333 11679134 10171241
6729 10171241 9623711 10365331 10517236 8662356 12775185 11694019 12440772 12236274 10035223
6720 10035223 8188394 9540899 10586589 8347078 10776429 8883046 9498511 10736459
6712 10736459 11021621 10286910 13569417 13092118 15503785 17214621 14884167 15577398 14851683
6703 14851683 15461298 17950219 21932734 26725603 29483401 35654910 43778126 56099294
6695 56099294 67556387 77756777 86556396 90904702 90238175 81975195 75473276 68367807
$$ [...]
##END NTUPLES=NMR SPECTRUM
##END=
