##TITLE=1H_DE-80H_X3
 200.13MHz, d2o
 8 sc
 
 19ns.26.2.2025
##JCAMPDX= 6.0         $$ Bruker NMR JCAMP-DX V2.0
##DATA TYPE= NMR SPECTRUM
##DATA CLASS= NTUPLES
##ORIGIN= UXNMR, Bruker Analytische Messtechnik GmbH
##OWNER= pz
$$ XWIN-NMR		Version 3.5
$$ Tue May  5 10:28:47 2026 Russian Standard Time (UT+4h)  Yarkov@DPX200
##.OBSERVE FREQUENCY= 200.1313
##.OBSERVE NUCLEUS= ^1H
##.ACQUISITION MODE= SIMULTANEOUS
##.ACQUISITION SCHEME= undefined
##.AVERAGES= 8
##.DIGITISER RES= 18
##SPECTROMETER/DATA SYSTEM= spect
##.PULSE SEQUENCE= zg30
##.SOLVENT NAME= CDCl3
##.SHIFT REFERENCE= (INTERNAL, CDCl3, 0, 18.0133)
##AUDIT TRAIL= $$ (NUMBER, WHEN, WHO, WHERE, WHAT)
$$ ##TITLE= Audit trail, XWIN-NMR		Version 3.5
$$ ##JCAMPDX= 5.01
$$ ##ORIGIN= Bruker BioSpin GmbH
$$ ##OWNER= Yarkov
$$ C:/Bruker/XWIN-NMR/data/yarkov2/nmr/H-C/1/pdata/1/auditp.txt
$$ ##AUDIT TRAIL=  $$ (NUMBER, WHEN, WHO, WHERE, WHAT)
(   1,<2026-05-05 10:26:23.07 +0400>,<Yarkov>,<DPX200>,
      <created by zg, POWCHK disabled, PULCHK disabled
       configuration hash MD5:
       00 E9 B6 7A A2 85 ED C7 34 08 36 98 17 FE 4E 26
       data hash MD5: 16K
       3C 3E B0 F1 B8 0E 99 DD CC AE A0 CB 3A 3A 22 FE>)
(   2,<2026-05-05 10:26:34.51 +0400>,<Yarkov>,<DPX200>,
      <Start of raw data processing
       efp BC_mod = 2 LB = 0.25 FT_mod = 6 PKNL = 1 PHC0 = -5309.116 PHC1 = 11.42193 SI = 16K 
       data hash MD5: 16K
       D0 DD 96 AE 19 85 45 04 D1 F2 80 26 0F 5E 75 DC>)
(   3,<2026-05-05 10:26:52.37 +0400>,<Yarkov>,<DPX200>,
      <pk PHC0 = 9.599999 PHC1 = 0 
       data hash MD5: 16K
       95 47 33 51 04 56 3E 36 65 65 04 6D 91 B4 14 E0>)
(   4,<2026-05-05 10:27:05.07 +0400>,<Yarkov>,<DPX200>,
      <abs ABSG = 5 
       data hash MD5: 16K
       F3 8C 72 AE BA 43 78 64 66 B1 56 8A 7D 6B B1 DB>)
$$ ##END=
$$ 
$$ hash MD5
$$ D1 44 2A 77 D1 6A A2 1E 21 52 BF 00 67 7C 6A 46
##$RELAX= 
##$RELAX= 
##$RELAX= 
##$RELAX= 
##$RELAX= 
##$RELAX= 
$$ Bruker specific parameters
$$ --------------------------
##$DU= <C:/Bruker/XWIN-NMR>
##$EXPNO= 1
##$NAME= <H-C>
##$PROCNO= 1
##$TYPE= <nmr>
##$USER= <yarkov2>
##$AMP= (0..31)
100 100 100 100 100 100 100 100 100 100 100 100 100 100 100 100 100 100 
100 100 100 100 100 100 100 100 100 100 100 100 100 100 
##$AQSEQ= 0
##$AQ_mod= 1
##$AUNM= <au_zg>
##$AUTOPOS= <>
##$BF1= 200.13
##$BF2= 200.13
##$BF3= 200.13
##$BF4= 200.13
##$BF5= 200.13
##$BF6= 200.13
##$BF7= 200.13
##$BF8= 200.13
##$BYTORDA= 1
##$CFDGTYP= 0
##$CFRGTYP= 5
##$CHEMSTR= <none>
##$CNST= (0..31)
1 1 145 1 1 1 1 1 1 1 1 1 1 1 1 1 1 1 1 1 1 1 1 1 1 1 1 1 1 1 1 1 
##$CPDPRG= <>
##$CPDPRG1= <>
##$CPDPRG2= <>
##$CPDPRG3= <>
##$CPDPRG4= <mlev>
##$CPDPRG5= <mlev>
##$CPDPRG6= <mlev>
##$CPDPRG7= <mlev>
##$CPDPRG8= <mlev>
##$CPDPRGB= <>
##$CPDPRGT= <>
##$D= (0..31)
0 0.7 0 0 0 0 0 0 0 0 0 0.03 0 0 0 0 0 0 0 0 0 0 0 0 0 0 0 0 0 0 0 0 
##$DATE= 1777962382
##$DBL= (0..7)
120 120 120 120 120 120 120 120 
##$DBP= (0..7)
150 150 150 150 150 150 150 150 
##$DBP07= 0
##$DBPNAM0= <>
##$DBPNAM1= <>
##$DBPNAM2= <>
$$ [...]
##$SUBNAM3= <"">
##$SUBNAM4= <"">
##$SUBNAM5= <"">
##$SUBNAM6= <"">
##$SUBNAM7= <"">
##$SUBNAM8= <"">
##$SUBNAM9= <"">
##$SW= 18.0517328524113
##$SWIBOX= (0..15)
0 0 2 0 0 0 0 0 0 0 0 0 0 0 0 0 
##$SW_h= 3612.71676300578
##$TD= 16384
##$TD0= 1
##$TE= 0
##$TE2= 300
##$TE3= 300
##$TEG= 300
##$TL= (0..7)
0 120 120 120 120 120 120 120 
##$TP= (0..7)
150 150 150 150 150 150 150 150 
##$TP07= 0
##$TPNAME0= <>
##$TPNAME1= <>
##$TPNAME2= <>
##$TPNAME3= <>
##$TPNAME4= <>
##$TPNAME5= <>
##$TPNAME6= <>
##$TPNAME7= <>
##$TPOAL= (0..7)
0.5 0.5 0.5 0.5 0.5 0.5 0.5 0.5 
##$TPOFFS= (0..7)
0 0 0 0 0 0 0 0 
##$TUNHIN= 0
##$TUNHOUT= 0
##$TUNXOUT= 0
##$USERA1= <user>
##$USERA2= <user>
##$USERA3= <user>
##$USERA4= <user>
##$USERA5= <user>
##$V9= 5
##$VALIST= <valist>
##$VCLIST= <CCCCCCCCCCCCCCC>
##$VD= 0
##$VDLIST= <DDDDDDDDDDDDDDD>
##$VPLIST= <PPPPPPPPPPPPPPP>
##$VTLIST= <TTTTTTTTTTTTTTT>
##$WBST= 1024
##$WBSW= 4
##$XGAIN= (0..3)
0 0 0 0 
##$XL= 0
##$YL= 0
##$YMAX_a= 108491
##$YMIN_a= -109810
##$ZGOPTNS= <>
##$ZL1= 120
##$ZL2= 120
##$ZL3= 120
##$ZL4= 120
##$ABSF1= 17.71035
##$ABSF2= -0.3415394
##$ABSG= 5
##$ABSL= 3
##$ALPHA= 0
##$AQORDER= 0
##$ASSFAC= 0
##$ASSFACI= 0
##$ASSFACX= 0
##$ASSWID= 0
##$AUNMP= <proc_1d>
##$AZFE= 0.1
##$AZFW= 0.1
##$BCFW= 0
##$BC_mod= 2
##$BYTORDP= 0
##$COROFFS= 0
##$CY= -3
##$DATMOD= 1
##$DC= 0
##$DFILT= <>
##$DTYPP= 0
##$F1P= 0
##$F2P= 0
##$FCOR= 1
##$FTSIZE= 16384
##$FT_mod= 6
##$GAMMA= 0
##$GB= 0
##$INTBC= 1
##$INTSCL= 3.241238e-09
##$ISEN= 128
##$LB= 0.25
##$LEV0= 0
##$LPBIN= 0
##$MAXI= 10000
##$MC2= 0
##$MEAN= 0
##$ME_mod= 0
##$MI= 1.114404
##$NCOEF= 0
##$NC_proc= -9
##$NLEV= 6
##$NOISF1= 3.799351
##$NOISF2= 2.8
##$NSP= 0
##$NTH_PI= 0
##$NZP= 0
##$OFFSET= 18.01333
##$PC= 1
##$PHC0= -5299.516
##$PHC1= 11.42193
##$PH_mod= 1
##$PKNL= yes
##$PPARMOD= 0
##$PSCAL= 0
##$PSIGN= 0
##$REVERSE= no
##$SF= 200.12950135885
##$SI= 16384
##$SIGF1= 3
##$SIGF2= 2
##$SINO= 0.751879
##$SIOLD= 32768
##$SREGLST= <19F.Aceton>
##$SSB= 0
##$STSI= 16384
##$STSR= 0
##$SW_p= 3612.71676300578
##$SYMM= 0
##$S_DEV= 0
##$TDeff= 16384
##$TDoff= 0
##$TI= <>
##$TILT= no
##$TM1= 0
##$TM2= 0
##$TOPLEV= 0
##$USERP1= <user>
##$USERP2= <user>
##$USERP3= <user>
##$USERP4= <user>
##$USERP5= <user>
##$WDW= 1
##$XDIM= 16384
##$YMAX_p= 469990940
##$YMIN_p= -7742651
$$ End of Bruker specific parameters
$$ ---------------------------------
##NTUPLES= NMR SPECTRUM
##VAR_NAME=  FREQUENCY,     SPECTRUM/REAL,   SPECTRUM/IMAG
##SYMBOL=    X,             R,               I
##VAR_TYPE=  INDEPENDENT,   DEPENDENT,       DEPENDENT
##VAR_FORM=  AFFN,          ASDF,            ASDF
##VAR_DIM=   16384,         16384,           16384
##UNITS=     HZ,            ARBITRARY UNITS, ARBITRARY UNITS
##FACTOR=    0.220516191357247, 1,           1
##FIRST=     3604.99884269088, 0,            0
##LAST=      -7.71792031490304, 0,           0
##MIN=       -7.71792031490304, -7742651,    0
##MAX=       3604.99884269088, 469990940,    0
$$ Real data points
##PAGE= N=1
##DATA TABLE= (X++(R..R)), XYDATA
$$ [...]
$$ plain form
3368 12597559 12412874 12608268 12613867 11544763 11723038 12754772 13876883 13813158 13916526
3359 13916526 12982921 11558100 9891231 8983019 8629428 7653589 5564590 8299497 11736480
3350 11736480 9920995 8693796 10404266 9207084 9355872 8545019 8386699 10858832 10036099
3341 10036099 11538746 11114921 10843148 12431221 11002326 10178081 9451349 10334057 8936854
3332 8936854 10602615 10700122 10843140 9433873 8454265 10001648 8978918 8096592 12149613
3323 12149613 11034559 10017418 12593787 13159060 11153277 8907081 12107506 10732689
3315 10732689 10812191 9626088 11119869 7539605 3863099 6646688 8550648 9172944 8503688
3306 8503688 8717991 6282329 6845960 9696174 12260801 11692208 10221770 7632758 5946783
$$ packed form
3368A2597559j84685J95394N599j069104J78275J031734J122111o3725J03368
3359A3916526r33605j424821j666869r08212l53591r75839k088999K734907L436983
3350A1736480j815485j227199J710470j197182J48788q10853j58320K472133q22733
3341A0036099J502647m23825k71773J588073j428895q24245p26732Q82708j397203
3332H936854J665761R7507J43018j409267r79608J547383j022730q82326M053021
3323A2149613j115054j017141K576369N65273k005783k246196L200425j374817
3315A0732689P9502j186103J493781l580264l676506K783589J903960O22296o69256
3306H503688K14303k435662N63631K850214K564627n68593j470438k589012j685975
$$ plain form
3297 5946783 6533059 9681813 11803880 11981530 11014883 6024635 5512731 7105187 9481656
3288 9481656 9741162 9316621 7573381 4958717 4122603 8490043 9440655 9710289 9450710
3279 9450710 9622315 8294851 7169054 9498574 11568783 9286189 6732678 10265231
3271 10265231 10446890 9370802 10609247 9764410 9853363 8495651 8777293 10546266 8578624
3262 8578624 7249199 9896058 9821451 9537155 8374606 8774263 7391852 7738049 9267968
3253 9267968 12261166 12259760 9656081 9322532 7391128 9928596 10028387 9538204 11161456
3244 11161456 8498189 8340266 8894681 9505859 6680752 7098248 9228345 11158546 10530480
3235 10530480 8281689 9450487 9534737 8411383 9724637 12597494 10786532 9099263
$$ packed form
3297E946783N86276L148754K122067J77650r66647m990248n11904J592456K376469
3288I481656K59506m24541j743240k614664q36114M367440R50612K69634k59579
3279I450710J71605j327464j125797K329520K070209k282594k553511L532553
3271A0265231J81659j076088J238445q44837Q8953j357712K81642J768973j967642
3262H578624j329425K646859p4607k84296j162549L99657j382411L46197J529919
3253I267968K993198j406k603679l33549j931404K537468R9791m90183J623252
3244A1161456k663267j57923N54415O11178k825107M17496K130097J930201o28066
3235A0530480k248791J168798Q4250j123354J313254K872857j810962j687269
$$ plain form
3227 9099263 10257678 14614751 12727783 11473817 11601737 11348839 9678856 8500779 11484892
3218 11484892 12917134 11311382 10837116 11573823 8424179 5393265 8255623 9673433
3210 9673433 8971286 9072265 10461797 9126820 5719961 5888239 9710941 10016490 9264097
3201 9264097 7574978 7739785 7499556 10354425 11950822 12741475 11018498 9278467 10140769
3192 10140769 12259011 11427040 11338494 8756225 8353924 9627491 7340523 10233652 10839669
3183 10839669 8889895 9323086 8948244 7170130 6756500 8881593 10426391 8811069 7034236
3174 7034236 11196927 12082528 10426747 9891703 10261718 10654140 7805997 7550514 9955902
3165 9955902 9474605 10568035 13222083 9331879 7981750 5012633 6220904 7549580
$$ packed form
3227I099263J158415M357073j886968j253966J27920k52898j669983j178077K984113
3218A1484892J432242j605752m74266P36707l149644l030914K862358J417810
3210I673433p02147J00979J389532j334977l406859J68278L822702L05549p52393
3201I264097j689119J64807k40229K854869J596397P90653j722977j740031Q62302
3192A0140769K118242q31971q8546k582269m02301J273567k286968K893129O06017
3183A0839669j949774M33191l74842j778114m13630K125093J544798j615322j776833
3174G034236M162691Q85601j655781n35044L70015L92422k848143k55483K405388
3165I955902m81297J093430K654048l890204j350129k969117J208271J328676
$$ plain form
3157 7549580 5312644 6421019 7268467 7755439 8445671 7813996 8497878 7555992 6479161
3148 6479161 8380961 7525566 5184591 5986478 3430736 3163143 4301324 5190950 5155261
3139 5155261 4761750 4431075 6755859 5760783 7157141 8832219 5681373 5886354 4078609
3130 4078609 5479082 7267519 6553003 9545844 6715249 6009361 6846639 4450723 3000836
3121 3000836 4189268 5807457 5565010 5378483 4772362 3910836 2159627 3668119 6591135
3112 6591135 4453758 4259473 5152170 5867351 8696088 6486161 5361565 5466385 3581710
3103 3581710 5863364 7516650 8677245 9412290 5780561 4736351 5026025 4024707 4009594
3094 4009594 5988615 3827256 3265735 2392773 6107389 6576073 2386893 2280371 2646659
$$ packed form
3157G549580k236936J108375Q47448M86972O90232o31675O83882r41886j076831
3148F479161J901800q55395k340975Q01887k555742k67593J138181Q89626l5689
3139E155261l93511l30675K324784r95076J396358J675078l150846K04981j807745
3130D078609J400473J788437p14516K992841k830595p05888Q37278k395916j449887
3121C000836J188432J618189k42447j86527o06121q61526j751209J508492K923016
3112F591135k137377j94285Q92697P15181K828737k209927j124596J04820j884675
3103C581710K281654J653286J160595P35045l631729j044210K89674j001318j5113
3094D009594J979021k161359n61521q72962L714616M68684m189180j06522L66288
$$ plain form
3085 2646659 1349660 2860293 2655280 1748105 1303807 1193749 6660351 4995419 3458204
3076 3458204 7436783 5642104 3349955 1366051 4158102 6188620 4595511 5987707
3068 5987707 6129290 3416964 4161848 7187769 6763594 4787874 4840203 6151187 5958986
3059 5958986 4136561 7561898 7701457 3798894 4465134 2763456 5893370 7899407 8375122
3050 8375122 8191072 3664916 2470026 3515333 2945486 6008998 6031033 2672361 2914861
3041 2914861 2394951 1789597 2857008 4729875 5386986 2684453 -546333 -1023161 -597681
3032 -597681 617098 3601105 5644162 6102407 6482012 7211585 5626359 4946811 8151243
3023 8151243 9964748 7519302 8046275 7699569 5065185 3156905 2805688 5731776 6323697
$$ packed form
3085B646659j296999J510633k05013r07175m44298j10058N466602j664932j537215
3076C458204L978579j794679k292149j983904K792051K030518j593109J392196
3068E987707J41583k712326P44884L025921m24175j975720N2329J310984j92201
3059E958986j822425L425337J39559l902563O66240j701678L129914K006037M75715
3050H375122j84050m526156j194890J045307n69847L063512K2035l358672K42500
3041B914861n19910o05354J067411J872867O57111k702533l230786m76828M25480
3032e97681J214779K984007K043057M58245L79605P29573j585226o79548L204432
3023H151243J813505k445446N26973l46706k634384j908280l51217K926088N91921
$$ plain form
3014 6323697 7218889 7823147 4276582 1027633 771618 3130842 3894796 4731929 4291311
3005 4291311 4134842 3877970 2679715 4355606 5547279 3779542 4111929 4815054 3741485
2996 3741485 2792518 2856505 4183454 4446022 3810346 5973660 5074742 1990217 661540
2987 661540 3210240 3756857 3684965 6207832 5367954 4582232 2809689 2122861 2636000
2978 2636000 1133392 2182727 3546055 3429334 4889884 4057946 4042970 3277296 3126763
2969 3126763 3513251 4722790 3365506 1902617 3080461 4890306 3957752 -1127388 -913175
2960 -913175 2002545 2340369 5026490 5377129 3048397 2784317 3388027 4379919 3123696
2951 3123696 1825011 4009629 2431690 2961028 6765640 3534027 3654796 5022201 4199261
$$ packed form
3014F323697Q95192O04258l546565l248949k56015K359224P63954Q37133m40618
3005D291311j56469k56872j198255J675891J191673j767737L32387P03125j073569
2996C741485r48967O3987J326949K62568o35676K163314q98918l084525j328677
2987F61540K548700N46617p1892K522867q39878p85722j772543o86828N13139
2978B636000j502608J049335J363328j16721J460550q31938j4976p65674j50533
2969C126763L86488J209539j357284j462889J177844J809845r32554n085140K14213
2960i13175K915720L37824K686121L50639k328732k64080O03710R91892j256223
2951C123696j298685K184618j577939N29338L804612l231613J20769J367405q22940
$$ plain form
2942 4199261 5316119 4955260 5885259 3633048 1509912 3508184 4246704 1134666 549975
2933 549975 2394242 328107 1947896 3932512 2255657 -1470706 -2217561 692428 2415858
2924 2415858 3437555 4099982 2330178 699134 1743199 2800015 2373197 2358486 4563481
2915 4563481 4453732 6451361 5318028 3814868 4801647 4491027 5862357 5414512 4701702
2906 4701702 4266360 827086 -408566 3135696 2428084 2520995 2949623 4080312 2987286
2897 2987286 424783 2822527 2628160 2131393 1836732 1331728 583983 2617850 2146354
2888 2146354 2607797 3686855 2902520 3178053 2867745 2253921 4596474 5631253 6813093
2879 6813093 5822375 926962 3521274 4482241 3628741 3080332 4920247 4875651 4981540
$$ packed form
2942D199261J116858l60859R29999k252211k123136J998272P38520l112038n84691
2933E49975J844267k066135J619789J984616j676855l726363p46855K909989J723430
2924B415858J021697O62427j769804j631044J044065J056816m26818j4711K204995
2915D563481j09749J997629j133333j503160R86779l10620J371330m47845p12810
2906D701702m35342l439274j235652L544262p07612R2911M28628J130689j093026
2897B987286k562503K397744j94367m96767k94661n05004p47745K033867m71496
2888B146354M61443J079058p84335K75533l10308o13824K342553J034779J181840
2879F813093r90718m895413K594312R60967q53500n48409J839915m4596J05889
$$ plain form
2870 4981540 5493059 4292554 3327552 3689908 8056636 8765821 6331714 4046244 3696783
2861 3696783 -487767 2787689 6696493 6600065 6394927 5630846 3278189 2574668 2241203
2852 2241203 5425957 5045971 -134324 1784172 1928138 3329646 5241020 6491752 3633171
2843 3633171 3164445 4492996 5762120 4516318 5938724 9529714 6229284 3909607
2835 3909607 5127018 5477060 5326980 5922033 5247548 3412869 1811339 3995961 6222026
2826 6222026 4366640 4914779 2203068 17690 -1837118 -800719 1015815 3123516
2818 3123516 3101319 2972662 3565725 3530520 2056515 4569612 5935478 7675139 7436167
2809 7436167 7590363 7663461 2868756 4508819 8211851 5611398 4128655 4705740 4890072
$$ packed form
2870D981540N11519j200505r65002L62356M366728P09185k434107k285470l49461
2861C696783m184550L275456L908804r6428k05138p64081k352657p03521l33465
2852B241203L184754l79986n180295J918496J43966J401508J911374J250732k858581
2843C633171m68726J328551J269124j245802J422406L590990l300430k319677
2835C909607J217411L50042j50080N95053o74485j834679j601530K184622K226065
2826F222026j855386N48139k711711k185378j854808J036399J816534K107701
2818C123516k2197j28657N93063l5205j474005K513097J365866J739661k38972
2809G436167J54196P3098m794705J640063L703032k600453j482743N77085J84332
$$ plain form
2800 4890072 6178782 6054100 7902304 4984343 1736674 2187871 2789685 1869794 5615045
2791 5615045 8575322 6333728 4381571 1647914 3483875 3575962 1501331 4654235 4883081
2782 4883081 5082808 6723185 3068509 2509319 4040096 5047810 6278650 4922560 4882933
2773 4882933 5096203 3092257 3439760 4214799 4152852 4162155 3543967 4330188 2316363 5499354
2763 5499354 6697087 7735854 7477451 7973463 5844820 5879864 7696368 8540623 9293843
2754 9293843 9765548 9612514 7660279 5168008 7076654 9276896 10355332 12259870 10000222
2745 10000222 8384804 5908322 6005272 7563924 8402215 12751046 12479701 11674096 8823220
2736 8823220 8613806 11420581 11587620 12906271 15119073 15416815 14564202 12878875 14108793
$$ packed form
2800D890072J288710j24682J848204k917961l247669M51197O01814r19891L745251
2791E615045K960277k241594j952157k733657J835961R2087k074631L152904K28846
2782D883081J99727J640377l654676n59190J530777J007714J230840j356090l9627
2773D882933K13270k003946L47503P75039o1947R303o18188P86221k013825L182991
2763E499354J197733J038767k58403M96012k128643L5044J816504Q44255P53220
2754I293843M71705j53034j952235k492271J908646K200242J078436J904538k259648
2745A0000222j615418k476482R6950J558652Q38291M348831k71345q05605k850876
2736H823220k09414K806775J67039J318651K212802K97742q52613j685327J229918
$$ plain form
2727 14108793 15340425 17635914 19256047 21058960 19997512 21081429 25599117 27898769
2719 27898769 29564767 33613159 42121306 48029861 55854608 66263131 85929214 109744114
2711 109744114 136426756 159371034 173070235 170818901 156770574 137976701 118234112
2704 118234112 97540908 81415941 70926770 62634999 55987147 53257190 55368991 52775354
2696 52775354 47730149 42560402 41190877 37200958 31734122 31371485 28116307 27494839
2688 27494839 26572045 26766642 22957586 17740700 16596253 19631788 19034284 20058134 20951300
2679 20951300 20253203 16721097 14224832 16331142 17196184 18930765 22194356 21455594 19369624
2670 19369624 18451103 16992241 15926343 16302210 18788775 21801678 24109723 27416377
$$ packed form
2727A4108793J231632K295489J620133J802913j061448J083917M517688K299652
2719B7898769J665998M048392Q508147N908555P824747J0408523J9666083K3814900
2711A09744114K6682642K2944278J3699201k251334j4048327j8793873j9742589
2704A18234112k0693204j6124967j0489171q291771o647852k729957K111801k593637
2696E2775354n045205n169747j369525l989919n466836l62637l255178o21468
2688B7494839r22794J94597l809056n216886j144447L035535n97504J023850Q93166
2679B0951300o98097l532106k496265K106310Q65042J734581L263591p38762k085970
2670A9369624r18521j458862j065898L75867K486565L012903K308045L306654
$$ plain form
2662 27416377 31748012 33240891 39242528 42201506 42035847 42758476 41716960 38022650
2654 38022650 35071299 36061307 36131420 33794358 32705921 34254642 36068125 38766170 41722883
2645 41722883 46594828 51439567 56079433 67064593 81147377 98236400 122089851 142554279
2637 142554279 160906806 169554017 164956246 159697909 141685768 119392368 100070973
2630 100070973 83182795 68913181 61135668 54652768 48009319 43566919 39778785 36205270
2622 36205270 33724857 29725175 26894315 24368743 21427639 21427923 20926144 22597562 22952341
2613 22952341 24217869 19540338 19395159 23075673 22194790 24489558 22881434 20960331
2605 20960331 20902716 20370115 20676983 21775650 17450859 17916271 18179640 15780174 15228894
$$ packed form
2662B7416377M331635J492879O001637K958978j65659P22629j041516l694310
2654C8022650k951351R90008P0113k337062j088437J548721J813483K698045K956713
2645D1722883M871945M844739M639866J0985160J4082784J7089023K3853451K0464428
2637A42554279J8352527Q647211m597771n258337j8012141k2293400j9321395
2630A00070973j6888178j4269614p777513o482900o643449m442400l788134l573515
2622C6205270k480413l999682k830860k525572k941104K84n01779J671418L54779
2613B2952341J265528m677531j45179L680514q80883K294768j608124j921103
2605B0960331n7615n32601L06868J098667m324791M65412K63369k399466n51280
$$ plain form
2596 15228894 17347907 15121575 13304335 13613339 13259627 15444236 13566064 13577415 15183223
2587 15183223 13749116 13319967 14899926 11835015 9306784 10718412 12929198 13970827
2579 13970827 14552812 14978704 16446253 18567895 16888847 17915183 20948356 21282443 20721346
2570 20721346 22597415 24756193 27119530 24820402 22285219 22864789 19362695 19687150
2562 19687150 22077649 20304241 17704860 18851520 19631599 18304652 16701177 17506441
2554 17506441 21638283 20969732 20706076 23146404 22495300 20778180 20741435 25095780 23419948
2545 23419948 17198531 16590794 14930473 13411221 11863367 12392047 18479736 15506681
2537 15506681 12298004 13597725 10315461 9114257 12586820 13124089 14592712 14497595 11839989
$$ packed form
2596A5228894K119013k226332j817240L09004l53712K184609j878172J1351J605808
2587A5183223j434107m29149J579959l064911k528231J411628K210786J041629
2579A3970827N81985M25892J467549K121642j679048J026336L033173L34087n61097
2570B0721346J876069K158778K363337k299128k535183N79570l502094L24455
2562A9687150K390499j773408k599381J146660P80079j326947j603475Q05264
2554A7506441M131842o68551k63656K440328o51104j717120l6745M354345j675832
2545B3419948o221417o07737j660321j519252j547854N28680O087689k973055
2537A5506681l208677J299721l282264j201204L472563N37269J468623r5117k657606
$$ plain form
2528 11839989 12729536 11417840 11205801 15768211 14397556 13140246 12447137 11728614 12487480
2519 12487480 13605374 13101542 13614209 12490805 11336422 9530638 10957097 12424628
2511 12424628 11540277 10945961 13534135 14774501 12129038 10824037 12962956 14222697
2503 14222697 11443152 14528942 14684327 11267577 10055696 12995433 12607977 8366107
2495 8366107 9446815 11073258 10842431 9457643 10403123 10901537 7430812 7174515 11002434
2486 11002434 6840440 8293710 11222885 10969812 12139245 10099182 9806184 10480775 10042689
2477 10042689 6386458 7424488 8184133 10818838 10662161 10085404 11103190 8890639 6685894
2468 6685894 7423733 7880250 8849841 11532817 12011003 9898382 8161950 9913875 11663841
$$ packed form
2528A1839989Q89547j311696k12039M562410j370655j257310o93109p18523P58866
2519A2487480J117894n03832N12667j123404j154383j805784J426459J467531
2511A2424628q84351n94316K588174J240366k645463j305001K138919J259741
2503A4222697k779545L085790J55385l416750j211881K939737l87456m241870
2495H366107J080708J626443k30827j384788R45480M98414l470725k56297L827919
2486A1002434m161994J453270K929175k53073J169433k040063k92998O74591m38086
2477A0042689l656231J038030P59645K634705j56677n76757J017786k212551k204745
2468F685894P37839M56517R69591K682976M78186k112621j736432J751925J749966
$$ plain form
2459 11663841 12136629 13286576 13394572 13278983 12569693 12327882 11720875 10584398 9971118
2450 9971118 11682035 12062499 11799625 8487720 8486139 11377504 12633862 14062435 12890708
2441 12890708 13131950 10631137 8647444 11556303 11773932 14428366 15316860 14303442 12744008
2432 12744008 11577630 11823065 13035898 12207101 11487453 13652321 13655334 10250236 12021692
2423 12021692 13684635 13880818 11728972 9622056 12431224 11771171 11743632 13658389 15359663
2414 15359663 12483920 12553726 14721084 16752501 16881302 17227178 16720890 16472529 17436097
2405 17436097 20091884 24385874 24700602 26496676 26843204 27190228 24950875 23162396 23152226
2396 23152226 21539766 20024459 19643259 19351835 19103008 17755754 15717406 16612033 13636221
$$ packed form
2459A1663841M72788J149947J07996j15589p09290k41811o07007j136477o13280
2450I971118J710917L80464k62874l311905j581K891365J256358J428573j171727
2441A2890708K41242k500813j983693K908859K17629K654434Q88494j013418j559434
2432A2744008j166378K45435J212833q28797p19648K164868L013l405098J771456
2423A2021692J662943J96183k151846k106916K809168o60053k7539J914757J701274
2414A5359663k875743O9806K167358K031417J28801L45876n06288k48361R63568
2405A7436097K655787M293990L14728J796074L46528L47024k239353j788479j0170
2396B3152226j612460j515307l81200k91424k48827j347254k038348Q94627k975812
$$ plain form
2387 13636221 13252967 13830449 16541255 16778537 13244077 11868388 12347403 12556343 13761808
2378 13761808 18737947 19274023 15639541 15246354 14617208 15097913 18174406 19724365 19902939
2369 19902939 18555242 20651988 26499118 31894665 36714179 41082917 45186203 45795529
2361 45795529 47482788 46614298 47027764 45065955 37818843 32251405 30885266 28583310
2353 28583310 27616165 27207160 26562062 23646820 20133045 24040739 23377990 22735915 21842136
2344 21842136 21694156 21895958 21783091 23567785 24093395 21914864 21601752 24356177 21413209
2335 21413209 19854704 22608658 25377177 25212570 23670094 23718472 26788116 26695787 28984537
2326 28984537 35690496 37804105 38306281 36181209 34379380 34028137 35723329 33554433
$$ packed form
2387A3636221l83254N77482K710806K37282l534460j375689M79015K08940J205465
2378A3761808M976139N36076l634482l93187o29146M80705L076493J549959J78574
2369A9902939j347697K096746N847130N395547M819514M368738M103286O09326
2361D5795529J687259q68490M13466j961809p247112n567438j366139k301956
2353B8583310r67145m09005o45098k915242l513775L907694o62749o42075q93779
2344B1842136j47980K01802j12867J784694N25610k178531l13112K754425k942968
2335B1413209j558505K753954K768519j64607j542476M8378L069644r2329K288750
2326B8984537O705959K113609N02176k125072j801829l51243J695192k168896
$$ plain form
2318 33554433 30812754 27702980 25724636 26616289 25757691 25525886 23442882 24309913 28950647
2309 28950647 32729301 35171361 40380406 42572307 38653877 34720821 34722841 32875495 29812590
2300 29812590 28884576 30506991 24080429 17778866 18186538 19171054 18885836 16189874 17955516
2291 17955516 17184057 12966930 13733758 15520578 14223366 12963639 11501621 13308894
2283 13308894 12754841 13758659 19692420 21386775 14936631 13428300 18493239 20260839
2275 20260839 20066998 19268110 20866924 19889286 18913317 24153759 26425949 26946325 27166230
2266 27166230 25958490 24564380 22485693 22897255 21985029 20407552 17816666 14086397
2258 14086397 10553824 9139999 9277925 10158329 11639298 10367443 8275164 6576969
$$ packed form
2318C3554433k741679l109774j978344Q91653q58598k31805k083004Q67031M640734
2309B8950647L778654K442060N209045K191901l918430l933056K020j847346l062905
2300B9812590r28014J622415o426562o301563M07672R84516k85218k695962J765642
2291A7955516p71459m217127P66828J786820j297212j259727j462018J807273
2283A3308894n54053J003818N933761J694355o450144j508331N064939J767600
2275B0260839j93841p98888J598814r77638r75969N240442K272190N20376K19905
2266B7166230j207740j394110k078687M11562r12226j577477k590886l730269
2258A4086397l532573j413825J37926Q80404J480969j271855k092279j698195
$$ plain form
2250 6576969 7502047 9379868 7718805 5048965 7697386 6432136 4943909 9735353
2242 9735353 13267339 12385652 9717628 8759015 9071808 9621347 10919777 12863099 10244678
2233 10244678 7021267 8107384 6190388 6176988 7435480 8222805 8372952 6723454 6652091
2224 6652091 8868235 8883995 9635984 7090790 5201784 5199007 3947223 6177482 9944550
2215 9944550 7486469 6184847 6241476 8280424 9205301 6592654 3706007 2756941 2203559
2206 2203559 6073191 7435148 6648588 7371141 3388124 3192868 5004214 5283565 5926016
2197 5926016 5351115 5413253 2600644 2416662 5391825 5309686 3373664 5513581 7413513
2188 7413513 5189830 4989518 6065477 7022600 3033584 4759196 4802260 2768696 4875618
$$ packed form
2250F576969R25078J877821j661063k669840K648421j265250j488227M791444
2242I735353L531986q81687k668024r58613L12793N49539J298430J943322k618421
2233A0244678l223411J086117j916996j3400J258492P87325J50147j649498p1363
2224F652091K216144J5760P51989k545194j889006k777j251784K230259L767068
2215I944550k458081j301622N6629K038948R24877k612647k886647r49066n53382
2206B203559L869632J361957p86560P22553l983017j95256J811346K79351O42451
2197E926016n74901O2138k812609j83982K975163q2139j936022K139917J899932
2188G413513k223683k00312J075959R57123l989016J725612M3064k033564K106922
$$ plain form
2179 4875618 7811009 8958556 7815031 6302212 6068214 4974414 5814118 7803937 7446320
2170 7446320 6837865 6469445 4117572 4164661 5741991 7877648 7893646 7443812 5392875
2161 5392875 4985740 1651177 4646461 6122656 7787078 9977398 9067177 6833017 3056327
2152 3056327 4082422 5056339 4811755 6955526 7914833 8379710 5792552 3000436 2903434
2143 2903434 2865218 3529856 3747816 7057832 6827052 3402089 4187847 5011882 6072071
2134 6072071 4904552 6387832 6742573 4624716 4571840 6090049 5671887 5286613 6236850
2125 6236850 6973158 5275878 6577683 8627970 9605681 8372768 7081453 9343616 8212910
2116 8212910 9858298 9669935 9322879 9767520 5186486 5510835 8643752 9088452 9315419
$$ packed form
2179D875618K935391J147547j143525j512819k33998j093800Q39704J989819l57617
2170G446320o08455l68420k351873M7089J577330K135657J5998m49834k050937
2161E392875m07135l334563K995284J476195J664422K190320r10221k234160l776690
2152C056327J026095R73917k44584K143771R59307M64877k587158k792116r7002
2143B903434l8216O64638K17960L310016k30780l424963P85758Q24035J060189
2134F072071j167519J483280L54741k117857n2876J518209m18162l85274R50237
2125F236850P36308j697280J301805K050287R77711j232913j291315K262163j130706
2116H212910J645388j88363l47056M44641m581034L24349L132917M44700K26967
$$ plain form
2107 9315419 8931394 8639288 8011361 7943513 7850775 8129766 8202687 10715610 10920480 10260776
2097 10260776 11405624 11447068 9020002 10525977 11677629 14625808 15681539 15136265 13689205
2088 13689205 11393980 12691080 15883259 12263247 10525980 11452666 12789859 10874639
2080 10874639 12748738 15406085 13928970 12332600 13822258 13143746 11154614 10007370
2072 10007370 13103501 15048275 14281598 13557544 12551902 11493952 11339988 11655672 11683013
2063 11683013 10999251 10930381 8705516 8593207 7869565 6831510 8175043 8583395 9490058
2054 9490058 8832151 13465308 14329357 12204856 10224267 14103528 14596068 12979428 13839434
2045 13839434 14992629 14512586 15647996 19445453 19617213 18591111 19205658 21477023 22940770
$$ packed form
2107I315419l84025k92106o27927o7848r2738K78991P2921K512923K04870o59704
2097A0260776J144848M1444k427066J505975J151652K948179J055731n45274j447060
2088A3689205k295225J297100L192179l620012j737267R26686J337193j915220
2080A0874639J874099K657347j477115j596370J489658o78512j989132j147244
2072A0007370L096131J944774p66677p24054j005642j057950j53964L15684K7341
2063A1683013o83762o8870k224865j12309p23642j038055J343533M08352R06663
2054I490058o57907M633157Q64049k124501j980589L879261M92540j616640Q60006
2045A3839434J153195m80043J135410L797457J71760j026102O14547K271365J463747
$$ plain form
2036 22940770 23861215 24256231 24713107 24504795 24975507 26099238 24947948 22715493 22807277
2027 22807277 22260736 22271721 19640619 17081890 17863123 17088914 15305176 16339927 16669896
2018 16669896 15573507 15399598 17549970 22022127 26072881 29719008 29004900 26249995
2010 26249995 23838528 24562704 22806198 21852729 20733964 18366747 19960519 21741593
2002 21741593 22384875 21487955 21848675 22463121 22002026 24086455 24915629 26428272 25836991
1993 25836991 25398985 23871364 22293767 22744302 25202900 25710677 25414282 27082020 27361590
1984 27361590 22639407 20684854 19242426 19663274 20234076 19569426 16230510 14301902 17042602
1975 17042602 19270360 19736539 19023094 19640097 21679529 22817369 25534583 28606061 28705940
$$ packed form
2036B2940770R20445L95016M56876k08312M70712J123731j151290k232455R1784
2027B2807277n46541J0985k631102k558729P81233p74209j783738J034751L29969
2018A6669896j096389j73909K150372M472157M050754L646127p14108k754905
2010B6249995k411467P24176j756506r53469j118765k367217J593772J781074
2002B1741593O43282q96920L60720O14446m61095K084429Q29174J512643n91281
1993B5836991m38006j527621j577597M50535K458598N07777k96395J667738K79570
1984B7361590m722183j954553j442428M20848N70802o64650l338916j928608K740700
1975A7042602K227758M66179p13445O17003K039432J137840K717214L071478R9879
$$ plain form
1966 28705940 31590782 32206303 33345619 35939920 39886746 39373559 37944211 39471788
1958 39471788 42131150 41921421 43254605 45453493 45650139 46249679 48149290 44726098 40092160
1949 40092160 38267516 37210359 34080198 29275563 26983239 23198281 23970463 26248623
1941 26248623 28868839 29015471 29400438 31016126 33436278 34983151 37370933 39051287
1933 39051287 35569052 34521404 33600274 30952795 32414090 30813196 26370073 23482891
1925 23482891 21186199 22294677 22785662 22029263 22053036 22734132 25547912 25220370 23449618
1916 23449618 24986185 24862949 23420062 24360349 24673923 25114395 26533383 27657895 29077923
1907 29077923 24493645 23939739 26114017 26310077 29550858 34407919 38016120 38540312 35626242
$$ packed form
1966B8705940K884842O15521J139316K594301L946826n13187j429348J527577
1958C9471788K659362k09729J333184K198888J96646N99540J899611l423192m633938
1949D0092160j824644j057157l130161m804635k292324l784958P72182K278160
1941B6248623K620216J46632L84967J615688K420152J546873K387782J680354
1933C9051287l482235j047648r21130k647479J461295j600894m443123k887182
1925B3482891k296692J108478M90985p56399K3773O81096K813780l27542j770752
1916B3449618J536567j23236j442887R40287L13574M40472J418988J124512J420028
1907B9077923m584278n53906K174278J96060L240781M857061L608201N24192k914070
$$ plain form
1898 35626242 36957371 37720605 33821233 32011284 29039112 23029227 22321930 21531373 20109034
1889 20109034 19299323 16346923 19240751 19481825 16312005 14402923 14323029 14680341 13454702
1880 13454702 14961774 15536668 14283878 13114865 12089962 11944814 12909588 14840646 15569182
1871 15569182 16339474 16781695 18221493 19469524 19176455 17074253 17516051 20264264 22697510
1862 22697510 23939584 25245477 27180967 31633295 37212011 41150898 43768805 43723718
1854 43723718 45892022 46182527 45237978 42095210 42482100 44759846 46355406 46747036 47808723
1845 47808723 48639611 46224084 44917748 43978567 44173113 45878816 45172390 45175168 42275521
1836 42275521 41700185 43173890 43870173 42703529 42133224 44429340 42541774 38674860 35915345
$$ packed form
1898C5626242J331129P63234l899372j809949k972172o009885p07297p90557j422339
1889B0109034q09711k952400K893828K41074l169820j909082p9894L57312j225639
1880A3454702J507072N74894j252790j169013j024903j45148R64774J931058P28536
1871A5569182P70292M42221J439798J248031k93069k102202M41798K748213K433246
1862B2697510J242074J305893J935490M452328N578716L938887K617907m5087
1854D3723718K168304K90505r44549l142768L86890K277746J595560L91630J061687
1845D7808723Q30888k415527j306336r39181J94546J705703p06426K778k899647
1836D2275521n75336J473705O96283j166644n70305K296116j887566l866914k759515
$$ plain form
1827 35915345 31518544 32431089 34478410 32967409 31249041 28741533 26453353 24900031
1819 24900031 23078741 21573554 21228141 21472214 22934073 21523150 20806820 21397189 19026916
1810 19026916 15637553 16258347 16319489 16927109 15021756 15706357 17985586 15734558 16357772
1801 16357772 16967834 15188851 13858857 13237893 13539425 11523148 10696557 11930064 11191199
1792 11191199 10994743 12725539 10749907 11400699 9125011 11417863 13967956 15024978
1784 15024978 14603993 16480148 16431978 16138479 18267414 17352661 19116249 20271879 22333476
1775 22333476 22192289 21371276 20027666 17904166 17828909 18383547 19088654 19194456 16852720
1766 16852720 15431057 16678727 18095889 18132873 18183958 17722569 18529361 20376135 20616523
$$ packed form
1827C5915345m396801R12545K047321j511001j718368k507508k288180j553322
1819B4900031j821290j505187l45413K44073J461859j410923p16330N90369k370273
1810A9026916l389363O20794O1142O07620j905353O84601K279229k251028O23214
1801A6357772O10062j778983j329994o20964L01532k016277q26591J233507p38865
1792A1191199j96456J730796j975632O50792k275688K292852K550093J057022
1784A5024978m20985J876155m8170k93499K128935r14753J763588J155630K061597
1775B2333476j41187q21013j343610k123500p5257N54638P05107J05802k341736
1766A6852720j421663J247670J417162L6984N1085m61389Q06792J846774K40388
$$ plain form
1757 20616523 20289565 18344475 17460606 16241993 15119582 17207759 19266808 18041508
1749 18041508 17425465 19953318 19629735 18958299 19757194 21479955 23721194 24596252 25195887
1740 25195887 24469518 20689508 22762490 27485652 25855960 26119922 26026252 24794546 23830808
1731 23830808 25516187 28162444 29146154 30362359 28528294 27464650 29153186 31744996
1723 31744996 29806136 30578416 29577811 30746403 31127820 31509559 33929171 36168199 37248625
1714 37248625 41757365 43231305 44581053 50549420 54422225 60931644 66381178 67740207
1706 67740207 68416422 67503333 69282833 72341158 74057023 72944188 73128134 72449242 71646053
1697 71646053 67997557 66449265 65024734 61733679 61004689 61684722 63448762 60699164
$$ packed form
1757B0616523l26958j945090q83869j218613j122411K088177K059049j225300
1749A8041508o16043K527853l23583o71436P98895J722761K241239Q75058N99635
1740B5195887p26369l780010K072982M723162j629692K63962r3670j231706r63738
1731B3830808J685379K646257R83710J216205j834065j063644J688536K591810
1723C1744996j938860P72280j000605J168592L81417L81739K419612K239028J080426
1714C7248625M508740J473940J349748N968367L872805O509419N449534J359029
1706F7740207O76215r13089J779500L058325J715865j112835J83946o78892q03189
1697G1646053l648496j548292j424531l291055p28990O80033J764040k749598
$$ plain form
1689 60699164 60616462 63508799 65889069 69353812 73541915 73017249 73791288 78199617 85858980
1680 85858980 92679201 99375880 106541633 114209849 116725944 118064200 121916067 124294509
1672 124294509 127864141 133149399 135101112 132683352 124227728 113506126 101437960 93076816
1664 93076816 86854306 81437096 75630330 70591692 66676767 65219487 63350669 63581213
1656 63581213 61608768 62617523 66319997 70032592 74071796 76041335 74760555 69486838
1648 69486838 63604648 59525045 58007762 55245739 54595586 54354534 50675621 47434972
1640 47434972 48518750 46847240 46604516 47308954 49623654 54218036 52531300 52189151 53219510
1631 53219510 54906664 55610786 54943992 57009502 56988984 56626632 56668280 59035961 59775894
$$ packed form
1689F0699164q2702K892337K380270L464743M188103n24666P74039M408329P659363
1680H5858980O820221O696679P165753P668216K516095J338256L851867K378442
1672A24294509L569632N285258J951713k417760q455624j0721602j2068166q361144
1664I3076816o222510n417210n806766n038638l914925j457280j868818K30544
1656F3581213j972445J008755L702474L712595M039204J969539j280780n273717
1648F9486838n882190m079603j517283k762023o50153k41052l678913l240649
1640D7434972J083778j671510k42724P04438K314700M594382j686736l42149J030359
1631E3219510J687154P04122o66794K065510k0518l62352M1648K367681P39933
$$ plain form
1622 59775894 63688456 69911703 72788947 71872658 70489813 71644086 69555589 67633789
1614 67633789 67417643 64321759 61203352 56742477 53157644 51553555 51496615 53665473 56214879
1605 56214879 56471928 55956205 55769904 54563265 54027387 50911669 48098171 49522392 50864600
1596 50864600 50389594 53596126 55372744 55746636 55365589 54265405 52833127 50826222 49199230
1587 49199230 50578808 54046355 53642452 55463304 56646402 55214610 53536118 54379965
1579 54379965 58477180 63919126 64441209 68236745 70755941 71855566 72855411 74877413
1571 74877413 74911833 73549073 72954848 71419363 67290644 64497851 63518005 61711514 60643090
1562 60643090 61599686 62674378 61606354 61940735 63165824 64937354 66063554 66043278 63582834
$$ packed form
1622E9775894L912562O223247K877244r16289j382845J154273k088497j921800
1614F7633789k16146l095884l118407m460875l584833j604089n6940K168858K549406
1605E6214879K57049n15723j86301j206639n35878l115718k813498J424221J342208
1596E0864600m75006L206532J776618L73892l81047j100184j432278k006905j626992
1587D9199230J379578L467547m03903J820852J183098j431792j678492Q43847
1579E4379965M097215N441946N22083L795536K519196J099625R99845K022002
1571G4877413L4420j362760n94225j535485m128719k792793r79846j806491j068424
1562F0643090R56596J074692j068024L34381J225089J771530J126200k0276k460444
$$ plain form
1553 63582834 60565153 63050888 62775291 64048604 62757825 60224988 60570029 61487238 64013562
1544 64013562 66371012 68678549 67343446 65200614 61833974 62645241 65392386 68121545
1536 68121545 70783363 72385432 70657084 69487143 69571123 68984090 72105467 78096618 80480618
1527 80480618 81367793 81894838 83928444 89586932 91650275 93309390 95544956 94443015
1519 94443015 93392652 93129917 90882644 87424987 87807154 86331274 87952265 88774334 90474850
1510 90474850 94755083 94042352 96781967 96584665 94051365 92880548 91686354 92308958 93175679
1501 93175679 95910226 97971946 98159903 99583343 98244075 96694873 97099332 94208249
1493 94208249 91330853 88089991 88387007 87486590 87119221 86373013 88981833 87965470 86985318
$$ packed form
1553F3582834l017681K485735k75597J273313j290779k532837L45041R17209K526324
1544F4013562K357450K307537j335103k142832l366640Q11267K747145K729159
1536F8121545K661818J602069j728348j169941Q3980n87033L121377N991151K384000
1527H0480618Q87175N27045K033606N658488K063343J659115K235566j101941
1519I4443015j050363k62735k247273l457657L82167j475880J620991Q22069J700516
1510I0474850M280233p12731K739615j97302k533300j170817j194194O22604Q66721
1501I3175679K734547K061720J87957J423440j339268j549202M04459k891083
1493I4208249k877396l240862K97016r00417l67369p46208K608820j016363r80152
$$ plain form
1484 86985318 87732523 85262886 84082505 87445848 81395787 76874696 75000077 70732693
1476 70732693 68903276 66436126 66328870 67165948 67593614 68231479 64801796 65014812 64271865
1467 64271865 64833741 67581191 72143151 76534591 80451110 81928282 85678042 87805590
1459 87805590 90702923 95799515 97787470 99017435 103608454 110473322 115867875 123199520
1451 123199520 125369425 131102311 130165880 131807613 135003021 135819918 136729036 137484675 132894630
1442 132894630 132040665 128823120 129868426 131923778 129495757 128793810 124112663 117672995
1434 117672995 113105233 107972389 105485755 102100207 96070329 89096368 82329396 78646106
1426 78646106 79614126 74703207 70359136 69629969 66228652 67311939 71749989 70778222 68959383
$$ packed form
1484H6985318P47205k469637j180381L363343o050061m521091j874619m267384
1476G0732693j829417k467150j07256Q37078M27666O37865l429683K13016p42947
1467F4271865N61876K747450M561960M391440L916519J477172L749760K127548
1459H7805590K897333N096592J987955J229965M591019O864868N394553P331645
1451A23199520K169905N732886r36431J641733L195408Q16897R09118P55639m590045
1442A32894630q53965l217545J045306K055352k428021p01947m681147o439668
1434A17672995m567762n132844k486634l385548o029878o973961o766972l683290
1426G8646106R68020m910919m344071p29167l401317J083287M438050r71767j818839
$$ plain form
1417 68959383 64703751 63169465 61185240 59887927 62354945 61629943 60885125 60008458 59077504
1408 59077504 59119517 58666587 56946596 57201726 57285331 56570651 58964189 57705311 59013527
1399 59013527 59611492 59476464 62639787 60618053 55135138 53867862 51234715 45777246
1391 45777246 43671419 44280076 45472736 46465222 46232493 44218602 43503889 43886573 47802824
1382 47802824 49176376 50352567 51305600 49447743 47204465 44721414 44575509 44695872 43941488
1373 43941488 41825535 39528295 39443742 39436634 39431904 39891614 39405857 38574152 39949806 40403030
1363 40403030 41511616 41167176 41289695 43423122 46667849 42161677 44809166 46754537
1355 46754537 47045083 48746546 52597854 54669642 56454998 57907821 59206668 59303938 59195961
$$ packed form
1417F8959383m255632j534286j984225j297313K467018p25002p44818q76667r30954
1408E9077504M2013m52930j719991K55130Q3605p14680K393538j258878J308216
1399E9013527N97965j35028L163323k021734n482915j267276k633147n457469
1391D5777246k105827O08657J192660R92486k32729k013891p14713L82684L916251
1382D7802824J373552J176191R53033j857857k243278k483051j45905J20363p54384
1373D3941488k115953k297240q4553p108m730M59710m85757q31705J375654M53224
1363D0403030J108586l44440J22519K133427L244727m506172K647489J945371
1355D6754537K90546J701463L851308K071788J785356J452823J298847R7270j07977
$$ plain form
1346 59195961 61608377 63339050 62020976 62316880 65444981 62991691 59750754 60961503
1338 60961503 63704814 63358249 65694326 68143845 70421581 72532279 75788213 78416599
1330 78416599 79884235 82716393 83661958 87828320 92853153 94792277 96277342 101282319
1322 101282319 105416903 112175692 122007240 130000821 132841895 134718731 141047292 150810798
1314 150810798 165301852 185975988 216710210 243412904 264449610 271392032 269196287
1307 269196287 252977668 242786771 248970184 268058990 297675045 327351123 342872647
1300 342872647 336335973 308745734 273767961 247264309 225176604 207653653 195654842
1293 195654842 187700328 178649887 171587895 167395653 165122297 161412183 156858044 151886199
$$ packed form
1346E9195961K412416J730673j318074K95904L128101k453290l240937J210749
1338F0961503K743311l46565K336077K449519K277736K110698L255934K628386
1330G8416599J467636K832158R45565M166362N024833J939124J485065N004977
1322A01282319M134584O758789R831548P993581K841074J876836O328561R763506
1314A50810798J4491054K0674136L0734222K6702694K1036706O942422k195745
1307B69196287j6218619j0190897O183413J9088806K9616055K9676078J5521524
1300C42872647o536674k7590239l4977773k6503652k2087705j7522951j1998811
1293A95654842p954514r050441p061992m192242k273356l710114m554139m971845
$$ plain form
1285 151886199 143903275 137538082 134491946 134127891 133969519 132486923 132357254 133468103
1277 133468103 136707167 137549266 139737463 139317806 136210367 136849184 135243263 135976481 140668095
1268 140668095 144006948 148210650 153758668 156834405 157987171 162471759 167555431 172969621
1260 172969621 183514288 200503164 215050837 228140693 235788045 236967963 237733357 237736103
1252 237736103 242859292 255802324 263417111 265046668 257959917 239501067 221678242 213697609
1244 213697609 209547455 211386748 212319313 207441163 196331670 183475335 168535926 153333284
1236 153333284 143716374 136739055 130227957 128325914 130826876 139263722 156000796 179884455
1228 179884455 211198206 239206847 259769724 269712288 259433357 239528513 213434301
$$ packed form
1285A51886199p982924o365193l046136l64055j58372j482596j29669J110849
1277A33468103L239064Q42099K188197m19657l107439O38817j605921P33218M691614
1268A40668095L338853M203702N548018L075737J152766M484588N083672N414190
1260A72969621J0544667J6988876J4547673J3089856P647352J179918P65394K746
1252B37736103N123189J2943032P614787J629557p086751j8458850j7822825p980633
1244B13697609m150154J839293R32565m878150j1109493j2856335j4939409j5202642
1236A53333284r616910o977319o511098j902043K500962Q436846J6737074K3883659
1228A79884455L1313751K8008641K0562877R942564j0278931j9904844k6094212
$$ plain form
1221 213434301 186313245 161538666 141613531 127617409 115955973 106639878 99257393
1214 99257393 95055214 86807731 81855754 80744056 78576567 76704856 75492819 73284317
1206 73284317 72161171 72714136 73623517 69849441 70211958 67716565 64199922 63517526 59233171
1197 59233171 55806438 58268888 58068100 59955423 61058229 61864062 61678507 61255954 61488383
1188 61488383 64358689 65677565 62088721 61885021 61622505 57026096 56381010 56312150 56843323
1179 56843323 56228306 59728917 58363146 59850240 59939899 58752083 56786778 57305540 60607073
1170 60607073 62208964 61979184 60864850 58843108 58349090 60667078 59261180 56904176
1162 56904176 53499564 52267760 51437925 50234531 53268625 57791139 54263943 52167531
$$ packed form
1221B13434301k7121056k4774579j9925135j3996122j1661436r316095p382485
1214I9257393m202179q247483m951977j111698k167489j871711j212037k208502
1206G3284317j123146N52965R09381l774076L62517k495393l516643o82396m284355
1197E9233171l426733K462450k00788J887323J102806Q05833j85555m22553K32429
1188F1488383K870306J318876l588844k03700k62516m596409o45086o8860N31173
1179E6843323o15017L500611j365771J487094Q9659j187816j965305N18762L301533
1170F0607073J601891k29780j114334k021742m94018K317988j405898k357004
1162E6904176l404612j231804q29835j203394L034094M522514l527196k096412
$$ plain form
1154 52167531 51213352 49304833 47184807 49535331 56029498 57027503 56015965 59622398
1146 59622398 59269515 58298751 62408402 68832683 76171671 83249753 91800829 107024034
1138 107024034 123652643 144979035 175623117 207626228 229063286 247104863 254532385
1131 254532385 250968979 241837886 240785686 241603228 251215562 262894516 272398956 273519354
1123 273519354 265381683 250240030 230725077 207644300 178290906 156379921 136883053
1116 136883053 121446406 112288722 104889862 95297395 86551096 80249711 72948957 73059879
1108 73059879 72284708 69769267 70832693 71439532 69659547 70259716 72257738 74589341 75182207
1099 75182207 77945398 83600825 86220567 88477550 94559147 104511903 117788402 138679310
$$ packed form
1154E2167531r54179j908519k120026K350524O494167R98005j011538L606433
1146E9622398l52883r70764M109651O424281P338988P078082Q551076J5223205
1138A07024034J6628609K1326392L0644082L2003111K1437058J8041577P427522
1131B54532385l563406r131093j052200Q17542R612334J1678954R504440J120398
1123B73519354q137671j5141653j9514953k3080777k9353394k1910985j9496868
1116A36883053j5436647r157684p398860r592467q746299o301385p300754J10922
1108G3059879p75171k515441J063426O06839j779985O00169J998022K331603N92866
1099G5182207K763191N655427K619742K256983O081597R952756J3276499K0890908
$$ plain form
1091 138679310 168663392 202207812 236219499 269640217 294527075 299991905 286817034
1084 286817034 263098213 234808882 204197910 177122905 158507266 139719890 126545512
1077 126545512 115048345 106142657 100986707 91693413 84402284 83072342 79343222 75194374
1069 75194374 77584674 77935361 72111462 68415467 65797406 65797373 62866528 62460787 62794080
1060 62794080 63085400 58926361 60082792 62702717 61138479 58617798 64711471 68756888
1052 68756888 67659125 69255821 71939288 72397022 70551254 72497899 77523658 80163439
1044 80163439 81988627 86041253 90023021 90303587 92527635 95205487 95159257 95513613 92762664
1035 92762664 94778283 90949795 90414895 92159648 91465236 92099823 91706841 89074274 89043732
$$ packed form
1091A38679310K9984082L3544420L4011687L3420718K4886858N464830j3174871
1084B86817034k3718821k8289331l0610972k7075005j8615639j8787376j3174378
1077A26545512j1497167q905688n155950r293294p291129j329942l729120m148848
1069G5194374K390300L50687n823899l695995k618061l3k930845m05741L33293
1060F2794080K91320m159039J156431K619925j564238k520681O093673M045417
1052F8756888j097763J596696K683467M57734j845768J946645N025759K639781
1044H0163439J825188M052626L981768K80566K224048K677852m6230L54356k750949
1035I2762664K015619l828488n34900J744753o94412O34587l92982k632567l0542
$$ plain form
1026 89043732 89811697 90761629 94200614 95431013 95098846 96331331 97154632 97720944 97986079
1017 97986079 97774369 100120971 102575556 102806379 102464940 102177517 105188014 105019900 109006441
1008 109006441 113403666 114885704 119156603 124490752 129926012 136148148 145475483 156367919
1000 156367919 169141567 186766832 214269051 248295912 285005667 321457948 347123239
993 347123239 359073856 358686143 345921754 331389378 311031636 291462703 273657516
986 273657516 254716830 234614731 222758278 211373411 202323970 198189543 195721888 200838446
978 200838446 211899090 231384747 259993780 295606921 328797711 358889068 375641892
971 375641892 372971808 352865950 326134652 296827923 269309727 249038812 233470354
$$ packed form
1026H9043732P67965R49932L438985J230399l32167J232485Q23301N66312K65135
1017I7986079k11710K346602K454585K30823l41439k87423L010497j68114L986541
1008A09006441M397225J482038M270899N334149N435260O222136R327335J0892436
1000A56367919J2773648J7625265K7502219L4026861L6709755L6452281K5665291
993C47123239J1950617l87713j2764389j4532376k0357742j9568933j7805187
986B73657516j8940686k0102099j1856453j1384867r049441m134427k467655N116558
978B00838446J1060644J9485657K8609033L5613141L3190790L0091357J6752824
971C75641892k670084k0105858k6731298k9306729k7518196k0270915j5568458
$$ plain form
964 233470354 218474896 207155946 202303926 198404461 197811051 197954491 205819452 214218157
956 214218157 223659473 237877378 255657892 277027407 307144533 343360142 384945781
949 384945781 423656802 454517109 469990940 467530941 456975775 443319082 421738617
942 421738617 401061098 381716822 358839377 338219299 316615293 299479303 285289834
935 285289834 275468627 274779258 280783381 289347881 301247574 309853752 314790752 310972068
927 310972068 301354792 289759191 274172002 262641199 256164325 249542471 248962691 252377585
919 252377585 259513848 273076439 291357837 311981425 335471057 357148128 378738393
912 378738393 392359505 395182751 386302747 365265998 336119724 307143150 282383238
$$ packed form
964B33470354j4995458j1318950m852020l899465n93410J43440P864961Q398705
956B14218157R441316J4217905J7780514K1369515L0117126L6215609M1585639
949C84945781L8711021L0860307J5473831k459999j0555166j3656693k1580465
942D21738617k0677519j9344276k2877445k0620078k1604006j7135990j4189469
935B85289834r821207o89369O004123Q564500J1899693Q606178M937000l818684
927C10972068r617276j1595601j5587189j1530803o476874o621854n79780L414894
919B52377585P136263J3562591J8281398K0623588K3489632K1677071K1590265
912C78738393J3621112K823246q880004k1036749k9146274k8976574k4759912
$$ plain form
905 282383238 266070507 249137818 237103324 223223409 203403562 184890311 171117173
898 171117173 157443517 147970491 138926236 133487763 126785304 118379243 116468495 115357085
890 115357085 114796002 109364792 110096554 109640227 105973899 105328823 108362423 108404429 108552772
881 108552772 109630078 109123242 108253319 106662201 105563686 102902909 99842669 98829301
873 98829301 98426439 95436107 91823780 87383665 85284335 84907535 80248086 79955293 81803842
864 81803842 83002057 80147566 78399553 77027901 75077935 73325035 74002024 76194937
856 76194937 74258759 71370795 69808504 68204758 66997640 70279159 67631074 65815447
848 65815447 63423192 63897783 65919777 68797993 72696683 72933756 74138264 72107797 70872274
$$ packed form
905B82383238j6312731j6932689j2034494j3879915j9819847j8513251j3773138
898A71117173j3673656r473026r044255n438473o702459q406061j910748j111410
890A15357085n61083n431210P31762m56327l666328o45076L033600M2006J48343
881A08552772J077306n06836q69923j591118j098515k660777l060240j013368
873I8829301m02862k990332l612327m440115k099330l76800m659449k92793J848549
864H1803842J198215k854491j748013j371652j949966j752900O76989K192913
856G6194937j936178k887964j562291j603746j207118L281519k648085j815627
848F5815447k392255M74591K021994K878216L898690K37073J204508k030467j235523
$$ plain form
839 70872274 70376520 71806887 70120157 71331629 71809080 71455017 71399238 72547553 75719204
830 75719204 76913931 73069785 72629050 76106463 77807185 81074408 83487697 86265415
822 86265415 88881021 92160037 101123661 110868259 120920357 137245773 156937467 184047772
814 184047772 224368278 271793257 325230028 373968089 412663593 435742168 437572305
807 437572305 416016420 379097183 336100869 292270222 252170321 218822048 192634861
800 192634861 170688989 150000935 132927541 121144218 108247481 98717977 92957091
793 92957091 89809643 83837912 78226544 74266408 68413113 65224478 62520152 62878308
785 62878308 60585738 59035987 55579437 51721528 50541719 47863172 50298932 53326859
$$ packed form
839G0872274m95754J430367j686730J211472M77451l54063n5779J148315L171651
830G5719204J194727l844146m40735L477413J700722L267223K413289K777718
822H6265415K615606L279016Q963624R744598J0052098J6325416J9691694K7110305
814A84047772M0320506M7424979N3436771M8738061L8695504K3078575J830137
807D37572305k1555885l6919237m2996314m3830647m0099901l3348273k6187187
800A92634861k1945872k0688054j7073394j1783323j2896737r529504n760886
793I2957091l147448n971731n611368l960136n853295l188635k704326L58156
785F2878308k292570j549751l456550l857909j179809k678547K435760L027927
$$ plain form
777 53326859 51323094 47614894 45971571 45116734 41962936 38165427 40828694 42418045
769 42418045 40806690 41135259 43169630 42447798 39544792 40106348 41663533 44044722 46423167
760 46423167 54904264 61579760 66188393 71364492 75687080 74330240 71777168 69790708
752 69790708 67729652 65532537 60528325 60492814 60919726 57705578 54142987 58561171 59274227
743 59274227 56527871 50816650 49767983 48073970 44812528 40748217 40836043 37814357 34644322
734 34644322 34570869 34209633 33341270 31756066 32559527 30478763 26599147 25824010 26193273
725 26193273 22303671 21759546 23376301 25381669 25120781 19536628 21096528 21252677 20006819
716 20006819 19558929 20355697 20428568 19347284 16839043 18255401 19903921 17073522 15915813
$$ packed form
777E3326859k003765l708200j643323q54837l153798l797509K663267J589351
769D2418045j611355L28569K034371p21832k903006N61556J557185K381189K378445
760D6423167Q481097O675496M608633N176099M322588j356840k553072j986460
752F9790708k061056k197115n004212l5511M26912l214148l562591M418184P13056
743E9274227k746356n711221j048667j694013l261442m064311Q7826l021686l170035
734C4644322p3453l61236q68363j585204Q03461k080764l879616p75137L69263
725B6193273l889602n44125J616755K005368k60888n584153J559900J56149j245858
716B0006819m47890P96768P2871j081284k508241J416358J648520k830399j157709
$$ plain form
707 15915813 14731406 14015232 15450550 16858280 17204651 17245742 15212061 16735033 14921354
698 14921354 12637494 15071635 16103833 16224303 16568567 16589916 15338163 12358988 12734765
689 12734765 11824632 14041485 13517533 12261457 13641843 17319888 18851819 17869399 15276759
680 15276759 11874966 12373094 12733580 14954877 16008097 17313929 13880871 13059549 14189657
671 14189657 13913684 14582275 13980534 13609084 13376663 13808186 15359373 13807740 10480795
662 10480795 9455183 11667798 13309647 13431083 16349326 13912792 12089321 10478451
654 10478451 10032896 11002409 11303463 11952721 13548018 13002018 12494940 10041654 10504558
645 10504558 8468148 8506650 10457947 10803100 12742859 8949962 10667437 11795573 9776045
$$ packed form
707A5915813j184407p16174J435318J407730L46371M1091k033681J522972j813679
698A4921354k283860K434141J032198J20470L44264K1349j251753k979175L75777
689A2734765r10133K216853n23952j256076J380386L678045J531931r82420k592640
680A5276759l401793M98128L60486K221297J053220J305832l433058q21322J130108
671A4189657k75973O68591o01741l71450k32421M31523J551187j551633l326945
662A0480795j025612K212615J641849J21436K918243k436534j823471j610870
654A0478451m45555R69513L01054O49258J595297n46000n07078k453286M62904
645A0504558k036410L8502J951297L45153J939759l792897J717475J128136k019528
$$ plain form
636 9776045 8856747 8443656 9535980 9022961 11939192 12046495 10819183 10452010 11846767
627 11846767 13891145 12092943 9424718 9514092 8703625 8591459 9413967 12711043 11393004
618 11393004 9401043 7664627 6077248 8787609 8390584 8780894 9808195 6814890 4935894
609 4935894 6565206 6428061 5106106 7565810 11222011 11539393 9004422 8084869 8059103
600 8059103 6598123 6736690 9325835 10870211 5293137 4515683 6793519 6249683 8020682
591 8020682 8228124 9443898 8858607 5874026 6686481 6837419 7275828 8092128 8642896
582 8642896 7819451 8487579 7126472 5071116 5192746 3622576 4786009 7311003 6980945
573 6980945 6128458 4573913 6235856 5440227 5085597 6787240 7047907 5945527 3806264
$$ packed form
636I776045r19298m13091J092324n13019K916231J07303j227312l67173J394757
627A1846767K044378j798202k668225Q9374q10467j12166Q22508L297076j318039
618A1393004j991961j736416j587379K710361l97025L90310J027301k993305j878996
609D935894J629312j37145j321955K459704L656201L17382k534971r19553k5766
600H059103j460980J38567K589145J544376n577074p77454K277836n43836J770999
591H020682K07442J215774n85291k984581Q12455J50938M38409Q16300N50768
582H642896q23445O68128j361107k055356J21630j570170J163433K524994l30058
573F980945q52487j554545J661943p95629l54630J701643K60667j102380k139263
$$ plain form
564 3806264 5927372 7805151 3840454 3042168 5046637 4560232 4360084 5605307 5441586
555 5441586 3950823 4191230 4270135 4948729 4940472 4662518 7488562 5656142 3584072 3944178
545 3944178 7119284 6631991 6451806 5475073 6470282 5597362 3068267 3391877 6244134
536 6244134 5500506 7088343 6967511 5764902 5880145 5437339 8376450 7526590 6207782
527 6207782 8060709 9247783 7794214 8015966 6848357 6683205 8495270 7390934 5976021
518 5976021 6772618 5029742 6149536 5787794 4549876 4309529 3634093 4379714 1897060
509 1897060 2421486 3238707 2881456 1520789 -559335 1652100 3340193 2063944 1729072
500 1729072 2987951 7157 1387703 1546244 970021 1392708 3460074 2445542 4125606
$$ packed form
564C806264K121108J877779l964697p98286K004469m86405k00148J245223j63721
555E441586j490763K40407P8905O78594q257k77954K826044j832420k072070L60106
545C944178L175106m87293j80185r76733R95209q72920k529095L23610K852257
536F244134p43628J587837j20832j202609J15243m42806K939111q49860j318808
527F207782J852927J187074j453569K21752j167609j65152J812065j104336j414913
518E976021P96597j742876J119794l61742j237918k40347o75436P45621k482654
509A897060N24426Q17221l57251j360667k080124K211435J688093j276249l34872
500A729072J258879k980794J380546J58541n76223M22687K067366j014532J680064
$$ plain form
491 4125606 1532069 3192541 6476335 4847783 6040090 5431451 4658014 6318327 6089364
482 6089364 4817104 7079123 6760513 4945980 5140238 6308222 5696939 4799388 3217753
473 3217753 2560977 1845202 1864470 4226790 3021377 1408188 2485761 5340820 4589214
464 4589214 5206371 4260494 2039456 1897275 5300265 4696337 4763368 3826765 3934844 5599172
454 5599172 732933 -263280 1408116 3167226 2084534 353321 933575 597350 -445113
445 -445113 -304678 648919 1989707 1302916 1543023 -869432 -2418788 2470355 4409247
436 4409247 965807 23710 3232629 3039385 2836694 3110484 2243537 1602081 1129113
427 1129113 4625086 4156381 1402115 4503093 3608633 546395 1784627 4071004 4412569
$$ packed form
491D125606k593537J660472L283794j628552J192307o08639p73437J660313k28963
482F089364j272260K262019l18610j814533J94258J167984o11283q97551j581635
473C217753o56776p15775J9268K362320j205413j613189J077573K855059p51606
464D589214O17157r45877k221038j42181L402990o03928O7031r36603J08079J664328
454E599172m866239r96213J671396J759110j082692j731213N80254l36225j042463
445d45113J40435R53597J340788o86791K40107k412455j549356M889143J938892
436D409247l443440r42097L208919j93244k02691K73790q66947o41456m72968
427A129113L495973m68705k754266L100978q94460l062238J238232K286377L41565
$$ plain form
418 4412569 2547830 4162070 3683344 3879996 2212619 3235951 3448309 5208274 5815992
409 5815992 5414988 2341556 -1375615 -753835 2602320 3503947 3356004 1466235 822117
400 822117 552945 -1287733 353341 1420969 1116786 567754 1717186 830829 -1278274
391 -1278274 829845 2279001 436668 -323439 1503424 828944 -1348109 -614600 1063698
382 1063698 -210392 -1421380 121468 887335 1513944 4195897 3290375 1531372 -1465431
373 -1465431 -1894426 -203437 933091 2677219 3056813 2041506 849313 -69765 -5044357
364 -5044357 -942248 2026644 1872053 2268202 3589172 2005762 -290126 810811 2452361
355 2452361 366828 1820169 5222079 3175773 2703355 1605550 3056764 1083938 6329
$$ packed form
418D412569j864739J614240m78726J96652j667377J023332K12358J759965O07718
409E815992m01004l073432l717171O21780L356155R01627j47943j889769o44118
400H22117k69172j840678J641074J067628l04183n49032J149432q86357k109103
391a278274K108119J449156j842333p60107J826863o74480k177053P33509J678298
382A063698j274090j210988J542848P65867O26609K681953r05522j759003k996803
373a465431m28995J690989J136528J744128L79594j015307j192193r19078m974592
364e044357M102109K968892j54591L96149J320970j583410k295888J100937J641550
355B452361k085533J453341L401910k046306m72418j097805J451214j972826j077609
$$ plain form
346 6329 911991 3030185 1722448 -157877 215668 -1137859 972355 -475100 -305520
337 -305520 2035043 -272 -776143 790561 -100664 772529 1500394 3293266 -1830355
328 -1830355 -4420731 -2060253 905537 479027 2148139 4216293 2352972 -2358127 -2961227
319 -2961227 280655 -2067503 -617439 2111178 2907149 2544930 2566380 1554981 1425280
310 1425280 -683443 2445035 6714129 2076974 -381860 -773475 -1031078 2490256 3903601
301 3903601 4793914 4478424 653307 311914 -697188 -814110 -539558 1340126 2760164
292 2760164 983289 -132385 -55477 -94113 -616576 865658 2475211 4616115 2050365
283 2050365 -1362378 451255 -635488 437989 3458347 991641 2170445 217010
$$ packed form
346F329R05662K118194j307737j880325L73545j353527K110214j447455J69580
337c05520K340563k035315p75871J566704q91225Q73193P27865J792872n123621
328a830355k590376K360478K965790m26510J669112K068154j863321m711099o03100
319b961227L241882k348158J450064K728617P95971l62219K1450j011399j29701
310A425280k108723L128478M269094m637155k458834l91615k57603L521334J413345
301C903601Q90313l15490l825117l41393j009102j16922K74552J879684J420038
292B760164j776875j115674P6908l8636n22463J482234J609553K140904k565750
283B050365l412743J813633j086743J073477L020358k466706J178804j953435
$$ plain form
275 217010 24844 969945 163038 -390292 1931446 2555587 1415760 -38318 -1272725
266 -1272725 2127847 911977 -305288 422611 -1712846 -5562721 -5567481 -2048215 -656025
257 -656025 -453411 369736 -1498698 -3020935 -1519432 -625090 -796454 -2326305 -1711380
248 -1711380 617655 1155212 -563428 -742091 -1870358 -301250 1012654 164627 441110
239 441110 390477 1335034 314356 -1312523 -1773724 -776864 -608212 -329151 -780605 208451
229 208451 1772491 2527762 2372297 762168 -145482 220978 -1643835 -3872146 -653005
220 -653005 614089 1019570 -565289 -2334230 -1398665 -606912 369199 -319389 -3572610
211 -3572610 -1791129 896705 1975770 2468483 1841969 1536771 755393 655858 1573873
$$ packed form
275B17010j92166R45101q06907n53330K321738O24141j139827j454078j234407
266a272725L400572j215870j217265P27899k135457l849875m760L519266J392190
257f56025K02614Q23147j868434j522237J501503Q94342j71364j529851O14925
248a711380K329035N37557j718640j78663j128267J569108J313904q48027K76483
239D41110n0633R44557j020678j626879m61201R96860J68652K79061m51454R89056
229B08451J564040P55271j55465j610129r07650L66460j864813k228311L219141
220f53005J267094M05481j584859j768941R35565P91753R76111o88588l253221
211c572610J781481K687834J079065M92713o26514l05198p81378r9535R18015
$$ plain form
202 1573873 2081120 1521898 403140 -1933608 -4157275 -2867582 -1050228 124616 -421452
193 -421452 -180522 2335050 -502225 -1267906 -2186809 -1630584 -781802 -1202466 515676
184 515676 2151723 -260379 1327245 696749 -399209 -1108950 739989 1496574 -208631
175 -208631 -545221 -1216594 -2736393 -3122081 -668973 2250010 1645554 1628430 947896 753306
165 753306 -1572787 -79636 2992606 1302426 1014924 1000572 857799 1290255 -668669
156 -668669 -187183 317071 -2206549 334578 -851107 -1544673 -1202444 409525 -1139924
147 -1139924 -1606105 -822253 -920775 -494868 -1716096 -1844618 -1607905 -1817223 -1502917 -3887453
137 -3887453 -3459056 -2648918 -3096034 -4741927 -3204855 -380137 1046215 272926 -1381557
$$ packed form
202A573873N07247n59222j118758k336748k223667J289693J817354J174844n46068
193d21452K40930K515572k837275p65681r18903N56225Q48782m20664J718142
184E15676J636047k412102J587624o30496j095958p09741J848939P56585j705205
175b08631l36590o71373j519799l85688K453108K918983o04456j7124o80534j94590
165G53306k326093J493151L072242j690180k87502j4352j42773M32456j958924
156f68669M81486N04254k523620K541127j185685o93566L42229J611969j549449
147a139924m66181P83852r8522M25907j221228j28522K36713k09318L14306k384536
137c887453M28397Q10138m47116j645893J537072K824718J426352p73289j654483
$$ plain form
128 -1381557 -2126644 -1235412 604969 1004352 -46480 206250 -1071314 -1549645 -1117299
119 -1117299 -1134382 -844005 -911897 -2521168 -2848225 -817096 4241 -984488 -4822726 -4805636
109 -4805636 -3023888 -4813856 -2226379 -2472963 -4819838 -2097555 -2252135 -2586505 -1264920
100 -1264920 -1496500 -2810032 -3789140 -3569741 -1228621 412694 -609768 687306 -1395353
91 -1395353 -3619318 -3698310 -2893217 -1256656 -1285835 -974378 -1052721 -2741671 -2421225 -2270417
81 -2270417 -2957562 -1825578 -2188579 -1428872 -1798925 -2293701 -345511 680566 -398036
72 -398036 -1028076 -1682247 -1866937 -1149324 -1447251 -333485 149827 28936 110232 -861267
62 -861267 -747446 618711 1290694 3028850 4473406 4184703 5388675 6219838 8021311
$$ packed form
128a381557p45087Q91232J840381L99383j050832K52730j277564m78331M32346
119a117299j7083K90377o7892j609271l27057K031129Q21337r88729l838238J7090
109d805636J781748j789968K587477k46584k346875K722283j54580l34370J321585
100a264920k31580j313532r79108K19399K341120J641315j022462J297074k082659
91a395353k223965p8992Q05093J636561k9179L11457p8343j688950L20446J50808
81b270417o87145J131984l63001P59707l70053m94776J948190J026077j078602
72c98036o30040o54171j84690P17613k97927J113766M83312j20891Q1296r71499
62h61267J13821J366157O71983J738156J444556k88703J203972Q31163J801473
$$ plain form
53 8021311 10020563 13522073 14412064 15907831 16881938 17250881 16915407 18837892 20090380
44 20090380 23838113 27798461 32510028 43472261 59440695 89664223 138060805 191254848
36 191254848 234979491 250469523 218642156 173900198 139841973 110382459 91987988
29 91987988 74857649 58854090 47390917 38531021 31265119 25349135 22952142 22020069
21 22020069 19586346 19018914 17540549 13984541 12900149 13964605 13406757 10145622 8415635
12 8415635 6920187 5666359 6926220 6105992 5660067 3481588 4269849 2716840 3055678
3 3055678 4364981 3359398 3301872
0 3301872
$$ packed form
53H021311J999252L501510Q89991J495767R74107L68943l35474J922485J252488
44B0090380L747733L960348M711567J0962233J5968434L0223528M8396582N3194043
36A91254848M3724643J5490032l1827367m4741958l4058225k9459514j8394471
29I1987988j7130339j6003559j1463173q859896p265902n915984k396993r32073
21B2020069k433723n67432j478365l556008j084392J064456n57848l261135j729987
12H415635j495448j253828J259861q20228m45925k178479P88261j553009L38838
3C055678J309303j005583n7526
0C301872
$$ Imaginary data points
##PAGE= N=2
##DATA TABLE= (X++(I..I)), XYDATA
$$ plain form
16383 -38536550 -38817541 -36984374 -38519086 -37582912 -36240378 -35252430 -33565758 -35411981
16375 -35411981 -35546750 -35539264 -36547247 -33808128 -30832337 -31905706 -32377543 -30718537 -30946405
16366 -30946405 -29479099 -27486029 -26628395 -26057880 -26426170 -24870533 -26467694 -27673649
16358 -27673649 -24891798 -23297535 -21958264 -23927525 -24402394 -25182959 -24609934 -23201609
16350 -23201609 -21820597 -21277703 -22432264 -22773100 -21055267 -20311935 -20057902 -19762876 -19653069
16341 -19653069 -20552917 -18588095 -17702926 -15672450 -14340437 -16126264 -15594065 -15583006 -16201531
16332 -16201531 -16626247 -15681986 -17341800 -18749096 -15782119 -15253349 -16088146 -16185304 -15595779
16323 -15595779 -16102653 -17101923 -16994181 -16078125 -15125750 -15192956 -12817839 -14955174 -17108283
$$ packed form
16383c8536550k80991J833167j534712R36174J342534R87948J686672j846223
16375c5411981j34769P486j007983K739119K975791j073369m71837J659006k27868
16366c0946405J467306J993070Q57634N70515l68290J555637j597161j205955
16358b7673649K781851J594263J339271j969261m74869p80565N73025J408325
16350b3201609J381012N42894j154561l40836J717833P43332K54033K95026J09807
16341a9653069q99848J964822Q85169K030476J332013j785827N32199J1059o18525
16332a6201531m24716R44261j659814j407296K966977N28770q34797r7158N89525
16323a5595779n06874r99270J07742R16056R52375o7206K375117k137335k153109
$$ plain form
16314 -17108283 -14848558 -14072589 -12409322 -10853358 -11646299 -10987002 -13098726 -11598595
16306 -11598595 -10401839 -10895515 -11071735 -11142245 -12350253 -9912868 -7371514 -7230502 -8157371
16297 -8157371 -10288978 -11962448 -9769365 -9417895 -8637155 -6713873 -8773481 -9722314 -6744143
16288 -6744143 -6069475 -6747525 -6347164 -7299196 -9185168 -8175367 -5548710 -5338187 -4967188
16279 -4967188 -6931260 -6978831 -5939344 -6958258 -5456059 -4753722 -6019192 -4847250 -5009819
16270 -5009819 -6028295 -4108653 -3732182 -4268057 -4360135 -4459000 -3977637 -3681911 -3660781 -3011437
16260 -3011437 -3767921 -5303368 -4049250 -4031933 -4505966 -494946 311580 -1769664 -5204025
16251 -5204025 -5179705 -5283841 -4608211 -3529028 -2036276 -2121749 -4230378 -5143924 -2137258
$$ packed form
16314a7108283K259725P75969J663267J555964p92941O59297k111724J500131
16306a1598595J196756m93676j76220p0510j208008K437385K541354J41012r26869
16297h157371k131607j673470K193083L51470P80740J923282k059608r48833K978171
16288f744143O74668o78050M00361r52032j885972J009801K626657K10523L70999
16279d967188j964072m7571J039487j018914J502199P02337j265470J171942j62569
16270e009819j018476J919642L76471n35875r2078r8865M81363K95726K1130O49344
16260c011437p56484j535447J254118J7317m74033M011020Q06526k081244l434361
16251e204025K4320j04136O75630J079183J492752q5473k108629r13546L006666
$$ plain form
16242 -2137258 -5191781 -3124978 229710 -1829288 -887886 -526721 195216 343814 405227
16233 405227 -283289 2659002 2638352 621751 -29326 -631131 46623 2143513 2643577
16224 2643577 1033365 -179124 -341381 -1255982 -1725943 -706952 -332713 963652 1769181
16215 1769181 406936 -331193 -2162656 2121323 3182221 -375802 1986513 1644129
16207 1644129 -95838 1720577 725621 1387016 -88560 1203724 268536 -2181594 -1973073
16198 -1973073 2157882 1051285 -2077438 89050 1485105 780354 1641927 1142205 1304903
16189 1304903 3774368 4750432 4134769 3772231 3003848 962338 3796841 5235119 3546600
16180 3546600 6886721 5126974 3363193 3063572 883437 2299406 1837702 63941
$$ packed form
16242b137258l054523K066803L354688k058998R41402L61165P21937J48598O1413
16233D05227o88516K942291k0650k016601o51077o01805O77754K096890N00064
16224B643577j610212j212489j62257r14601m69961J018991L74239J296365Q05529
16215A769181j362245p38129j831463M283979J060898l558023K362315l42384
16207A644129j739967J816415r94956O61395j475576J292284r35188k450130K08521
16198a973073M130955j106597l128723K166488J396055p04751Q61573m99722J62698
16189A304903K469465R76064o15663l62538p68383k041510K834503J438278j688519
16180C546600L340121j759747j763781k99621k180135J415969m61704j773761
$$ plain form
16172 63941 2862410 3006838 2159359 4792496 4593896 2839300 1121797 612190 3057795
16163 3057795 4600126 4568006 4734020 3831348 338355 956785 1741361 4573252 5189881
16154 5189881 2935749 4088389 2651565 2729332 4983200 6257486 5820092 5386897 5913239
16145 5913239 6341562 3762856 3447490 3324878 2910374 2288134 3739773 5455310 3687395
16136 3687395 115406 2155863 4701428 3611950 5374159 6695041 2292112 2193665
16128 2193665 2596443 2314067 3980958 5471896 8198505 7660216 3988753 3427874 2711439
16119 2711439 4498840 7543082 6992189 5252394 6007779 4794675 4343303 3670816 5685276
16110 5685276 6491176 8087277 8088672 7773164 5681019 5938629 5332888 1855019 3342610
$$ packed form
16172F3941K798469J44428q47479K633137j98600j754596j717503n09607K445605
16163C057795J542331l2120J66014r02672l492993O18430P84576K831891O16629
16154E189881k254132J152640j436824P7767K253868J274286m37394m33195N26342
16145E913239M28323k578706l15366j22612m14504o22240J451639J715537j767915
16136C687395l571989K040457K545565j089478J762209J320882m402929r8447
16128B193665M02778k82376J666891J490938K726609n38289l671463n60879p16435
16119B711439J787401L044242n50893j739795P55385j213104m51372o72487K014460
16110E685276Q05900J596101J395l15508k092145K57610o05741l477869J487591
$$ plain form
16101 3342610 4233005 5898779 6557387 6422561 4710365 4551730 3807980 3668789 2703423
16092 2703423 2847053 3708421 4343180 3228471 2612290 1459455 2553934 2280408 4245119
16083 4245119 7650074 8074401 7984194 6424632 4211949 1956038 3954457 5080327 6440033
16074 6440033 6982492 6217273 3944584 3592629 5339687 6156048 7348678 7251605 6894578
16065 6894578 4819235 4698814 3646326 7135016 8065103 8248989 5995755 3192881 2762906
16056 2762906 1951756 4269226 5563062 7652793 5758502 2251010 590890 -217301
16048 -217301 433271 4533054 4796340 4784938 6165656 5692985 4737704 5630948 6083241
16039 6083241 5068218 7087576 6593886 5529416 5898117 6036030 5755929 2555476 3266346
$$ packed form
16101C342610Q90395J665774O58608j34826j712196j58635p43750j39191r65366
16092B703423J43630Q61368O34759j114709o16181j152835J094479k73526J964711
16083D245119L404955M24327r0207j559562k212683k255911J998419J125870J359706
16074F440033N42459p65219k272689l51955J747058Q16361J192630r7073l57027
16065F894578k075343j20421j052488L488690R30087J83886k253234k802874m29975
16056B762906q11150K317470J293836K089731j894291l507492j660120q08191
16048b17301O50572M099783K63286j1402J380718m72671r55281Q93244M52293
16039F083241j015023K019358m93690j064470L68701J37913k80101l200453P10870
$$ plain form
16030 3266346 3146073 379840 4024240 7189868 8778363 5794561 4840132 5195461 3743248
16021 3743248 3057888 3333890 5010385 4725481 6984365 7741032 4264899 3168382 4756067
16012 4756067 6180440 4248755 4511060 6164233 4283075 3106352 1884334 3381924
16004 3381924 5303479 4156289 3255191 2565213 3312644 6761408 9353611 8714309 7316842
15995 7316842 7547286 4010955 5378170 5434798 4060166 6416505 8724782 6564229 5812267
15986 5812267 4974356 4581851 5866840 4419082 6405950 7364630 4723720 4657797 3117889
15977 3117889 2622018 3895091 2887173 5494247 5627105 3825887 6784845 7722572 5422142
15968 5422142 4231508 3811705 3556911 5371615 6184897 7926898 6298871 3083176 6346506
$$ packed form
16030C266346j20273k766233L644400L165628J588495k983802r54429L55329j452213
16021C743248o85360K76002J676495k84904K258884P56667l476133j096517J587685
16012D756067J424373j931685K62305J653173j881158j176723j222018J497590
16004C381924J921555j147190r01098o89978P47431L448764K592203o39302j397467
15995G316842K30444l536331J367215N6628j374632K356339K308277k160553p51962
15986E812267q37911l92505J284989j447758J986868R58680k640910o5923j539908
15977C117889m95871J273073j007918K607074J32858j801218K958958R37727k300430
15968E422142j190634m19803k54794J814704Q13282J742001j628027l215695L263330
$$ plain form
15959 6346506 7919616 7716272 8874320 8720437 7053158 2736976 3307563 5240738 4545507
15950 4545507 8255535 7052094 5335095 4416826 3122203 2766069 4761822 5962077
15942 5962077 6815865 6308275 4547741 5281994 6716614 5756992 5776580 5392764 4430772
15933 4430772 4761397 5827501 6199225 4880754 3719228 3221139 3179380 5150866 5453059
15924 5453059 5036657 1645512 2567090 5803586 8201211 6938143 4528188 4722425 4784318
15915 4784318 4690265 7441526 7985418 5310898 5604840 7872274 5281170 3294923 2458310
15906 2458310 1848962 46597 1347312 5336710 6190044 4197148 5800152 5070737 4137870
15897 4137870 3546391 6647665 8600875 5905172 7544505 8474327 4459825 122255
$$ packed form
15959F346506J573110k03344J158048j53883j667279m316182N70587J933175o95231
15950D545507L710028j203441j716999r18269j294623l56134J995753J200255
15942E962077Q53788n07590j760534P34253J434620r59622J9588l83816r61992
15933D430772L30625J066104L71724j318471j161526m98089m1759J971486L02193
15924E453059m16402l391145R21578L236496K397625j263068k409955J94237O1893
15915D784318r4053K751261N43892k674520K93942K267434k591104j986247q36613
15906B458310o09348j802365J300715L989398Q53334j992896J603004p29415r32867
15897D137870n91479L101274J953210k695703J639333R29822m014502m337570
$$ plain form
15889 122255 2073791 2128570 4914530 6258376 4567679 3531208 2220495 2966539 4332765
15880 4332765 2189221 1868963 1590741 1671806 4162017 5234637 9204462 8662802 7012268
15871 7012268 7419082 5348262 6680632 7094175 8737696 8863238 10089696 5858354 4356111
15862 4356111 3898814 4064048 4030643 4741265 4423199 7443375 7584351 9322701 6861340
15853 6861340 6302458 3658473 -175560 2881101 7217472 12203368 11417753 6712738
15845 6712738 2626312 707286 3762768 7080728 9633466 7907173 4485570 1707582
15837 1707582 666193 1470557 5034492 5576784 3829603 5150907 8240881 6666944
15829 6666944 8354025 7678990 5048874 4641913 3289653 6254023 7416668 8383379 6257195
$$ packed form
15889A22255J951536N4779K785960J343846j690697j036471j310713P46044J366226
15880D332765k143544l20258k78222Q1065K490211J072620L969825n41660j650534
15871G012268M06814k070820J332370M13543J643521J25542J226458m231342j502243
15862D356111m57297J65234l3405P10622l18066L020176J40976J738350k461361
15853F861340n58882k643985l834033L056661M336371M985896p85615m705015
15845F712738m086426j919026L055482L317960K552738j726293l421603k777988
15837A707582j041389Q04364L563935N42292j747181J321304L089974j573937
15829F666944J687081o75035k630116m06961j352260K964370J162645R66711k126184
$$ plain form
15820 6257195 6953433 7274348 8787219 9766539 8113044 8075358 6757140 6017761 4933501
15811 4933501 6018814 8313388 5630791 6126499 2687253 723495 4483133 5558237
15803 5558237 4991952 4400357 3770754 4693919 740474 -537652 3029939 4557922 2527809
15794 2527809 4404668 5214271 4653395 6020263 5138246 6122444 3995327 4330946 9042235
15785 9042235 6250419 5101823 3255157 2890967 1063035 4139241 6972962 8190469
15777 8190469 6407052 4802120 4626949 5185222 4377658 7019648 8402579 7255653 5089376
15768 5089376 5481481 5054681 2882799 1607336 2469800 4146532 3510316 2678973 3710562
15759 3710562 4767812 2655606 3341912 4487073 2125049 2976668 3995202 3767863 4370510
$$ packed form
15820F257195O96238L20915J512871R79320j653495l7686j318218p39379j084260
15811D933501J085313K294574k682597M95708l439246j963758L759638J075104
15803E558237n66285n91595o29603R23165l953445j278126L567591J527983k030113
15794B527809J876859Q09603n60876J366868q82017R84198k127117L35619M711289
15785I042235k791816j148596j846666l64190j827932L076206K833721J217507
15777H190469j783417j604932j75171N58273q07564K641990J382931j146926k166277
15768E089376L92105m26800k171882j275463Q62464J676732o36216q31343J031589
15759C710562J057250k112206O86306J145161k362024Q51619J018534k27339O02647
$$ plain form
15750 4370510 4545641 4448601 7232207 7407988 8495949 9078614 7548094 4864514 4289951
15741 4289951 5801432 7698168 5616064 2296391 2787397 843335 2513323 3258233
15733 3258233 6446666 6594290 6950008 5619291 4566272 1911447 2432969 4912177 5351508
15724 5351508 4427263 5671818 8182415 6909267 6248868 6768306 5604981 4934310 5309499
15715 5309499 5918819 3529633 3417406 5652388 6286750 5492713 4663928 5171677 6839311
15706 6839311 6690262 6699988 6484549 7295255 8346182 6331317 4115931 5906513 5291721
15697 5291721 4887304 4733441 5597834 7077089 8287913 7704753 6415340 1557593 2346732
15688 2346732 6399915 7305958 9471419 9606484 7732104 4439443 2000790 3858206
$$ packed form
15750D370510J75131r7040K783606J75781J087961N82665j530520k683580n74563
15741D289951J511481J896736k082104l319673M91006j944062J669988P44910
15733C258233L188433J47624L55718j330717j053019k654825N21522K479208M39331
15724E351508r24245J244555K510597j273148o60399N19438j163325o70671L75189
15715E309499O09320k389186j12227K234982O34362p94037q28785N07749J667634
15706F839311j49049R726k15439Q10706J050927k014865k215386J790582o14792
15697E291721m04417j53863Q64393J479255J210824n83160j289413m857747P89139
15688B346732M053183R06043K165461J35065j874380l292661k438653J857416
$$ plain form
15680 3858206 6516050 7868463 8598054 7329171 3019503 1573326 2647852 5321904
15672 5321904 6429275 7339474 5986268 3506528 2401379 1559207 2579039 5087162
15664 5087162 4289065 2106348 1383837 3265632 4450434 5174180 5674238 6090657 3596869
15655 3596869 4711119 6471737 7001068 4917593 5450921 7843977 6858137 7300867 8665497
15646 8665497 10062061 7770234 7028921 6260283 7444078 5347499 3971544 4779650 6392738
15637 6392738 6637645 6607466 5257000 4220414 1243057 1366193 3047059 2546680 3326673
15628 3326673 5749532 4342010 2274923 542077 1889220 3748577 4786740 4488013
15620 4488013 4109036 3486087 1039149 1986720 5986859 8951051 8841604 5491147 5006551
$$ packed form
15680C858206K657844J352413P29591j268883m309668j446177J074526K674052
15672E321904J107371R10199j353206k479740j105149q42172J019832K508123
15664E087162p98097k182717p22511J881795J184802P23746N00058M16419k493788
15655C596869J114250J760618N29331k083475N33328K393056r85840M42730J364630
15646H665497J396564k291827p41313p68638J183795k096579j375955Q08106J613088
15637F392738K44907l0179j350466j036586k977357J23136J680866n00379P79993
15628C326673K422859j407522k067087j732846J347143J859357J038163k98727
15620D488013l78977o22949k446938R47571M000139K964192j09447l350457m84596
$$ plain form
15611 5006551 3000812 2701850 5373993 7864671 6253578 3319127 3895538 5108458
15603 5108458 2806782 4761125 6531203 6270807 3039294 1567420 3109401 2321743
15595 2321743 1341246 3245289 5940825 4148315 4857056 10384949 9142828 5026892
15587 5026892 4031360 6500066 5609001 3384581 6443855 8502757 7817670 7079761 8157182
15578 8157182 8523365 5279482 5348534 4803543 3041396 3990476 4455676 5209933 3587924
15569 3587924 1309580 2555773 2736477 5292788 6307371 7321165 7890677 5868387
15561 5868387 4060076 2124205 3585608 2273229 4569245 3362346 3114634 3721936
15553 3721936 4579686 8856282 7332550 5008767 5034946 4498164 5218816 4034846 7664070
$$ packed form
15611E006551k005739k98962K672143K490678j611093k934451N76411J212920
15603E108458k301676J954343J770078k60396l231513j471874J541981p87658
15595B321743r80497J904043K695536j792510P08741N527893j242121m115936
15587E026892r95532K468706q91065k224420L059274K058902o85087p37909J077421
15578H157182L66183l243883O9052n44991j762147R49080M65200P54257j622009
15569C587924k278344J246193J80704K556311J014583J013794N69512k022290
15561E868387j808311j935871J461403j312379K296016j206899k47712O07302
15553C721936Q57750M276596j523732k323783K6179n36782P20652j183970L629224
$$ plain form
15544 7664070 7393904 5438782 5178039 6862646 7371946 7626042 9158553 9218296 8027211
15535 8027211 5767226 6678857 7835864 4086989 4973866 6807431 7323838 6636297 5405558
15526 5405558 6936775 4426846 2522594 5060050 4896319 4172538 2554023 6229251
15518 6229251 4425288 3200435 5986386 9037159 6757991 6011464 8210195 6429990
15510 6429990 7400311 8276649 10998694 9422341 8749277 8066556 5950425 4089875 4082621
15501 4082621 3241798 3976772 6564549 4951724 2864082 5512401 6516994 5091783
15493 5091783 5654900 5383064 3489429 959079 2578756 5597976 6215089 5257128 6522384
15484 6522384 4773070 -778419 199995 3369256 4468751 4524822 6555365 8533440 5856799
$$ packed form
15544G664070k70166j955122k60743J684607N09300K54096J532511N9743j191085
15535H027211k259985R11631J157007l748875Q86877J833565N16407o87541j230739
15526E405558J531217k509929j904252K537456j63731p23781j618515L675228
15518F229251j803963j224853K785951L050773k279168p46527K198731j780205
15510F429990R70321Q76338K722045j576353o73064o82721k116131j860550p254
15501D082621q40823P34974K587777j612825k087642K648319J004593j425211
15493E091783N63117k71836j893635k530350J619677L019220O17113r57961J265256
15484F522384j749314n551489R78414L169261J099495N6071K030543J978075k676641
$$ plain form
15475 5856799 2661988 4717344 4155627 2823792 2951648 6518480 5121933 1870120
15467 1870120 5616479 7678648 7459718 7139156 9219611 6484912 4611608 5803363
15459 5803363 6485187 5819299 4302120 5344909 4866806 3452762 4740556 5291199 4219775
15450 4219775 5758226 5100114 4168279 1745137 2034838 2698472 3925523 4559427 5498587
15441 5498587 5535897 3691145 5152862 6136350 5980556 6862773 3415679 1266378 2399600
15432 2399600 8545843 8726921 6796707 5317258 3767344 3656263 4664547 7359766
15424 7359766 6025367 5677618 5248801 6465152 5194204 4790024 4510182 2343610 1503514
15415 1503514 5163525 6761144 4548737 5338494 6377600 4156245 6088581 5251400
$$ packed form
15475E856799l194811K055356n61717j331835J27856L566832j396547l251813
15467A870120L746359K062169k18930l20562K080455k734699j873304J191755
15459E803363O81824o65888j517179J042789m78103j414044J287794N50643j071424
15450D219775J538451o58112r31835k423142K89701O63634J227051O33904R39160
15441E498587L7310j844752J461717R83488j55794Q82217l447094k149301J133222
15432B399600O146243J81078j930214j479449j549914j11081J008284K695219
15424G359766j334399l47749m28817J216351j270948m04180k79842k166572q40096
15415A503514L660011J597619k212407P89757J039106k221355J932336q37181
$$ plain form
15407 5251400 5206455 5764132 4806083 6105678 7448163 6368234 4154056 4224575 5103162
15398 5103162 6782130 5566729 4020491 5024920 4412141 5720923 7691170 7656579 6119984
15389 6119984 6863581 8105595 7535271 5297593 6386959 5418302 1761095 1614404 5270407
15380 5270407 6869817 5113062 5313299 6097761 7073166 3841336 5674777 4130460 4495837
15371 4495837 7655934 8742615 8827387 7515635 5948541 4762956 2313786 2362611 6272862
15362 6272862 4285559 3619085 7733014 7287856 6730059 5086389 3145003 5235596 5657130
15353 5657130 6590726 7901993 5421430 2701975 2784348 3607090 6384261 6213167 6210850
15344 6210850 4453397 1483225 2845001 4613761 5471457 5632323 4907030 3704290 2332331
$$ packed form
15407E251400m4945N57677r58049J299595J342485j079929k214178P0519Q78587
15398E103162J678968j215401j546238J004429o12779J308782J970247l4591j536595
15389F119984P43597J242014n70324k237678J089366r68657l657207j46691L656003
15380E270407J599410j756755K00237P84462R75405l231830J833441j544317L65377
15371D495837L160097J086681Q4772j311752j567094j185585k449170M8825L910251
15362F272862j987303o66474M113929m45158n57797j643670j941386K090593M21534
15353E657130R33596J311267k480563k719455Q2373Q22742K777171j71094k317
15344F210850j757453k970172J361776J768760Q57696J60866p25293j202740j371959
$$ plain form
15335 2332331 3829335 7988004 7343210 6560826 6290765 5880547 4765755 4224921 3880268
15326 3880268 4700328 8526114 9157422 7317197 4447242 3789230 3446503 3734958 5992911
15317 5992911 6637058 7170643 7055513 7810776 5906245 3430378 7017981 6979878 4068734
15308 4068734 5230969 5671091 7486439 5655604 4430267 7519161 6186288 6104086 7308951
15299 7308951 5314905 4203872 4467756 5644513 6200310 3303595 3265158 6205003 5871074
15290 5871074 4072769 4023967 796093 2857566 3969002 5586660 6818892 4855312
15282 4855312 5177094 2942176 1078994 1829755 2617112 5134170 5354088 5018338 6779077
15273 6779077 8746808 8678934 5801317 3196642 5917042 9041433 8124261 6394105 7061646
$$ packed form
15335B332331J497004M158669o44794p82384k70061m10218j114792n40834l44653
15326C880268Q20060L825786O31308j840225k869955o58012l42727K88455K257953
15317E992911O44147N33585j15130P55263j904531k475867L587603l8103k911144
15308D068734J162235M40122J815348j830835j225337L088894j332873q2202J204865
15299G308951j994046j111033K63884J176757N55797k896715l8437K939845l33929
15290E871074j798305m8802l227874K061473J111436J617658J232232j963580
15282D855312L21782k234918j863182P50761P87357K517058K19918l35750J760739
15273F779077J967731o7874k877617k604675K720400L124391r17172j730156O67541
$$ plain form
15264 7061646 6319354 6666246 7848128 7220094 7043436 3718982 4930222 5827292 6247596
15255 6247596 7385450 6804778 3709203 -181883 1771443 5527497 8670695 9374690
15247 9374690 7046465 6316781 3006190 2035461 3576141 4831761 5535354 4542848 7075905
15238 7075905 5386128 3715684 3387326 5129350 5008500 4129569 5256979 5564497 5108447
15229 5108447 5553771 6581843 6709812 4852708 6229614 7407985 6401521 8128291
15221 8128291 7319302 4713903 2450927 5656306 7413892 6523985 6235277 5425180 5601810
15212 5601810 5006468 8098822 8278337 5061639 4883038 4588755 4221771 6324403 7810949
15203 7810949 4186346 4541071 4765131 6219366 8052103 8664469 8894550 6416690 3162020
$$ packed form
15264G061646p42292L46892J181882o28034j76658l324454J211240Q97070M20304
15255F247596J137854n80672l095575l891086J953326L756054L143198P03995
15247I374690k328225p29684l310591r70729J540680J255620P03593r92506K533057
15238G075905j689777j670444l28358J742024j20850q78931J127410L07518m56050
15229E108447M45324J028072J27969j857104J376906J178371j006464J726770
15221H128291q08989k605399k262976L205379J757586q89907k88708q10097J76630
15212E601810n95342L092354J79515l216698j78601k94283l66984K102632J486546
15203G810949l624603L54725K24060J454235J832737O12366K30081k477860l254670
$$ plain form
15194 3162020 5758205 6612766 5924674 8013945 9626248 8729241 7504057 5335418 4663311
15185 4663311 5896304 8439184 8274876 3978072 1885281 2808759 4437628 6522899
15177 6522899 3505813 2843042 2458414 1261418 3850861 6764753 7415756 6352528 1465181
15168 1465181 433907 3243936 3479935 5977991 7196130 4498766 4401331 5870539 4553707
15159 4553707 6668207 5439294 5656651 6708828 5458031 4648198 3725528 3616939 2798883
15150 2798883 5091056 7581500 8419447 7382921 5935665 2610207 1033761 39529
15142 39529 3776836 8184088 8620911 6068321 3588513 1296087 204119 3326955 4679634
15133 4679634 5901616 3476556 1366728 -393266 131253 1163916 2289844 3876038
$$ packed form
15194C162020K596185Q54561o88092K089271J612303q97007j225184k168639o72107
15185D663311J232993K542880j64308m296804k092791R23478J628869K085271
15177F522899l017086o62771l84628j196996K589443K913892O51003j063228m887347
15168A465181j031274K810029K35999K498056J218139k697364r7435J469208j316832
15159D553707K114500j228913K17357J052177j250797q09833r22670j08589q18056
15150B798883K292173K490444Q37947j036526j447256l325458j576446r94232
15142C9529L737307M407252M36823k552590k479808k292426j091968L122836J352679
15133D679634J221982k425060k109828j759994N24519J032663J125928J586194
$$ plain form
15125 3876038 507698 -446987 232163 1261418 4359693 4819118 4748338 3947117 4580242
15116 4580242 3158881 4889867 4590413 7120041 7631708 5455560 5139156 5057652 5423714
15107 5423714 7600642 7417087 7290542 4620670 2970232 2962340 3429173 389737 1216903
15098 1216903 3894572 3512600 5348227 6395511 7015374 4133800 2300733 3425954
15090 3425954 417584 1278427 3493744 8260943 8165043 6663343 6502230 5577920 3136708
15081 3136708 3229128 6942680 5733446 7428584 7588079 4053908 3531987 4575228 4395080
15072 4395080 6395664 5124267 6558256 5916111 6928182 4985633 4581375 3394229
15064 3394229 6140658 7624193 4722455 4882488 4390773 4024063 2839619 6193295 8093484
$$ packed form
15125C876038l368340r54685O79150J029255L098275M59425p0780q01221O33125
15116D580242j421361J730986k99454K529628N11667k176148l16404q1504L66062
15107E423714K176928j83555j26545k669872j650438p892M66833l039436Q27166
15098A216903K677669l81972J835627J047284O19863k881574j833067J125221
15090C425954l008370Q60843K215317M767199r5900j501700j61113r24310k441212
15081C136708R2420L713552j209234J695138J59495l534171n21921J043241j80148
15072D395080K000584j271397J433989o42145J012071j942549m04258j187146
15064C394229K746429J483535k901738J60033m91715l66710j184444L353676J900189
$$ plain form
15055 8093484 7109103 4867100 4863508 5763244 5123011 6260321 7915181 6688292 3166190
15046 3166190 5044503 4864847 4208907 4962829 6245439 8224510 7842968 6640711 7249612
15037 7249612 4597552 4859217 7570832 8512933 7780431 7226151 6345540 5032500 6041456
15028 6041456 5167047 4760078 4877775 4567997 4465669 4638749 6239539 5118328 4702502
15019 4702502 5199380 4394132 4044863 1115434 2085088 4975690 4671390 9110532 8214934
15010 8214934 5885335 2696187 1766876 2315816 3827869 4734024 6477316 7466074 4549941
15001 4549941 4463730 3968832 2040168 2601714 4627255 5338553 6932183 4602398 2108118
14992 2108118 2238992 3598287 7678558 10191604 8768459 6183085 4241646 4781227
$$ packed form
15055H093484r84381k242003l592Q99736o40233J137310J654860j226889l522102
15046C166190J878313j79656o55940P53922J282610J979071l81542j202257O08901
15037G249612k652060K61665K711615R42101p32502n54280q80611j313040J008956
15028F041456q74409m06969J17697l09778j02328J73080J600790j121211m15826
15019D702502M96878q05248l49269k929429R69654K890602l04300M439142q95598
15010H214934k329599l189148r29311N48940J512053R06155J743292R88758k916133
15001D549941q6211m94898j928664N61546K025541P11298J593630k329785k494280
14992B108118J30874J359295M080271K513046j423145k585374j941439N39581
$$ plain form
14984 4781227 6797910 8326149 6254935 7329044 7252215 5354744 5887722 6539209 6295626
14975 6295626 6661183 6052757 5282744 3721408 5918521 7578568 6782535 7282278 6577887
14966 6577887 5598111 4077041 1149040 4039616 6560260 6832612 5924774 3783329 4558772
14957 4558772 5167841 5530268 6995826 5551385 3100456 3799644 5458020 3865829 5660864
14948 5660864 5041058 6634226 6844108 5300280 9992075 10110633 7033860 7496762 4675512
14939 4675512 4908486 6002954 6384923 8225563 6600995 6371621 3524146 4754109 5187688
14930 5187688 4059859 6450044 7070118 5862930 4822893 5134923 5519119 6190591 5682263
14921 5682263 4516239 4493962 3085557 5964000 8539872 4457200 4685146 5466474 5766651
$$ packed form
14984D781227K016683J528239k071214J074109p6829j897471N32978O51487k43583
14975F295626L65557o08426p70013j561336K197113J660047p96033M99743p04391
14966F577887r79776j521070k928001K890576K520644K72352r07838k141445P75443
14957D558772O09069L62427J465558j444441k450929O99188J658376j592191J795035
14948E660864o19806J593168K09882j543828M691795J18558l076773M62902k821250
14939D675512K32974J094468L81969J840640j624568k29374k847475J229963M33579
14930E187688j127829K390185O20074j207188j040037L12030L84196O71472n08328
14921E682263j166024k2277j408405K878443K575872m082672K27946P81328L00177
$$ plain form
14912 5766651 4829393 3652092 6889443 6887185 6273550 5684481 6023637 5652592 4870531
14903 4870531 4228732 3254861 3125583 5257187 6677254 7091972 5988017 6218951 6586876
14894 6586876 4885397 5118197 7215573 5921782 3795512 2914495 2151603 4033419 4908998
14885 4908998 6483487 7909695 6794139 4928765 2409278 4141306 4573807 6133951
14877 6133951 4713315 3239355 3024452 3813561 3543299 4179096 5235686 7144356 7115195
14868 7115195 6083444 3735551 4084343 5009022 2591842 3403585 3148003 4890260 5633043
14859 5633043 7947072 9368849 8151054 5649013 5500922 7393344 5172625 3886347
14851 3886347 4823652 1497806 2298833 4722238 6160057 6212825 6187021 7931423 5417314
$$ packed form
14912E766651r37258j177301L237351k258o13635n89069L39156l71045p82061
14903D870531o41799r73871j29278K131604J420067M14718j103955K30934L67925
14894F586876j701479K32800K097376j293791k126270q81017p62892J881816Q75579
14885D908998J574489J426208j115556j865374k519487J732028M32501J560144
14877F133951j420636j473960k14903P89109k70262O35797J056590J908670k9161
14868G115195j031751k347893L48792R24679k417180Q11743k55582J742257P42783
14859E633043K314029J421777j217795k502041j48091J892422k220719j286278
14851C886347R37305l325846Q01027K423405J437819N2768k5804J744402k514109
$$ plain form
14842 5417314 3831142 6347500 5597679 3512578 2726981 3450674 5487511 6722854 5979162
14833 5979162 4486821 4085587 5545743 5950745 5887600 6692020 5606583 2642066 3568852
14824 3568852 1531983 3047794 5213030 6608758 8617493 5054637 3753279 3684604
14816 3684604 3298402 5514953 6770710 6438647 5315411 4131493 2842949 2793290 4755672
14807 4755672 4411360 5431382 4929907 1363363 729986 3591224 4893477 5379540 6337379
14798 6337379 5900805 5251729 2478125 1729716 3957164 4800202 8243918 11112177 6339368
14789 6339368 3697457 2376920 2927850 4403750 4886954 9466639 7606684 4808450
14781 4808450 4487924 3047693 5011722 7040469 9410347 9376760 6545242 7314808 5254519
$$ packed form
14842E417314j586172K516358p49821k085101p85597P23693K036837J235343p43692
14833E979162j492341m01234J460156M05002o3145Q04420j085437k964517R26786
14824C568852k036869J515811K165236J395728K008735l562856j301358o8675
14816C684604l86202K216551J255757l32063j123236j183918j288544m9659J962382
14807D755672l44312J020022n01475l566544o33377K861238J302253M86063R57839
14798F337379m36574o49076k773604p48409K227448Q43038L443716K868259m772809
14789F339368k641911j320537N50930J475900M83204M579685j859955k798234
14781D808450l20526j440231J964029K028747K369878l3587k831518P69566k060289
$$ plain form
14772 5254519 5293727 7256056 6879087 5580471 5336569 5859931 4154433 4899579 4596193
14763 4596193 5306417 5688345 4482575 7034804 6106563 6326147 8506492 5416998 4214895
14754 4214895 6193173 8530637 5710024 6188795 7578827 3814206 5724319 6652636
14746 6652636 6513038 7442526 5800081 6561117 5688812 4130165 6622693 6094979 6083673
14737 6083673 5484719 5596164 5116625 4468913 5794522 7011428 5662175 6840827 9737779
14728 9737779 10188411 7184334 5197293 3846023 4954788 6332929 6458765 8220029
14720 8220029 6405230 7092984 7054042 6068926 6591084 7757306 10220804 8664427 6580143
14711 6580143 7468307 6059919 4512377 4567937 4696825 6665074 8287603 9374617 5596633
$$ packed form
14772E254519L9208J962329l76969j298616k43902N23362j705498P45146l03386
14763D596193P10224L81928j205770K552229r28241K19584K180345l089494j202103
14754D214895J978278K337464k820613M78771J390032l764621J910113R28317
14746F652636j39598R29488j642445P61036q72305j558647K492528n27714j1306
14737F083673n98954J11445m79539o47712J325609J216906j349253J178652K896952
14728I737779M50632l004077j987041j351270J108765J378141J25836J761264
14720H220029j814799O87754l8942r85116N22158J166222K463498j556377k084284
14711F580143Q88164j408388j547542N5560J28888J968249J622529J087014l777984
$$ plain form
14702 5596633 6425926 3485587 4956944 7448683 3480950 4949012 5472069 5360516 5551516
14693 5551516 5940603 4743934 5164302 4531831 4026912 4477685 3739499 3549245 3984975
14684 3984975 4866943 5184842 4303952 6060736 7255713 6014513 6528443 6134466 7807041
14675 7807041 6376740 4956211 6561899 5315959 4420061 5445530 6229496 5005321
14667 5005321 6174291 7227040 6736647 3177302 3607570 5813177 5193872 4875328 5508988
14658 5508988 4176561 4105130 4742337 6624203 6716656 6799801 4981860 5124145 5183481 3079819
14648 3079819 5866340 8722853 7851228 8276068 5219489 3787951 6021432 6665885 7146554
14639 7146554 9689148 5146656 3063552 5196474 3790434 2534914 4538353 9440812
$$ packed form
14702E596633Q29293k940339J471357K491739l967733J468062N23057j11553J91000
14693E551516L89087j196669M20368o32471n04919M50773p38186j90254M35730
14684C984975Q81968L17899q80890J756784J194977j241200N13930l93977J672575
14675G807041j430301j420529J605688j245940q95898J025469P83966j224175
14667E005321J168970J052749m90393l559345M30268K205607o19305l18544O33660
14658E508988j332427p1431O37207J881866R2453Q3145j817941J42285N9336k103662
14648C079819K786521K856513q71625M24840l056579j431538K233481O44453M80669
14639G146554K542594m542492k083104K132922j406040j255520K003439M902459
$$ plain form
14631 9440812 8743586 5406789 3040717 2024150 1869795 844977 4359303 6006641
14623 6006641 4071277 5598058 4882676 1244194 730652 4554902 5368351 5762228 6571268
14614 6571268 4911412 5111281 3245453 4568565 4517921 4013470 6293232 6000848 6256289
14605 6256289 6272672 8242484 7312418 8155075 7452815 2325818 1823310 6572811 7300821
14596 7300821 9165799 6576265 5326248 5933425 3387201 3010784 5499815 6325309 8257665
14587 8257665 10304796 4735254 1991455 1494597 1861101 3295585 4888531 8228417
$$ packed form
14631I440812o97226l336797k366072j016567j54355j024818L514326J647338
14623F006641j935364J526781p15382l638482n13542L824250Q13449L93877Q09040
14614F571268j659856J99869j865828J323112n0644n04451K279762k92384K55441
14605F256289J6383J969812r30066Q42657p02260n126997n02508M749501P28010
14596G300821J864978k589534j250017O07177k546224l76417K489031Q25494J932356
14587H257665K047131n569542k743799m96858L66504J434484J592946L339886
$$ [...]
##END NTUPLES=NMR SPECTRUM
##END=
