##TITLE=1H_DE-80H_X3
 200.13MHz, d2o
 8 sc
 
 19ns.26.2.2025
##JCAMPDX= 6.0         $$ Bruker NMR JCAMP-DX V2.0
##DATA TYPE= NMR SPECTRUM
##DATA CLASS= NTUPLES
##ORIGIN= UXNMR, Bruker Analytische Messtechnik GmbH
##OWNER= pz
$$ XWIN-NMR		Version 3.5
$$ Tue May  5 10:35:43 2026 Russian Standard Time (UT+4h)  Yarkov@DPX200
##.OBSERVE FREQUENCY= 200.1313
##.OBSERVE NUCLEUS= ^1H
##.ACQUISITION MODE= SIMULTANEOUS
##.ACQUISITION SCHEME= undefined
##.AVERAGES= 8
##.DIGITISER RES= 18
##SPECTROMETER/DATA SYSTEM= spect
##.PULSE SEQUENCE= zg30
##.SOLVENT NAME= CDCl3
##.SHIFT REFERENCE= (INTERNAL, CDCl3, 0, 18.0431)
##AUDIT TRAIL= $$ (NUMBER, WHEN, WHO, WHERE, WHAT)
$$ ##TITLE= Audit trail, XWIN-NMR		Version 3.5
$$ ##JCAMPDX= 5.01
$$ ##ORIGIN= Bruker BioSpin GmbH
$$ ##OWNER= Yarkov
$$ C:/Bruker/XWIN-NMR/data/yarkov2/nmr/H-C/1/pdata/1/auditp.txt
$$ ##AUDIT TRAIL=  $$ (NUMBER, WHEN, WHO, WHERE, WHAT)
(   1,<2026-05-05 10:32:28.65 +0400>,<Yarkov>,<DPX200>,
      <created by zg, POWCHK disabled, PULCHK disabled
       configuration hash MD5:
       00 E9 B6 7A A2 85 ED C7 34 08 36 98 17 FE 4E 26
       data hash MD5: 16K
       F4 A9 77 19 8E C8 FD B7 14 29 18 40 DF D7 17 58>)
(   2,<2026-05-05 10:32:35.68 +0400>,<Yarkov>,<DPX200>,
      <Start of raw data processing
       efp BC_mod = 2 LB = 0.25 FT_mod = 6 PKNL = 1 PHC0 = -5299.516 PHC1 = 11.42193 SI = 16K 
       data hash MD5: 16K
       FB CA C4 F7 B7 CF FB E6 65 28 F2 CC 86 ED 65 62>)
(   3,<2026-05-05 10:33:07.15 +0400>,<Yarkov>,<DPX200>,
      <pk PHC0 = -205.2001 PHC1 = 0 
       data hash MD5: 16K
       AC 10 B3 F6 6B EF 66 E5 7E EE 94 F5 BE 19 6F 6F>)
$$ ##END=
$$ 
$$ hash MD5
$$ 0B 8E 79 64 C7 F0 75 E2 5A 50 39 91 46 A2 07 91
##$RELAX= 
##$RELAX= 
##$RELAX= 
##$RELAX= 
##$RELAX= 
##$RELAX= 
$$ Bruker specific parameters
$$ --------------------------
##$DU= <C:/Bruker/XWIN-NMR>
##$EXPNO= 1
##$NAME= <H-C>
##$PROCNO= 1
##$TYPE= <nmr>
##$USER= <yarkov2>
##$AMP= (0..31)
100 100 100 100 100 100 100 100 100 100 100 100 100 100 100 100 100 100 
100 100 100 100 100 100 100 100 100 100 100 100 100 100 
##$AQSEQ= 0
##$AQ_mod= 1
##$AUNM= <au_zg>
##$AUTOPOS= <>
##$BF1= 200.13
##$BF2= 200.13
##$BF3= 200.13
##$BF4= 200.13
##$BF5= 200.13
##$BF6= 200.13
##$BF7= 200.13
##$BF8= 200.13
##$BYTORDA= 1
##$CFDGTYP= 0
##$CFRGTYP= 5
##$CHEMSTR= <none>
##$CNST= (0..31)
1 1 145 1 1 1 1 1 1 1 1 1 1 1 1 1 1 1 1 1 1 1 1 1 1 1 1 1 1 1 1 1 
##$CPDPRG= <>
##$CPDPRG1= <>
##$CPDPRG2= <>
##$CPDPRG3= <>
##$CPDPRG4= <mlev>
##$CPDPRG5= <mlev>
##$CPDPRG6= <mlev>
##$CPDPRG7= <mlev>
##$CPDPRG8= <mlev>
##$CPDPRGB= <>
##$CPDPRGT= <>
##$D= (0..31)
0 0.7 0 0 0 0 0 0 0 0 0 0.03 0 0 0 0 0 0 0 0 0 0 0 0 0 0 0 0 0 0 0 0 
##$DATE= 1777962748
##$DBL= (0..7)
120 120 120 120 120 120 120 120 
##$DBP= (0..7)
150 150 150 150 150 150 150 150 
##$DBP07= 0
##$DBPNAM0= <>
##$DBPNAM1= <>
##$DBPNAM2= <>
##$DBPNAM3= <>
##$DBPNAM4= <>
##$DBPNAM5= <>
##$DBPNAM6= <>
##$DBPNAM7= <>
##$DBPOAL= (0..7)
0.5 0.5 0.5 0.5 0.5 0.5 0.5 0.5 
##$DBPOFFS= (0..7)
$$ [...]
##$SUBNAM2= <"">
##$SUBNAM3= <"">
##$SUBNAM4= <"">
##$SUBNAM5= <"">
##$SUBNAM6= <"">
##$SUBNAM7= <"">
##$SUBNAM8= <"">
##$SUBNAM9= <"">
##$SW= 18.0517328524113
##$SWIBOX= (0..15)
0 0 2 0 0 0 0 0 0 0 0 0 0 0 0 0 
##$SW_h= 3612.71676300578
##$TD= 16384
##$TD0= 1
##$TE= 0
##$TE2= 300
##$TE3= 300
##$TEG= 300
##$TL= (0..7)
0 120 120 120 120 120 120 120 
##$TP= (0..7)
150 150 150 150 150 150 150 150 
##$TP07= 0
##$TPNAME0= <>
##$TPNAME1= <>
##$TPNAME2= <>
##$TPNAME3= <>
##$TPNAME4= <>
##$TPNAME5= <>
##$TPNAME6= <>
##$TPNAME7= <>
##$TPOAL= (0..7)
0.5 0.5 0.5 0.5 0.5 0.5 0.5 0.5 
##$TPOFFS= (0..7)
0 0 0 0 0 0 0 0 
##$TUNHIN= 0
##$TUNHOUT= 0
##$TUNXOUT= 0
##$USERA1= <user>
##$USERA2= <user>
##$USERA3= <user>
##$USERA4= <user>
##$USERA5= <user>
##$V9= 5
##$VALIST= <valist>
##$VCLIST= <CCCCCCCCCCCCCCC>
##$VD= 0
##$VDLIST= <DDDDDDDDDDDDDDD>
##$VPLIST= <PPPPPPPPPPPPPPP>
##$VTLIST= <TTTTTTTTTTTTTTT>
##$WBST= 1024
##$WBSW= 4
##$XGAIN= (0..3)
0 0 0 0 
##$XL= 0
##$YL= 0
##$YMAX_a= 327590
##$YMIN_a= -366757
##$ZGOPTNS= <>
##$ZL1= 120
##$ZL2= 120
##$ZL3= 120
##$ZL4= 120
##$ABSF1= 0
##$ABSF2= 0
##$ABSG= 0
##$ABSL= 0
##$ALPHA= 0
##$AQORDER= 0
##$ASSFAC= 0
##$ASSFACI= 0
##$ASSFACX= 0
##$ASSWID= 0
##$AUNMP= <proc_1d>
##$AZFE= 0.1
##$AZFW= 0.1
##$BCFW= 0
##$BC_mod= 2
##$BYTORDP= 0
##$COROFFS= 0
##$CY= -3
##$DATMOD= 1
##$DC= 0
##$DFILT= <>
##$DTYPP= 0
##$F1P= 0
##$F2P= 0
##$FCOR= 1
##$FTSIZE= 16384
##$FT_mod= 6
##$GAMMA= 0
##$GB= 0
##$INTBC= 1
##$INTSCL= 3.241238e-09
##$ISEN= 128
##$LB= 0.25
##$LEV0= 0
##$LPBIN= 0
##$MAXI= 10000
##$MC2= 0
##$MEAN= 0
##$ME_mod= 0
##$MI= 1.114404
##$NCOEF= 0
##$NC_proc= -7
##$NLEV= 6
##$NOISF1= 3.799351
##$NOISF2= 2.8
##$NSP= 0
##$NTH_PI= 0
##$NZP= 0
##$OFFSET= 18.04308
##$PC= 1
##$PHC0= -5504.716
##$PHC1= 11.42193
##$PH_mod= 1
##$PKNL= yes
##$PPARMOD= 0
##$PSCAL= 0
##$PSIGN= 0
##$REVERSE= no
##$SF= 200.129495404952
##$SI= 16384
##$SIGF1= 3
##$SIGF2= 2
##$SINO= 0.751879
##$SIOLD= 32768
##$SREGLST= <19F.Aceton>
##$SSB= 0
##$STSI= 16384
##$STSR= 0
##$SW_p= 3612.71676300578
##$SYMM= 0
##$S_DEV= 0
##$TDeff= 16384
##$TDoff= 0
##$TI= <>
##$TILT= no
##$TM1= 0
##$TM2= 0
##$TOPLEV= 0
##$USERP1= <user>
##$USERP2= <user>
##$USERP3= <user>
##$USERP4= <user>
##$USERP5= <user>
##$WDW= 1
##$XDIM= 16384
##$YMAX_p= 508407781
##$YMIN_p= -5143737
$$ End of Bruker specific parameters
$$ ---------------------------------
##NTUPLES= NMR SPECTRUM
##VAR_NAME=  FREQUENCY,     SPECTRUM/REAL,   SPECTRUM/IMAG
##SYMBOL=    X,             R,               I
##VAR_TYPE=  INDEPENDENT,   DEPENDENT,       DEPENDENT
##VAR_FORM=  AFFN,          ASDF,            ASDF
##VAR_DIM=   16384,         16384,           16384
##UNITS=     HZ,            ARBITRARY UNITS, ARBITRARY UNITS
##FACTOR=    0.220516191357247, 1,           1
##FIRST=     3610.95237111455, 0,            0
##LAST=      -1.76439189123494, 0,           0
##MIN=       -1.76439189123494, -5143737,    0
##MAX=       3610.95237111455, 508407781,    0
$$ Real data points
##PAGE= N=1
##DATA TABLE= (X++(R..R)), XYDATA
$$ [...]
9483c07794K80397O337l82011j71324M75030O55867l1346m53381L80820j83954
9473B68641p65088M73265k33114l58573K48926K64082L54810J68032l97339m46498
9463d22856L29104n31079o28J67316J72909J24201M85607K31565j76235m83561
9453a03657l68248K84534K357n08200J90489K96120K11339L34791k43554N2311
9443A48282j08852J09941l32741l76152l25568J69890M43828p7727J05344J15169
9433a28586J16405K44862l12390n47469k34852J01470M8603O4319N7169L80734
9423b09735L05253k16214L07232k68880n78808M65233j75917j15784N22312l35772
9413c01080j72657J16995p9401K5162P39777r10987K10527L72162j81952J65883
$$ y = [-307794, -27397, -21060, -403071, -574395, -99365, 556502, 525156, 71775, 452595, 268641, -496447, -23182, -256296, -614869, -365943, -101861, 252949, 420981, 23642, -422856, -93752, -624831, -625459, -458143, -285234, -161033, 324574, 556139, 379904, -103657, -471905, -187371, -185014, -693214, -502725, -206605, 4734, 339525, 95971, 148282, 39430, 149371, -183370, -559522, -885090, -715200, -271372, -349099, -243755, -128586, -12181, 232681, -79709, -627178, -862030, -760560, -711957, -647638, -590469, -209735, 95518, -120696, 186536, -82344, -661152, -195919, -371836, -487620, 34692, -301080, -473737, -356742, -436143, -410981, 328796, -582191, -371664, 498, -181454, -15571]
9403a5571l80665q4847J13511n3594J02027K41928m33910q6895q7871j56419n2083
9392h94389L97491q440K56708m88395J59895N37582n8463J79648j88777j49858
9382b56998k74110J20782J92055R9591K1124P7699k80068k74965L24667K39652
9372a0571q2562R1612r1018q886K19077n22649r53L76577m7654P198m5119p4398
9360a89346K34911K40037o62600m19092K92964J94080M20270J1043m90407k05337
9350e73477K23250o5831K23837J95313N3702j70297l7701m85612L6889P0199N675
9339e24053K74664O2369M19739p5162k16132k46905J94361j28869J13599j80006
9329c06395O9865j00704m33849r1875L38127J81210O5661J42873n23194n47731
$$ y = [-15571, -396236, -481083, -367572, -421166, -319139, -77211, -511121, -598016, -685887, -842306, -894389, -496898, -505338, -248630, -737025, -577130, -39548, -98011, 81637, -107140, -256998, -531108, -410326, -218271, -118680, -97556, -19857, -299925, -574890, -250223, -10571, -93133, -1521, -92539, -101425, 117652, -404997, -405950, -29373, -77027, -69829, -114948, -189346, 45565, 285602, -376998, -796090, -503126, -309046, 111224, 122267, -368140, -573477, -350227, -416058, -192221, 3092, 56794, -113503, -151204, -636816, -599927, -529728, -524053, -249389, -187020, 232719, 157557, -58575, -305480, -111119, -239988, -126389, -306395, -236530, -337234, -771083, -862958, -524831, -343621, -277960, -135087, -658281, -1206012]
9319a206012J12104M78272l7098K00194M50942k3016L9400j764k01744P8104j8167
9308a28785Q8417Q4233j37426r515j1191l8670k22105j69522P0528k11564K6281
9297f59319K46314k2293K89553J07652J24158n6545j17755N29037j75430o50262
9287c84890p5286j96697q3490Q74408K56856k47189j44310k80367N833N67856
9277B92724n95559O940J73363l50706K49141j43631m01410K65615J43618l87741
9267g47646M38498J01214j71764O34923j33249n83653R7814k25247K71758O05727
9257B88375j47363m12809k20051k13600M86996O4068l4206K27491j55755o35877
9247g52731R5562L10844k02142j2483O81828J03339l64414p70942K84543J15656
$$ y = [-1206012, -1093908, -615636, -652734, -452540, -1598, -24614, 14786, 13022, -188722, -110618, -128785, -40368, 43865, -93561, -103076, -114267, -152937, -375042, -544564, -474036, -685600, -659319, -413005, -435298, -145745, -38093, 86065, 29520, -88235, 440802, 265372, -384890, -460176, -656873, -740363, 134045, 390901, 143712, -598, -280965, -275132, 292724, -302835, -295895, -122532, -473238, -224097, -367728, -769138, -503523, -359905, -747646, -309148, -207934, -379698, 255225, 121976, -461677, -363863, -589110, -317352, 288375, 141012, -271797, -491848, -705448, -218452, -154384, -188590, 38901, -116854, -752731, -657169, -346325, -548467, -560950, 120878, 224217, -140197, -911139, -626596, -510940]
9237e10940n92146P30843m4864J02860M0422R9749j08927K00972l62091K7674
9227d16448K32729k92139R3555J54761K51715M40091l86819l71242M53705j47450
9217A2458J68870j02856q8531l03368o2032l9511L52686J70123k39925P8266K28362
9206A74542J51335l41362K30702l08326K5752K07218j26730K24267j31226j33993
9196b7821K17517k27128l06554k0899Q2179K52705l0798k3060L61345j97304p30376
9185f50194M71300M27339k43276O2781j02663J26863K01506r9681o3720j60179
9175b9924j07441k93333L72667j30425L48460L57672o14658l08825J21221J85181
9165i9405K87950J84673p50056n5811J29747Q098R0746k35790l67941J074906
$$ y = [-510940, -1103086, -372243, -417107, -314247, -273825, -174076, -283003, -82031, -444122, -416448, -183719, -475858, -382303, -227542, 24173, 464264, 77445, -293797, 159908, 12458, 181328, 78472, -10059, -313427, -375459, -414970, -62284, 107839, -132086, -53820, 174542, 325877, -15485, 215217, -93109, -67357, 139861, 13131, 237398, 106172, -27821, 189696, -37432, -343986, -364885, -282706, -30001, -60799, -83859, 277486, 80182, -650194, -178894, 248445, 5169, 67950, -34713, 92150, 293656, 193975, 130255, -29924, -137365, -430698, -58031, -188456, 160004, 517676, -96982, -405807, -284586, -99405, 188545, 373218, -376838, -432649, -302902, -294804, -204058, -439848, -807789, 267117]
9155B67117l44218k57455N20403p2903o9365o9036k47151M0466O8396l30230L48964
9144a45012k0140r7442J07458n02513m75717N98723L49957M74072J79377m60420
9134H343l69287K09179j0701r8328K07291Q5346m25350j57431j07773J92921M5643
9123d20147M1429J15311k10257L93958N6254l25063k24472J222j4700K54249L52472
9112B0256J10583r3132o73211j10626Q2871J92355L15032J99245n1298j92805
9102b00730L8822q2629m49801j85568K35107L34796J33955n3754k7976j82422
9092d40200J97156L23921R8499p41454k9797l10325J90997P05156m0617M27086
9082C80422j73605o47396M06736j68505m53298L6413K24582J73905j00966J50292
$$ y = [267117, -77101, -334556, 185847, 112944, 43579, -25457, -272608, -232142, -163746, -493976, -145012, -165152, -262594, -155136, -657649, -1133366, -534643, -184686, 289386, 468763, 8343, -360944, -151765, -162466, -260794, -53503, 31843, -393507, -550938, -658711, -465790, -420147, -378718, -263407, -473664, -79706, -23452, -348515, -572987, -571765, -586465, -332216, 20256, 130839, 37707, -635504, -746130, -663259, -470904, -155872, 43373, -7925, -200730, -161908, -244537, -694338, -879906, -644799, -310003, -176048, -229802, -257778, -440200, -243044, 80877, 179376, -562078, -591875, -902200, -711203, -6047, -46664, 380422, 206817, -440579, -33843, -202348, -655646, -619233, -394651, -220746, -321712, -171420]
9072a71420j75309L04421p0538k18813L1019k65334O0085j0588N2411k57310m64425
9061a185801M12055M15304K53936J23039n42115k05245J81330P8693J95248L33223
9051E9667k8738M2689j93740m84690L50380k71007l18944N06525K88470l86385
9041d35773J19651R01829m33907l86149M4461m08188Q117K22534N13956n2743
9031I3788o56106k00623L71134L93852L78027j01761k91641N399J1515n017L63352
9020C61919J86255j96298k32369J12336j39981l47597p6767n2938K31892l74614
9010e28162L85822J92884l90423k2317L27462m17661j22572K92102k87621M15822
9000a54664K49322l96745M8946K68952m92542Q6165Q7890J16K80749m80466j46097
$$ y = [-171420, -346729, -42308, -112846, -331659, -300640, -565974, -505889, -516477, -464066, -721376, -1185801, -773746, -358442, -104506, 18533, -523582, -728827, -547497, -468804, -273556, 59667, 30929, 73618, -120122, -604812, -254432, -525439, -844383, -337858, -49388, -435773, -316122, 585707, 151800, -234349, -189888, -598076, -589959, -367425, 146531, 93788, -562318, -762941, -391807, 2045, 380072, 278311, -13330, -7931, 3584, -1433, 361919, 548174, 351876, 119507, 231843, 91862, -255735, -332502, -385440, -153548, -528162, -142340, 50544, -339879, -362196, -34734, -452395, -574967, -282865, -570486, -154664, 94658, -302087, -253141, 15811, -476731, -390566, -302676, -302560, -21811, -502277, -648374]
8989f48374L92222L2127L23383M76178l84485o57841j05387N80377K6712j36124
8979a01212Q0156k27724m16053P014N83448P7741J36622k51385j75664L61458
8969G4401o2731j51818k08187K83185p3528J71699k39209j74718J12460k57950
8959e26396N96667p5899j83296K62080P2203n59971j20364P2488N85146K18202
8949C40860k73915l46721j14154k49914K77181P03808n90384O0610K04259k59639
8939b48009K13826m71580j24309J58587R3836M6295l87349J34952r9315L8814
8929f44252M27081N56057j89555o37846N6777K80184j83071j42113O9856K40421
8919a66461m2067K56066k42024n57627N51414J72932k69141o5451k59785O3840
$$ y = [-648374, -256152, -224025, 99358, 575536, 191051, -466790, -572177, 8200, 34912, -101212, -21056, -248780, -664833, -657819, -74371, 3370, 139992, -111393, -287057, 74401, 11670, -140148, -348335, -65150, -138678, 33021, -206188, -380906, -268446, -526396, 70271, -5628, -188924, 73156, 145359, -414612, -534976, -462488, 122658, 340860, 66945, -279776, -393930, -643844, -366663, 337145, -253239, -192629, 11630, -248009, -34183, -505763, -630072, -471485, -377649, -331354, -718703, -583751, -683066, -644252, -217171, 338886, 149331, -488515, -431738, -151554, -334625, -476738, -406882, -166461, -208528, 47538, -194486, -752113, -200699, -27767, -296908, -362359, -622144, -558304]
8909e58304P79367j57352l62430j17299Q828J10486l3368K10835N75577o13306
8899a56966j30025L50221l04527K04607j41419J52100Q4684o98293m68271O37490
8889d70399J14786L51955Q53971o78024n53799K27663l22416J42942o586j36144
8879d76051m7930m914j74494L76866J57197L48649L18012o56984n7234J19313
8869i7570m05468J81238K2061J18691K10943m55927J12189M26908j73481m97244
8859e57660N80663l61701p5843M96852m19239M11298K0181o91692N13617L12665
8849B29141l07954l14394N56718r5981j20609L32256p6834m6766m81122p7950
8839d03495L47297K0057m03398L0924L20978j61637L70856L04609o76452J76544
$$ y = [-558304, 221063, 63711, -298719, -416018, -407190, -296704, -330072, -119237, 456340, -156966, -286991, 63230, -241297, -36690, -178109, -26009, 58675, -639618, -1107889, -470399, -355613, -3658, 850313, 172289, -381510, -153847, -476263, -333321, -339907, -476051, -523981, -528895, -703389, -326523, -169326, 179323, 497335, -159649, -216883, -97570, -503038, -321800, -299739, -181048, 29895, -426032, -313843, 113065, -60416, -557660, 23003, -338698, -414541, 82311, -336928, 74370, 94551, -597141, -83524, 229141, -78813, -393207, 163511, 67530, -53079, 279177, 202343, 155577, -325545, -403495, -56198, -36141, -439539, -408615, -87637, -249274, 121582, 426191, -250261, -73717]
8829g3717j54083j39457l3355j09404k41092K00966L33756R7913k33894m65042
8819h17409J24842M17698j36973J81874j31880k09255J77604o7622K96270J80404
8809A5553m14321m19097J59508m78002K58800O57791k2952k30598k68421J77052
8799e64687L07930L26118R4551l84709m84024m07854K60436K98482L44916J81242
8789b7599J91824L04557l45217P4785j60420p61460O86551K3407k5398K97804
8779B58834k27277K47839M53050l23740m15543J71871l72922j85588P08769m21154
8769a05861K33679K67556k13575N7759J31800R9890K17594M8923o64797l09484
8759b36516K35601k60975K14501K11911k95259K99230j89429j1585r4925J09142
$$ y = [-73717, -227800, -367257, -400612, -510016, -751108, -550142, -216386, -118473, -352367, -817409, -692567, -274869, -411842, -229968, -361848, -571103, -393499, -461121, -164851, 15553, -398768, -817865, -658357, -1136359, -877559, -219768, -242720, -473318, -741739, -564687, -256757, 69361, 163912, -220797, -704821, -1112675, -852239, -553757, -208841, -27599, 164225, 468782, 123565, 198350, 37930, -723530, -36979, -13572, -38970, 258834, 31557, 279396, 732446, 408706, -6837, 165034, -207888, -393476, 315293, -105861, 127818, 395374, 181799, 239558, 371358, 471248, 688842, 737765, 72968, -236516, -915, -261890, -47389, 164522, -130737, 168493, -20936, -32521, -127446, -18304]
8749a8304k98436M95676m39685R4032O38185n69360k10529N58653L3532l07675
8739b3911M83639n24218n07009M83670l09579j36025P03137l78705L76619K08726
8729C76344n94953M33528r9993J02898J3219l47459l68955K43429k65766K58359
8719b49349K22113p76408K38130k9724l1855K99911L92178J02924k04750k82494
8709c19324M01912j42163n95208l29045M18418K44237l18755L24746J30504J14777
8699f9901k83775J79966j53356n42918O07704K30901k76278r4451r50k83973K82335
8688d04696L04776m46149l0432M71162m41453j09760N92186l36368j45948O893
8678e39789j41984n3764L45583R8504P74533n6281m92716n47259k04246J00379
$$ y = [-18304, -316740, 178936, -260749, -166717, 471468, -97892, -308421, 250232, 283764, -23911, 459728, -64490, -571499, -87829, -397408, -533433, 169704, -209001, 167618, 376344, -218609, 214919, 114926, 217824, 231043, -116416, -485371, -241942, -507708, -249349, -27236, -803644, -565514, -595238, -627093, -327182, 64996, 167920, -36830, -319324, 82588, -59575, -654783, -983828, -565410, -321173, -639928, -315182, -184678, -69901, -353676, -173710, -327066, -869984, -262280, -31379, -307657, -402108, -403058, -687031, -404696, -99920, -546069, -576501, -105339, -546792, -656552, -64366, -400734, -546682, -539789, -681773, -735537, -389954, -291450, 483083, 426802, -65914, -613173, -817419, -717040]
8668g17040Q7593J89137j6154J61473n38722Q71780K33370l95243o8809K16858
8658B4243l23621N1415L358p41293K64299L9204k87828O95221L52587m59748J29795
8647b52368k33422J37815J6293k9425L22041k42250l18996j24397K72578k68117
8637g20248M67234K46250p01165J93670j6590M15092L24913l0538k46850o8809
8627a37041P9149k24359J13251p4624j44671J4865o021L10815j47455j44929L19728
8616d1292r8553K16897k65629L50958K02659o86216P9852J79226m46709M85227
8606b3580L65780m61898K39305r9895r4300k7471n18389J11136M27650j29551
8596b11213L90802O7361j97623P6936o02270J63364o8618J08576O09089L6224
$$ y = [-717040, -629447, -440310, -456464, -294991, -833713, 38067, 271437, -123806, -192615, 24243, -299378, -247963, -244605, -985898, -721599, -682395, -970223, -275002, 77585, -382163, -252368, -485790, -347975, -331682, -361107, -39066, -281316, -600312, -724709, -452131, -720248, -253014, -6764, -707929, -514259, -530849, -115757, 209156, 178618, -68232, -137041, -57892, -282251, -169000, -243624, -388295, -373430, -379451, -68636, -216091, -361020, -41292, -139845, 77052, -188577, 162381, 365040, -321176, -241324, -62098, -508807, -23580, 342200, -119698, 119607, 19712, -74588, -102059, -620448, -509312, -81662, -211213, 179589, 246950, 49327, 126263, -476007, -312643, -381261, -272685, 336404, 372628]
8586C72628l54866K477O7564k47912K02816O83036n9896m09481N8634k19806l06446
8575b11252L24346M0415j40444Q6897j11679l82633l00607K49460J93938K11903
8565c9656p1582m0745P0106J29106j21617L29589r8906K4800j81575j47168j28316
8554b75964q7680K70305L1177J9521m72712k57387K91493M82524k85885p0023
8544c54631K88237l55569j60211L96960j54135J6980k14998n3626q9526j63511
8534h44030M51735L39416K80834P3126k58272o81801N28393R6331p4047P0308
8524a8007k94655L34064p8714k55402Q23475l06211o33140K87539j47603j99525
8514d88179K38972k95321J35767N91402K5615M3930K57702l42500J74981j01587
$$ y = [372628, 17762, 20239, 87803, -160109, 42707, 725743, 665847, 256366, 315000, 95194, -211252, 113094, 153509, 13065, 99962, -11717, -394350, -694957, -445497, -251559, -39656, -111238, -151983, -81877, 47229, -74388, 255201, 156295, 181095, -480, -147648, -275964, -363644, -93339, -62162, -42641, -515353, -772740, -481247, 1277, -284608, -354631, -66394, -421963, -582174, -185214, -339349, -322369, -537367, -590993, -680519, -844030, -392295, -52879, 227955, 301081, 42809, -638992, -110599, -14268, -88315, -18007, -312662, 21402, -57312, -312714, 510761, 204550, -428590, -141051, -288654, -488179, -249207, -544528, -408761, 182641, 208256, 252186, 509888, 167388, 342369, 240782]
8504B40782n11988l8220j02925L58345j5528k5669r6346m6011k3222J00327j39071
8493b99526K6809O174n90276L95837J45819n6013M70757R4298m00240m14985J11620
8482e09726k49825m48562R02458N77473m84604j79718Q6039L1075k25361J6270
8472d84481k42988J36105R7649K13467q8237o15999r8525R22443K00650r4020
8462e3936k13402J5571j27945P36613k25901p40247L92175n0667k96003O58028
8452I4286J32381o51693O6166L59924m3054l1644n29940J69212O56727m82802
8442b60437j05572M12744l31141N589J82169k55903J13206m8386J17111L73186
8432B02566n8154r63209J79806M02875M05127m13988j77618M48095K80749n26166
$$ y = [240782, -271206, -309426, -412351, -54006, -69534, -95203, -191549, -237560, -260782, -160455, -299526, -272717, -266543, -856819, -460982, -315163, -371176, 99581, 193879, -206361, -621346, -509726, -759551, -1208113, -305655, 271818, -212786, -392504, -306465, -275390, -500751, -484481, -727469, -591364, -493715, -280248, -368485, -984484, -1083009, -160566, 40084, -53936, -267338, -251767, -379712, 356901, 131000, -609247, -217072, -267739, -563742, 94286, 226667, -425026, -358860, 1064, -41990, -73634, -603574, -434362, 222365, -260437, -366009, 46735, -284406, -278817, -96648, -352551, -239345, -287731, -170620, 202566, 144412, -818797, -638991, -236116, 169011, -244977, -422595, 25500, 306249, -219917]
8422b19917M71758N9263p02417q895J93256l89593j63246J64835M52198M85027
8412C42269l40958J46318n90262K46899O93133l18198J07411k73722j107044O20730
8402d73424P20857p42125J3257l21690j36070R02712Q311n4542P66631o68921
8392A4996m19938K68180r3941l51425J92493N14405k39597L40081J32107j63386
8382A93975j62095k9200j94451M8685J74626j02433L49432k17268J29288p8895
8372A11664m63256k9135J04987l7127k29074L4896k02242K59380M09770p3064
8362a13201K9568J81975m95181r7549j95898J11136K64942P8425K28043m712j43442
8351a55894r7085K32940n12266K04924j93708J13219K13934L9028M60223j40398
$$ y = [-219917, 251841, 311104, -391313, -400208, -206952, -596545, -759791, -594956, -142758, 342269, 1311, 147629, -442633, -195734, 497399, 179201, 286612, 12890, -1094154, -473424, 247433, -494692, -481435, -803125, -939195, -36483, -28172, -82714, 683917, 14996, -404942, -136762, -230703, -582128, -389635, 124770, -114827, 225254, 357361, 193975, 31880, 2680, -191771, -143086, 31540, -70893, 278539, 61271, 190559, 111664, -351592, -380727, -275740, -312867, -541941, -507045, -709287, -449907, -40137, -113201, -83633, 98342, -396839, -494388, -690286, -579150, -314208, -235783, -7740, -12452, -155894, -252979, -20039, -532305, -327381, -521089, -407870, -193936, -154908, 305315, 164917]
8341A64917p6972J74646j45437J25951J56534n92595l1839L96017O3435o3645
8331A71012r1149k43679J21014k91675P4492N06277R9284j83502K30706j07857
8321B84923n11334k99111J88388n7483J3593r5667l8206L6363l4542J511O89002
8310A77437p7349n06418J75437l68000l08184L18691q7854n2482K17751k59337
8300g70308M30957r9482n22384J00952P4410J50710K73773L9730O56239l70112
8290c5515m72527j61318j29410J11058N3445M31109K70993M29391m04880j90096
8280i7750m42314j03903N45553m29903K18696O33662l76036J48498Q21774o16814
8270C01463j93409J46426j35015j97961m12963l12352M89111P6902J95540M98046
$$ y = [164917, 87945, 262591, 117154, 243105, 399639, -192956, -224795, 171222, 234657, 171012, 79863, -163816, -42802, -334477, -259985, 246292, 345576, 162074, 392780, 284923, -226411, -525522, -337134, -394617, -381024, -476691, -514897, -478534, -513076, -511565, 177437, 100088, -406330, -230893, -598893, -907077, -588386, -676240, -728722, -510971, -770308, -339351, -438833, -961217, -860265, -785855, -635145, -361372, -321642, 334597, -35515, -508042, -669360, -798770, -687712, -634267, -203158, 67835, 497226, 92346, -97750, -540064, -643967, -98414, -528317, -309621, 324041, -51995, 96503, 918277, 301463, 108054, 254480, 119465, -78496, -491459, -803811, -314700, -237798, -42258, 455788]
8260D55788j62765l06818k32578l53901L07713N77084m53955q9607K50490k08387
8250b16936p9246L12716k61490m84915M19997Q7629n08778K16466J85980J21581
8240b06996N25074l10899n81994K26246K31572m53066k53924L97003N26570Q074
8230A07660j17846M41859m90973k68196M08023m00293J41959M09785k57988M75049
8220D49039L60353q04009q5278L71615l41942q7347M44500l09349p12163K21154
8210d93427K75668K40525j57397r6344J87671N40817q5480K69486j90366m74357
8200A6796m9158K00278q0657J04506k52784j75657j27372J367293m01019j596796
8190i94570J509069m12942q18201m16440k1835L41830J029178l15270j70825K42250
$$ y = [455788, 293023, -13795, -246373, -600274, -292561, 284523, -169432, -259039, -8549, -216936, -296182, 16534, -244956, -729871, -309874, -222245, -731023, -514557, -328577, -206996, 318078, 7179, -574815, -348569, -116997, -570063, -823987, -426984, 99586, 107660, -10186, 431673, -59300, -327496, 80527, -319766, -177807, 231978, -26010, 449039, 809392, 5383, -79895, 291720, -50222, -137569, 306931, -2418, -714581, -493427, -217759, 22766, -134631, -230975, -43304, 497513, 412033, 681519, 491153, 16796, -32362, 167916, 87259, 191765, -61019, -236676, -364048, 1003245, 602226, -994570, 514499, 101557, -716644, -1133084, -1154919, -813089, 216089, -99181, -270006, -27756]
8180b7756p74118K4394J001142j14106m65004R141m8377O7308O391J40873N79755
8169C99643N0451J60070l20780l09570J27572j88613j29102M94203J4794j96741
8159A01927K69306o21975j61330M33913n996l24491J48476Q3947L93080m54099
8149a37242M10620K35040p33846K75682J19874j62841l23023J62765j92545k7751
8139c73267L37970M65142j89518o94997J11249k94717j3336M08170N6464k44038
8129d30878K74512o61191J68155L97266p74377P2437K06657O1539N44498n6115
8119a97497n66950Q7351N8034K19142K50412k35006k12781n10719l4688O78957
8109d63745J29159o41381K98419j02554k56053R6872J38067L98972o1922L01543
$$ y = [-27756, -801874, -777480, 223662, 109556, -355448, -346307, -394684, -327376, -320985, -180112, 399643, 450094, 610164, 289384, -20186, 107386, -81227, -210329, 283874, 298668, 101927, 371233, -250742, -412072, 21841, 15845, -308646, -160170, -76223, 316857, -137242, 273378, 508418, -225428, 50254, 170128, 7287, -315736, -152971, -345516, -373267, -35297, 429845, 240327, -454670, -343421, -638138, -651474, -243304, -186840, -430878, -156366, -817557, -649402, -252136, -1026513, -954076, -747419, -685880, -141382, -197497, -764447, -677096, -619062, -399920, -149508, -384514, -597295, -1108014, -1142702, -463745, -334586, -975967, -677548, -780102, -1036155, -939283, -801216, -402244, -464166, -162623]
8099a62623l64443L42837N53299m87379k4807J14324q83415L78589Q51750o5260
8089B52872q35q1725j60506l58277O1219M2270P65835m25143m73969J26030k94490
8078e46719L3009L85697M59211J92674J95040o43447k80906l5584N53166L11084
8068F23225l62383l58470k48970r0722L43654N7794l08982N74029R4240N823K11443
8057E40681n63414m60427M07863l48665j12961L85548L09324P7623j43060L94313
8047D86825m27669r1089K29087K6816J90270k68072m90851m0290l4067L18544
8037a00496O50520k13675j21895K53291o94144M1249k79988j35060L16078J00839
8027a83281l8453J98651J45357j25304k8995L23970n32685q1635K49505j42790
$$ y = [-162623, -527066, -184229, 369070, -118309, -143116, -28792, -912207, -533618, 318132, 252872, 252037, 170312, 9806, -348471, -287252, -244982, 520853, 95710, -378259, -252229, -546719, -513710, -128013, 331198, 523872, 718912, 75465, -205441, -241025, 312141, 623225, 260842, -97628, -346598, -437320, -93666, -35872, -344854, 229175, 323415, 329238, 540681, -22733, -483160, -75297, -423962, -536923, -151375, 157949, 235572, 92512, 486825, 59156, -31933, 197154, 223970, 414240, 146168, -344683, -384973, -419040, -100496, 550024, 336349, 214454, 467745, -226399, -185150, -465138, -600198, -284120, -183281, -221734, -23083, 122274, -3030, -32025, 291945, -240740, -322375, -72870, -215660]
8017b15660j5725l17033J69456O9919L89729n7393k1745l46129k17979L57063
8007b05497o5386r7531P33552j51576j07539l02818l63305L71223j57608R0291
7997b56194O11003p9536k54760N31620j62973j32590K28523n11459j45582J37044
7987c4904K26545l2407m16362P1386J92905K33337J41766j20709k30323k88928
7977b57694J54531l890P0447K18079J74406j20913k58696k34894j511L82868J19738
7966B42471j58761j84329K0269O4002J18942K34268q31277m60107N31108k87830
7956g11244K52232O8441n9550J12406J2804l2459P5290o9281o4722O21364l8996
7945A66285p17436R2588J74772N6953K69718K12794o30891j23799L79349m88033
$$ y = [-215660, -231385, -548418, -378962, -309043, 80686, 23293, 1548, -344581, -562560, -205497, -270883, -368414, 365138, 213562, 106023, -196795, -560100, -188877, -346485, -256194, 354809, 275273, 20513, 552133, 389160, 256570, 485093, -26366, -171948, -34904, 191641, 159234, -257128, -185742, 7163, 240500, 382266, 261557, 31234, -257694, -103163, -107053, -36606, 181473, 355879, 234966, -23730, -258624, -260135, 122733, 242471, 83710, -100619, -80350, -16348, 102594, 336862, -494415, -954522, -423414, -711244, -459012, -390571, -450121, -337715, -324911, -357370, -282080, -351361, -416083, 205281, 166285, -551151, -458563, -283791, -226838, 42880, 255674, -375217, -499016, -119667, -607700]
7935f07700O45147m85855p96777Q10473J63458j56616N04960k02146q1989M35400
7925B28355j4094n47760K01949k12722J90418K50617m87281r354O768L75216K03859
7914A85971J86677l29948J97781M63000p07911k27044L37106p40362M53101L36651
7904A55022n32063J46136k31762j96586O55210J21222m57344N42851j80392p40554
7894g18260K48200J29835J10496R6053K45851J28399j05477j14709J35547o9583
7884H6352n98343j00792K8865k5678M27182O04193l47715l35585k35464k3534
7874e20519Q52161l29650m59971J87581k40324q1383J00902p2055N67546k59515
7864b55227o2039M15338l21812m8822J58422K50878M1646j87542p21998L70360
$$ y = [-607700, 37447, -448408, -1245185, -434712, -271254, -427870, 77090, -125056, -207045, 228355, 214261, -333499, -131550, -344272, -153854, 96763, -390518, -399872, -393104, -17888, 185971, 372648, 42700, 240481, 703481, -4430, -231474, 105632, -634730, -181629, 155022, -377041, -230905, -462667, -659253, -4043, 117179, -340165, 202686, 22294, -718260, -470060, -340225, -229729, -133676, 112175, 240574, 135097, 20388, 155935, 86352, -511991, -612783, -583918, -609596, -182414, 421779, 74064, -261521, -496985, -520519, 331642, 1992, -457979, -270398, -510722, -592105, -491203, -563258, 4288, -255227, -317266, 98072, -223740, -272562, -114140, 136738, 178384, -9158, -731156, -360796]
7854c60796P5601o49966L78874M24784J73954j44442j80963J39548k349k34197
7844c79952J18384M15753l43064l08796M92487K40957j96457j27692k00998M09350
7834A19972k50262l91760K53758q9040l17163O39733N85215m59258J5524l45027
7824b38308k8739k0232J50599J24264K40311J15939k85464M23740l86284j58413
7814f2587J05069r4333J57399P333r1899M67114J63564J5539J05322n99579j14926
7803E8016N18347L6951j60699J06925j262704L28714Q6189L50149R15852N2395
7793A030135j07152n06383k48985l03437L01019m33333o3360N81583J62053J77324
7783E89464J86301J9890j61699k95140j7515l71534m502k16487K26811O73616
$$ y = [-360796, -285195, -935161, -556287, -131503, 42451, -101991, -282954, -143406, -145755, -379952, -261568, 154185, -188879, -497675, -5188, 235769, 39312, -88380, -289378, 119972, -130290, -522050, -268292, -357332, -674495, -34762, 550453, 91195, 106719, -238308, -267047, -287279, -136680, -12416, 227895, 343834, 58370, 482110, 95826, -62587, 42482, -51851, 105548, 112881, 20982, 488096, 651660, 667199, 772521, 172942, 58016, 576363, 613314, 452615, 559540, -703164, -374450, -288261, 61888, 977740, 1030135, 922983, 416600, 167615, -135822, 165197, -268136, -331496, 250087, 412140, 589464, 775765, 795655, 633956, 338816, 321301, -50233, -54735, -271222, -44411, 629205]
7773F29205o87720J58823K99145p0071O8490j88724L64354j02536o02771N7854
7763g3951O72121n68859O8876N09819p90957L39739R5316j02978M56909m39378
7753A66657L29125R0227n03737j86663R4069M22q2060j54645j09197L93770N5067
7742I3035n4091N87008k80070j09650N65619l08106r10345k11632L01246R21514
7732E94528J62430m58175p6137l89173k72254K38929O06121k15127K69351j57013
7722C03480J16163N53262k37971l01084L6836l44357j62601j68461L46603N25534
7712F67404q1131r543L7006j98043p106M67104K54622n43569n91478L59866L01122
7701F56254k08584L66193l51461k1929K48977l28042N5819k35646L1401M11499
$$ y = [629205, -58515, 100308, 399453, 329382, 397872, 209148, 573502, 470966, -131805, -73951, 598170, 29311, 98187, 608006, -182951, 156788, 252104, 149126, 606035, 166657, 495782, 586009, 82272, -104391, -10322, -9900, -91960, -246605, -355802, 37968, 93035, 38944, 625952, 345882, 236232, 801851, 493745, -416600, -628232, -326986, 594528, 756958, 298783, 222646, -166527, -438781, -199852, 406269, 191142, 460493, 303480, 419643, 972905, 734934, 433850, 470686, 126329, -36272, -204733, 141870, 667404, 586273, 576730, 613736, 415693, 408587, 875691, 1130313, 586744, -4734, 355132, 656254, 447670, 813863, 462402, 440473, 689450, 361408, 417227, 181581, 212982, 624481]
7691F24481J28510L00646q0569J28150J292630L17445q66045J04940l85972l89243
7681A174973O48851j12415J51370O03656j95946k51341K87950o86799l38700N4030
7671A335629k14138J17824M47928M9318k65788l60409j84337n14393k17335P4928
7661B69227O4456k52727j81157L04398J68547N55492L16570j50952k14947l42306
7651E36601l60450k74925J35343l6289r6801L37436M16513K04982n75779R7693
7641C84324k15670p23679K29453L25117J01506M93149J33444q6296j39068j99977
7631C02303J35164k1825k57739m83689j07525K26122K83956K22314m1065M14484
7621F72500l6635k89432j63738k33288O08066j84348j29801J51122n91785k64853
$$ y = [624481, 752991, 1053637, 973068, 1101218, 2393848, 2711293, 1845248, 1950188, 1564216, 1174973, 1823824, 1711409, 1862779, 2466435, 2270489, 2019148, 2307098, 1620299, 1281599, 1335629, 1121491, 1239315, 1687243, 1736561, 1470773, 1110364, 926027, 411634, 194299, 269227, 333683, 80956, -100201, 204197, 372744, 928236, 1244806, 1093854, 878907, 536601, 176151, -98774, 36569, 280, -96521, 240915, 657428, 862410, 286631, 384324, 168654, -555025, -325572, -455, 101051, 594200, 727644, 641348, 502280, 302303, 437467, 415642, 157903, -325786, -433311, -207189, 76767, 299081, 258016, 672500, 635865, 346433, 182695, -50593, 557473, 373125, 243324, 394446, -197339, -462192]
7611d62192N50965L49128P9507p5422n87039p6067K06213L47515N91979l255j42639
7600G78693n8454p42768L99839P9935o94484L60596k63402l37517L62419J01239
7590a3904K26401N19083o26664m02801K30346p8063N38474Q40702n17675m43159
7580B72740j57251k34340J17059L10518M37528l73395p5527J53586P5560O9909
7570E96387j03800j83596m9963J50802K92047n92697l86577M48532J65185K86419
7560F22739L10924n0844j04060k53150j63944k0902L78305K4922L91950j3013
7550A122927J22132K51973k41829j90104j09706m21775j80403L25627j04655J54028
7540G28215L48781K09252j21692K34078l35845M65335K44718m03796L82013O22326
$$ y = [-462192, 88773, 437901, 517408, 441986, -145053, -221120, -14907, 332608, 924587, 921332, 778693, 720239, -22529, 377310, 457245, -237239, 123357, -140045, -477562, -115143, -13904, 212497, 731580, 104916, -297885, -67539, -145602, 392872, 1233574, 715899, 272740, 115489, -118851, -1792, 308726, 746254, 372859, 297332, 450918, 526478, 596387, 492587, 308991, 259028, 409830, 701877, 109180, -277397, 171135, 336320, 622739, 933663, 882819, 778759, 525609, 361665, 340763, 719068, 743990, 1135940, 1122927, 1245059, 1497032, 1255203, 1065099, 955393, 533618, 353215, 678842, 574187, 728215, 1076996, 1286248, 1164556, 1398634, 1062789, 1528124, 1772842, 1369046, 1751059, 2373385]
7530B373385r10575n0236L85974o08641O43010M55805q00454r082K41881n50551
7520A170516J85001O9613P9568M24951m74878J05002J83475o46085J43064l6616
7510A203611m38629N12036L51576N2860K44928r0122l4113k0678k82926l58980
7500A139563K13548l70690L94884J5536m17189j27577P1721M66188K9722N92272
7490B007978o03657m06775L50978k98913j7445M27764J65669l01306K82642J14465
7480A721400j29378M61049j43345j21905n8547n77596J72652L25722L16371M14302
7470B380725M47161k95928l61888J03169l76792M68967m435l81557L33627L17885
7460B630934K80561L87688m44506k45207J75957r7980O08073J52178m78922j4798
$$ y = [2373385, 1462810, 1412574, 1798548, 1189907, 1832917, 2288722, 1488268, 1479186, 1721067, 1170516, 1355517, 1425130, 1504698, 1929649, 1454771, 1559773, 1743248, 1097163, 1240227, 1203611, 764982, 1277018, 1628594, 1681454, 1926382, 1836260, 1802147, 1781469, 1498543, 1139563, 1353111, 982421, 1377305, 1392841, 975652, 848075, 919796, 1385984, 1415706, 2007978, 1404321, 997546, 1348524, 1049611, 1032166, 1459930, 1625599, 1324293, 1606935, 1721400, 1592022, 2053071, 1909726, 1787821, 1729274, 1151678, 1324330, 1650052, 1966423, 2380725, 2827886, 2531958, 2170070, 2273239, 1896447, 2365414, 2360979, 1979422, 2313049, 2630934, 2911495, 3299183, 2854677, 2609470, 2785427, 2687447, 3295520, 3447698, 2968776, 2953978]
7450B953978K20942j98327M73608M43529J38161J00749k16907l92765l72071Q0126
7440C231023K97843O72990M01045J17234J62313k19919n60605Q8633J16052j24417
7430D182192O13750l82552m75611L80514J58005k18105J56378M03050J97258L69625
7420E384504M4075J22775j21400l75454l1950J88574N59287P79280K62818l02382
7410F510127O78743K20769k51085N12202L16682J82072R18307N62255o2461R22987
7400A0510598Q32204J86526Q20523O95020N12655J228380M52433O77480J065908
7391A6981727N77603P28965J142434m4005O47422J009924J90440L73105K6753
7382B1634368K49487K25577m26614K54193k35066q50937k50149m04078j136774
$$ y = [2953978, 3174920, 2976593, 3450201, 3893730, 4031891, 4132640, 3915733, 3522968, 3150897, 3231023, 3528866, 4201856, 4602901, 4720135, 4882448, 4662529, 4101924, 4190557, 4306609, 4182192, 4795942, 4413390, 3937779, 4318293, 4476298, 4258193, 4414571, 4817621, 5014879, 5384504, 5428579, 5551354, 5429954, 5054500, 5022550, 5211124, 5770411, 6549691, 6812509, 6510127, 7188870, 7409639, 7158554, 7670756, 7987438, 8169510, 9087817, 9650072, 9587611, 10510598, 11342802, 11529328, 12349851, 13044871, 13557526, 14785906, 15238339, 15915819, 16981727, 17559330, 18288295, 19430729, 19386724, 20034146, 21044070, 21234510, 21607615, 21634368, 21883855, 22109432, 21682818, 21937011, 21701945, 20851008, 20600859, 20196781, 19060007]
7373A9060007o57471q36960r37073l84259r4319K64575m40695m63939l46590m73289
7363A4689987l55055L30099p18930m79878j1122p1834J14913K64304m7486O27921
7353A4342919L47615k67923K66696J94919j36020J29206N77713J98122R19370
7344A6572617O18215P92147R64428M95099L91178n0641L97433N74246J116109
7335B1870831J733005J593649J588578K155785K946223K657458K092206K594989
7327C9232724K302604L085007M473951M831179N951718P264372Q813421J0142176
7319H6097152J4097669K0938251K8364928L7131388M5537510M7880249L8702429
7312C18749576K3002880N377149q976675j0887858j910997J1061974K3411775
$$ y = [19060007, 18402536, 17565576, 16628503, 16244244, 16149925, 16414500, 15973805, 15509866, 15163276, 14689987, 14334932, 14665031, 13946101, 13466223, 13455101, 13383267, 13498180, 13762484, 13714998, 14342919, 14690534, 14422611, 14689307, 14884226, 14748206, 14877412, 15455125, 15653247, 16572617, 17190832, 17982979, 18947407, 19442506, 19833684, 19783043, 20180476, 20754722, 21870831, 23603836, 25197485, 26786063, 28941848, 31888071, 34545529, 36637735, 39232724, 41535328, 44620335, 49094286, 53925465, 59877183, 67141555, 75954976, 86097152, 100194821, 121133072, 149498000, 186629388, 232166898, 280047147, 318749576, 341752456, 347129605, 338152930, 327265072, 325354075, 336416049, 359827824]
7305C59827824K6321639J6146828p43945k0150903l6304552m2542831l9885743
7298B62668317l4122639k7286180k2194485j8053093j5073786j4185056j3642297
7291A18110781j2854479j0846979j0226859r401970p702429p482366p350567n660717
7283D6584415n114683m277415k529478k868319k226528j688350j219353j450622
7275B5209667r97549q57288j084247j518533j166332n31560r50160j60569j89203
7266A7754226p09794r59873m41231o27805q21045n34556j52363l29553p48476
7257A2429530l58292j00769l67223j63405P3127q44248q28495m88455l70680J97749
7247I178839r9404M92803L73773j98624k48349r1316j00736K0457n86998n01303
$$ y = [359827824, 386149463, 402296291, 401552346, 381401443, 345096891, 302554060, 262668317, 228545678, 201259498, 179065013, 161011920, 145938134, 131753078, 118110781, 105256302, 94409323, 84182464, 74780494, 67078065, 59595699, 52245132, 46584415, 41469732, 37192317, 34662839, 31794520, 29567992, 27879642, 26660289, 25209667, 24212118, 23354830, 22270583, 20752050, 19585718, 19054158, 18103998, 17943429, 17754226, 17044432, 16084559, 15643328, 15015523, 14194478, 13659922, 13507559, 13178006, 12429530, 12071238, 11970469, 11603246, 11439841, 11512968, 10668720, 9840225, 9351770, 8981090, 9178839, 9079435, 9572238, 9946011, 9747387, 9499038, 9407722, 9306986, 9327443, 8740445, 8239142]
7237H239142J25199k60249k09692L76777m74478m23365L35440m32791k25052m3965
7227G006966K65906M3119n38616o75487J93671M8845l26017M64493l70m72779
7217F009731L88976p9846o65055K78288L52379q7175K71540p32530q0278l59207
7207E296823l13744J22003P1352l32803k67010o49046o13773L75608K92925k50439
7197C731896n1506L06048k46622K02700k00041k5781J42988m54605n69072L14206
7187C150211J11582k1870M64924J47827J7378N00698Q5854n7071N6616l62333
7177D093816k99743N93021j68148l92744L05706j46501l67787K69414O863K41870
7167D135767l26092l20960N34134o18498m83425K83385k31162m07086Q06289q1921
$$ y = [8239142, 8364341, 8104092, 7894400, 8271177, 7796699, 7373334, 7708774, 7275983, 7050931, 7006966, 7272872, 7315991, 6777375, 6101888, 6295559, 6344404, 6018387, 6482880, 6482510, 6009731, 6398707, 6318861, 5653806, 5932094, 6284473, 6197298, 6468838, 5736308, 5656030, 5296823, 4983079, 5105082, 5176434, 4843631, 4576621, 3927575, 3313802, 3689410, 3982335, 3731896, 3680390, 3986438, 3739816, 3942516, 3742475, 3716694, 3859682, 3405077, 2836005, 3150211, 3261793, 3239923, 3704847, 3852674, 3870052, 4370750, 4456604, 4399533, 4456149, 4093816, 3794073, 4387094, 4218946, 3826202, 4131908, 3985407, 3617620, 3887034, 3893897, 4135767, 3809675, 3488715, 4022849, 3404351, 2920926, 3204311, 2973149, 2566063, 3372352, 3290431]
7157C290431p66469R6440k08363J11325K83590j86892l86761l08290k56657M46772
7147B115126R9994l49658k82296K62486l07407q9196l8286r5247j02488j89308
7137A023720p6344k26606K11053k58770q7412m18804j68076n9096K86544L8420
7127B64629o5140J49017n4867M20182p4348k87715m1528J74334l85358K34469
7117C33675P31260m86526j13364O3375J16040M66212Q6666p05517j23863M28618
7107G96576L10666k0881q5659K55768j67001L5845M80849j6057n03581M54715
7097A541240K26468j64633K47617J99501L40984l08842l65865K61704O30427k83381
7087B325220N30952J10231o01984J83800M3405m67731j63152m67826l62844q7665
$$ y = [3290431, 2523962, 2620402, 2412039, 2523364, 2806954, 2620062, 2233301, 1925011, 1668354, 2115126, 2215120, 1865462, 1583166, 1845652, 1538245, 1449049, 1410763, 1315516, 1213028, 1023720, 947376, 720770, 931823, 673053, 585641, 166837, -1239, -60335, 226209, 264629, 199489, 348506, 293639, 713821, 639473, 351758, 310230, 484564, 99206, 333675, 1064935, 578409, 465045, 528420, 644460, 1110672, 1197338, 491821, 367958, 796576, 1107242, 1086361, 1000702, 1256470, 1089469, 1125314, 1606163, 1590106, 1086525, 1541240, 1767708, 1603075, 1850692, 2050193, 2391177, 2082335, 1716470, 1978174, 2608601, 2325220, 2856172, 2966403, 2364419, 2548219, 2591624, 2123893, 1960741, 1492915, 1130071, 1042406]
7077A042406j57721M55201J5470Q8407J07643n60655j57790P20671k31767K56951
7067A578816M70719n66085k49960j36221R8271M31812K51006O42791P62066P6459
7057C359674R45943K99040r44735j08290k17766p14058K22413k88537j054457
7048A499227K78556L80923j16569o05694k87840j11840j89359L7609N48350K20062
7038A653425n86773L4463L5342j84958K47851J08639l4477j76711r7883K35848
7028A234766Q9066j01110l78404K41099N40027k7656j16142J14595K19211K94147
7018B109599N70871M80703n5446m3889p70308q9890L46845m84794M57205Q458
7008B529354p61912K5487J34493N83949Q08354l41668p22707k18028o1624M49931
$$ y = [1042406, 884685, 1339886, 1355356, 1443763, 1551406, 990751, 832961, 1553632, 1321865, 1578816, 2049535, 1483450, 1233490, 1097269, 1195540, 1627352, 1878358, 2521149, 3283215, 3359674, 4305617, 4604657, 3659922, 3551632, 3333866, 2619808, 2842221, 2553684, 1499227, 1777783, 2158706, 2042137, 1436443, 1148603, 1036763, 847404, 885013, 1433363, 1653425, 1066652, 1101115, 1136457, 951499, 1199350, 1307989, 1273512, 1096801, 998918, 1234766, 1323832, 1222722, 844318, 1085417, 1625444, 1597788, 1481646, 1596241, 1815452, 2109599, 2680470, 3161173, 3105727, 3061838, 2291530, 2201640, 2548485, 2063691, 2520896, 2529354, 1767442, 1792929, 1927422, 2511371, 3319725, 2978057, 2255350, 2037322, 1975698, 2425629]
6998B425629K61517p42998K28189k00539o50372N41745M13170l42549L29098M68941
6988B731831M7823l25850J95543J53700K45198K15349M47219j61031l67555j81916
6978C000311q6116P03068K15054j81790Q3988K39265k63345N2317L16917J72591
6968D252260J44097m36696n39661K96708k35835j37744J92952R3888l60325R204
6958C278848L8377M5272l05924q0502P12394Q4754o14033L92225k50103J11020
6948C412328J91422n64691L0286K98295m47770m4518R26674K72598J98975L54101
6938D627700q6922l67667k02997k9124O89372J4054j95099L69080K85896m78673
6928D625620M53342O69979l51364n31340l02384k64114L43637J73391K8155N64591
$$ y = [2425629, 2687146, 1944148, 2172337, 1971798, 1321426, 1863171, 2276341, 1933792, 2262890, 2731831, 2779654, 2453804, 2649347, 2803047, 3048245, 3263594, 3710813, 3549782, 3182227, 3000311, 2914195, 3617263, 3832317, 3650527, 3734515, 3973780, 3710435, 3762752, 4079669, 4252260, 4396357, 3959661, 3420000, 3716708, 3480873, 3343129, 3536081, 3629969, 3269644, 3278848, 3317225, 3362497, 3056573, 2976071, 3688465, 3773219, 3159186, 3551411, 3301308, 3412328, 3603750, 3039059, 3069345, 3367640, 2919870, 2875352, 3802026, 4074624, 4273599, 4627700, 4540778, 4173111, 3970114, 3940990, 4630362, 4644416, 4449317, 4818397, 5104293, 4625620, 5078962, 5748941, 5397577, 4866237, 4563853, 4299739, 4643376, 4816767, 4844922, 5409513]
6918E409513k2306k15797o4465o01548J23458K28786j35378j48399K26204j54480
6908D645588K38386L33407l19645O59715L1088m66170M09601k35931N07134K60561
6898F063734o71698K12648N53086J53732l127K98751k17216R00607O22432m97054
6888G415895J99657p35284J56126P31773K34930N95355l09603q9222M37429P01469
6878I338525m53872L04085Q80762J85349j54587M93701N4959J53113J020964Q88612
6868A2711611J04970N67043O65790O03203J061836N87679Q60830O43326J660204
6859A9466492J189395J545839J935951J841938K180972L111373L708736L653501
6851C8634197N832448Q322752J1396333J4930427J7033983J8364411J5809779
$$ y = [5409513, 5387207, 5171410, 5106945, 4505397, 4628855, 4857641, 4722263, 4573864, 4800068, 4645588, 4883974, 5217381, 4897736, 5557451, 5588539, 5122369, 5531970, 5296039, 5803173, 6063734, 5392036, 5604684, 6157770, 6311502, 6308375, 6607126, 6389910, 7290517, 7912949, 7415895, 7615552, 6880268, 7036394, 7768167, 8003097, 8598452, 8288849, 8199627, 8637056, 9338525, 8884653, 9188738, 10069500, 10254849, 10100262, 10593963, 10648922, 10802035, 11822999, 12711611, 12816581, 13383624, 14049414, 14652617, 15714453, 16302132, 17162962, 17806288, 19466492, 20655887, 22201726, 24137677, 25979615, 28160587, 31271960, 34980696, 38634197, 44466645, 52789397, 64185730, 79116157, 96150140, 114514551, 130324330]
6844A30324330R128993L074501j864959m460639l569647O23021M109700N500225
6836A42865525L270885k238236o628901j0740856j4439699j5514029j3681546
6829H2893143j1354608r244705o602358n503321l561212k298566j104440k27044
6821D2996889p81972J48686P80100J167925J504956J754160K738800M541376N538668
6812F0389588P405266J0692926J3953072J8348758K3703039K6569576K5154025
6805A86216250J8337529Q571617J597577l757143n573941k659107L062015P233334
6797B13028131Q156155J730235o753923j2381483j7615558k0201153j8898076
6790A47064328j5923236j4224522j2994245j3510317j1888743q436131n528846
$$ y = [130324330, 139453323, 142527824, 140662865, 136202226, 132632579, 133255600, 137365300, 142865525, 146136410, 143898174, 137269273, 126528417, 112088718, 96574689, 82893143, 71538535, 62293830, 55691472, 50188151, 46626939, 44328373, 43223933, 42996889, 42214917, 42363603, 43143703, 44311628, 45816584, 47570744, 50309544, 54850920, 60389588, 67794854, 78487780, 92440852, 110789610, 134492649, 161062225, 186216250, 204553779, 213125396, 214722973, 210965830, 205391889, 202732782, 205794797, 213028131, 221184286, 222914521, 216160598, 203779115, 186163557, 165962404, 147064328, 131141092, 116916570, 103922325, 90412008, 78523265, 70087134, 64558288]
6783F4558288k772988j158816l15339j681542l986453n108184n153784l834597
6775D0546585l848417l529906k182290k012135j974959j044907q06740o30909
6767B4516322j08153L92912J64420M19609N01421Q33105Q96118O5368o44311K92400
6757B7329211J372551J248047K305136L221662M293433M680517N469795L658818
6749E3579170r67533l973041l709725j952037q47334J184740K415427L002550
6741D8732217J485640l289664o007020n241540m869332l751821k728079k451686
6733B1878715l057745j612586r10652n22883L2145j060338p84223j28247p78800
6724A3055386m93038q8941J77658j49482j87228k25303o33026j92089k34866N38390
$$ y = [64558288, 61785300, 60626484, 60311145, 58629603, 54643150, 49534966, 44381182, 40546585, 36698168, 33168262, 30985972, 28973837, 26998878, 25953971, 25147231, 24516322, 24408169, 24801081, 24965501, 25385110, 25886531, 26719636, 27615754, 27681122, 27036811, 27329211, 28701762, 29949809, 32254945, 35476607, 39770040, 44450557, 49920352, 53579170, 52611637, 48638596, 44928871, 42976834, 42129500, 43314240, 45729667, 48732217, 50217857, 46928193, 40921173, 35679633, 30810301, 27058480, 24330401, 21878715, 18820970, 17208384, 16297732, 15774849, 15806994, 14746656, 13962433, 13834186, 13055386, 12562348, 12473407, 12651065, 12501583, 12314355, 12089052, 11456026, 11263937, 11029071, 11567461]
6714A1567461K45120m75436m55863J74598J66436M3554J46033l48099R4122O66091
6704A1824017n86993M47604K12175p46378J14644J70063n87906K59156O14434
6695A1720816K4522L18369q0938M12795N42817J3169j14074Q9495j99016L96127
6685A3124082K61801P483N67396R65215O00246P57877Q32508Q802J19454R54448
6675A8199312Q29805N50752J404272P10341O05608P12317J105511P15905J171764
6666B6005587J389576J424117J942364J902452K499739L106428L482868L994678
6658D5747809L790795M624888O699039Q793253J1658702J6553522K2565889K9355511
6650A49789408L7042303L9751776L7738036L1031797J8449097J905192j3487558
$$ y = [11567461, 11812581, 11337145, 10881282, 11055880, 11222316, 11265870, 11411903, 11063804, 11157926, 11824017, 11237024, 11684628, 11896803, 11150425, 11265069, 11435132, 10847226, 11106382, 11720816, 11745338, 12063707, 11982769, 12395564, 12938381, 12951550, 12837476, 12926971, 12727955, 13124082, 13385883, 13393366, 13960762, 14925977, 15526223, 16284100, 17116608, 17125410, 17244864, 18199312, 19029117, 19579869, 20984141, 21694482, 22300090, 23012407, 24117918, 24833823, 26005587, 27395163, 28819280, 30761644, 32664096, 35163835, 38270263, 41753131, 45747809, 49538604, 54163492, 60862531, 69655784, 81314486, 97868008, 120433897, 149789408, 186831711, 226583487, 264321523, 295353320, 313802417, 315707609, 302220051]
6643C02220051k6045128l4605760l6559615l4105213k9341321k4318475j9227881
6636I8016658j4858265j0729055q012365n588222m798341l038056k040578j605117
6628D7346659j323472r53922p93429k70793R39341N51760Q46650J079676N81435
6619D8003905K331421K658445K409365M740184O876901R236501J3025875J6720953
6611A06003550K1309376K5540393K6767107K5006147J8402629Q593370k021875
6604B29600697j1695667j8935089k2208223k2897236j9994982j6576005j3742290
6597A03551205r241684n061808j884747J506657N064942Q021710J2787549K0943906
6589A35687730L8845241O1755710P1509030Q1625293Q5033022L3951755m6563700
$$ y = [302220051, 276174923, 241569163, 205009548, 170904335, 141563014, 117244539, 98016658, 83158393, 72429338, 64416973, 58828751, 54030410, 50992354, 48951776, 47346659, 46023187, 45069265, 44275836, 44005043, 44944384, 45496144, 46342794, 47422470, 48003905, 50335326, 52993771, 55403136, 60143320, 67020221, 76256722, 89282597, 106003550, 127312926, 152853319, 179620426, 204626573, 223029202, 231622572, 229600697, 217905030, 198969941, 176761718, 153864482, 133869500, 117293495, 103551205, 94309521, 89247713, 87362966, 88869623, 93934565, 101956275, 114743824, 135687730, 174532971, 236288681, 307797711, 389423004, 474456026, 508407781, 461844081]
6582D61844081p6831330p2595471o1237940m7792910m0743547l6861090k8582560
6575I7199233k0111869j2730036q061236o684364m444893m083754k712748j762506
6567C6607827k159455k191095k182222j843917j071657j577871l06694q36896
6559B4438020p65269j21060q58035j322612j118451p93850n14947q43979p55774
6550A7344043l50688o9890k970O00768l78883k20899p43621m53298K47729l89568
6540A5582723m47266K68686O1511M37206M34769k96073l42530J25739J024222
6531A6848987J040351J618597J764723L124658M765661O704568Q132144R231742
6523E3231431Q981572N602844J562595k479801o880376r031821q259529p455035
$$ y = [461844081, 385012751, 312417280, 251179340, 203386430, 162642883, 125781793, 97199233, 77087364, 64357328, 56296092, 49611728, 45166835, 41083081, 38370333, 36607827, 34448372, 32257277, 30075055, 28231138, 27159481, 25581610, 25274916, 24438020, 23672751, 23551691, 22693656, 21371044, 20252593, 19458743, 18943796, 18099817, 17344043, 16993355, 16923465, 16920495, 17521263, 17142380, 16921481, 16177860, 15724562, 15972291, 15582723, 15135457, 15404143, 15465654, 15902860, 16337629, 16041556, 15699026, 15824765, 16848987, 17889338, 19507935, 21272658, 24397316, 29162977, 35867545, 43999689, 53231431, 62213003, 67815847, 69378442, 66898641, 60018265, 50986444, 42726915, 35271880]
6515C5271880n930415m541865l244868k450583j533640j361290q98340p60564
6507A4550315j333901p66446o59707n50979n4873K94119J07831k46634r4733j68109
6497A1076883J63699M16868N48333M7241j34197N23851N47044J771294K148371
6488A7109387L058630M843192N043638P281840O938087L857469J222536j438972
6480D7915807m708515o337228n642234n827725m613091l503313k839171j821715
6472A2622815j335163q40315o89373q93261l64170m62124M9783l73371l62523
6463G352298l82136q3230M61020R397O6218p86211K23652M08608J67750j87290
6453G250076m21258n1388m31315m20532l89271k7604M7262j44190L17986j30366
$$ y = [35271880, 29341465, 24799600, 21554732, 19104149, 17570509, 16209219, 15310879, 14550315, 13216414, 12449968, 11790261, 11239282, 11184409, 11478528, 11586359, 11339725, 11244992, 11076883, 11240582, 11657450, 12205783, 12253024, 12118827, 12642678, 13189722, 14961016, 17109387, 20168017, 25011209, 30054847, 37336687, 44274774, 48132243, 49354779, 47915807, 43207292, 36870064, 31227830, 25400105, 20787014, 17283701, 14444530, 12622815, 11287652, 10447337, 9757964, 8864703, 8500533, 8038409, 8088192, 7714821, 7352298, 6970162, 6886932, 7347952, 7357349, 7423567, 6637356, 6861008, 7269616, 7437366, 7250076, 6828818, 6777430, 6346115, 5925583, 5536312, 5508708, 5555970, 5411780, 5729766, 5599400]
6443E599400l59332j20758O43439Q25190m2230Q46015L51834J009362J363468
6434A0116388M22745N18667j11361j089230p78213p01487j588275q79532K4240
6425E933942n05930Q2335n30925p74291n66602n51752M55766k26521J15310K46817
6415C678149k47014L32796k85223m07433k6808q638N6310j20281J31986j69189
6405B934655K98904p1525L42151K44681j64585Q94783L35843j5143N60693J91682
6395E552139P46133J341039K94130k07478o59384j131629j166860m30758r41395
6386C395937k97108R3767j99969J8175m98539m19663r7120O6503J13815q2257
6376B093541j27842j56987r0882L03035J68175M82176l18088l22299J27261m13505
$$ y = [5599400, 5240068, 5119310, 5762749, 6587939, 6545709, 7391724, 7743558, 8752920, 10116388, 10539133, 11057800, 10946439, 9857209, 9078996, 8377509, 6789234, 5909702, 5933942, 5428012, 5510347, 4979422, 4205131, 3638529, 3086777, 3542543, 3316022, 3431332, 3678149, 3431135, 3763931, 3478708, 3071275, 3044467, 3035829, 3092139, 2971858, 3103844, 2934655, 3233559, 3162034, 3504185, 3748866, 3584281, 4479064, 4814907, 4799764, 5360457, 5552139, 6298272, 7639311, 7933441, 7725963, 7066579, 5934950, 4768090, 4337332, 3395937, 3098829, 3192596, 2992627, 3010802, 2512263, 2092600, 1995480, 2061983, 2175798, 2093541, 1965699, 1808712, 1717830, 2020865, 2189040, 2671216, 2353128, 2030829, 2158090, 1744585]
6366A744585k90882o0304L61832n31911k28440N27643o44929K76281J89145o94889
6356F48131k05321l3555l34582M65378J38028l74907N93475j55953m83368L24116
6346E81442n31250j48073N82685o01784M5087k76071L8583M36434P2512Q3743
6336B83308J72658J2618k32039K06474q8015k26562O7825j04956K89694J74784
6326E55789j53644L7554K95890L1757j09109K18078j32338j49208J59511Q1881
6316H36161P1753j65943m28202J01297k11524m35484Q5302K52421J02899K27121
6306D35801J20275m34404o1783j64359l89045M73988l3460J02865J15802l06516
6296a40836K65660M51005m93188J03686M5128m77075M85821K27487j97345j43059
$$ y = [1744585, 1453703, 1393399, 1755231, 1223320, 994880, 1522523, 877594, 1153875, 1343020, 648131, 442810, 409255, 74673, 540051, 678079, 303172, 896647, 740694, 257326, 581442, 50192, -97881, 484804, -116980, -71893, -347964, -309381, 127053, 199565, 283308, 455966, 468584, 236545, 443019, 355004, 128442, 196267, 91311, 381005, 555789, 402145, 439699, 735589, 767346, 658237, 876315, 743977, 594769, 754280, 836161, 907914, 741971, 313769, 415066, 203542, -231942, -146640, 105781, 208680, 435801, 556076, 121672, 59889, -104470, -493515, -19527, -52987, 49878, 165680, -140836, 124824, 575829, 82641, 186327, 231455, -245620, 240201, 467688, 270343, 127284]
6286A27284R0624J88549M43737k98123N54668K68447m71235L47246k12179m18595
6276F20423J16737K38216m03742L42671k62082o79358N14184J62947k99545K17911
6266E68362l10370m66788m1967L08177k50955k61969L21177l16677N93333j50928
6256h605l38669P02598j84729l845M6641m19288K25976J91191J10606k8071m63423
6245a69618k20161M49744r4030L27999P49613q71241K05333J057701o3231n9372
6235A312737l94798n95961j81445K12066j14817j77684J71267m08149M84925J82751
6225D90892j7685J79237o05845j18809J63616l77753j34400O89204J72574l34675
6215A06356O14923r9963p16950K44607j47307m27977J97148J64653m7209M40842
$$ y = [127284, 217908, 406457, 850194, 552071, 1106739, 1375186, 903951, 1251197, 1039018, 620423, 737160, 975376, 571634, 914305, 652223, -27135, 487049, 649996, 350451, 568362, 257992, -208796, -250763, 57414, -193541, -455510, -134333, -451010, 142323, -8605, -347274, 355324, 170595, 166750, 213391, -205897, 20079, 211270, 321876, 293805, -169618, -389779, 59965, -34065, 293934, 1043547, 172306, 377639, 1435340, 1372109, 1312737, 917939, 321978, 140533, 352599, 237782, 60098, 231365, -176784, 308141, 490892, 473207, 652444, 46599, -72210, 91406, -286347, -420747, 268457, 441031, 106356, 721279, 621316, -95634, 148973, 1666, -426311, -229163, -64510, -111719, 329123]
6205C29123j79555m18053M43922l29091j57122K63770j08038L97916m0768j48719
6195E3385J03550k61283l83760J99939Q30215k42871n84062j93149M72107K35233
6185B29304l01557M29609j98611k64726j17573K37562K91895Q2641m25622j17392
6175a54470P2119l19475J89599J57317J13617n0649m59375M69990L34899l29262
6165B4310L6486r7936j37366k98414j85234O02911L6259m72362N00593O13357
6155F22604J814J3956n01904k72176O30930l1793k0302n15863k97234K35668J49596
6144A5296K29695l05218l03460K88161M85652m01218j67937K15337r2094j83880
6134b19666J55853r7439M7891k86205k94769L36030N27094j37809k0422J3192
$$ y = [329123, 149568, -268485, 175437, -153654, -310776, -47006, -155044, 242872, 202104, 53385, 156935, -104348, -488108, -288169, 542046, 299175, -284887, -478036, -5929, 229304, -72253, 357356, 158745, -105981, -223554, 14008, 305903, 388544, -37078, -154470, -82351, -401826, -212227, -54910, 58707, 8058, -451317, 18673, 353572, 24310, 60796, -37140, -174506, -472920, -658154, -55243, -18984, -491346, 9247, 622604, 624418, 638374, 136470, -135706, 495224, 463431, 443129, -72734, -369968, -134300, 15296, 244991, -60227, -363687, -75526, 410126, 8908, -159029, 56308, -35786, -219666, -63813, -161252, -113361, -399566, -694335, -358305, 168789, 30980, 10558, 23750]
6124B3750p61110O09833l19031k94692O04235k08799L40170N02975l88733M99780
6114F08378N03944l59346L4503K48898J2422J171113O47760m68214k6124m10881
6104A962453n55816j92798l05819n41561J16050L81230o82994j94105J44576l93960
6094b62744M06470k63725l23754R0419k24708j6663N27920N8442M74999L32545
6084G99201q37432k76709K63174m80897L58329l4414m84317L74253N4239J08369
6074a56204K92300L80095k30963o03771o60658l01783M46125m2324p1485M61486
6064d87182L39474K37129J98582l13847l51511r6559m10479J95290O30034j83094
6054b42163R80137N89576q71865n17228n53843R1330K23401Q9328J58840J83654
$$ y = [23750, -737360, -127527, -446558, -741250, -137015, -345814, -5644, 497331, 108598, 608378, 1112322, 752976, 787479, 1036377, 1048799, 2219912, 2867672, 2399458, 2373334, 1962453, 1406637, 1213839, 908020, 366459, 482509, 863739, 180745, -13360, 131216, -262744, 143726, -119999, -443753, -353334, -578042, -594705, -66785, -8343, 466656, 799201, -38231, -314940, -51766, -532663, -174334, -208748, -693065, -318812, -264573, -156204, 136096, 516191, 285228, -318543, -979201, -1280984, -834859, -877183, -948668, -487182, -147708, 89421, 288003, -25844, -377355, -473914, -884393, -689103, -59069, -242163, 737974, 1327550, 455685, -61543, -615386, -524056, -300655, -211327, -52487, 131167]
6044A31167j70247j36266R8275M07328J10990L6791k42902k80065n16647K15000
6034c46576L81169O69788K41893l82294r6172m89407k67755M12403l76387J8877
6024b34461j46044J06077K88209l8891j6445k79724N70534l2844k75926l95996
6014d55511M6564L49065J01176J52808j42428n53280K32233L20956J10695q5980
6004G6298K65360m47089k58133N71935n61951K708L32711l80278o6197K99282
5994a65354O879l01950p5965k29253L6402n5836J96497K07124R832J87994j33366
5983c16996m66162L18935M99710p6317o6503K2815P5426l71191m87689j66485
5973a034457P92666L21121k5555m80772m38236J56665k0168M26410K57053k91541
$$ y = [131167, -39080, -175346, -77071, 330257, 441247, 478038, 235136, -44929, -561576, -346576, 34593, 704381, 946274, 563980, 467808, -21599, -289354, 123049, -253338, -234461, -380505, -274428, 13781, -25110, -41555, -321279, 249255, 216411, -59515, -455511, -408947, -59882, 41294, 194102, 51674, -501606, -269373, 51583, 162278, 76298, 341658, -105431, -363564, 208371, -353580, -350872, -18161, -398439, -464636, -165354, -158475, -460425, -536390, -765643, -729241, -785077, -588580, -381456, -371624, -183630, -316996, -783158, -464223, 35487, -40830, -107333, -84518, -9092, -380283, -867972, -1034457, -241791, 79330, 53775, -426997, -865233, -708568, -728736, -302326, -45273, -336814]
5963c36814k80273L34725k70339k01227N01533k3787j59470l8587n6346l1136
5953e61721p597K05048j90425p016K97680r2885K37457P47465j41374o68967j64402
5942c46737o9240j16153J32368j38791K45472J87526K55495K53137k72333p2752
5932E7992k59245j20159J07202l99863K01212M79163M49903P5659l54061j88180
5922D9623m15284J01822R3399K07805k1169K08949k08063K8200J44835j85380
5912D737J89230L32183k79854k00029k12241j80055Q8990K35167P51191j0568
5902G18751p09638J02383r4168k28187K50809k25097o82782L40873M79028J63484
5892A15456O21274m38727k93242p08567k23157q1101M50368K80358j2787j91560
$$ y = [-336814, -617087, -282362, -552701, -753928, -252395, -276182, -435652, -474239, -530585, -561721, -569318, -364270, -554695, -561711, -264031, -356916, -119459, 628006, 486632, -182335, -346737, -415977, -532130, -399762, -538553, -293081, -105555, 149940, 403077, 130744, 57992, -201253, -321412, -214210, -614073, -412861, 66302, 516205, 591864, 237803, 49623, -365661, -263839, -170440, 37365, 16196, 225145, 17082, 45282, 190117, 4737, 193967, 526150, 246296, 46267, -165974, -346029, -257039, -21872, 729319, 718751, 9113, 111496, 17328, -210859, 39950, -185147, -867929, -527056, -48028, 115456, 736730, 298003, 4761, -703806, -926963, -1008064, -557696, -277338, -290125, -481685]
5882d81685J99376K04898r705N1029n7265o4703l05573r4400j84929M93477n91132
5871h40612N41815O23931l48242k46437k09304L92844j82619J86328J56479o12568
5861e38385L2940J76579P2858N4477K14374J85285n58279L03116j7743l35300
5851d10078O8813j55442L19013l79687M71142L56183m61742J14850k66787P6016
5841b67719J0443K25340k31582N8892j11627m4866L46993J22562j08911j70974
5831a71449J99803k64090Q01136l74455j76670M9669K01978j78643M04166J63531
5821F54976m02991l44240m19635J12583K25092K02226P7091k08608j36244N82477
5811C42727n50524k17137K94461k65598j76030M24834Q71p68075M47995N38293
$$ y = [-481685, -282309, -77411, -87116, -36087, -93352, -158055, -463628, -558028, -742957, -249480, -840612, -298797, 325134, -23108, -269545, -478849, -86005, -268624, -82296, 74183, -538385, -505445, -328866, -256008, -201531, 12843, 198128, -360151, -57035, -74778, -410078, -341265, -496707, -177694, -557381, -86239, 269944, -191798, -76948, -343735, -267719, -257276, -31936, -263518, -204626, -316253, -361119, -14126, 108436, -475, -171449, 28354, -235736, 565400, 190945, 14275, 63944, 265922, 87279, 491445, 654976, 251985, -92255, -511890, -399307, -174215, 28011, 105102, -103506, -239750, 342727, -207797, -424934, -130473, -396071, -572101, -147267, -146396, -914471, -466476, 71817]
5801G1817m86185K77499j54852j0692J31663J16894j76882j81322q7152j09266
5791f08478K73185j80779N18442J89493m42064k7199m06769m66671O24432L76483
5781a49925k91098K83523K39084l57920n4096M24741l66498p4932K06091j62948
5771c03978k08817L85553l4312M12781L53742k17638j72064j46623k80664q2996
5761b95016J60048l3290l23283K98549L89212M796N3625J3172l10108m14984j61880
5750f19159j25162N5881k01898L43375l54671L40759M95514l40838L3706j44245
5740e16738m87414N31149K82695m49766P2837L17166l90933j943K02366l34726
5730g75307N11957n54677L31059O88649l22384L3953K12214o94652K61757N30478
$$ y = [71817, -414368, -136869, -291721, -302413, -170750, -53856, -230738, -412060, -499212, -608478, -335293, -516072, 2370, 191863, -250201, -277400, -684169, -1150840, -526408, -149925, -441023, -157500, 81584, -276336, -330432, 94309, -272189, -347121, -141030, -303978, -512795, -127242, -161554, 251227, 604969, 387331, 215267, 68644, -212020, -295016, -134968, -168258, -491541, -192992, 196220, 201016, 254641, 267813, -42295, -457279, -619159, -744321, -688440, -890338, -546963, -901634, -560875, -65361, -406199, -372493, -516738, -1004152, -473003, -190308, -640074, -567237, -250071, -641004, -642947, -440581, -775307, -263350, -818027, -486968, 201681, -120703, -86750, 125464, -569188, -307431, 223047]
5720B23047p32899J82909K04857n9860L93792j12261l15278K07920m53122M01111
5710e9784o8895l23386P1780k4600k9280J57352L07636L4657J06193k13365o4785
5699a06477j4552k39264O2014J9144k83560l7265M20149Q2950k95545O76821m10378
5688a25963k09959M94956p27289J49924M23038n31839j52309M96691j33142j62359
5678d78251P0719j47581M15747K2237R3576J21984q15249k10976P30711j22590
5668c19673K98555J30030j2984j92081o5267k87978m92694L63664j29674M89650
5658b18452J87522k1558j36288k59673K74772J81989l71627J6753j83640l47318
5648h77520O37548K43794M098L43661l30999o49099l52252q0627P4161O82137
$$ y = [223047, -509852, -326943, -122086, -181946, 211846, 99585, -215693, -7773, -460895, -59784, -128679, -452065, -380285, -404885, -434165, -276813, 30823, 65480, 171673, -41692, -106477, -121029, -360293, -298279, -279135, -562695, -599960, -179811, -96861, -392406, 284415, -125963, -335922, 159034, -568255, -418331, 4707, -527132, -679441, -182750, -315892, -478251, -407532, -555113, -139366, -117129, -23553, 98431, -716818, -927794, -197083, -319673, -21118, 108912, 95928, -96153, -161420, -449398, -942092, -578428, -708102, -218452, -30930, -52488, -188776, -448449, -173677, 8312, -363315, -346562, -530202, -877520, -239972, 3822, 7920, 351581, 20582, -628517, -980769, -1061396, -987235, -305098]
5638c05098k77678j590L81904J9809N89892k02832p04003j45472J56350J77694
5628c11024J35655J12617j81792L191l4514O0377O53096n08527r0104J87158k78250
5617b52117Q6064j68948k38270J84175K74129k9300K64275K15068n57219P8634
5607a43509K46839n52169L06588r2911k64975n4783M6847J86482L47094M38266
5597D63769m4093j82813k6026Q8123p24346k28447K187M37273J04781N75264K82354
5586G48026l45732p04025Q9671K24918p03835M08194Q4694K9369K56833K80423
5576C68536J45131K82006n14454l22257j12335l13728k50957M26036k4261o3359
5566c79642P72139L14457j98819l60231m74232j73263N7244j0531j27644K95280
$$ y = [-305098, -582776, -584366, -202462, -182653, 407239, 204407, -499596, -645068, -488718, -311024, -175369, -62752, -244544, -241353, -275867, -215490, 437606, -70921, -161025, 26133, -252117, -166053, -335001, -573271, -389096, -114967, -144267, 120008, 335076, -222143, -143509, 103330, -448839, -142251, -235162, -500137, -554920, -508073, -321591, 25503, 463769, 419676, 236863, 210837, 298960, -425386, -653833, -651646, -214373, -109592, 465672, 748026, 402294, -301731, -212060, 12858, -690977, -282783, -198089, -168720, 88113, 368536, 513667, 795673, 281219, -41038, -153373, -467101, -718058, -292022, -316283, -379642, 392497, 706954, 508135, 147904, -326328, -499591, -442347, -452878, -580522, -285242]
5556b85242J96926q9189L87159l3584j67873p37699m37652K28095M83137j14339
5546e70261K15683q9934J79873p9738L26712J42688m9581l08175l94567J0028
5536f17272l11962M92648L24984K48576l24641r047m81364K18527R851j99507
5526f49207M65648o086j2680K76604k13145n87942L68566L77190J82988l72978
5516a71042o42867r5920K65174L63097k17789N54653Q1166m56152J44417j12890
5506b88153q66458j79525P86449j02175N78600L38323k97889m8908k89442k36353
5496f05531J70663J75088k03765j94268j59633Q0376O1610O04531N94260K62157
5486G85488q91495q1846m18495j16539O73749j79539K00980k61951J3511l45554
$$ y = [-285242, -88316, -177505, 209654, 176070, 8197, -729502, -1167154, -939059, -455922, -570261, -354578, -444512, -264639, -344377, -17665, 125023, 75442, -232733, -627300, -617272, -929234, -436586, -111602, 136974, -187667, -196714, -678078, -459551, -449700, -649207, -183559, -189645, -202325, 74279, -138866, -726808, -358242, 18948, 201936, -171042, -813909, -909829, -644655, -281558, -499347, 55306, 136472, -319680, -175263, -288153, -1154611, -1334136, -547687, -649862, -71262, 267061, -30828, -79736, -369178, -605531, -434868, -259780, -463545, -657813, -817446, -737070, -675460, -70929, 523331, 785488, -106007, -187853, -606348, -722887, -49138, -228677, -27697, -289648, -276137, -621691]
5476f21691M11239j06647Q2671K81406k37421k58893M8407K61251p8022j17310
5466c35010J93407n92548M485L6748n1209P49243K48958n10540k22966L64325
5456a15107n6105o9143j43784j72950J11421l01987K09125N71646l62880M29469
5446I9705J91015p94936k23009J09844p63641P42541P59099q55811K58407J58525
5436c18261o48184P38273J64870m93236K60803j8721k15507J53160j98258k50072
5426h25133M61538K05968q7739j70784l5710K22452n7208k24243Q1295j89614
5416f19178r2450O53381L55890j67621o21412n95729L68828K71170k86842j4741
5406g48704n106J4366m4007J99302M37782J03722K85953n08126m71801K1193l10015
$$ y = [-621691, -210452, -317099, -234428, 46978, -190443, -449336, -400929, -139678, -217700, -335010, -141603, -734151, -729666, -692918, -744127, 5116, 254074, -256466, -479432, -115107, -171212, -240355, -384139, -557089, -445668, -747655, -538530, 33116, -329764, 99705, 290720, -504216, -727225, -617381, -1381022, -638481, 120618, -735193, -476786, -318261, -966445, -228172, -63302, -556538, -295735, -314456, -529963, -376803, -575061, -825133, -363595, -157627, -245366, -416150, -451860, -229408, -286616, -510859, -429564, -619178, -711628, -58247, 297643, 130022, -491390, -1087119, -718291, -447121, -733963, -748704, -753810, -739444, -783451, -584149, -146367, -42645, 243308, -264818, -736619, -715426, -1025441]
5395a025441L44781N49962j44162k78141J86410j33063l82079J03145K87437q4683
5385e75834K81927M11435K22027m11038m02490n0821J82804N4169j83128k35583
5375g06532j03131O92753j35278J3600K46561m18894n1363l04575N4558J49762
5365e62539k39014K33994M16516m72780J76363M81032j36252Q8781n52845o09240
5355a175984M08236J58894J23246M4980J28093L52145N9897L61133k27306n16589
5345b83255M5997J19016L06109l87440m64726J73792J39337j3969J36202K05482
5335b3455k28493K03569j21884J49431r2583o4123o4423o6374M46666k05139j13259
5324a80067R5799k32469k01609K16742Q008q7371K98406j00129l336J42560l1657
$$ y = [-1025441, -680660, -130698, -274860, -553001, -366591, -499654, -881733, -778588, -491151, -575834, -293907, 117528, 339555, -71483, -473973, -524794, -341990, -287821, -470949, -706532, -809663, -116910, -252188, -238588, 7973, -410921, -462284, -766859, -712301, -562539, -801553, -567559, -151043, -623823, -447460, 33572, -102680, -13899, -566744, -1175984, -767748, -608854, -485608, -440628, -312535, 39610, 99507, 460640, 233334, -283255, -237258, -118242, 187867, -199573, -664299, -490507, -351170, -365139, -228937, -23455, -251948, -48379, -170263, -20832, -113415, -177538, -241961, -308335, 138331, -66808, -180067, -84268, -316737, -518346, -301604, -293596, -380967, -82561, -182690, -186026, -43466, -75123]
5313g5123p8649r1487n59298J97289K61175K04438k5165k07372M0715Q340J24157
5302b00980P6774L1107k71556L7513J08546J33374K82971k50160o3882K15075
5292I8782j47123j23882R5535J87341J04725L4786q2347k96668n42535L46862
5282c24524N4697L5184M19664M2042j44214o1572r9486J9825L08897l78301l29473
5271d57261P1137k01007l82814K55390r5966K19891L9431L06479o9504m20962
5261g35186j14290L72979J39317j33270l542p08548K68674L28548K23036j84752
5251e47034J20496M7907n0206l08871K66975K56044k60927L79534l66978n62697
5241a025757L51278N27872M000k26022J48375j20810N5382M65355k41396l48921
$$ y = [-75123, -153772, -245259, -804557, -607268, -346093, -141655, -166820, -374192, -333477, -325137, -200980, -124206, -93099, -364655, -327142, -218596, -85222, 197749, -52411, -116293, 98782, -48341, -172223, -76688, 110653, 215378, 250164, 167817, -128851, -671386, -324524, -269827, -234643, 185021, 227063, 82849, 21277, -78209, -58384, 250513, -127788, -457261, -386124, -587131, -969945, -714555, -810521, -590630, -551199, -244720, -314224, -735186, -849476, -476497, -337180, -470450, -473992, -1182540, -913866, -585318, -362282, -547034, -426538, -378631, -428837, -737708, -470733, -214689, -475616, -96082, -463060, -1025757, -674479, -146607, -142607, -368629, -220254, -341064, -285682, 179673, -61723, -410644]
5231d10644L79133m54151k40326J73300J08445j22799J1492K4663N06857J93304
5221A69274p64480L02494j63023j92535K56269j45568k38642M84552M7084m00777
5211f45352L90584j24510j16181K08004o0755N844J49538N7492Q2341l76748l58494
5200g88237n6203K43841K96755J72359O10338n15457p3055m91965M19657J92633
5190A0666l20162m38570Q3356l4953J4967J020746l37403l9970J65124k93687
5180a69886k41847J57334o52282o4231M01586j23986L6473N20037J06346L21041
5170B90585J05820p27735J61154m31292L3065L07288j43315J95775K32186l1986
5160h455p01684o1836L12888l9689j72307L05512r999L5970J46472J90306j34268
$$ y = [-410644, -31511, -485662, -725988, -552688, -444243, -567042, -555550, -530887, -24030, 169274, -595206, -292712, -455735, -648270, -392001, -537569, -776211, -291659, -244575, -645352, -254768, -379278, -495459, -287455, -348210, -342366, -192828, -135336, -52995, -429743, -788237, -844440, -600599, -303844, -131485, 478853, -36604, -109659, -601624, -181967, 10666, -309496, -748066, -664710, -699663, -684696, 336050, -1353, -41323, 123801, -169886, -411733, -254399, -906681, -970912, -569326, -693312, -656839, -136802, -30456, 290585, 396405, -331330, -170176, -601468, -568403, -261115, -404430, -208655, 23531, -8455, -710139, -771975, -459087, -498776, -671083, -365571, -375570, -339600, -193128, -2822, -137090]
5149a37090m29713Q7063j61945l22515M50144N87189k99374L73300L16782o35264
5139a71423K37804m46606m68089N80427N82301P1898J49623m25815l09349j87356
5129c86585k7435M54020Q2539l61236J93034J00508m80515M75476p826k17017
5119a75037J03996K4615k77890L66540k92239l2151O79725q3951l33811j48146
5109a68349n12848J25411K98587n40972L14321M81626m45425N70025N54656l23807
5099C53225L39828l70801l62111o9044j84163k62109N39421j2996k92847P41752
5089D20155n98730n74960L86361j2315N01905K08162m36277j18129Q7804k54843
5079c90867Q6655O75802m87083N6442j19814o49431L30824P6595N442Q3459J24762
$$ y = [-137090, -566803, -479740, -641685, -964200, -514056, 73133, -226241, 147059, 463841, -171423, 66381, -380225, -848314, -267887, 314414, 386312, 535935, 110120, -199229, -386585, -414020, 40000, 122539, -238697, -45663, 54845, -425670, 49806, 41980, -175037, -71041, -46426, -324316, 42224, -250015, -282166, 397559, 313608, -20203, -168349, -681197, -555786, -257199, -798171, -483850, -2224, -447649, 122376, 677032, 353225, 693053, 322252, -39859, -108903, -293066, -555175, -15754, -28750, -321597, 420155, -178575, -753535, -367174, -379489, 122416, 330578, -105699, -223828, -136024, -390867, -304212, 371590, -115493, -59051, -178865, -828296, -497472, -420877, -415435, -331976, -207214]
5068b07214J22266L31636k72874l14248K98840n2227P789M0428l54296l00421
5058g00321j64408L69740L87774N987N6289M7098k86218j59755P1689j21740o2317
5047e56182K28151J66296N1977O23186n48789n95226M2866L37119n7J15526k98225
5036d33358n2505J29974m3236J69176L43423j56930k56534J87349J2318j85928
5026b86251m38484N04689J37310k35360K60673j31182k40762J90354n9340r6640
5016c94993J28131R3861m9780O44645n6176q77198J86605N9681m49062l80957
5006a095243K34592L76247L7775J59473p5393j99801j02397K43467K97648j88054
4996c11686J90201k35943q5295M10401m7185l26026K24383j67179R8086n0558
$$ y = [-207214, -84948, 246688, -26186, -340434, -41594, -93821, -86032, -45604, -399900, -700321, -864729, -494989, -107215, -101228, -44939, 2159, -284059, -443814, -372125, -493865, -556182, -328031, -161735, -109758, 513428, -35361, -630587, -587721, -250602, -250659, -135133, -433358, -485863, -355889, -399125, -229949, 113474, -43456, -299990, -112641, -100323, -286251, -724735, -220046, -82736, -318096, -57423, -188605, -429367, -239013, -298353, -394993, -266862, -173001, -222781, 421864, 365688, -511510, -324905, -265224, -714286, -1095243, -860651, -484404, -446629, -287156, -362549, -562350, -664747, -421280, -123632, -311686, -121485, -357428, -442723, -32322, -79507, -405533, -181150, -348329, -250243, -300801]
4986c00801k76177K83852m52340N70143O59092k18700k86715j48785m17179K96182
4976b91428l7597j50493M17206j41765l60480K99871J63567r1748N18009j87657
4966A37485k63503l20330l92494L68459N99513K31793j34193j09103q95793K97376
4956d80790q4058j94018L61336j00827m09145L30328L47129k13255K60050J39490
4946d3760k35700J71977K9569r39904N69744M17481m69284Q8272K44039J22081
4936d5485L38014K04534n42233j26160P492m3200J60956J2903j10721J16454r7862
4925a25308M2393n0666j50006M49495k10809q21343J34521O33469p343M63621
4915C58024K27840o86733j94l80659l2693O33107m04437n46273L5490k4835N48735
$$ y = [-300801, -576978, -293126, -745466, -175323, 483769, 265069, -21646, -170431, -587610, -291428, -329025, -479518, -62312, -204077, -564557, -264686, -101119, -192867, 325142, 137485, -126018, -446348, -838842, -470383, 129130, 360923, 226730, 117627, -778166, -480790, -564848, -758866, -397530, -498357, -907502, -577174, -230045, -443300, -183250, -43760, -279460, -107483, -77914, -1017818, -448074, -30593, -499877, -411605, -167566, -45485, 292529, 497063, -45170, -171330, -163838, -207038, -46082, -33179, -143900, -27446, -125308, -82915, -133581, -283587, 165908, -44901, -866244, -731723, -98254, -105597, 358024, 585864, -100869, -101063, -481722, -514415, 118692, -285745, -832018, -796528, -821363, -272628]
4904b72628K36274K03438L14724m81782M293J17340o5674p60058N33342L7112
4894a33619P9981M49756l72016J52365m4710o03956k20341K10910N57777k59164
4884a83017l44503O4186j21995m26495N94709L64348o73681M17677K3358k48124
4874e33537j35149j74353K87929l9160r3256P70226J16627o5459k47663l06427
4864d20222J54569N51737q6292m18861j51930K42202K52854m27520K71330J71481
4854A39348l18120L28290L99853l40526j21227J32372n73918K41129N95146j31654
4844C50693Q9688m44838m95603O55542J96364l41922k41380J73727O48111n7027
4834E33355l60948r0535K3775K8377K60193l13949p2996J70992l6169K49617L1500
$$ y = [-272628, -36354, 167084, 481808, 26, 4319, 121659, 55985, -704073, -170731, -133619, -53638, 396118, 24102, 176467, 131757, -472199, -692540, -481630, 76147, -183017, -527520, -463334, -585329, -1011824, -417115, -52767, -726448, -308771, -285413, -533537, -668686, -843039, -555110, -594270, -687526, 82700, 199327, 133868, -113795, -420222, -265653, 286084, 199792, -219069, -370999, -128797, 124057, -303463, -32133, 139348, -178772, 149518, 549371, 208845, 87618, 219990, -353928, -112799, 482347, 350693, 440381, -4457, -500060, 155482, 351846, 9924, -231456, -57729, 590382, 533355, 172407, 81872, 105647, 134024, 394217, 80268, 7272, 178264, 142095, 391712, 423212]
4823D23212m17159K66300L52852l58336l90488j87785O7410N37683K81582j51930
4813D23341n60611K76470j14843K83503O6398m47138M1407k54899M780J21860
4803a59732k7132j97551N20153J05698l12428k76320J81307J05691J3094J32196
4793H4976k68239m00982N41494N46171J5416k51306o11807j68210k38909M14584
4783c36812L64170q8064K28703m2256m54823j27601L0617k72312L02038K93565
4773a02775j52503J63165j71034j21912M98992k50767j85152j04130o3553j8830
4763e08499M8649j74111J56268N68911L6797l23753J56560j99449l22510J84071
4753c77066j560j59845L14228j88802J01252K39936n32721R2198K84036j98549
$$ y = [423212, 6053, 272353, 625205, 266869, -123619, -311404, -243994, 293689, 575271, 423341, -137270, 139200, 24357, 307860, 374258, -72880, -31473, -286372, -281592, -159732, -186864, -384415, 135738, 241436, -70992, -347312, -166005, -60314, -47220, 84976, -183263, -584245, -42751, 503420, 518836, 267530, -344277, -512487, -751396, -336812, 27358, -60706, 167997, 125741, -329082, -456683, -426066, -698378, -396340, -102775, -255278, -92113, -263147, -385059, 113933, -136834, -321986, -426116, -489669, -508499, -459850, -633961, -477693, 91218, 128015, -195738, -39178, -238627, -561137, -377066, -378626, -538471, -224243, -413045, -311793, -71857, -604578, -512380, -228344, -426893]
4743d26893M26216k44974l05744K17262K1001K50155O9074m6843k72836J67036
4733a46546K3424J7522n87601J9269L17893j51207L36563R8230L2086j83278K08632
4722a5013m43618k4103K34233J96212o9793J84114m11014n37184P51004j59836
4712b94998M974M15336l19321o66145M16874J91869j36222L28067J52081k72269
4702a79754m71875L36162k83470m5211O73037l42291l02309L29249o1958j24687
4692d73107M05546j92509q6189k24175p507J90413O33937n24685J43561M45427
4682C10712l86628N2063j45408n01515J40892M53039O4486L83409k01689n08929
4672c39568K67920P5803k03630O13506r61893l2581K74478m26883L77836O46417
$$ y = [-426893, -677, -245651, -551395, -334133, -313132, -62977, 6097, -40746, -313582, -146546, -123122, -105600, -693201, -673932, -356039, -507246, -170683, -72453, -40367, -223645, -15013, -458631, -482734, -248501, -52289, -122082, 62032, -348982, -886166, -135162, -294998, -290024, 125312, -194009, -860154, -443280, -251411, -387633, -59566, 92515, -179754, -651629, -315467, -598937, -644148, 28889, -313402, -615711, -286462, -348420, -473107, -67561, -260070, -346259, -570434, -577941, -387528, 246409, -278276, -134715, 310712, -75916, -23853, -169261, -670776, -529884, -76845, -12359, 371050, 169361, -339568, -71648, 4155, -199475, 414031, -547862, -580443, -305965, -732848, -355012, 291405]
4662B91405o8469m4414O49155o19534m46069j16286k37193O62623M6795o8657
4652D9356M17626p10526M43562J10165j09279j61142J44378n21769l85748N59345
4642a64032J19031K40761K15867R1172m32566r6774N14683k65075m79972j24884
4632c81789N5932L19515k4345K84615M36394p24273k41053J57131l63300k09435
4622f90608P53895L84503k58575K88858n16963K87005j51722J35043m05302j89697
4612c63563O1012k22473P04560K59001O0001n0483m4489N4495l21086k98384p7440
4601b38849j92444J66214J70789N69161J48176N3129K11664p86640n10633J6121
4591c93312N72513q5223M73815K29109l32165J9575K50314K0631l72846K38190
$$ y = [291405, 222936, 178522, 827677, 208143, -237926, -354212, -591405, 71218, 118013, 49356, 466982, -243544, 200018, 310183, 200904, 39762, 184140, -337629, -723377, -164032, -45001, 195760, 411627, 502799, 70233, -26541, 488142, 223067, -256905, -381789, -325857, -6342, -30687, 253928, 690322, -33951, -275004, -117873, -481173, -690608, 63287, 447790, 189215, 478073, -38890, 248115, 96393, 231436, -173866, -363563, -302551, -525024, 179536, 438537, 498538, 448055, 403566, 458061, 136975, -161409, -238849, -431293, -265079, -94290, 474871, 623047, 676176, 887840, 101200, -409433, -393312, 179201, 93978, 567793, 796902, 464737, 484312, 734626, 755257, 382411, 620601]
4581F20601m01078k03547k15555R7125L70482j4744M15973K78998k81188j13875
4571E53192j74353o29347k65543L68415J43237L57713J7891K06212M82279p58495
4561C01201L3578P53994p79063k84466j51530k52187R6034P25975M14121q03j28346
4550G28508l71718o3244m15369n0245k82791j65760L13507j653K19048J047023
4540I57306j8750m93934K8922L37299p79939k90016L54208l94824l98555J94802
4530e03481K94211J49749J45946n2563K48218k7039l50552J94159m0785o66560
4520f08697J08546L98681m21669L49717K03620J20894K97289k78909j17394m2528
4510I550l71322M04836J78872m09224K64917J6837k01078O856O29745j28243j27170
$$ y = [620601, 219523, 15976, -199579, -102454, 268028, 253284, 669257, 948255, 667067, 553192, 378839, -250508, -516051, -147636, -4399, 353314, 371205, 577417, 1059696, 301201, 334779, 1088773, 309710, 25244, -126286, -378473, -282439, 443536, 857657, 856854, 728508, 356790, 293546, -121823, -172068, -454859, -620619, -307112, -308765, -89717, 957306, 938556, 444622, 473544, 810843, 30904, -259112, 95096, -299728, -698283, -503481, -209270, -59521, 86425, 33862, 282080, 255041, -95511, 98648, 57863, -608697, -500151, -101470, -523139, -173422, 30198, 151092, 448381, 169472, 52078, 9550, -361772, 43064, 221936, -187288, 77629, 94466, -106612, -99756, 529989, 401746, 274576]
4499B74576k45544k41053J87316k03456M13997L50706m6816m13432K00566o22884
4489c46024j83302N81607j25533K29793r3504J6897l951R79738l05330m70210
4479B80181k4114q19795o66190K46137P17799M56727N9673N85964l08103o07651
4469g9372P45485r0655o82568l32144p970j81602L85155M13183K56744L96090
4459H22346l93677L82625l45925q51911p6472l0599J01252J38912N06445K5966
4449B78962L20239N7680j67862l88622j03308l424L21203R7128l85371J72668
4439A99293j19334P6157M7928R2836m46868k6034L4362L52269l03844l3440M20915
4428B94240J85137n8364k1002J17293m75360L69300o5661m01676m91826K11393
$$ y = [274576, 29032, -212021, -24705, -228161, 185836, 536542, 489726, 76294, 276860, -346024, -529326, 52281, -73252, 156541, 63037, 79934, 75983, 1055721, 750391, 280181, 256067, -563728, -1229918, -983781, -265982, 190745, 250418, 836382, 528279, -79372, 666113, 575458, -107110, -439254, -447224, -628826, -243671, 169512, 426256, 822346, 428669, 811294, 465369, -386542, -463014, -493613, -392361, -253449, 252996, 278962, 599201, 656881, 489019, 100397, -2911, -6335, 314868, 411996, 26625, 199293, 79959, 156116, 204044, 296880, -149988, -176022, -141660, 210609, -93235, -126675, 294240, 479377, 421013, 400011, 517304, 41944, 411244, 345583, -56093, -547919, -336526]
4418c36526P79246O20632J02729n70842l42783j02316j5169M9289j47915K34945
4408B71290J79861J9683L95851k66045n88467L80002O64882m26328n05948N0527
4398A75308k95979K65445N40367j33001j40816j45711k75330l9471M41579L7904
4388D30295M8842J27965M35131m06961l90510Q7082j80451J97535N76j15755q5953
4377A47796K256L71804P91167j84089K17593J66440J75346l17666m49796M9302
4367I70153K41015l77578K44021Q1413m04090Q6652J09528k24832r9292k09226
4357D17764m17958O46192l4393l29276J90400j8467m13635l23677K87495j96071
4347a91626J8722K42912k44524M21015k0354n80978O65200J92502o94066L08979
$$ y = [-336526, 442720, 1063352, 1166081, 595239, 252456, 150140, 134971, 184260, 36345, 271290, 451151, 470834, 866685, 600640, 12173, 392175, 1057057, 630729, 124781, 175308, -120671, 144774, 685141, 552140, 411324, 265613, -9717, -49188, 392391, 430295, 479137, 607102, 1042233, 635272, 244762, 331844, 151393, 348928, 349504, 233749, 147796, 150052, 521856, 1313023, 1128934, 1346527, 1512967, 1688313, 1370647, 920851, 970153, 1211168, 833590, 1077611, 1159024, 754934, 841586, 951114, 726282, 626990, 417764, -194, 645998, 611605, 282329, 472729, 454262, 40627, -283050, 4445, -191626, -172904, 70008, -174516, 246499, 226145, -354833, 310367, 502869, -191197, 117782]
4337A17782m9251n9776J35122J99940q7054l2068j76610J76055J80063j98091
4327B06112k46603j50089K68507l57064L34803R51511K54376L85362n63031q18803
4317B65081J08122M3830k15587M48329m61298J45270N40105j87664M39252m2383
4307A083057p37817L44556m5069o48898O51361L09782O4639q4509k834m53223
4297D81045K17483k93528k36856j7608j291J41500o5401L77028L06380J95631
4287A104383k56917j44041j00022p41916K29411L21729l73017L40013n0477l70106
4277d0960M81387L59881j75433r0822n28241k57127P20066Q7494k7254L02301
4267H31292k43194K71288j43050l89282l33044j95107L87387L01342J22626m44012
$$ y = [117782, 68531, 8755, 143877, 343817, 256763, 224695, 48085, 224140, 404203, 206112, -40491, -190580, 77927, -279137, 55666, 1007177, 1261553, 1646915, 1083884, 265081, 373203, 417033, 201446, 649775, 188477, 333747, 873852, 686188, 1125440, 1083057, 345240, 689796, 644727, -4171, 647190, 956972, 1021611, 937102, 934268, 481045, 698528, 405000, 168144, 150536, 149245, 290745, 225344, 602372, 908752, 1104383, 847466, 703425, 603403, -138513, 90898, 412627, 39610, 379623, 329146, -40960, 440427, 800308, 624875, 534053, 5812, -251315, 468751, 556245, 528991, 831292, 588098, 859386, 716336, 327054, -5990, -201097, 186290, 487632, 610258, 166246]
4257A66246J84012M28834J5594K79464o18552l5476J30211j04077m4609J14493
4247E16140J41849l82240L80179J05204p25878k8731K91963J63558j71826q199
4237B82019k9921P6433N35770J3137J94431j0381l61291k47600k97560M39804
4227E94841m24151L78541P39962j33195j28183q1175Q2839j61690K67016k8866
4217A105939k62320l97387L91308J93765p1396k43947k60989r3972P87435M53656
4207A602092m47053k09715l30638n23835K27757O52791q95617K10285P05741k26013
4197G65795J48257L54886p08519m3183M61774k80655o2561J10809n01165n3109
4187A92329Q0022O2686N63462J25403m09333J74218k00290j94635O97026o19874
$$ y = [166246, 350258, 779092, 794686, 1074150, 455598, 420122, 550333, 446256, 401647, 516140, 657989, 275749, 655928, 761132, 35254, 6523, 298486, 462044, 290218, 282019, 252098, 328531, 864301, 877438, 1071869, 1061488, 700197, 452597, 155037, 594841, 170690, 549231, 1289193, 1155998, 1027815, 946640, 1029479, 867789, 1134805, 1105939, 843619, 446232, 837540, 1031305, 959909, 715962, 454973, 361001, 1148436, 1602092, 1155039, 945324, 614686, 90851, 318608, 971399, 75782, 286067, 991808, 765795, 914052, 1268938, 560419, 517236, 979010, 698355, 635794, 746603, 245438, 192329, 272351, 335037, 898499, 1023902, 614569, 788787, 588497, 393862, 1090888, 471014]
4177D71014j83637M40371o14028J14660N42817o58323M46607L06962m20389N86823
4167A032877Q6262j269055K08270M44864K57821N37918k88347l39882J00835n89576
4157A81987K08064N91318n86830L28713M19652o51599o1500M58570j44440R08959
4147A652894j41759j080285M46428J21224j66943O23594M7434l42607R23653m0228
4137B043405m27564O5636p66669l76572L62586j98939L55291N16202J9863L9961
4127A633200J76621q83069m11003M97426J85578O53278k04930o11055j90069J41932
4117I87909O39726M33286r16886j48603L74839j42609L9864M2616p03148O98264
4107A305258K00799k53977N0900n22069k83310K21586J2843k01176M32762K11622
$$ y = [471014, 287377, 727748, 113720, 228380, 771197, 112874, 559481, 866443, 446054, 1032877, 1119139, -149916, 58354, 503218, 761039, 1298957, 1010610, 670728, 771563, 181987, 390051, 981369, 394539, 723252, 1142904, 491305, 429805, 888375, 743935, 1652894, 1511135, 430850, 877278, 998502, 831559, 1455153, 1502587, 1159980, 2083633, 2043405, 1615841, 1681477, 914808, 538236, 900822, 701883, 1057174, 1573376, 1593239, 1633200, 1809821, 926752, 515749, 1013175, 1198753, 1852031, 1647101, 1036046, 845977, 987909, 1627635, 2060921, 1144035, 995432, 1370271, 1227662, 1267526, 1310142, 606994, 1305258, 1506057, 1252080, 1302980, 780911, 497601, 719187, 732030, 530854, 963616, 1175238]
4097A175238K60696l44255l59125J92625P7669L18330Q7685l43687n9733j01642
4087I03801J974K86008J3247J65150l6377j06780l9786k24657l49847L16091L62613
4076A291437K25950j50694m15645J07515j03230J18603N27434k02248n37961K86003
4066A147164J5662l4616K17066m88233K38308M38170l77404O35203l34412k55019
4056A201889O16015l02272k41026O61652M8822J99863J13557k22601N6000P2845
4046B204744m74805M92520j62220J02433J252918o73547l79849r2211m51095N01837
4036B320725N36701o07120R1038m312n17551L14496N49855j37563p6964m08477
4026B060828j82750L16672K40728K35262J25639l35688k43778L95367j92897k65307
$$ y = [1175238, 1435934, 1091679, 732554, 925179, 1002848, 1321178, 1408863, 1065176, 1005443, 903801, 905775, 1191783, 1205030, 1370180, 1333803, 1227023, 1187237, 962580, 612733, 928824, 1291437, 1517387, 1366693, 951048, 1058563, 955333, 1073936, 1601370, 1399122, 861161, 1147164, 1162826, 1128210, 1345276, 857043, 1095351, 1533521, 1156117, 1791320, 1456908, 1201889, 1817904, 1515632, 1274606, 1936258, 1985080, 2184943, 2298500, 2075899, 2131899, 2204744, 1729939, 2222459, 2060239, 2162672, 3415590, 2742043, 2362194, 2269983, 1818888, 2320725, 2857426, 2250306, 2341344, 2337032, 1819481, 2133977, 2683832, 2546269, 2469305, 2060828, 1878078, 2194750, 2435478, 2670740, 2796379, 2460691, 2216913, 2612280, 2419383, 2154076]
4016B154076O41774M4238K07393l6601p76666j48195K81409O1099J37487K01476
4006B767490K00380J46217j21982j01384J5216m4540q1857K87333P6917k94072
3996B849718j08662L50788J12240p6867m67899J87910K57982l56586N07969M63352
3986C719945k01241o5630j55319P5147N96017j81290j7457M06491l86934n61526
3976C228203N6558j73136J65100O85234J58288K79457k46177l05920m97396L7508
3966C387719K25567J83120N01673J9246m00991M4645J87459j96904M19315k69914
3956D100935l56150L82579l85205k16628K21375K41034J95926j33491J23011L61472
3946D534858K86624J88648K02213l32918r75871j39539M87859K6131M94008L66217
$$ y = [2154076, 2795850, 2840088, 3047481, 3010880, 2234214, 2086019, 2367428, 2428527, 2566014, 2767490, 2967870, 3114087, 2992105, 2890721, 2905937, 2861397, 2779540, 3066873, 3143790, 2849718, 2741056, 3091844, 3204084, 3127217, 2659318, 2847228, 3105210, 2748624, 3256593, 3719945, 3518704, 3453074, 3297755, 3372902, 3968919, 3787629, 3770172, 4176663, 3789729, 3228203, 3284761, 3111625, 3276725, 3961959, 4120247, 4399704, 4153527, 3847607, 3350211, 3387719, 3613286, 3796406, 4298079, 4317325, 3916334, 3960979, 4148438, 3951534, 4370849, 4100935, 3744785, 4127364, 3742159, 3525531, 3746906, 3987940, 4183866, 4050375, 4173386, 4534858, 4821482, 5010130, 5212343, 4879425, 3903554, 3764015, 4251874, 4278005, 4772013, 5138230]
3936E138230K93612n41807l62420K4705P1208L42718K90030o1820k21959M45765
3926E418262J21513J66301Q47010K3296n12468M10942Q7291K76511N43191M17225
3916G799074l44635L30726Q55433k28950J62757M71629j92293L21934K42544J83140
3906I601359J65540K25389m75733O83913J048513j16743R43430K78710k05567
3897A2148811N78300M38083J13616N61907l0999m63449N2973m527p3615O30232
3887A3951332N26824N34269M83851J7599O33239j77496J77810N98034L9962Q09724
3877A7595148J86462k38208O10988O88269o51529K86698j325n40809k5576m26041
3867A7484077k34426N7244n40570O6510J70390j06099L79053J074939R28973J57101
$$ y = [5138230, 5431842, 4890035, 4527615, 4552320, 4623528, 4966246, 5256276, 5194456, 4972497, 5418262, 5539775, 5706076, 6553086, 6576382, 6063914, 6474856, 6562147, 6838658, 7381849, 7799074, 7454439, 7785165, 8640598, 8411648, 8574405, 9046034, 8853741, 9175675, 9418219, 9601359, 9766899, 9992288, 9516555, 10200468, 11248981, 11132238, 12075668, 12354378, 12148811, 12727111, 13165194, 13278810, 13840717, 13809718, 13346269, 13399242, 13394715, 13321100, 13951332, 14478156, 15012425, 15496276, 15513875, 16147114, 15969618, 16147428, 16745462, 16785424, 17595148, 17781610, 17543402, 18154390, 18842659, 18191130, 18477828, 18476503, 17935694, 17910118, 17484077, 17249651, 17306895, 16766325, 16832835, 17003225, 16897126, 17276179, 18351118, 19280091, 19437192]
3857A9437192K81227Q71892J045876J125630J253458J580210J965280J597212
3849B9157977J639337K531991K659604L136115L774268M885423N833467N516730
3841E9134912N861769N706984M889555N346026N463070N809047O563475O189924
3833A04964762O434007P076133N432762M011916M112250K531224R62989r53091
3825A34572952j893713k420967k965092k833072j204248J381558K306216L186478
3817A30130112L733607L104856K144017K367714K458698J593097K106888K455922
3809A50094911J816026J432469J687823M32727r31450l243148n654694p739854
3801A37894810q496010r897136r887402r514909q404932o803729n333474l760173
$$ y = [19437192, 19718419, 20590311, 21636187, 22761817, 24015275, 25595485, 27560765, 29157977, 30797314, 33329305, 35988909, 39125024, 42899292, 47784715, 53618182, 59134912, 64996681, 70703665, 75593220, 80939246, 86402316, 92211363, 98774838, 104964762, 111398769, 118474902, 123907664, 127919580, 132031830, 134563054, 135526043, 134572952, 132679239, 130258272, 127293180, 124460108, 123255860, 124637418, 126943634, 130130112, 133863719, 136968575, 139112592, 141480306, 143939004, 145532101, 147638989, 150094911, 151910937, 153343406, 155031229, 155463956, 154532506, 151289358, 145634664, 137894810, 129398800, 119501664, 109614262, 100099353, 91694421, 84890692, 79557218, 75797045]
3793G5797045k242457r33089k16190P3635j554360k049670l524328m504188m439162
3784E6407236m707665m526165m564508m232911l212130l414819k667929j341176
3776B7739933k327616j652407m42628p76560n69666m77399j234686r02100n86871
3767A8770000r25328M992j63327r1070j22815o29165l33582m03101l89888j41034
3757A5575682o68763n06364J51575k03909n12204O0859m67944m5419P80484k78825
3747A3885172k8754N2806j83482M07419R0087j18864k3621M82925Q3268P7386
3737A4724342P22568o9383P2731K24223q04799j005181l00493m7918m08031k80069
3727A2827990n73577k59307M11497L55709P01834P79216J3973n47369p34067o24671
$$ y = [75797045, 73554588, 72621499, 72405309, 72478944, 70924584, 68874914, 65350586, 60846398, 56407236, 51699571, 47173406, 42608898, 38375987, 35163857, 31749038, 29081109, 27739933, 25412317, 23759910, 23317282, 22540722, 21971056, 21493657, 20258971, 19356871, 18770000, 17844672, 17849664, 17686337, 17595267, 17472452, 16843287, 16509705, 16106604, 15716716, 15575682, 14906919, 14400555, 14552130, 14348221, 13836017, 13896876, 13428932, 13383513, 14163997, 13885172, 13856418, 13909224, 13725742, 14133161, 14223248, 14104384, 14080763, 14563688, 14646956, 14724342, 15446910, 15377527, 15450258, 15674481, 14869682, 13864501, 13564008, 13516090, 13108059, 12827990, 12254413, 11995106, 12406603, 12762312, 13464146, 14243362, 14257335, 13709966, 12975899, 12351228]
3717A2351228l49334m39992k42921l22677j322712o51061n62906m19637M61979
3708H501967k77813k49146m11375o63883O26748M3765K14186M11942q64492m0165
3698G291734J99638q49474k96794M55371K6704q0665J24103n76409N48324J47319
3688F989851n03142k70910j83886K1295O5414R59152j83603j59757j40231l62651
3678F231532J04592N39159k73867k05362J41659l8688K17194L91135l29755m03350
3668F374249k49105j31628Q16304k06868n7282K64327k13544l19552J49452J57942
3658F584295L15264Q21880o66281p9686O30906l92926L84264Q73229p55793R541
3648G724693N35503l44337Q18627P12027L7389R94352O51137j37059N67574O30088
$$ y = [12351228, 12001894, 11561902, 11318981, 10996304, 9673592, 9022531, 8459625, 8039988, 8501967, 8224154, 7975008, 7563633, 6899750, 7526498, 7570263, 7784449, 8196391, 7331899, 7291734, 7491372, 6641898, 6345104, 6800475, 6827179, 6746514, 6870617, 6294208, 6842532, 6989851, 6486709, 6215799, 6031913, 6053208, 6118622, 7077774, 6894171, 6734414, 6594183, 6231532, 6336124, 6875283, 6601416, 6396054, 6537713, 6499025, 6716219, 7107354, 6777599, 6374249, 6125144, 5993516, 6809820, 6602952, 6545670, 6809997, 6596453, 6276901, 6426353, 6584295, 6899559, 7721439, 7055158, 6975472, 7606378, 7213452, 7597716, 8470945, 7715152, 7724693, 8260196, 7915859, 8734486, 9446513, 9483902, 10478254, 11129391, 10992332, 11559906, 12189994]
3638A2189994L10495M09550L12973L18133L20438K69660K81920M18319L03396
$$ y = [12189994, 12500489, 12910039, 13223012, 13541145, 13861583, 14131243, 14413163, 14831482, 15134878]
$$ [...]
##END NTUPLES=NMR SPECTRUM
##END=
