##TITLE=1H_DE-80H_X3
 200.13MHz, d2o
 8 sc
 
 19ns.26.2.2025
##JCAMPDX= 6.0         $$ Bruker NMR JCAMP-DX V2.0
##DATA TYPE= NMR SPECTRUM
##DATA CLASS= NTUPLES
##ORIGIN= UXNMR, Bruker Analytische Messtechnik GmbH
##OWNER= pz
$$ XWIN-NMR		Version 3.5
$$ Mon May  4 11:46:18 2026 Russian Standard Time (UT+4h)  Yarkov@DPX200
##.OBSERVE FREQUENCY= 200.1313
##.OBSERVE NUCLEUS= ^1H
##.ACQUISITION MODE= SIMULTANEOUS
##.ACQUISITION SCHEME= undefined
##.AVERAGES= 8
##.DIGITISER RES= 18
##SPECTROMETER/DATA SYSTEM= spect
##.PULSE SEQUENCE= zg30
##.SOLVENT NAME= CDCl3
##.SHIFT REFERENCE= (INTERNAL, CDCl3, 0, 18.0056)
##AUDIT TRAIL= $$ (NUMBER, WHEN, WHO, WHERE, WHAT)
$$ ##TITLE= Audit trail, XWIN-NMR		Version 3.5
$$ ##JCAMPDX= 5.01
$$ ##ORIGIN= Bruker BioSpin GmbH
$$ ##OWNER= Yarkov
$$ C:/Bruker/XWIN-NMR/data/yarkov2/nmr/H-C/1/pdata/1/auditp.txt
$$ ##AUDIT TRAIL=  $$ (NUMBER, WHEN, WHO, WHERE, WHAT)
(   1,<2026-05-04 11:43:43.04 +0400>,<Yarkov>,<DPX200>,
      <created by zg, POWCHK disabled, PULCHK disabled
       configuration hash MD5:
       00 E9 B6 7A A2 85 ED C7 34 08 36 98 17 FE 4E 26
       data hash MD5: 16K
       A7 F9 52 57 6D 36 60 A3 D3 8B 95 6F B2 1C 32 A8>)
(   2,<2026-05-04 11:44:00.75 +0400>,<Yarkov>,<DPX200>,
      <Start of raw data processing
       efp BC_mod = 2 LB = 0.25 FT_mod = 6 PKNL = 1 PHC0 = -5303.516 PHC1 = 11.42193 SI = 16K 
       data hash MD5: 16K
       0F 1D BC 04 95 DF CF 2C 66 D0 D2 7A BA 0E 70 90>)
(   3,<2026-05-04 11:44:11.14 +0400>,<Yarkov>,<DPX200>,
      <abs ABSG = 5 
       data hash MD5: 16K
       97 9D 90 FC FB 5F D1 D2 4E 32 CC EB 90 3A BD E2>)
$$ ##END=
$$ 
$$ hash MD5
$$ 14 02 C6 B6 8F 96 A1 06 A0 AF 39 A1 24 93 56 DD
##$RELAX= 
##$RELAX= 
##$RELAX= 
##$RELAX= 
##$RELAX= 
##$RELAX= 
$$ Bruker specific parameters
$$ --------------------------
##$DU= <C:/Bruker/XWIN-NMR>
##$EXPNO= 1
##$NAME= <H-C>
##$PROCNO= 1
##$TYPE= <nmr>
##$USER= <yarkov2>
##$AMP= (0..31)
100 100 100 100 100 100 100 100 100 100 100 100 100 100 100 100 100 100 
100 100 100 100 100 100 100 100 100 100 100 100 100 100 
##$AQSEQ= 0
##$AQ_mod= 1
##$AUNM= <au_zg>
##$AUTOPOS= <>
##$BF1= 200.13
##$BF2= 200.13
##$BF3= 200.13
##$BF4= 200.13
##$BF5= 200.13
##$BF6= 200.13
##$BF7= 200.13
##$BF8= 200.13
##$BYTORDA= 1
##$CFDGTYP= 0
##$CFRGTYP= 5
##$CHEMSTR= <none>
##$CNST= (0..31)
1 1 145 1 1 1 1 1 1 1 1 1 1 1 1 1 1 1 1 1 1 1 1 1 1 1 1 1 1 1 1 1 
##$CPDPRG= <>
##$CPDPRG1= <>
##$CPDPRG2= <>
##$CPDPRG3= <>
##$CPDPRG4= <mlev>
##$CPDPRG5= <mlev>
##$CPDPRG6= <mlev>
##$CPDPRG7= <mlev>
##$CPDPRG8= <mlev>
##$CPDPRGB= <>
##$CPDPRGT= <>
##$D= (0..31)
0 0.7 0 0 0 0 0 0 0 0 0 0.03 0 0 0 0 0 0 0 0 0 0 0 0 0 0 0 0 0 0 0 0 
##$DATE= 1777880622
##$DBL= (0..7)
120 120 120 120 120 120 120 120 
##$DBP= (0..7)
150 150 150 150 150 150 150 150 
##$DBP07= 0
##$DBPNAM0= <>
##$DBPNAM1= <>
##$DBPNAM2= <>
##$DBPNAM3= <>
##$DBPNAM4= <>
##$DBPNAM5= <>
##$DBPNAM6= <>
##$DBPNAM7= <>
##$DBPOAL= (0..7)
0.5 0.5 0.5 0.5 0.5 0.5 0.5 0.5 
##$DBPOFFS= (0..7)
0 0 0 0 0 0 0 0 
##$DE= 6
$$ [...]
##$SUBNAM3= <"">
##$SUBNAM4= <"">
##$SUBNAM5= <"">
##$SUBNAM6= <"">
##$SUBNAM7= <"">
##$SUBNAM8= <"">
##$SUBNAM9= <"">
##$SW= 18.0517328524113
##$SWIBOX= (0..15)
0 0 2 0 0 0 0 0 0 0 0 0 0 0 0 0 
##$SW_h= 3612.71676300578
##$TD= 16384
##$TD0= 1
##$TE= 0
##$TE2= 300
##$TE3= 300
##$TEG= 300
##$TL= (0..7)
0 120 120 120 120 120 120 120 
##$TP= (0..7)
150 150 150 150 150 150 150 150 
##$TP07= 0
##$TPNAME0= <>
##$TPNAME1= <>
##$TPNAME2= <>
##$TPNAME3= <>
##$TPNAME4= <>
##$TPNAME5= <>
##$TPNAME6= <>
##$TPNAME7= <>
##$TPOAL= (0..7)
0.5 0.5 0.5 0.5 0.5 0.5 0.5 0.5 
##$TPOFFS= (0..7)
0 0 0 0 0 0 0 0 
##$TUNHIN= 0
##$TUNHOUT= 0
##$TUNXOUT= 0
##$USERA1= <user>
##$USERA2= <user>
##$USERA3= <user>
##$USERA4= <user>
##$USERA5= <user>
##$V9= 5
##$VALIST= <valist>
##$VCLIST= <CCCCCCCCCCCCCCC>
##$VD= 0
##$VDLIST= <DDDDDDDDDDDDDDD>
##$VPLIST= <PPPPPPPPPPPPPPP>
##$VTLIST= <TTTTTTTTTTTTTTT>
##$WBST= 1024
##$WBSW= 4
##$XGAIN= (0..3)
0 0 0 0 
##$XL= 0
##$YL= 0
##$YMAX_a= 313005
##$YMIN_a= -314307
##$ZGOPTNS= <>
##$ZL1= 120
##$ZL2= 120
##$ZL3= 120
##$ZL4= 120
##$ABSF1= 18.08188
##$ABSF2= 0.02998352
##$ABSG= 5
##$ABSL= 3
##$ALPHA= 0
##$AQORDER= 0
##$ASSFAC= 0
##$ASSFACI= 0
##$ASSFACX= 0
##$ASSWID= 0
##$AUNMP= <proc_1d>
##$AZFE= 0.1
##$AZFW= 0.1
##$BCFW= 0
##$BC_mod= 2
##$BYTORDP= 0
##$COROFFS= 0
##$CY= -3
##$DATMOD= 1
##$DC= 0
##$DFILT= <>
##$DTYPP= 0
##$F1P= 0
##$F2P= 0
##$FCOR= 1
##$FTSIZE= 16384
##$FT_mod= 6
##$GAMMA= 0
##$GB= 0
##$INTBC= 1
##$INTSCL= 3.241238e-09
##$ISEN= 128
##$LB= 0.25
##$LEV0= 0
##$LPBIN= 0
##$MAXI= 10000
##$MC2= 0
##$MEAN= 0
##$ME_mod= 0
##$MI= 1.114404
##$NCOEF= 0
##$NC_proc= -7
##$NLEV= 6
##$NOISF1= 3.799351
##$NOISF2= 2.8
##$NSP= 0
##$NTH_PI= 0
##$NZP= 0
##$OFFSET= 18.00562
##$PC= 1
##$PHC0= -5303.516
##$PHC1= 11.42193
##$PH_mod= 1
##$PKNL= yes
##$PPARMOD= 0
##$PSCAL= 0
##$PSIGN= 0
##$REVERSE= no
##$SF= 200.129502903168
##$SI= 16384
##$SIGF1= 3
##$SIGF2= 2
##$SINO= 0.751879
##$SIOLD= 32768
##$SREGLST= <19F.Aceton>
##$SSB= 0
##$STSI= 16384
##$STSR= 0
##$SW_p= 3612.71676300578
##$SYMM= 0
##$S_DEV= 0
##$TDeff= 16384
##$TDoff= 0
##$TI= <>
##$TILT= no
##$TM1= 0
##$TM2= 0
##$TOPLEV= 0
##$USERP1= <user>
##$USERP2= <user>
##$USERP3= <user>
##$USERP4= <user>
##$USERP5= <user>
##$WDW= 1
##$XDIM= 16384
##$YMAX_p= 313259888
##$YMIN_p= -427315
$$ End of Bruker specific parameters
$$ ---------------------------------
##NTUPLES= NMR SPECTRUM
##VAR_NAME=  FREQUENCY,     SPECTRUM/REAL,   SPECTRUM/IMAG
##SYMBOL=    X,             R,               I
##VAR_TYPE=  INDEPENDENT,   DEPENDENT,       DEPENDENT
##VAR_FORM=  AFFN,          ASDF,            ASDF
##VAR_DIM=   16384,         16384,           16384
##UNITS=     HZ,            ARBITRARY UNITS, ARBITRARY UNITS
##FACTOR=    0.220516191357247, 1,           1
##FIRST=     3603.45558975465, 0,            0
##LAST=      -9.26117325113501, 0,           0
##MIN=       -9.26117325113501, -427315,     0
##MAX=       3603.45558975465, 313259888,    0
$$ Real data points
##PAGE= N=1
##DATA TABLE= (X++(R..R)), XYDATA
$$ [...]
$$ plain form
4005 2099583 2185381 2127201 2077857 2079293 2113222 2156421 2128117 2068940 1957236 2020389 2075208
3994 2075208 2011240 2057247 2211226 2142872 2064828 2090025 2193201 2066762 2015482 2120015 2304806
3983 2304806 2273513 2220662 2312826 2361402 2360794 2290184 2374456 2416567 2352911 2410653 2534766 2636040
3971 2636040 2660991 2717111 2747077 2754597 2842962 3006037 3078323 3165595 3394537 3492176 3510494
3960 3510494 3536770 3527322 3629256 3797939 3809159 3879018 3911733 3954822 4146033 4252730 4281596
3949 4281596 4432978 4735782 4922937 5186482 5253592 5299246 5471070 5646743 5914894 6069456
3939 6069456 6386180 6567343 6799978 7035868 7385485 7589077 7601038 7774476 7956104 8006096
3929 8006096 8022476 8238786 8367816 8475913 8688897 8979642 9168269 9145321 9184455 9347445
$$ packed form
4005B099583Q5798n8180m9344J436L3929M3199k8304n9177j11704O3153N4819
3994B075208o3968M6007J53979o8354p8044K5197J03176j26439n1280J04533J84791
3983B304806l1293n2851R2164M8576o08p0610Q4272M2111o3656N7742J24113J01274
3971B636040K4951N6120K9966P520Q8365J63075P2286Q7272K28942R7639J8318
3960C510494K6276r448J01934J68683J1220O9859L2715M3089J91211J06697K8866
3949D281596J51382L02804J87155K63545O7110M5654J71824J75673K68151J54562
3939F069456L16724J81163K32635K35890L49617K03592J1961J73438J81628M9992
3929H006096J6380K16310J29030J08097K12984K90745J88627k2948L9134J62990
$$ plain form
3919 9347445 9342242 9613010 9845401 10081325 10376890 10764001 11116179 11289818 11440535 11535773
3909 11535773 11720628 11699129 11678251 11576005 11729646 11549497 11483835 11480344 11507745 11611605
3899 11611605 11783935 12098881 12285082 12593119 12785293 13072366 13507441 13926877 14484697
3890 14484697 15149900 15827793 16555758 17536679 18663034 20031743 21469196 23143271 25324598
3881 25324598 27751557 30413808 33120263 35951412 38746160 41389397 44200051 47015872
3873 47015872 49884327 53022608 56559452 60302442 63979830 67369644 70668740 73381417
3865 73381417 75612175 77127130 78159432 78693306 78609879 78299999 77911262 77661157 77811109
3856 77811109 78172879 78816527 79608416 80441287 81502419 82570602 83868124 85081328 86426277
$$ packed form
3919I347445n203K70768K32391K35924K95565L87111L52178J73639J50717R5238
3909A1535773J84855k1499k0878j02246J53641j80149o5662l491K7401J03860
3899A1611605J72330L14946J86201L08037J92174K87073M35075M19436N57820
3890A4484697O65203O77893P27965R80921J126355J368709J437453J674075K181327
3881B5324598K426959K662251K706455K831149K794748K643237K810654K815821
3873D7015872K868455L138281L536844L742990L677388L389814L299096K712677
3865G3381417K230758J514955J032302N33874q3427l09880l88737k50105J49952
3856G7811109L61770O43648P91889Q32871J061132J068183J297522J213204J344949
$$ plain form
3847 86426277 87531772 88721236 89781113 90569675 91017738 90984555 90188530 88562364 86188386
3838 86188386 82963599 79120560 74773528 70323112 65983749 61894477 58249544 55262023
3830 55262023 53025132 51149933 49980892 49095737 48079554 47013103 45716246 43877501
3822 43877501 41794187 39302540 36730506 34234603 31703069 29359776 27288345 25438837
3814 25438837 23732281 22110218 20774818 19714331 18711262 17744485 16936836 16349017 15796434
3805 15796434 15346943 14731696 14270390 13841072 13380890 13182194 12751985 12373869 12133206
3796 12133206 11856224 11581592 11317751 11048440 10716447 10420072 10135186 10021335 9925134 9818379
3786 9818379 9634608 9591978 9641059 9506248 9433627 9433691 9393340 9440569 9479843 9583472 9621814
$$ packed form
3847H6426277J105495J189464J059877P88562M48063l3183p96025j626166k373978
3838H6188386l224787l843039m347032m450416m339363m089272l644933k987521
3830E5262023k236891j875199j169041q85155j016183j066451j296857j838745
3822D3877501k083314k491647k572034k495903k531534k343293k071431j849508
3814B5438837j706556j622063j335400j060487j003069r66777q07649n87819n52583
3805A5796434m49491o15247m61306m29318m60182j98696m30209l78116k40663
3796A2133206k76982k74632k63841k69311l31993k96375k84886j13851r6201j06755
3786I818379j83771m2630M9081j34811p2621O4m0351M7229L9274J03629L8342
$$ plain form
3775 9621814 9597237 9671031 9797599 9822604 9807405 9711543 9502757 9361802 9169548 8881512
3765 8881512 8554620 8524709 8239387 8149613 8194765 8284664 8431087 8449324 8476617 8516577 8446015
3754 8446015 8215153 7931127 7627021 7234693 6914533 6528504 6050543 5825077 5612397 5537919
3744 5537919 5425121 5204159 5118852 5035580 4905936 4839720 4798310 4716629 4496845 4486424 4389800
3733 4389800 4260998 4157044 3957665 3864963 4038622 4108255 4026647 3931531 3858111 3666029
3723 3666029 3630566 3768582 3735851 3635475 3619843 3534132 3562722 3556237 3417090 3393748 3538951
3712 3538951 3532861 3533301 3376166 3446201 3562422 3496987 3440937 3547367 3601591 3651348 3440719
3701 3440719 3286639 3360214 3413382 3530549 3641873 3667707 3742063 3850616 3787039 3804180 3908975
$$ packed form
3775I621814k4577P3794J26568K5005j5199r5862k08786j40955j92254k88036
3765H881512l26892k9911k85322q9774M5152Q9899J46423J8237K7293L9960p0562
3754H446015k30862k84026l04106l92328l20160l86029m77961k25466k12680p4478
3744E537919j12798k20962q5307q3272j29644o6216m1410q1681k19784j0421r6624
3733D389800j28802j03954j99379r2702J73659O9633q1608r5116p3420j92082
3723C666029l5463J38016l2731j00376j5632q5711K8590o485j39147k3342J45203
3712C538951o090M40j57135P0035J16221o5435n6050J06430N4224M9757k10629
3701C440719j54080P3575N3168J17167J11324K5834P4356J08553o3577J7141J04795
$$ plain form
3690 3908975 3955387 3952161 4170288 4280248 4339170 4523627 4816266 4867345 5084811 5383757
3680 5383757 5759267 6120462 6550471 6873208 7209086 7544822 7729553 7870924 8002106 8099563
3670 8099563 8110686 8053017 8135336 8326629 8502554 8727108 9037466 9260241 9566132 10276666
3660 10276666 10696368 11190748 11754645 12314080 13067912 13570043 14093573 14587867 14985849
3651 14985849 15339360 15582802 15622743 15784119 15967026 16296589 16593708 16830531 17239599 17682756
3641 17682756 18137832 18642911 19239298 19987777 20695777 21262629 21714822 22121576 22505942
3632 22505942 22732272 22979772 23013773 23012614 23069604 23239504 23395723 23525607 23843226 24169376
3622 24169376 24599995 25099154 25479375 25996322 26560963 27226066 27853128 28099245 28433151
$$ packed form
3690C908975M6412l226K18127J09960N8922J84457K92639N1079K17466K98946
3680E383757L75510L61195M30009L22737L35878L35736J84731J41371J31182R7457
3670H099563J1123n7669Q2319J91293J75925K24554L10358K22775L05891P10534
3660A0276666M19702M94380N63897N59435P53832N02131N23530M94294L97982
3651A4985849L53511K43442L9941J61376J82907L29563K97119K36823M09068M43157
3641A7682756M55076N05079N96387P48479P08000N66852M52193M06754L84366
3632B2505942K26330K47500L4001j159N6990J69900J56219J29884L17619L26150
3622B4169376M30619M99159L80221N16947N64641O65103O27062K46117L33906
$$ plain form
3613 28433151 28706573 28806314 28691850 28446936 28238756 28225193 28067812 27779720 27567856 27382537
3603 27382537 27368649 27355017 27452101 27428713 27586881 27768942 27844850 28035244 28130473 28103429 28024515
3592 28024515 27864593 27536807 27292498 27061176 26619993 26260028 25809266 25307399 24844017
3583 24844017 24343736 23992112 23465635 23094289 22701995 22276518 21942638 21590921 21190291
3574 21190291 20917237 20482791 20212242 20025198 19671835 19442859 19124804 18895178 18454281
3565 18454281 18050914 17721899 17461766 16957597 16551139 16138259 15568298 15099849 14728531
3556 14728531 14192511 13807824 13351414 13001140 12791315 12364724 12088156 11568948 11071740
3547 11071740 10733057 10345710 9850467 9415599 9205321 8956234 8774799 8528395 8214004
$$ packed form
3613B8433151K73422R9741j14464k44914k08180j3563j57381k88092k11864j85319
3603B7382537j3888j3632R7084k3388J58168J82061P5908J90394R5229k7044p8914
3592B8024515j59922l27786k44309k31322m41183l59965m50762n01867m63382
3583B4844017n00281l51624n26477l71346l92294m25477l33880l51717m00630
3574B1190291k73054m34446k70549j87044l53363k28976l18055k29626m40897
3565A8454281m03367l29015k60133n04169m06458m12880n69961m68449l71318
3556A4728531n36020l84687m56410l50274k09825m26591k76568n19208m97208
3547A1071740l38683l87347m95243m34868k10278k49087j81435k46404l14391
$$ plain form
3538 8214004 8034269 7788555 7447200 7246058 6966829 6556013 6351754 6196001 6113398 5854388
3528 5854388 5556534 5341762 5092251 4826001 4630513 4514336 4180633 3987309 4017105 3886172
3518 3886172 3641505 3509649 3244787 3139242 3306719 3189628 3069876 2889024 2803109 2733879
3508 2733879 2670536 2660685 2611519 2528513 2320675 2281995 2272263 2072116 2112739 2136410 2204887
3497 2204887 2201198 2059723 2070228 2107460 2043747 1981055 1880115 1784979 1869401 1937329 1830226
3486 1830226 1795322 1786050 1610964 1731811 1683237 1553602 1454939 1481062 1606941 1640656 1485350
3475 1485350 1488243 1690541 1673849 1654905 1539777 1449325 1520117 1560839 1608933 1519839 1407010
3464 1407010 1373787 1476790 1514028 1400729 1396599 1452135 1392037 1266888 1393171 1428529 1359084
$$ packed form
3538H214004j79735k45714l41355k01142k79229m10816k04259j55753q2603k59010
3528E854388k97854k14772k49511k66250j95488j16177l33703j93324K9796j30933
3518C886172k44667j31856k64862j05545J67477j17091j19752j80852q5915o9230
3508B733879o3343r851m9166q3006k07838l8680r732k00147M0623K3671O8477
3497B204887l689j41475J0505L7232o3713o2692j00940r5136Q4422O7928j07103
3486A830226l4904r272j75086J20847m8574j29635r8663K6123J25879L3715j55306
3475A485350K893K02298j6692j8944j15128r0452P0792M0722M8094q9094j12829
3464A407010l3223J03003L7238j13299m130N5536o0098j25149J26283L5358o9445
$$ plain form
3453 1359084 1160798 1185733 1318532 1269106 1300539 1378918 1238040 1181018 1264706 1282699 1319506
3442 1319506 1110562 1159354 1281490 1302215 1251056 1218313 1378865 1353396 1237180 1234099 1201849
3431 1201849 1183825 1152522 1157117 1225744 1257143 1104486 1182370 1114383 1085756 1177189 1223549
3420 1223549 1271597 1302270 1296396 1369819 1383502 1301353 1335320 1249953 1352008 1307587 1165708
3409 1165708 1102510 1220138 1196943 1205724 1137430 1131480 1199822 1395126 1363176 1258015 1218809
3398 1218809 1177720 1304850 1330611 1171143 984849 1046574 1080446 1074937 1146290 1179177 1173878
3387 1173878 1171180 1140954 1163815 1200141 1219806 1351912 1522905 1358930 1350657 1416665 1368485
3376 1368485 1344193 1334120 1321764 1369229 1376664 1297795 1377960 1302378 1246773 1169703 1126608 1098593
$$ packed form
3453A359084j98286K4935J32799m9426L1433P8379j40878n7022Q3688J7993L6807
3442A319506k08944M8792J22136K0725n1159l2743J60552k5469j16216l081l2250
3431A201849j8024l1303M595O8627L1399j52657P7884o7987k8627R1433M6360
3420A223549M8048L0673n874P3423J3683q2149L3967q5367J02055m4421j41879
3409A165708o3198J17628k3195Q781o8294n950O8342J95304l1950j05161l9206
3398A218809m1089J27130K5761j59468j86294O1725L3872n509P1353L2887n299
3387A173878k698l0226K2861L6326J9665J32106J70993j63975q273O6008m8180
3376A368485k4292j0073j2356M7465P435p8869Q0165p5582n5605p7070m3095k8015
$$ plain form
3364 1098593 1157042 1258269 1385059 1323315 1261176 1280779 1188426 1229931 1215868 1222318 1196190
3353 1196190 1154269 1156704 1277131 1200274 1325733 1232216 1093916 1254039 1292270 1382422 1413540
3342 1413540 1550773 1405380 1277993 1302872 1316563 1236264 1431379 1523370 1554596 1553217 1448095
3331 1448095 1352078 1198362 1336044 1362972 1310555 1386983 1326743 1212862 1326287 1408327 1436947
3320 1436947 1406021 1390807 1597101 1521140 1510819 1495003 1347634 1349877 1329252 1318418 1211688
3309 1211688 1293851 1287377 1288445 1253474 1379135 1238613 1190704 1297536 1195019 1225213 1354698
3298 1354698 1379900 1502805 1478987 1154682 1129159 1091118 1127963 1222731 1119372 1142180 1168778
3287 1168778 1271252 1399825 1279526 1212771 1287069 1306954 1391812 1407581 1405194 1312385 1483982
$$ packed form
3364A098593N8449J01227J26790o1744o2139J9603r2353M1505j4063O450k6128
3353A196190m1921K435J20427p6857J25459r3517j38300J60123L8231R0152L1118
3342A413540J37233j45393j27387K4879J3691q0299J95115R1991L1226j379j05122
3331A448095r6017j53716J37682K6928n2417P6428o0240j13881J13425Q2040K8620
3320A436947l0926j5214K06294p5961j0321j5816j47369K243k0625j0834j06730
3309A211688Q2163o474J068l4971J25661j40522m7909J06832j02517L0194J29485
3298A354698K5202J22905k3818l24305k5523l8041L6845R4768j03359K2808K6598
3287A168778J02474J28573j20299o6755P4298J9885Q4858J5769k387r2809J71597
$$ plain form
3276 1483982 1436739 1292401 1351941 1364670 1491841 1363571 1428085 1393832 1308742 1400354 1282588
3265 1282588 1344683 1391623 1413107 1355722 1375479 1462409 1497102 1415992 1282280 1274556 1316506
3254 1316506 1218664 1174117 1184726 1177596 1309019 1361318 1221616 1101619 1223043 1186583 1243834
3243 1243834 1176207 1146868 1150551 1175896 1431440 1290118 1236612 1363470 1393286 1392579 1428437
3232 1428437 1311556 1236217 1231015 1355807 1446870 1437445 1439711 1223627 1202783 1224519 1214299
3221 1214299 1212195 1199902 1100950 1220225 1263957 1294652 1290393 1377171 1242613 1296809 1383276
3210 1383276 1375283 1439199 1409782 1336899 1339683 1348664 1356542 1397793 1363417 1313234 1202943 1336479
3198 1336479 1579948 1513058 1543737 1583982 1418483 1233630 1391828 1375000 1254857 1320664
$$ packed form
3276A483982m7243j44338N9540J2729J27171j28270O4514l4253q5090R1612j17766
3265A282588O2095M6940K1484n7385J9757Q6930L4693q1110j33712p724M1950
3254A316506r7842m4547J0609p130J31423N2299j39702j19997J21424l6460N7251
3243A243834o7627k9339L683K5345K55544j41322n3506J26858K9816p07L5858
3232A428437j16881p5339n202J24792R1063r425K266k16084k0844K1736j0220
3221A214299k104j2293r8952J19275M3732L0695m259Q6778j34558N4196Q6467
3210A383276p993O3916k9417p2883K784Q981P878M1251l4376n0183j10291J33536
3198A336479K43469o6890L0679M0245j65499j84853J58198j6828j20143O5807
$$ plain form
3188 1320664 1368261 1330353 1311679 1203683 1174196 1273274 1324678 1177049 1280274 1278931 1247353
3177 1247353 1485768 1410845 1355450 1385420 1388954 1363512 1348186 1306996 1301894 1249441 1308116 1347633
3165 1347633 1372555 1209443 1185368 1192136 1174422 1080689 1031178 1066127 1255716 1148178 1164983
3154 1164983 1121178 1058790 1098353 1081207 1221296 1234956 1120872 1099066 1239832 1203674 1224034
3143 1224034 1202466 1085704 932988 874567 1070212 1062518 1037485 1039984 1070728 953153 900833
3132 900833 1044171 1016775 1044733 1086869 1045382 1143019 1142934 1075136 1035639 1016369 1018415 1127534
3120 1127534 1116173 1044775 1089042 1133775 1198424 1155792 1123703 1059150 986731 968947 1058997
3109 1058997 1013849 1031699 1011209 1074620 1024133 874044 933735 970219 978459 976142 920257 979567
$$ packed form
3188A320664M7597l7908j8674j07996k9487R9078N1404j47629J03225j343l1578
3177A247353K38415p4923n5395K9970L534k5442j5326m1190n102n2453N8675L9517
3165A347633K4922j63112k4075O768j7714r3733m9511L4949J89589j07538J6805
3154A164983m3805o2388L9563j7146J40089J3660j14084k1806J40766l6158K0360
3143A224034k1568j16762j52716n8421J95645p694k5033K499L0744j17575n2320
3132I00833J43338k7396K7958M2136m1487R7637q5o7798l9497j9270K046J09119
3120A127534j1361p1398M4267M4733O4649m2632l2089o4553p2419j7784R0050
3109A058997m5148J7850k0490O3411n0487j50089N9691L6484Q240k317n5885N9310
$$ plain form
3097 979567 963141 912927 981810 1001193 964020 832613 899696 846967 708792 730537 854466
3086 854466 916805 810645 910632 896832 853847 942298 925108 1028675 962989 1040874 992292
3075 992292 965849 991852 971997 982626 1076686 1044122 861067 939925 991267 976555 1053007
3064 1053007 1046436 1038752 1132867 986732 949988 978032 1046633 1188446 1190962 1112950 1055417 1023415
3052 1023415 1055066 1254065 1208353 1253366 1260563 1073151 1102759 1106271 1070455 1163455 1160142 1122250
3040 1122250 1204293 1111247 994657 1073212 1057843 989563 977695 1092574 1385036 1389763 1302700
3029 1302700 1173396 1084279 1211079 1322100 1341514 1418437 1290954 1166819 1178094 1228346
3019 1228346 1220893 1283443 1292293 1404595 1389707 1283818 1284094 1507706 1515457 1453785 1386924 1397244
$$ packed form
3097I79567j6426n0214O8883J9383l7173j31407O7083n2729j38175K1745J23929
3086H54466O2339j06160R9987j3800m2985Q8451j7190J03567o5686P7885m8582
3075I92292k6443K6003j9855J0629R4060l2564j83055P8858N1342j4712P6452
3064A053007o571p684R4115j46135l6744K8044O8601J41813K516p8012n7533l2002
3052A023415L1651J98999m5712M5013P197j87412K9608L512l5816R3000l313l7892
3040A122250Q2043r3046j16590P8555j5369o8280j1868J14879K92462M727q7063
3029A302700j29304q9117J26800J11021J9414P6923j27483j24135J1275N0252
3019A228346p453O2550Q850J12302j4888j05889K76K23612P751o1672o6861J0320
$$ plain form
3007 1397244 1523039 1490234 1621821 1606741 1444372 1405737 1383214 1338309 1422862 1425026 1372692
2996 1372692 1433373 1345770 1256764 1398839 1331969 1316969 1466272 1415523 1396609 1369970 1445961
2985 1445961 1552928 1677132 1572045 1449931 1491221 1488253 1461211 1436824 1456068 1469282 1518825
2974 1518825 1527684 1486652 1455310 1354733 1276779 1391379 1416670 1353266 1449911 1449533 1429010 1532399
2962 1532399 1578651 1516064 1497726 1580399 1476915 1500332 1530899 1449372 1518740 1648013 1430282
2951 1430282 1343596 1371141 1402248 1373159 1290304 1217656 1284834 1306871 1400144 1381443 1442830
2940 1442830 1522416 1411399 1346743 1426031 1527014 1533871 1588912 1627194 1527983 1580146 1698922
2929 1698922 1629208 1511461 1536954 1650868 1631315 1602648 1519388 1456655 1548824 1599441 1593122
$$ packed form
3007A397244J25795l2805J31587j5080j62369l8635k2523m4905Q4553K164n2334
2996A372692O0681q7603q9006J42075o6870j5000J49303n0749j8914k6639P5991
2985A445961J06967J24204j05087j22114M1290k968k7042k4387J9244J3214M9543
2974A518825Q859m1032l1342j00577p7954J14600K5291o3404R6645l78k0523J03389
2962A532399M6252o2587j8338Q2673j03484K3417L0567q1527O9368J29273k17731
2951A430282q6686K7545L1107k9089q2855p2648O7178K2037R3273j8701O1387
2940A442830P9586j11017o4656P9288J00983O857N5041L8282r9211N2163J18776
2929A698922o9714j17747K5493J13914j9553k8667q3260o2733R2169N0617o319
$$ plain form
2918 1593122 1588523 1524292 1367577 1368916 1609004 1571201 1530063 1547893 1533443 1468260 1421034
2907 1421034 1419142 1417415 1406596 1488832 1566949 1336989 1435483 1369856 1364555 1388905 1343913 1392216
2895 1392216 1370641 1525074 1384926 1408785 1367022 1443765 1496673 1692298 1643308 1565545 1689221
2884 1689221 1608961 1644999 1658902 1538203 1575878 1624056 1517197 1545744 1551359 1435614 1442191
2873 1442191 1542736 1603977 1619841 1580417 1644156 1690922 1652385 1680844 1714271 1664918 1651743
2862 1651743 1677091 1654907 1688915 1694777 1548044 1579841 1622499 1695588 1780407 1717340 1693830
2851 1693830 1691903 1654555 1726569 1740173 1730515 1659533 1711454 1641180 1648583 1883575 1936465 1968483
2839 1968483 1840312 1793991 1761311 1775517 1672035 1715862 1871668 1764663 1791314 1835902 1878938
$$ packed form
2918A593122m599o4231j56715J339K40088l7803m1138J7830j4450o5183m7226
2907A421034j892j727j0819Q2236P8117k29960R8494o5627n301K4350m4992M8303
2895A392216k1575J54433j40148K3859m1763P6743N2908J95625m8990p7763J23676
2884A689221q0260L6038J3903j20699L7675M8178j06859K8547N615j15745O577
2873A442191J00545O1241J5864l9424O3739M6766l8537K8459L3427m9353j3175
2862A651743K5348k2184L4008N862j46733L1797M2658P3089Q4819o3067k3510
2851A693830j927l7348P2014J3604r658p0982N1921p0274P403K34992N2890L2018
2839A968483j28171m6321l2680J4206j03482M3827J55806j07005K6651M4588M3036
$$ plain form
2828 1878938 1841659 1763633 1690570 1834389 1880550 1917566 1967764 2003535 2038868 1949017 1925568
2817 1925568 1898827 1805426 1730754 1838511 1951037 1850693 1975712 1937700 1981420 2056378 2082006
2806 2082006 2292937 2161280 2070317 2127962 2101863 2089639 2255375 2196458 2127305 2128185 2238050
2795 2238050 2196812 2190226 2216277 2296946 2419614 2299875 2321751 2331656 2391361 2385597 2404577 2472715
2783 2472715 2431323 2408292 2421604 2463646 2480895 2422885 2473479 2511104 2518280 2697046 2739871
2772 2739871 2663210 2750327 2798142 2847274 2864179 2945854 3141458 3118842 3391655 3485810 3546613
2761 3546613 3810178 3931606 3873274 3818099 3914960 4129153 4290474 4342226 4420793 4576628
2751 4576628 4556274 4458071 4600950 4668697 4526792 4719132 4851856 4794762 5062333 5306486
$$ packed form
2828A878938l7279p8026p3063J43819M6161L7016N0198L5771L5333q9851k3449
2817A925568k6741r3401p4672J07757J12526j00344J25019l8012M3720P4958K5628
2806B082006K10931j31657r0963N7645k6099j2224J65736n8917o9153Q80J09865
2795B238050m1238o586K6051Q0669J22668j19739K1876R905N9705n764J8980O8138
2783B472715m1392k3031J3312M2042J7249n8010N0594L7625P176J78766M2825
2772B739871p6661Q7117M7815M9132J6905Q1675J95604k2616K72813R4155O0803
2761C546613K63565J21428n8332n5175R6861K14193J61321N1752P8567J55835
2751D576628k0354r8203J42879O7747j41905J92340J32724n7094K67571K44153
$$ plain form
2741 5306486 5423358 5592398 6066949 6597209 7279099 8108472 8845408 9605338 10447633 11168807
2731 11168807 11747937 11908438 11798657 11591407 11208341 10747125 10248260 10016314 9900625
2722 9900625 9790654 9768982 9863934 10048726 10388457 10926706 11521732 12112063 12516174 12872007
2712 12872007 13136879 12963643 12539062 12062596 11606500 10951150 10434514 10009994 9673886
2703 9673886 9417467 9332744 9408722 9420625 9588073 9923781 10413143 11080589 11485417 11857080
2693 11857080 12114250 12378565 12659072 12733012 12774617 12888322 13365336 14051652 14950648 16107142
2683 16107142 17317621 18675902 19764641 20879815 22013724 22964593 23678432 24096346 24050273
2674 24050273 23486192 22507835 21393601 20240948 18850305 17750304 16748259 16099086 15636863
$$ packed form
2741E306486J16872J69040M74551N30260O81890Q29373P36936P59930Q42295P21174
2731A1168807N79130J60501j09781k07250l83066m61216m98865k31946j15689
2722I900625j09971k1672R4952J84792L39731N38249N95026N90331M04111L55833
2712A2872007K64872j73236m24581m76466m56096o55350n16636m24520l36108
2703I673886k56419q4723P5978J1903J67448L35708M89362O67446M04828L71663
2693A1857080K57170K64315K80507P3940M1605J13705M77014O86316Q98996J156494
2683A6107142J210479J358281J088739J115174J133909R50869P13839M17914m6073
2674B4050273n64081r78357j114234j152653j390643j100001j002045o49173m62223
$$ plain form
2665 15636863 15216913 15205109 15420489 15517419 15966939 16319179 16791514 17260407 17353447 17178668
2655 17178668 16631324 15935431 15270128 14373767 13558392 12863112 12393618 11876815 11448234
2646 11448234 11203983 11196530 11072939 11210086 11615118 12113087 12658725 13155795 13419364 13574359
2636 13574359 13536305 13336945 13059818 12646704 12191819 11875523 11414548 11114133 11000445 10983759
2626 10983759 11032099 11173668 11525649 11938253 12506532 12860421 13162468 13250078 13306561 13163528
2616 13163528 13044516 12919974 12573055 12389699 12427645 12529553 12864655 13520509 14371960 15017220
2606 15017220 15525984 15804114 16020926 15749821 15213939 14433834 13692608 12788991 12022887
2597 12022887 11444453 11037364 10598540 10215948 9980406 9943124 10001338 9950627 10246739 10383863
$$ packed form
2665A5636863m19950j1804K15380R6930M49520L52240M72335M68893R3040j74779
2655A7178668n47344o95893o65303q96361q15375o95280m69494n16803m28581
2646A1448234k44251p453j23591J37147M05032M97969N45638M97070K63569J54995
2636A3574359l8054j99360k77127m13114m54885l16296m60975l00415j13688j6686
2626A0983759M8340J41569L51981M12604N68279L53889L02047Q7610N6483j43033
2616A3163528j19012j24542l46919j83356L7946J01908L35102O55854Q51451O45260
2606A5017220N08764K78130K16812k71105n35882p80105p41226r03617p66104
2597A2022887n78434m07089m38824l82592k35542l7282N8214n0711K96112J37124
$$ plain form
2587 10383863 10450357 10740965 11025774 11019150 10859745 10558723 10267445 9850818 9301799 9083809
2577 9083809 8937510 8673069 8386756 8149231 8047784 8109890 8120993 8188583 8292654 8359455
2567 8359455 8591925 8863783 9193794 9559451 10107912 10712597 11507747 12260326 12907232 13529352
2557 13529352 13899924 14246510 14466718 14606695 14709375 14922251 15315588 15762260 16426763
2548 16426763 17075688 17506148 17807260 18143204 18256336 18328555 18421602 18326788 18161658 17939285
2538 17939285 17548570 16953697 16479544 16160975 15912009 15556770 15587841 15746658 15778742 15660975
2528 15660975 15528905 15297222 14673102 14033310 13434431 12751756 12291472 11733836 11273660
2519 11273660 10890579 10494620 10362351 10309413 10154030 10116091 10176816 10282395 10562519 10980398
$$ packed form
2587A0383863O6494K90608K84809o624j59405l01022k91278m16627n49019k17990
2577I083809j46299k64441k86313k37525j01447O2106J1103O7590J04071O6801
2567H359455K32470K71858L30011L65657N48461O04685P95150P52579O46906O22120
2557A3529352L70572L46586K20208J39977J02680K12876L93337M46672O64503
2548A6426763O48925M30460L01112L35944J13132P2219R3047r4814j65130k22373
2538A7939285l90715n94873m74153l18569k48966l55239L1071J58817L2084j17767
2528A5660975j32070k31683o24120o39792n98879o82675m60284n57636m60176
2519A1273660l83081l95959j32269n2938j55383l7939O0725J05579K80124M17879
$$ plain form
2509 10980398 11673651 12459844 13139616 14080250 15185537 16397657 17211502 17999032 18522560
2500 18522560 18479237 18056771 17414396 16706852 16137878 15435151 14873311 14611443 14472837 14519072
2490 14519072 14621332 15029362 15507750 16182177 16705020 17305148 17663981 17711839 17316772 16686187
2480 16686187 15791532 14833461 13816024 12919264 12063882 11366876 10750645 10216306 9580391
2471 9580391 9026365 8649505 8455796 8226866 8081690 7695048 7440049 7390625 7213106 7063095
2461 7063095 7009604 6949687 6933218 6810460 6760631 6712981 6656189 6594327 6437266 6351311 6458585
2450 6458585 6409544 6306091 6300903 6204655 6225791 6155712 6110586 6053083 5979096 5940221 6027899
2439 6027899 6160766 6246695 6123879 6067399 6106475 6072701 6109778 6247364 6216934 6169615 6199596
$$ packed form
2509A0980398O93253P86193O79772R40634J105287J212120Q13845P87530N23528
2500A8522560m3323m22466o42375p07544n68974p02727n61840k61868j38606M6235
2490A4519072J02260M08030M78388O74427N22843O00128L58833M7858l95067o30585
2480A6686187q94655r58071j017437q96760q55382o97006o16231n34339o35915
2471I580391n54026l76860j93709k28930j45176l86642k54999m9424j77519j50011
2461G063095n3491n9917j6469j22758m9829m7650n6792o1862j57061q5955J07274
2450F458585m9041j03453n188r6248K1136p0079m5126n7503p3987l8875Q7678
2439F027899J32867Q5929j22816n6480L9076l3774L7077J37586l0430m7319K9981
$$ plain form
2428 6199596 6212716 6169593 6192477 6303860 6332265 6348160 6287331 6390735 6381586 6380520 6404053
2417 6404053 6553177 6571597 6420987 6630253 6660138 6726434 6830943 6998251 6913413 6914434 7061788
2406 7061788 7123897 7140739 7146228 7201645 7507071 7642491 7790965 7826244 7890880 8129745 8330628
2395 8330628 8517862 8887156 9184482 9572053 9922203 10271137 10912638 11671218 12535595 13416072
2385 13416072 14676630 15938240 17015152 18118437 19162189 19935896 20052343 20098705 20036969
2376 20036969 19916504 19786441 19552005 19387580 19408040 19253483 18751740 18193033 17496027 16796167
2366 16796167 16168971 15389720 14813930 14346731 14087072 13719886 13292968 13202280 13049961 13120591
2356 13120591 13298867 13497246 13571325 13913338 14454497 14813751 15163024 15869091 16767157 17678673
$$ packed form
2428F199596J3120m3123K2884J11383K8405J5895o0829J03404r149j066K3533
2417F404053J49124J8420j50610K09266K9885O6296J04509J67308q4838J021J47354
2406G061788O2109J6842N489N5417L05426J35420J48474L5279O4636K38865K00883
2395H330628J87234L69294K97326L87571L50150L48934O41501P58580Q64377Q80477
2385A3416072J260558J261610J076912J103285J043752P73707J16447M6362o1736
2376B0036969j20465j30063k34436j64425K0460j54557n01743n58707o97006o99860
2366A6796167o27196p79251n75790m67199k59659l67186m26918r0688j52319P0630
2356A3120591J78276J98379P4079L42013N41159L59254L49273P06067Q98066R11516
$$ plain form
2346 17678673 18786165 20125691 21430974 22678498 23802663 24709276 25572563 26308311 26927979
2337 26927979 27489989 27858168 28306329 28536423 28471592 28107858 27717182 27046703 26339532 25725349
2327 25725349 25354836 25062125 24820556 24541739 24120285 23828134 23278332 23014258 22754901
2318 22754901 22858837 23278751 23791128 24519105 25020712 25570513 26058576 26273543 26257048 26017382
2308 26017382 25500187 24645766 23805232 23135334 22546669 22040458 21616861 21480244 21399525 21411498
2298 21411498 21639301 21720623 21707888 21666785 21391627 21286122 21153120 21256430 21619603 21996920
2288 21996920 22569123 22986401 23532767 24055896 24520740 24955081 25423984 25992514 26503698
2279 26503698 27297375 27996380 28354807 28579891 28734220 28719392 28356298 27505843 26558502 25410165
$$ packed form
2346A7678673J107492J339526J305283J247524J124165R06613Q63287P35748O19668
2337B6927979N62010L68179M48161K30094o4831l63734l90676o70479p07171o14183
2327B5725349l70513k92711k41569k78817m21454k92151n49802k64074k59357
2318B2754901J03936M19914N12377P27977N01607N49801M88063K14967j6495k39666
2308B6017382n17195q54421q40534o69898n88665n06211m23597j36617q0719J1973
2298B1411498K27803Q1322j2735m1103k75158j05505j33002J03310L63173L77317
2288B1996920N72203M17278N46366N23129M64844M34341M68903N68530N11184
2279B6503698P93677O99005L58427K25084J54329j4828l63094q50455r47341j148337
$$ plain form
2269 25410165 24217446 23034966 21916465 20915172 19869661 19196823 18923898 18467180 18233502
2260 18233502 18352827 18563494 18950477 19312286 19611308 19791165 19821671 19697807 19390935 18699486
2250 18699486 18048656 17387378 16949546 16729525 16606814 16310458 16200650 16264039 16242855 16140848
2240 16140848 16010009 15908763 15601378 15014302 14414925 13878313 13565232 13235928 12928668
2231 12928668 12669162 12344196 12434807 12486551 12476369 12603057 12698249 12915868 13164834 13781082
2221 13781082 14303182 14943910 15507641 15948523 16107380 15937400 15620036 15094971 14423009
2212 14423009 13708207 13024012 12423014 12067146 11500318 11128210 10741746 10304045 10176044
2203 10176044 9920820 9505609 9321019 9074124 9073959 8789981 8498554 8522411 8510442 8377831
$$ packed form
2269B5410165j192719j182480j118501j001293j045511o72838k72925m56718k33678
2260A8233502J19325K10667L86983L61809K99022J79857L0506j23864l06872o91449
2250A8699486o50830o61278m37832k20021j22711k96356j09808O3389k1184j02007
2240A6140848j30839j01246l07385n87076n99377n36612l13081l29304l07260
2231A2928668k59506l24966R0611N1744j0182J26688R5192K17619K48966O16248
2221A3781082N22100O40728N63731M40882J58857j69980l17364n25065o71962
2212A4423009p14802o84195o00998l55868n66828l72108l86464m37701j28001
2203A0176044k55224m15211j84590k46895j65k83978k91427K3857j1969j32611
$$ plain form
2193 8377831 8273946 8288078 8144613 8042163 8047078 8067689 8121300 8098576 7940993 7940135 7877995
2182 7877995 7763301 7870610 7771832 7644712 7634097 7533565 7561517 7678810 7621523 7667782
2172 7667782 7648382 7511979 7367685 7566326 7654017 7500656 7353470 7332184 7370467 7370625 7373009
2161 7373009 7389718 7390470 7212143 7118741 7156261 7239162 7174301 7221516 7179455 7216966 7286454 7290013
2149 7290013 7122625 6934200 6879221 6999500 7182553 7118592 7042261 7037625 7049986 6988047 6918254
2138 6918254 7039347 7054715 6964558 6960872 7023733 7070186 7037908 6960761 6846981 6908394 6915302
2127 6915302 6972407 6847591 6926498 7023155 7013268 6948808 6862094 6943266 7018595 6995679 7077945
2116 7077945 6937488 6740370 6799126 6832138 6792565 6991962 7046174 7083631 7100871 7149795 7177493
$$ packed form
2193H377831j03885J4132j43465j02450M915K0611N3611k2724j57583q58o2140
2182G877995j14694J07309r8778j27120j0615j00532K7952J17293n7287M6259
2172G667782j9400j36403j44294J98641Q7691j53361j47186k1286L8283J58K384
2161G373009J6709P52j78327r3402L7520Q2901o4861M7215m2061L7511O9488L559
2149G290013j67388j88425n4979J20279J83053o3961p6331m636J2361o1939o9793
2138F918254J21093J5368r0157l686O2861M6453l2278p7147j13780O1413O908
2127F915302N7105j24816P8907R6657r887o4460q6714Q1172P5329k2916Q2266
2116G077945j40457j97118N8756L3012l9573J99397N4212L7457J7240M8924K7698
$$ plain form
2105 7177493 7179781 7208392 7228758 7140480 7198103 7334655 7275476 7248015 7250148 7267557 7383994
2094 7383994 7424580 7604469 7679439 7558267 7693438 7812111 8166054 8380589 8659476 8838787
2084 8838787 8982836 9001455 8876927 8741925 8591041 8382842 8292231 8133706 8230936 8092891
2074 8092891 8061655 8141329 8099298 7955045 7962283 7960266 7924370 7814042 7803823 7926699 7940448
2063 7940448 8000662 8072586 8082683 8008441 8057571 8136945 8078739 8025720 8007392 8203340 8302266
2052 8302266 8257380 8212788 8368464 8377381 8298362 8262033 8411914 8450963 8489272 8551033 8759101
2041 8759101 8790233 8875544 8932535 8925945 9095098 9234912 9458963 9578644 9840056 10229093
2031 10229093 10422755 10813422 11139737 11510983 11847690 11956105 12170268 12418447 12847314
$$ packed form
2105G177493K288K8611K0366q8278N7623J36552n9179k7461K133J7409J16437
2094G383994M0586J79889P4970j21172J35171J18673L53943K14535K78887J79311
2084H838787J44049J8619j24528j35002j50884k08199r0611j58525R7230j38045
2074H092891l1236P9674m2031j44253P238k017l5896j10328j0219J22876J3749
2063G940448O0214P1924J0097p4242M9130P9374n8206n3019j8328J95948R8926
2052H302266m4886m4592J55676Q917p9019l6329J49881L9049L8309O1761K08068
2041H759101L1132Q5311N6991o590J69153J39814K24051J19681K61412L89037
2031A0229093J93662L90667L26315L71246L36707J08415K14163K48179M28867
$$ plain form
2022 12847314 13061379 13416040 13819209 14043377 14204288 14390983 14663238 14942328 15329422
2013 15329422 15943227 16469738 17500418 18442226 19647327 20901707 22549743 24560235 26937200
2004 26937200 30103464 34263593 39531583 46718365 56472715 69916969 85466875 103112218
1996 103112218 118751556 125565785 122864132 114196811 102841627 89692088 77331383
1989 77331383 66463947 57103632 49441914 43543069 38999142 35263504 32265180 29356797
1981 29356797 26816803 24623337 22929493 21578224 20217068 19129587 18214563 17477530
1973 17477530 16854803 16315860 15869919 15543252 15267496 14902400 14652853 14403705 14208511
1964 14208511 13966837 13803443 13724959 13675271 13534285 13333151 13138233 13028511 13020672 12918063
$$ packed form
2022A2847314K14065L54661M03169K24168J60911J86695K72255K79090L87094
2013A5329422O13805N26511J030680R41808J205101J254380J648036K010492K376965
2004B6937200L166264M160129N267990P186782R754350J3444254J5549906J7645343
1996A03112218J5639338O814229k701653q667321j1355184j3149539j2360705
1989G7331383j0867436r360315p661718n898845m543927l735638k998324k908383
1981B9356797k539994k193466j693844j351269j361156j087481r15024p37033
1973A7477530o22727n38943m45941l26667k75756l65096k49547k49148j95194
1964A4208511k41674j63394p8484m9688j40986k01134j94918j09722p839j02609
$$ plain form
1954 12918063 12936634 13004712 13036424 13150411 13174270 13180764 13288119 13384662 13410761 13502123 13639816
1943 13639816 14014436 14340692 14684725 15237932 15706783 16518993 17283293 18235558 19491207
1934 19491207 20983964 22691154 24688222 26930624 29369766 31955194 34145611 35943217
1926 35943217 37461654 38537586 39523658 40343146 41168240 41848824 42235221 42142925 41771593
1917 41771593 41090817 40558856 40336390 40401195 40708515 41403933 42119770 42911460 43335908 43345029
1907 43345029 43221021 42868871 42564741 42305332 41556542 40442968 39109157 37028562 34544997
1898 34544997 31958503 29488589 27185492 24945558 22943491 21162680 19873170 18665643
1890 18665643 17724130 16849248 16125463 15654308 15285049 15002837 14786485 14728552 14603529 14780264
$$ packed form
1954A2918063J8571O8078L1712J13987K3859O494J07355R6543K6099R1362J37693
1943A3639816L74620L26256L44033N53207M68851Q12210P64300R52265J255649
1934A9491207J492757J707190J997068K242402K439142K585428K190417J797606
1926C5943217J518437J075932R86072Q19488Q25094O80584L86397r2296l71332
1917D1771593o80776n31961k22466O4805L07320O95418P15837P91690M24448R121
1907D3345029j24008l52150l04130k59409p48790j113574j333811k080595k483565
1898C4544997k586494k469914k303097k239934k002067j780811j289510j207527
1890A8665643r41513q74882p23785m71155l69259k82212k16352n7933j25023J76735
$$ plain form
1880 14780264 15055623 15381877 15577057 15693490 15626017 15195117 14461093 13623030 13003031 12400930
1870 12400930 11733381 11162374 10630247 10262900 9742030 9306088 9103063 8822083 8540514
1861 8540514 8400526 8299857 8208634 8055975 8105000 8085796 7857241 7770945 7767552 7616143 7440315
1850 7440315 7264755 7341188 7292152 7299797 7407691 7264480 7340864 7274856 7203519 7208770 7199409
1839 7199409 7113272 7170621 7186262 7221021 7190315 7113963 7126036 7156774 7173848 7113216 7100848
1828 7100848 7128131 7076112 6996340 6925276 7007385 6997701 7111981 7063669 7007832 6976224 6948671
1817 6948671 6952586 6791777 6924103 6776790 6631693 6740005 6649976 6462056 6426976 6355865
1807 6355865 6372548 6325004 6263767 6120588 5957606 5865754 6006612 6001692 6028666 5898119 5757920
$$ packed form
1880A4780264K75359L26254J95180J16433o7473m30900p34024q38063o19999o02101
1870A2400930o67549n71007n32127l67347n20870m35942k03025k80980k81569
1861H540514j39988j00669r1223j52659M9025j9204k28555q6296l393j51409j75828
1850G440315j75560P6433m9036P645J07894j43211P6384o6008p1337N251r361
1839G199409q6137N7349J5641L4759l0706p6352J2073L0738J7074o0632j2368
1828G100848K7283n2019p9772p1064Q2109r684J14280m8312n5837l1608k7553
1817F948671L915j60809J32326j47313j45097J08312r0029j87920l5080p1111
1807F355865J6683m7544o1237j43179j62982r1852J40858m920K6974j30547j40199
$$ plain form
1796 5757920 5537150 5565428 5625417 5495488 5524912 5410691 5331752 5369348 5499059 5415141 5190047
1785 5190047 5128981 5067867 5175353 5362155 5285365 5143820 5052499 4963221 5042890 5137231 5073187
1774 5073187 4968056 4975310 5088746 5081002 4983640 5008366 5131010 5098812 4977620 5011704 5129328
1763 5129328 5221059 5231649 5350081 5334934 5294930 5257338 5344369 5297883 5196372 5316725 5258647
1752 5258647 5339871 5192249 5304063 5439373 5248612 5244621 5214317 5370581 5451868 5475965 5576656
1741 5576656 5537259 5398841 5374472 5365306 5337681 5424880 5395283 5496212 5584931 5590560 5690446
1730 5690446 5766651 5818404 5838780 5756046 5885939 6060275 5972688 5973886 6227749 6348847 6427057
1719 6427057 6517641 6642053 6858332 6969208 7155999 7342797 7524142 8056631 8452985 8694565
$$ packed form
1796E757920k20770K8278N9989j29929K9424j14221p8939L7596J29711q3918k25094
1785E190047o1066o1114J07486J86802p6790j41545r1321q9278P9669R4341o4044
1774E073187j05131P254J13436p744r7362K4726J22644l2198j21192L4084J17624
1763E129328R1731J0590J18432j5147m0004l7592Q7031m6486j01511J20353n8078
1752E258647Q1224j47622J11814J35310j90761l991l0304J56264Q1287K4097J00691
1741E576656l9397j38418k4369r166k7625Q7199k9597J00929Q8719N629R9886
1730E690446P6205N1753K0376q2734J29893J74336q7587J198K53863J21098P8210
1719F427057R0584J24412K16279J10876J86791J86798J81345N32489L96354K41580
$$ plain form
1709 8694565 9092339 9652081 10494958 11023052 11761569 12860656 13946212 15114691 16312107
1700 16312107 17803718 19258150 20647871 21888127 22890039 23562375 24144052 24677659 24872796
1691 24872796 25058280 25089183 24817966 24164396 23285092 22425325 21414170 20494441 19652078
1682 19652078 18726203 18100395 17842486 17565894 17709243 18240283 18937802 19740449 20753741
1673 20753741 21611223 22267778 22930329 23787650 24439239 25220540 25948314 26305291 26687272
1664 26687272 27127524 27197950 27239968 27152499 26803575 26328580 25562517 24620600 23283588 22121382
1654 22121382 20889694 19311084 18048613 16864985 15867864 14885959 13879147 13074504 12457301
1645 12457301 11984515 11399974 10930145 10661280 10448747 10100786 9755402 9652082 9590697 9510185
$$ packed form
1709H694565L97774N59742Q42877N28094P38517J099087J085556J168479J197416
1700A6312107J491611J454432J389721J240256J001912O72336N81677N33607J95137
1691B4872796J85484L0903k71217o53570q79304q59767j011155r19729q42363
1682A9652078r25875o25808k57909k76592J43349N31040O97519Q02647J013292
1673B0753741Q57482O56555O62551Q57321O51589P81301P27774L56977L81981
1664B6687272M40252P0426M2018q7469l48924m74995p66063r41917j337012j162206
1654B2121382j231688j578610j262471j183628r97121r81905j006812q04643o17203
1645A2457301m72786n84541m69829k68865k12533l47961l45384j03320o1385q0512
$$ plain form
1635 9510185 9482398 9376873 9199510 9142018 9205797 8942296 8835786 8627943 8489422 8432767
1625 8432767 8244611 8161989 8139696 8119765 8054651 7993971 8047775 7934599 7940965 7929384 8031161
1614 8031161 7992900 8105029 8172421 8109457 8104847 8110170 8220579 8215238 8364052 8452639 8335782
1603 8335782 8212346 8226844 8286349 8441908 8604905 8614186 8582345 8544041 8622374 8583569 8615244
1592 8615244 8541615 8682650 8724323 8653569 8617122 8605884 8602529 8642196 8736015 8649307 8659290 8615747
1580 8615747 8657993 8651912 8656907 8684723 8691381 8758638 8927418 8778445 8689675 8802352 8966694
1569 8966694 8884490 8967252 9087888 9155806 9143296 9285026 9241636 9240199 9443454 9483267 9519282
1558 9519282 9673653 9875867 9907455 9976483 10087731 10311470 10511903 10666491 10725466 10815157
$$ packed form
1635I510185k7787j05525j77363n7492O3779k63501j06510k07843j38521n6655
1625H432767j88156q2622k2293j9931o5114o0680N3804j13176O366j1581J01777
1614H031161l8261J12129O7392o2964m610N323J10409n341J48814Q8587j16857
1603H335782j23436J4498N9505J55559J62997R281l1841l8304P8333l8805L1675
1592H615244p3629J41035M1673p0754l6447j1238l355L9667R3819q6708R983m3543
1580H615747M2246o081M995K7816O658O7257J68780j48973q8770J12677J64342
1569H966694q2204Q2762J20636O7918j2510J41730m3390j437K03255L9813L6015
1558I519282J54371K02214L1588O9028J11248K23739K00433J54588N8975Q9691
$$ plain form
1548 10815157 11020780 11389585 11892240 12217036 12379401 12649426 13024459 13559328 14099953
1539 14099953 14574212 15148608 15566751 16081996 16702244 17438598 17984643 18480472 19237992
1530 19237992 19913066 20815645 21486204 22302071 23373106 24419951 25511827 26626037 27804742
1521 27804742 28997232 30172183 31409431 32600927 33701575 34981379 36177815 37339003
1513 37339003 38448210 39464905 40624724 41735999 42986214 44316442 45500325 46776491
1505 46776491 48140003 49507771 50870581 52228767 53555478 54659450 55787792 56662504
1497 56662504 57354855 57850638 58281782 58663329 58736677 58645434 58492626 58177418 57836043 57535549
1487 57535549 57211456 56638193 56014338 55177783 54183358 53049333 51600737 50052315 48375913
$$ packed form
1548A0815157K05623L68805N02655L24796J62365K70025L75033N34869N40625
1539A4099953M74259N74396M18143N15245O20248P36354N46045M95829P57520
1530A9237992O75074R02579O70559Q15867J071035J046845J091876J114210J178705
1521B7804742J192490J174951J237248J191496J100648J279804J196436J161188
1513C7339003J109207J016695J159819J111275J250215J330228J183883J276166
1505D6776491J363512J367768J362810J358186J326711J103972J128342Q74712
1497E6662504O92351M95783M31144L81547P3348r1243j52808l15208l41375l00494
1487E7535549l24093n73263o23855q36555r94425j134025j448596j548422j676402
$$ plain form
1478 48375913 46741440 45163394 43659063 41969862 40388075 38821013 37323758 36067815
1470 36067815 34943035 33989326 33226746 32778843 32632877 32748751 33015341 33410681 34182350
1461 34182350 35025367 35975731 37068255 38336084 39825582 41377318 42900411 44601547
1453 44601547 46513339 48258472 49953361 51546614 52966553 54170459 55399330 56647616
1445 56647616 57642000 58393578 58927782 59503229 59769467 59878724 59878256 59416489 58816278 57948042
1435 57948042 57106415 56346510 55291632 54380756 53185166 51832822 50399317 48828810 47135818
1426 47135818 45579854 44006544 42301797 40861131 39389810 37991319 36815067 35561975
1418 35561975 34631776 33649135 32712986 31934787 31319974 30863561 30395215 30107470 29867283
$$ packed form
1478D8375913j634473j578046j504331j689201j581787j567062j497255j255943
1470C6067815j124780r53709p62580m47903j45966J15874K66590L95340P71669
1461C4182350Q43017R50364J092524J267829J489498J551736J523093J701136
1453D4601547J911792J745133J694889J593253J419939J203906J228871J248286
1445E6647616R94384P51578N34204N75447K66238J09257m68m61767o00211q68236
1435E7948042q41627p59905j054878r10876j195590j352344j433505j570507j692992
1426D7135818j555964j573310j704747j440666j471321j398491j176252j253092
1418C5561975r30199r82641r36149p78199o14813m56413m68346k87745k40187
$$ plain form
1409 29867283 29989906 30088502 30037785 30348295 30591588 30602603 30740468 30790739 30897023 31089893
1399 31089893 31490395 31696352 31888234 32298312 32610083 33054416 33449469 33787578 34038730
1390 34038730 34328355 34696453 35025176 35349909 35829378 36064640 36413162 36841081 37186289
1381 37186289 37437278 37457413 37349761 37245246 37177366 36984656 36659717 36281667 35883952 35533934
1371 35533934 35113442 34400207 33803035 33395483 32796147 32295229 31916056 31396454 30991143
1362 30991143 30535729 30196659 29666604 29432160 29230070 28946509 28516810 28540175 28639588 28769944
1352 28769944 28981502 29346020 29886728 30632800 31422941 32262854 33123754 33968991 35100782
1343 35100782 36229845 37347718 38493098 39684711 40724281 41695828 42647320 43614418 44437333
$$ packed form
1409B9867283J22623R8596n0717L10510K43293J1015J37865N0271J06284J92870
1399C1089893M00502K05957J91882M10078L11771M44333L95053L38109K51152
1390C4038730K89625L68098L28723L24733M79469K35262L48522M27919L45208
1381C7186289K50989K0135j07652j04515o7880j92710l24939l78050l97715l50018
1371C5533934m20492p13235n97172m07552n99336n00918l79173n19602m05311
1362C0991143m55414l39070n30055k34444k02090k83561m29699K3365R9413J30356
1352B8769944K11558L64518N40708P46072P90141Q39913Q60900Q45237J131791
1343C5100782J129063J117873J145380J191613J039570R71547R51492R67098Q22915
$$ plain form
1334 44437333 45287494 46250811 47072989 48032166 48832752 49573330 50585402 51349837 51932647
1325 51932647 52519591 53045607 53220289 53595370 53860736 54026834 54093427 54095842 53966401 53686943
1315 53686943 53390009 53001460 52550287 52023595 51679800 51397038 51159216 51050516 51097471 51307806
1305 51307806 51713487 52235188 52729910 53378226 54335594 55331578 56459902 57548623 58810510
1296 58810510 59989311 60973352 61900669 62926591 64072817 65336839 66427693 67258605 67922858
1287 67922858 68090092 67860747 67333336 66668142 65937532 65255427 64575122 64224167 64009664
1278 64009664 64077680 64511181 64941230 65482679 66033993 66439579 67026242 67808857 68777209 69646249
1268 69646249 70560132 71886526 73343098 74712533 76251313 77655373 79069191 80149923
$$ packed form
1334D4437333Q50161R63317Q22178R59177Q00586P40578J012072P64435N82810
1325E1932647N86944N26016J74682L75081K65366J66098O6593K415j29441k79458
1315E3686943k96934l88549m51173n26692l43795k82762k37822j08700M6955K10335
1305E1307806M05681N21701M94722O48316R57368R95984J128324J088721J261887
1296E8810510J178801R84041R27317J025922J146226J264022J090854Q30912O64253
1287F7922858J67234k29345n27411o65194p30610o82105o80305l50955k14503
1278F4009664O8016M33501M30049N41449N51314M05586N86663P82615R68352Q69040
1268F9646249R13883J326394J456572J369435J538780J404060J413818J080732
$$ plain form
1260 80149923 80916173 81244351 81534325 81717789 81662024 81538706 81326288 80816612 80085304 79276256
1250 79276256 78514852 78072959 77778332 77827978 78232350 78599523 79186054 80201735 81287326
1241 81287326 82430734 83563573 84707061 85528178 86049127 86214828 86111805 85910563 85508696
1232 85508696 85086020 84912608 84970866 85061655 85253425 85653376 85926792 86191561 86533846 87038041
1222 87038041 87532047 88387496 89490520 90942741 92603319 94757777 97330382 100388363
1214 100388363 103817432 107673859 111675181 115497806 119341680 123077078 126449077 129669068
1206 129669068 132920684 136318238 139997418 144094921 148954239 154451462 160857500 168396158
1198 168396158 177332229 187709079 199658412 212845389 227163434 242167826 257263197
$$ packed form
1260H0149923P66250L28178K89974J83464n5765j23318k12418n09676p31308q09048
1250G9276256p61404m41893k94627M9646M04372L67173N86531J015681J085591
1241H1287326J143408J132839J143488Q21117N20949J65701j03023k01242m01867
1232H5508696m22676j73412N8258R0789J91770L99951K73416K64769L42285N04195
1222H7038041M94006Q55449J103024J452221J660578K154458K572605L057981
1214A00388363L429069L856427M001322L822625L843874L735398L371999L219991
1206A29669068L251616L397554L679180M097503M859318N497223O406038P538658
1198A68396158Q936071J0376850J1949333J3186977J4318045J5004392J5095371
$$ plain form
1191 257263197 271642761 285072858 296713872 305717645 311407769 313259888 311763947 307099519
1183 307099519 299717823 290283695 279647247 268487539 257291420 246399690 236101511
1176 236101511 226092412 216349993 206941849 197805353 188876682 180172042 171623006 163224627
1168 163224627 155209706 147428672 139990442 132948650 126162074 119690458 113508893 108067408
1160 108067408 102689943 97582921 92976779 88744310 84900585 81317796 78236059 75550601
1152 75550601 73002405 70710266 68691979 66886552 64995462 63346814 61936413 60410623
1144 60410623 59080369 57688640 56204961 54864945 53819032 52538029 51553308 50676097
1136 50676097 49880005 49222960 48520863 47812293 47311627 46860067 46558905 46375399 46389826 46400808
$$ packed form
1191B57263197J4379564J3430097J1641014R003773N690124J852119j495941m664428
1183C07099519p381696r434128j0636448j1159708j1196119j0891730j0298179
1176B36101511j0009099r742419r408144r136496q928671q704640q549036q398379
1168A63224627q014921p781034p438230p041792o786576o471616o181565n441485
1160A08067408n377465n107022m606142m232469l843725l582789l081737k685458
1152G5550601k548196k292139k018287j805427j891090j648648j410401j525790
1144F0410623j330254j391729j483679j340016j045913j281003r84721q77211
1136E0676097p96092o57045p02097p08570n00666m51560l01162j83506J4427J0982
$$ plain form
1126 46400808 46599374 46572068 46836906 47338882 47837362 48231847 48563637 48735408 48711524 48629863
1116 48629863 48191977 47593036 47024039 46575137 46133485 45620458 45125272 44305138 43498903
1107 43498903 42501372 41400605 40374339 39312558 38443471 37685791 36963390 36510691 36202408
1098 36202408 36023948 36021942 35947927 35999221 36119355 36425963 36474736 36521082 36712384 37005765
1088 37005765 37163770 37498158 37674847 37880838 38064473 38171054 38141006 38276475 38337413 38237299
1078 38237299 38230112 38080359 38059223 38137328 38068137 38195722 38244396 38177805 38294624 38116493 37940793
1067 37940793 37704142 37191522 36878823 36592882 36322137 36081216 36065312 36001361 36016833 36089033
1057 36089033 36328289 36245319 36506519 36937216 37356539 38022091 38885319 39807794 41088006
$$ packed form
1126D6400808J98566k7306K64838N01976M98480L94485L31790J71771k3884q1661
1116D8629863m37886n98941n68997m48902m41652n13027m95186q20134q06235
1107D3498903r97531j100767j026266j061781q69087p57680p22401m52699l08283
1098C6202408j78460k006p4015N1294J20134L06608M8773M6346J91302K93381
1088C7005765J58005L34388J76689K05991J83635J06581l0048J35469O0938j00114
1078C8237299p187j49753k1136P8105o9191J27585M8674o6591J16819j78131j75700
1067C7940793k36651n12620l12699k85941k70745k40921j5904o3951J5472P2200
1057C6089033K39256q2970K61200M30697M19323O65552Q63228R22475J280212
$$ plain form
1048 41088006 42775173 44714805 46812354 48913095 50865951 52642356 54223216 55404573
1040 55404573 56677545 57533639 57989728 58282802 58841446 59425913 60002166 60677292 61241584
1031 61241584 61652717 61735028 61507116 61111917 60452707 59629399 58653689 57747838 56875896 55883280
1021 55883280 54886633 53731782 52588895 51315460 49892147 48525299 47018672 45854820
1013 45854820 44881217 44087514 43654214 43575105 43776907 43908571 44451919 45302427 46361820
1004 46361820 47747868 49290191 51093980 53194290 55500076 58099204 61198932 64500623
996 64500623 67915723 71443465 75344224 79587664 84130948 89492634 96014250 103793698
988 103793698 112925079 123596281 136109022 149451237 162088906 172641262 179300668
$$ packed form
1048D1088006J687167J939632K097549K100741J952856J776405J580860J181357
1040E5404573J272972Q56094M56089K93074N58644N84467N76253O75126N64292
1031F1241584M11133Q2311k27912l95199o59210q23308r75710r05851q71942r92616
1021E5883280r96647j154851j142887j273435j423313j366848j506627j163852
1013D5854820r73603p93703m33300p9109K01802J31664N43348Q50508J059393
1004D6361820J386048J542323J803789K100310K305786K599128L099728L301691
996F4500623L415100L527742L900759M243440M543284N361686O521616P779448
988A03793698R131381J0671202J2512741J3342215J2637669J0552356O659406
$$ plain form
981 179300668 180849503 177773231 171055508 161986659 152118940 142160877 132489798 124014567
973 124014567 116383138 109754078 103984004 99109515 94918549 91266281 87959600 85380445
965 85380445 83745562 82596718 82228002 82581309 83425009 85290817 87680409 91092772 95384890
956 95384890 100878516 107897812 116585595 127499830 140674276 155911298 172504204 189159976
948 189159976 203840217 215432108 223604996 229150007 233229652 237301521 241726049 246400103
940 246400103 250024903 251629893 250389594 246103709 238968748 229982852 220312016 210780097
932 210780097 202445065 195501987 190108835 186677036 185138370 185674183 187950437 192231338
924 192231338 198303039 205558603 213586055 221399436 228815781 235410636 241636430 248324211
$$ packed form
981A79300668J548835l076272o717723r068849r867719r958063r671079q475231
973A24014567p631429o629060n770074m874489m190966l652268l306681k579155
965H5380445j634883j148844l68716L53307Q43700J865808K389592L412363M292118
956I5384890N493626P019296Q687783J0914235J3174446J5237022J6592906J6655772
948A89159976J4680241J1591891Q172888N545011M079645M071869M424528M674054
940B46400103L624800J604990j240299m285885p134961q985896r670836r531919
932B10780097q335032o943078n393152l431799j538666N35813K276254M280901
924A92231338O071701P255564Q027452P813381P416345O594855O225794O687781
$$ plain form
916 248324211 255530541 262825851 269528568 274912072 277968074 279028082 278272039 276079031
908 276079031 272858019 269484749 266393179 263672381 261470896 260006756 258238207 254776486
900 254776486 248584585 239330832 227473941 213596523 199022223 184639406 171193150
893 171193150 159102361 148500568 139621730 132148904 126025028 120963334 117023854 114047508
885 114047508 111559906 110036386 109238332 108915678 109260947 110146514 111363943 113318422 115929545
876 115929545 118920433 122484102 126488590 130495982 134828050 139168135 142952534 146150712
868 146150712 148668549 150248327 151123048 151502065 151482269 151189892 150574560 149811745 148694373
859 148694373 147387697 146050624 144755432 143609264 142754692 142383671 142495840 143039727 144225859
$$ packed form
916B48324211P206330P295310O702717N383504L056002J060008p56043k193008
908B76079031l221012l373270l091570k720798k201485j464140j768549l461721
900B54776486o191901r253753j1856891j3877418j4574300j4382817j3446256
893A71193150j2090789j0601793q878838p472826o123876n061694l939480k976346
885A14047508k487602j523520p98054l22654L45269Q85567J217429J954479K611123
876A15929545K990888L563669M004488M007392M332068M340085L784399L198178
868A46150712K517837J579778Q74721L79017j9796k92377o15332p62815j117372
859A48694373j306676j337073j295192j146168q54572l71021J12169N43887J186132
$$ plain form
850 144225859 146045563 148735840 152402741 157535087 164678674 174205990 186566826 201100728
842 201100728 217348064 232743055 243311081 246172962 242053138 232770122 220012137 205959247
834 205959247 191969477 178873333 167425679 157813477 149683224 142787081 136785245 131343655
826 131343655 126399642 122077519 118483381 115747042 113954737 112777736 112277396 112700367
818 112700367 113885541 115674352 118377517 122168189 126900332 132233252 137999007 144404816
810 144404816 150737928 156997379 163307634 169646390 176360686 183831661 191827497 199442959
802 199442959 205639320 209066445 208625214 203960646 195574746 184223461 171168386 157530164
794 157530164 144106305 131625232 120107851 110117212 101385476 93590310 86566220 80611571
$$ packed form
850A44225859J819704K690277L666901N132346P143587R527316J2360836J4533902
842B01100728J6247336J5394991J0568026K861881m119824r283016j2757985j4052890
834B05959247j3989770j3096144j1447654r612202q130253o896143o001836n441590
826A31343655m944013m322123l594138k736339j792305j177001n00340M22971
818A12700367J185174J788811K703165L790672M732143N332920N765755O405809
810A44404816O333112O259451O310255O338756O714296P470975P995836P615462
802A99442959O196361L427125m41231m664568q385900j1351285j3055075j3638222
794A57530164j3423859j2481073j1517381r990639q731736p795166p024090n954649
$$ plain form
786 80611571 75300216 70690836 66820361 63322740 60338617 57551151 55199916 53233066
778 53233066 51427171 49899600 48524624 47281257 46286475 45680291 45209045 44654595 44480986
769 44480986 44447262 44544985 44818080 45224926 46136394 47076856 48479290 50038288 52130178
760 52130178 54770458 57874790 61681312 66316200 72026003 78811895 86871843 96205714
752 96205714 106687089 117449251 127717647 136404137 142820632 146146605 146892787 145505596
744 145505596 142981078 140338436 138589323 137942521 139070805 141420963 144279393 146731537
736 146731537 147695284 146373455 142301134 135827765 127380682 117812260 107996081 98393452
728 98393452 89460056 81317082 74103136 67802390 62261780 57492856 53257886 49524172
$$ packed form
786H0611571n311355m609380l870475l497621k984123k787466k351235j966850
778E3233066j805895j527571j374976j243367r94782o06184m71246n54450j73609
769D4480986l3724R7723K73095M06846R11468R40462J402434J558998K091890
760E2130178K640280L104332L806522M634888N709803O785892Q059948R333871
752I6205714J0481375J0762162J0268396Q686490O416495L325973P46182j387191
744A45505596k524518k642642j749113o46802J128284K350158K858430K452144
736A46731537R63747j321829m072321o473369q447083r568422r816179r602629
728I8393452q933396q142974p213946o300746n540610m768924m234970l733714
$$ plain form
720 49524172 46364608 43557282 41000271 38687344 36712721 35030308 33696556 32298454
712 32298454 30961331 30015831 29043430 28306086 27715579 27283200 26842172 26776396 26786451 26975675
702 26975675 27241735 27630845 27957705 28166973 28575989 28689008 28750034 28637837 28122144 27373990
692 27373990 26380657 25081705 23824339 22585495 21364298 20283672 19406725 18410006 17595360
683 17595360 16939103 16161631 15642993 15245728 14749555 14282241 13830355 13343680 13031080 12698410
673 12698410 12532958 12313397 12160930 11851941 11658632 11626619 11568160 11423075 11224383 11051213
663 11051213 10945544 10850383 10655024 10477507 10174954 9944398 9838014 9711469 9641912 9526923
653 9526923 9374811 9243001 8992446 8743436 8661903 8483591 8392086 8113514 8019178 7933529
$$ packed form
720D9524172l159564k807326k557011k312927j974623j682413j333752j398102
712C2298454j337123r45500r72401p37344n90507m32379m41028o5776J0055J89224
702B6975675K66060L89110L26860K09268M09016J13019O1026j12197n15693p48154
692B7373990r93333j298952j257366j238844j221197j080626q76947r96719q14646
683A7595360o56257p77472n18638l97265m96173m67314m51886m86675l12600l32670
673A2698410j65452k19561j52467l08989j93309l2013n8459j45085j98692j73170
663A1051213j05669r5161j95359j77517l02553k30556j06384j26545o9557j14989
653I526923j52112j31810k50555k49010q1533j78312r1505k78572r4336q5649
$$ plain form
643 7933529 7859285 7778176 7745891 7720877 7717318 7481026 7294896 7339891 7409572 7405537 7284806
632 7284806 7379818 7392910 7390363 7315016 7271218 7123988 7049002 6965117 6926449 6817185 6705705
621 6705705 6684123 6730786 6778793 6735691 6693234 6632813 6466860 6280933 6071634 5999114 5926994
610 5926994 5865225 5836805 5678898 5503856 5293145 5302426 5368605 5292857 5232381 5123768 5011020
599 5011020 4960059 4823614 4803506 4833975 4717132 4539342 4579391 4620207 4718341 4776417 4581456
588 4581456 4450731 4443565 4541933 4537432 4484718 4451834 4413839 4346909 4386011 4457876 4421653 4316642
576 4316642 4308081 4290137 4276986 4093399 4217306 4139243 3902007 3909660 3840848 3823694 3801780
565 3801780 3711695 3774893 3886460 3991434 3832376 3934762 3948038 4096426 4228003 4161373
$$ packed form
643G933529p4244q1109l2285k5014l559k36292j86130M4995O9681m035j20731
632G284806R5012J3092k547p5347m3798j47230p4986q3885l8668j09264j11480
621F705705k1582M6663M8007m3102m2457o0421j65953j85927k09299p2520p2120
610E926994o1769k8420j57907j75042k10711R281O6179p5748o0476j08613j12748
599E011020n0961j36445k0108L0469j16843j77790M0049M0816R8134N8076j94961
588D581456j30725p166R8368m501n2714l2884l7995o6930L9102P1865l6223j05011
576D316642q561j7944j3151j83587J23907p8063k37236P653o8812j7154k1914
565C801780r0085O3198J11567J04974j59058J02386J3276J48388J31577o6630
$$ plain form
555 4161373 4064700 4044029 4224487 4155767 4072288 3824017 3697957 3777994 3639215 3434744 3277822
544 3277822 3339042 3403609 3298161 3193645 3193537 3247462 3126201 3257920 3290434 3266335 3211337
533 3211337 3235637 3251476 3222059 3199308 3245669 3256277 3216265 3350435 3501907 3392430 3378338
522 3378338 3491038 3384739 3293099 3394034 3318492 3411454 3487660 3336374 3320446 3323436 3229755
511 3229755 3136761 3155462 2873777 2716474 2860024 2741580 2656746 2637869 2722620 2677199 2638526
500 2638526 2503149 2629455 2445103 2490396 2431359 2275082 2379130 2345437 2428237 2355489 2311771
489 2311771 2165576 2080738 2113756 2173980 2062414 2089423 2123152 2037155 1993978 2098174 2067366
478 2067366 2183132 2266171 2255228 2216598 2284799 2260055 2373759 2389163 2506898 2420153 2273580
$$ packed form
555D161373r6673k0671J80458o8720q3479k48271j26060Q0037j38779k04471j56922
544C277822O1220O4567j05448j04516j08N3925j21261J31719L2514k4099n4998
533C211337K4300J5839k9417k2751M6361J0608m0012J34170J51472j09477j4092
522C378338J12700j06299r1640J00935p5542R2962P6206j51286j5928K990r3681
511C229755r2994J8701k81685j57303J43550j18444q4834j8877Q4751m5421l8673
500B638526j35377J26306j84352M5293n9037j56277J04048l3693Q2800p2748m3718
489B311771j46195q4838L3018O0224j11566K7009L3729q5997m3177J04196l0808
478B067366J15766Q3039j0943l8630O8201k4744J13704J5404J17735q6745j46573
$$ plain form
467 2273580 2413408 2649202 2564111 2617443 2732672 2633169 2635361 2592201 2392424 2370528 2507013
456 2507013 2464889 2548891 2399522 2478924 2387870 2426845 2435256 2397900 2413700 2332578 2304108 2290050
444 2290050 2188141 2070208 1969495 1879032 1867150 1860869 1831343 1788433 1777908 1747276 1775955
433 1775955 1772764 1771770 1842280 1932827 1783760 1672551 1756383 1709383 1605832 1688483 1735599 1716830
421 1716830 1713045 1735446 1710977 1694918 1749781 1688006 1689830 1748564 1676091 1625016 1607630 1664177
409 1664177 1639163 1434175 1516129 1551022 1506363 1500355 1562295 1418244 1450772 1516890 1374629
398 1374629 1566325 1563715 1537888 1518501 1508497 1575100 1511538 1500038 1520559 1502890 1354044
387 1354044 1387794 1488215 1403794 1385379 1579040 1458412 1502741 1485737 1300137 1384993 1260546
$$ packed form
467B273580J39828K35794q5091N3332J15229r9503K192m3160j99777k1896J36485
456B507013m2124Q4002j49369P9402r1054L8975Q411l7356J5800q1122k8470j4058
444B290050j01909j17933j00713r0463j1882o281k9526m2910j0525l0632K8679
433A775955l191r94P0510R0547j49067j11209Q3832m7000j03551Q2651M7116j8769
421A716830l785K2401k4469j6059N4863o1775J824N8734p2473n1075j7386N6547
409A664177k5014k04988Q1954L4893m4659o008O1940j44051L2528O6118j42261
398A374629J91696k610k5827j9387j0004O6603o3562j1500K0521j7669j48846
387A354044L3750J00421q4421j8415J93661j20628M4329j7004j85600Q4856j24447
$$ plain form
376 1260546 1319474 1534015 1591114 1398293 1287728 1367439 1372594 1303124 1264948 1257836 1242483
365 1242483 1245947 1403068 1422305 1364236 1350618 1418219 1425167 1456071 1324131 1234658 1314388 1312514
353 1312514 1264272 1349254 1420826 1347284 1306616 1321929 1345454 1180734 1186203 1253873 1248278 1216258
341 1216258 1275339 1270177 1225448 1225729 1234357 1112676 1114147 1135498 1214169 1314141 1241220 1161340
329 1161340 1167360 1268022 1264781 1180614 1229547 1305562 1448963 1503203 1401632 1373024 1440969
318 1440969 1404243 1394294 1308661 1248768 1388145 1467765 1581477 1475998 1582393 1606151 1492639
307 1492639 1494607 1492209 1426771 1451241 1417346 1299218 1280505 1253525 1349960 1331941 1171446 1130260
295 1130260 1139412 1217147 1217176 1232932 1294313 1127273 1111701 1171833 1123990 1195015 1117808 1168859
$$ packed form
376A260546N8928K14541N7099j92821j10565P9711N155o9470l8176p112j5353
365A242483L464J57121J9237n8069j3618O7601O948L0904j31940q9473P9730j874
353A312514m8242Q4982P1572p3542m0668J5313K3525j64720N469O7670n595l2020
341A216258N9081n162m4729K81Q628j21681J471K1351P8671R9972p2921p9880
329A161340O020J00662l241q4167M8933P6015J43401N4240j01571k8608O7945
318A440969l6726r949q5633n9893J39377P9620J13712j05479J06395K3758j13512
307A492639J968k398o5438K4470l3895j18128j8713k6980R6435j8019j60495m1186
295A130260R152P7735K9J5756O1381j67040j5572O0132m7843P1025p7207N1051
$$ plain form
283 1168859 1036134 947333 1043247 1215267 1140667 1009395 1074125 1138213 1054215 1043675 1184577
272 1184577 1201555 1218851 1050845 1068124 1056270 1021963 1048343 974002 1014537 1075401 1043438
261 1043438 1049699 1093585 1009114 978647 996432 1010084 1117264 1169559 1200283 1089843 1127100
250 1127100 1238618 1280600 1147069 1145000 1165357 1134045 1129479 1056713 1045753 1010464 923124 990999
238 990999 1034388 1077165 1122591 1112272 987205 933149 1216876 1106703 1048393 1029338 985619
227 985619 1091467 1063914 1091226 962877 938561 1020112 1054594 914495 898209 1079387 1000554
216 1000554 1082883 1036793 1008774 1067095 936821 1137620 1145681 1106479 1078118 1031679 954139
205 954139 943259 1104109 1067949 911378 911074 1038683 1080751 927522 1076226 1087552 1032431
$$ packed form
283A168859j32725q8801R5914J72020p4600j31272O4730O4088q3998j0540J40902
272A184577J6978J7296j68006J7279j1854l4307K6380p4341M0535O0864l1963
261A043438O261M3886q4471l0467J7785J3652J07180N2295L0724j10440L7257
250A127100J11518M1982j33531k069K0357l1312m566p2766j0960l5289q7340O7875
238I90999M3389M2777M5426j0319j25067n4056K83727j10173n8310j9055m3719
227I85619J05848k7553K7312j28349k4316Q1551L4482j40099j6286J81178p8833
216A000554Q2329m6090k8019N8321j30274K00799Q061l9202k8361m6439p7540
205I54139j0880J60850l6160j56571l04J27609M2068j53229J48704J1326n5121
$$ plain form
194 1032431 1071726 1011523 1002529 929581 965706 931534 994831 1082460 1023820 913603 932902 960552
182 960552 989647 987841 987182 938998 873703 885674 954221 992824 1021357 987368 1001286 980162
170 980162 1034989 987840 864881 976787 1060763 985202 1036011 1113952 1067003 942029 953346
159 953346 926346 708558 636207 751528 974710 1058050 926450 870059 976266 906607 813452
148 813452 859905 863479 943908 885045 853830 787225 886321 886870 837220 860054 1004519 994998
136 994998 867967 935109 1077545 999787 842152 943058 930251 932278 933883 930799 1043801
125 1043801 1035458 988151 1041718 991226 860729 888456 852064 947102 988516 943434 1027225 920789
113 920789 941997 1066407 985068 901089 1016055 947780 1032270 1085605 1098502 1028456 1098115
$$ packed form
194A032431L9295o0203q994p2948L6125l4172O3297Q7629n8640j10217J9299K7650
182I60552K9095j806o59m8184o5295J1971O8547L8603K8533l3989J3918k1124
170I80162N4827m7149j22959J11906Q3976p5561N0809P7941m6949j24974J1317
159I53346k7000k17788p2351J15321K23182Q3340j31600n6391J06207o9659r3155
148H13452M6453L574Q0429n8863l1215o6605R9096N49m9650K2834J44465r521
136I94998j27031O7142J42436p7758j57635J00906j2807K027J605l084J13002
125A043801q343m7307N3567n0492j30497K7727l6392R5038M1414m5082Q3791j06436
113I20789K1208J24410q1339q3979J14966o8275Q4490N3335J2897p0046O9659
$$ plain form
102 1098115 1105196 1012164 1015161 1033095 969942 1137248 1243896 1145556 1159281 1220429 1212194 1208195
90 1208195 1152906 1268509 1274116 1257126 1354776 1198973 1278302 1362237 1412766 1513742 1421515
79 1421515 1532887 1521338 1508513 1545341 1598311 1604531 1682063 1794345 1966953 1951305 2005859
68 2005859 2042625 2187513 2393334 2532912 2794273 2963121 3138486 3454686 3927380 4402327
58 4402327 4935814 5304384 5734101 6177225 6713662 7376262 8219507 9313416 10939615 12939628
48 12939628 15736739 19324479 24142904 29812995 36161056 41634957 43699161 42272055
40 42272055 38993877 34675020 29870058 25482392 21584544 18203463 15428132 13277011
32 13277011 11529893 10273886 9209081 8244615 7482295 6754249 6133388 5494339 4966650
$$ packed form
102A098115P081r3032K997J7934o3153J67306J06648r8340J3725O1148q235l999
90A208195n5289J15603N607j6990R7650j55803P9329Q3935N0529J00976r2227
79A421515J11372j1549j2825L6828N2970O220P7532J12282J72608j5648N4554
68B005859L6766J44888K05821J39578K61361J68848J75365L16200M72694M74947
58D402327N33487L68570M29717M43124N36437O62600Q43245J093909J626199K000013
48A2939628K797111L587740M818425N670091O348061N473901K064204j427106
40D2272055l278178m318857m804962m387666l897848l381081k775331k151121
32A3277011j747118j256007j064805r64466p62320p28046o20861o39049n27689
$$ plain form
23 4966650 4379483 3921068 3585243 3285748 3033807 2755778 2727798 2562843 2472693 2329878
13 2329878 2163312 2034291 1945635 1826751 1741044 1657352 1575299 1605973 1543011 1445701 1234973
2 1234973 1144962 1127860
0 1127860
$$ packed form
23D966650n87167m58415l35825k99495k51941k78029k7980j64955r0150j42815
13B329878j66566j29021q8656j18884q5707q3692q2053L0674o2962r7310k10728
2A234973r0011j7102
0A127860
$$ Imaginary data points
##PAGE= N=2
##DATA TABLE= (X++(I..I)), XYDATA
$$ plain form
16383 -17515669 -17293094 -17012199 -16696535 -16507895 -16275796 -16116358 -15902862 -15774699 -15571789
16374 -15571789 -15327274 -15093083 -14888593 -14707111 -14496017 -14358261 -14101621 -13948944 -13849583
16365 -13849583 -13620887 -13373174 -13216978 -13031178 -12836393 -12678626 -12556179 -12417008 -12352716
16356 -12352716 -12136695 -11978842 -11893370 -11671378 -11546239 -11390503 -11199217 -11103252 -10911727 -10827954
16346 -10827954 -10656424 -10554323 -10388908 -10238013 -10097322 -9860126 -9732318 -9715481 -9553484
16337 -9553484 -9461565 -9406287 -9318644 -9113966 -8944527 -8785030 -8582182 -8427959 -8342269 -8224010
16327 -8224010 -8149948 -8096596 -7972342 -7872976 -7663746 -7646693 -7600325 -7426792 -7261602 -7254477 -7105610
16316 -7105610 -7001975 -6861074 -6655497 -6519019 -6370919 -6237044 -6172231 -6138053 -6022780 -5985379
$$ packed form
16383a7515669K22575K80895L15664J88640K32099J59438K13496J28163K02910
16374a5571789K44515K34191K04490J81482K11094J37756K56640J52677R9361
16365a3849583K28696K47713J56196J85800J94785J57767J22447J39171O4292
16356a2352716K16021J57853Q5472K21992J25139J55736J91286R5965J91525Q3773
16346a0827954J71530J02101J65415J50895J40691K37196J27808J6837J61997
16337i553484R1919N5278Q7643K04678J69439J59497K02848J54223Q5690J18259
16327h224010P4062N3352J24254R9366K09230J7053M6368J73533J65190P125J48867
16316g105610J03635J40901K05577J36478J48100J33875O4813L4178J15273L7401
$$ plain form
16306 -5985379 -5937470 -5858482 -5698975 -5625646 -5515698 -5408091 -5240148 -5128610 -5025775 -4988728
16296 -4988728 -4899111 -4836768 -4794174 -4588407 -4502939 -4457969 -4357936 -4139319 -4072356 -4049002 -3930973
16285 -3930973 -3819752 -3774934 -3733945 -3612768 -3451969 -3539157 -3433839 -3258485 -3290532 -3115543
16275 -3115543 -3089426 -3054282 -2949053 -2896417 -2814877 -2680674 -2526976 -2479636 -2519435 -2442097 -2390668
16264 -2390668 -2356063 -2254688 -2163069 -2102652 -2143385 -1989722 -1838349 -1742522 -1632121 -1638449 -1623512
16253 -1623512 -1530263 -1468567 -1383034 -1311215 -1296599 -1223528 -1251500 -1120218 -1014241 -884056 -857237
16242 -857237 -904960 -769411 -759010 -776526 -677578 -583391 -437384 -521694 -603708 -410539 -353744
16231 -353744 -338644 -395461 -147380 -17482 39910 -3792 21554 90870 78122 140777 296875
$$ packed form
16306e985379M7909P8988J59507P3329J09948J07607J67943J11538J02835L7047
16296d988728Q9617O2343M2594K05767Q5468M4970J00033K18617O6963K3354J18029
16285c930973J11221M4818M0989J21177J60799q7188J05318J75354l2047J74989
16275c115543K6117L5144J05229N2636Q1540J34203J53698M7340l9799P7338N1429
16264b390668L4605J01375R1619O0417m0733J53663J51373R5827J10401o328J4937
16253a623512R3249O1696Q5533P1819J4616P3071k7972J31282J05977J30185K6819
16242h57237m7723J35549J0401j7516R8948R4187J46007q4310q2014J93169N6795
16231c53744J5100n6817K48081J29898N7392m3702K5346O9316j2748O2655J56098
$$ plain form
16220 296875 380956 482597 375025 453937 550615 521899 487102 471484 695041 786717 816095
16209 816095 797635 777055 910418 868219 905220 1055899 1061703 1058524 1048817 1021602 1119705 1191008
16197 1191008 1288238 1212785 1165870 1250720 1430341 1441865 1405755 1560321 1499575 1526697 1547646
16186 1547646 1629935 1705905 1540185 1625390 1685328 1695078 1718993 1859456 1938482 1840298 1787281
16175 1787281 1741546 1815583 1848944 1794029 1802496 1849920 1841735 1913998 2075735 2019346 2016790 2142438
16163 2142438 2129022 2133885 2051520 2009120 2056577 2115485 2099256 2206311 2232412 2231888 2150625 2186808
16151 2186808 2213390 2320084 2437048 2387489 2324852 2344686 2299178 2356406 2334710 2363149 2528738
16140 2528738 2568646 2603133 2699971 2556811 2481777 2411756 2460570 2553957 2641782 2746439 2829177
$$ packed form
16220B96875Q4081J01641j07572P8912R6678k8716l4797j5618K23557R1676K9378
16209H16095j8460k0580J33363m2199L7001J50679N804l179r707k7215R8103P1303
16197A191008R7230p5453m6915Q4850J79621J1524l6110J54566o0746K7122K0949
16186A547646Q2289P5970j65720Q5205N9938R750K3915J40463P9026r8184n3017
16175A787281m5735P4037L3361n4915Q467M7424q185P2263J61737n6389k556J25648
16163B142438j3416M863q2365m2400M7457N8908j6229J07055K6101n24q1263L6183
16151B186808K6582J06694J16964m9559o2637J9834m5508N7228k1696K8439J65589
16140B528738L9908L4487R6838j43160p5034p0021M8814R3387Q7825J04657Q2738
$$ plain form
16129 2829177 2679592 2673079 2689190 2700134 2674099 2663122 2686945 2779006 2715919 2640409 2555378
16118 2555378 2645121 2809071 2915149 2865774 2829936 2725449 2643527 2810719 2890473 2888074 2841971
16107 2841971 2935041 2864344 2776788 2648927 2792589 2921825 2976613 2906177 2929266 2861927 2913262
16096 2913262 2930747 3029327 3151695 3136065 3126343 3154054 3046282 2908852 2967500 3038481 3031439
16085 3031439 3064870 3026119 3059720 3111633 3038334 2990721 2798415 2863916 3006451 2975341 2983736
16074 2983736 2990222 3086899 3139678 3122597 2959064 2941704 3071697 3101681 3064731 3072469 3039741
16063 3039741 3020966 3080144 2998538 3071084 3144301 3185340 3221925 3187570 3075104 3143965 3148821
16052 3148821 3120471 3149102 3182969 3132864 3058359 3006786 2948037 3071523 3087502 3164595 3203559
$$ packed form
16129B829177j49585o513J6111J0944k6035j0977K3823R2061o3087p5510q5031
16118B555378Q9743J63950J06078m9375l5838j04487q1922J67192P9754k399m6103
16107B841971R3070p0697q7556j27861J43662J29236N4788p0436K3089o7339N1335
16096B913262J7485R8580J22368j5630r722K7711j07772j37430N8648P0981p042
16085C031439L3431l8751L3601N1913p3299m7613j92306O5501J42535l1110Q395
16074B983736O486R6677N2779j7081j63533j7360J29993K9984l6950P738l2728
16063C039741j8775N9178q1606P2546P3217M1039L6585l4355j12466O8861M856
16052C148821k8350K8631L3867n0105p4505n1573n8749J23486J5979P7093L8964
$$ plain form
16041 3203559 3239664 3110873 3042430 3061230 3197772 3225320 3262119 3184940 3029370 2968228 2981518
16030 2981518 3108045 2978101 2951473 3037842 3042051 3052417 3035220 3155854 3290122 3223894 3267042
16019 3267042 3405953 3325694 3223591 3066903 3077423 3150122 3121417 3035199 3061053 3188624
16009 3188624 3184519 3122432 3039443 3088439 3147661 2991166 3007323 3156955 3179911 3262382 3325680
15998 3325680 3331975 3263715 3294028 3248448 3279680 3264568 3158356 3141621 3233193 3317026 3197484
15987 3197484 3219386 3062004 3038610 3064124 2937634 3000564 3102596 3127717 3242828 3195791
15977 3195791 3042748 3144236 3214099 3169979 3068326 3176848 3132667 3186531 3151605 3116800
15967 3116800 3113819 3195914 3223534 3232880 3127720 3054727 3189392 3124168 3283666 3333178 3103738
$$ packed form
16041C203559L6105j28791o8443J8800J36542K7548L6799p7179j55570o1142J3290
16030B981518J26527j29944k6628Q6369M209J0366j7197J20634J34268o6228M3148
16019C267042J38911q0259j02103j56688J0520P2699k8705q6218K5854J27571
16009C188624m105o2087q2989M8996N9222j56495J6157J49632K2956Q2471O3298
15998C325680O295o8260L0313m5580L1232j5112j06212j6735R1572Q3833j19542
15987C197484K1902j57382k3394K5514j26490O2930J02032K5121J15111m7037
15977C195791j53043J01488O9863m4120j01653J08522m4181N3864l4926l4805
15967C116800k981Q2095K7620R346j05160p2993J34665o5224J59498M9512k29440
$$ plain form
15956 3103738 3111345 3219874 3104449 3160557 3095561 3077868 3123623 3199033 3159625 3145359 3079005
15945 3079005 3191040 3192398 3123904 3150537 3140737 3288854 3255505 3178227 3096905 3063731 3063780 3090816
15933 3090816 3170213 3182975 3119588 3199646 3250313 3149262 3020161 3098411 3179457 3228021 3251531
15922 3251531 3290575 3242096 3236205 3119145 3117015 3178810 3122797 3050121 3085650 3158321 3226410
15911 3226410 3212389 3105344 3313376 3347336 3293961 3175230 3109848 3277759 3251878 3167391
15901 3167391 3097952 3190723 3193685 3271768 3141368 3166461 3151856 3171142 3260388 3106522 3142464
15890 3142464 3232835 3219557 3139507 3176529 3220423 3305465 3287745 3200621 3124318 2978801 3331587
15879 3331587 3397193 3240825 3094512 3063561 3144643 3242383 3392031 3361449 3229439 3183309
$$ packed form
15956C103738P607J08529j15425N6108o4996j7693M5755P5410l9408j4266o6354
15945C079005J12035J358o8494K6633r800J48117l3349p7278q1322l3174M9K7036
15933C090816P9397J2762o3387Q0058N0667j01051j29101P8250Q1046M8564K3510
15922C251531L9044m8479n891j17060k130O1795n6013p2676L5529P2671O8089
15911C226410j4021j07045K08032L3960n3375j18731o5382J67911k5881q4487
15901C167391o9439R2771K962P8083j30400K5093j4605J9286Q9246j53866L5942
15890C142464R0371j3278q0050L7022M3894Q5042j7720q7124p6303j45517L52786
15879C331587O5606j56368j46313l0951Q1082R7740J49648l0582j32010m6130
$$ plain form
15869 3183309 3010299 3097299 3239679 3254313 3291486 3233660 3295852 3095280 3101269 3112490 3129871
15858 3129871 3095307 3127274 3238458 3216218 3168150 3132610 3069730 3097659 3010696 3042051 3148047
15847 3148047 3160147 3323308 3275991 3160969 3233207 3358493 3384195 3374862 3282076 3038260 3081684
15836 3081684 3181725 3288824 3255148 3328289 3411116 3363731 3271359 3393837 3289263 3280375 3334184
15825 3334184 3297781 3213031 3128670 3265529 3223477 3115107 3201390 3148396 3061913 3203160 3198299
15814 3198299 3240544 3269127 3183855 3237466 3435803 3363865 3145049 3046695 2982528 3151272 3289869
15803 3289869 3323574 3224842 3176146 3099527 3220620 3245692 3166118 3115936 3206568 3251266 3198230
15792 3198230 3168117 3192562 3089106 3144232 3186264 3192183 3240832 3164566 3171747 3108584 3159781
$$ packed form
15869C183309j73010Q7000J42380J4634L7173n7826O2192k00572N989J1221J7381
15858C129871l4564L1967J11184k2240m8068l5540o2880K7929q6963L1355J05996
15847C148047J2100J63161m7317j15022P2238J25286K5702r333r2786k43816M3424
15836C081684J00041J07099l3676P3141Q2827m7385r2372J22478j04574q888N3809
15825C334184l6403q4750q4361J36859m2052j08370Q6283n2994q6483J41247m861
15814C198299M2245K8583q5272N3611J98337p1938k18816r8354o4167J68744J38597
15803C289869L3705r8732m8696p6619J21093K5072p9574n0182R0632M4698n3036
15792C198230l0113K4445j03456N5126M2032N919M8649p6266P181o3163N1197
$$ plain form
15781 3159781 3163340 3237380 3122138 3107816 3177407 3258594 3230354 3151372 3098335 3176244 3347757
15770 3347757 3300850 3175105 3159140 3141098 3147397 3103020 3135523 3158530 3204391 3332593 3291651
15759 3291651 3275328 3233956 3201421 3231306 3182870 3133124 3160057 3213885 3323948 3208140 3198574
15748 3198574 3312903 3285102 3260830 3227507 3233870 3345275 3372256 3230693 3174737 3160952 3295324
15737 3295324 3295345 3331822 3237216 3098955 3199039 3227551 3123175 3313345 3239292 3234768 3267599
15726 3267599 3216733 3206733 3165403 3219581 3269995 3333184 3467355 3369495 3326060 3414389 3435730
15715 3435730 3384163 3312670 3328367 3269498 3243439 3306437 3294887 3214568 3240979 3375714 3199990
15704 3199990 3255113 3220573 3277974 3245929 3152567 3128736 3110497 3284724 3303038 3231776 3346101
$$ packed form
15781C159781L559P4040j15242j4322O9591Q1187k8240p8982n3037P7909J71513
15770C347757m6907j25745j5965j8042O299m4377L2503K3007M5861J28202m0942
15759C291651j6323m1372l2535K9885m8436m9746K6933N3828J10063j15808r566
15748C198574J14329k7801k4272l3323O363J11405K6981j41563n5956j3785J34372
15737C295324K1L6477r4606j38261J00084K8512j04376J90170p4053m524L2831
15726C267599n0866j0000m1330N4178N0414O3189J34171r7860m3435Q8329K1341
15715C435730n1567p1493J5697n8869k6059O2998j1550q0319K6411J34735j75724
15704C199990N5123l4540N7401l2045r3362k3831j8239J74227J8314p1262J14325
$$ plain form
15693 3346101 3318558 3251960 3383153 3335905 3303695 3293878 3303297 3374734 3281964 3165294 3169250
15682 3169250 3267622 3434209 3331528 3268188 3204618 3268546 3336915 3435475 3297632 3348197 3447027
15671 3447027 3344533 3244266 3239129 3118992 3262203 3283880 3164848 3163045 3275018 3278298 3297827
15660 3297827 3376484 3385722 3254586 3222821 3132111 3078619 3127792 3201021 3282832 3313696 3305769
15649 3305769 3322298 3206022 3249398 3215181 3138620 3178413 3355253 3424346 3408310 3456060 3393626
15638 3393626 3411792 3359240 3303379 3218183 3210886 3274592 3308775 3428936 3430587 3139480 3155967
15627 3155967 3162179 3293427 3397027 3295949 3199501 3184062 3222272 3181461 3080852 3175576 3173579
15616 3173579 3245292 3375561 3417268 3216002 3230256 3189299 3226013 3378432 3303893 3299059 3338930
$$ packed form
15693C346101k7543o6598J31193m7248l2210r817R419P1437r2770j16670L956
15682C169250R8372J66587j02681o3340o3570O3928O8369R8560j37843N0565R8830
15671C447027j02494j00267n137j20137J43211K1677j19032j803J11973L280J9529
15660C297827P8657R238j31136l1765r0710n3492M9173P3229Q1811L0864p927
15649C305769J6529j16276M3376l4217p6561L9793J76840O9093j6036M7750o2434
15638C393626J8166n2552n5861q5196p297O3706L4183J20161J651k91107J6487
15627C155967O212J31248J03600j01078r6448j5439L8210m0811j00609R4724j997
15616C173579P1713J30269M1707k01266J4254m0957L6714J52419p4539m834L9871
$$ plain form
15605 3338930 3373908 3303094 3394411 3450127 3252423 3324749 3404510 3420991 3360427 3319273 3336134
15594 3336134 3344034 3386382 3324783 3252143 3225713 3270743 3279111 3265084 3111334 3128066 3214389
15583 3214389 3256637 3165444 3298892 3266645 3338541 3152846 2963087 3101454 3047298 3128160
15573 3128160 3317105 3152219 3161090 3257746 3233264 3359473 3336328 3302972 3422758 3359649 3269350
15562 3269350 3276193 3225068 3173957 3307125 3290939 3215946 3367991 3204277 3234718 3242508 3344638
15551 3344638 3209961 3233548 3225600 3311767 3379622 3274353 3210226 3175158 3207064 3335190 3241155
15540 3241155 3268522 3315461 3235251 3295723 3203096 3177664 3288378 3188523 3083607 3119197 3215299
15529 3215299 3156562 3228909 3430472 3332953 3290669 3290627 3415547 3318142 3321144 3149778 3182701
$$ packed form
15605C338930L4978p0814R1317N5716j97704P2326P9761J6481o0564m1154J6861
15594C336134P900M2348o1599p2640k6430M5030Q368j4027j53750J6732Q6323
15583C214389M2248r1193J33448l2247P1896j85695j89759J38367n4156Q0862
15573C128160J88945j64886Q871R6656k4482J26209k3145l3356J19786o3109r0299
15562C269350O843n1125n1111J33168j6186p4993J52045j63714L0441P790J02130
15551C344638j34677K3587p948Q6167O7855j05269o4127l5068L1906J28126r4035
15540C241155K7367M6939q0210O0472r2627k5432J10714r9855j04916L5590R6102
15529C215299n8737P2347K01563r7519m2284m2J24920r7405L002j71366L2923
$$ plain form
15518 3182701 3309968 3224856 3133127 3195623 3166205 3198304 3350225 3327203 3253223 3118132 3108945
15507 3108945 3188894 3202009 3195869 3267338 3215087 3269725 3307878 3457104 3344247 3325781 3566344
15496 3566344 3405411 3252450 3304409 3313456 3158450 3153343 3242184 3167053 3194843 3275438 3215865
15485 3215865 3283415 3358857 3324468 3283269 3326995 3360983 3359836 3230159 3260932 3405595 3281971
15474 3281971 3321300 3324060 3185004 3153473 3086006 3091143 3265503 3297117 3159783 3235038 3217100
15463 3217100 3260460 3258822 3416848 3514295 3389558 3236332 3210060 3256138 3389304 3420358 3311153
15452 3311153 3308052 3217470 3148045 3228442 3262034 3357249 3210507 3062692 3110700 3289670 3305260
15441 3305260 3200985 3278113 3302835 3307215 3246387 3288415 3253582 3296886 3366449 3290591 3306430
$$ packed form
15518C182701J27267q5112r1729O2496k9418L2099J51921k3022p3980j35091r187
15507C108945P9949J3115o140P1469n2251N4638L8153J49226j12857j8466K40563
15496C566344j60933j52961N1959R047j55006n107Q8841p5131K7790Q0595n9573
15485C215865O7550P5442l4389m1199M3726L3988j147j29677L0773J44663j23624
15474C281971L9329K760j39056l1531o7467N137J74360L1614j37334P5255j7938
15463C217100M3360j638J58026R7447j24737j53226k6272M6078J33166L1054j09205
15452C311153l101r0582o9425Q0397L3592R5215j46742j47815M8008J78970J5590
15441C305260j04275P7128K4722M380o0828M2028l4833M3304O9563p5858J5839
$$ plain form
15430 3306430 3501466 3429306 3367418 3352402 3368270 3375214 3320390 3301784 3293142 3309754 3316371 3211425
15418 3211425 3205498 3187742 3270034 3242669 3160919 3283018 3358900 3347093 3279397 3353261 3273391
15407 3273391 3258878 3393093 3301625 3165222 3198444 3292050 3285165 3252737 3118492 3202397 3373153
15396 3373153 3217399 3156416 3299421 3302911 3327481 3208170 3304672 3385247 3246874 3342796 3399094
15385 3399094 3238611 3265181 3349967 3299077 3267696 3381482 3363039 3207574 3268500 3344006 3397374
15374 3397374 3337392 3206477 3256495 3212274 3218549 3308725 3204038 3262772 3283400 3277063 3356898
15363 3356898 3308144 3216825 3232754 3330093 3233880 3199922 3238545 3281457 3346213 3216423 3333342
15352 3333342 3312257 3296820 3252429 3285393 3330928 3355553 3495491 3449724 3382598 3427987 3401576
$$ packed form
15430C306430J95036p2160o1888j5016J5868O944n4824j8606q642J6612O617j04946
15418C211425n927j7756Q2292k7365q1750J22099P5882j1807o7696P3864p9870
15407C273391j4513J34215r1468j36403L3222R3606o885l2428j34245Q3905J70756
15396C373153j55754o0983J43005L490K4570j19311R6502Q0575j38373R5922N6298
15385C399094j60483K6570Q4786n0890l1381J13786j8443j55465O0926P5506N3368
15374C397374n9982j30915N0018m4221O275R0176j04687N8734K0628o337P9835
15363C356898m8754r1319J5929R7339r6213l3958L8623M2912O4756j29790J16919
15352C333342k1085j5437m4391L2964M5535K4625J39938m5767o7126M5389k6411
$$ plain form
15341 3401576 3377083 3315943 3276111 3320923 3367252 3321110 3332705 3290331 3225469 3344806 3447952
15330 3447952 3452678 3377635 3336588 3333330 3396460 3315497 3343759 3294388 3402141 3493252 3496032 3374937
15318 3374937 3261203 3266767 3336750 3429382 3272639 3201811 3220773 3324854 3299797 3380445 3534742
15307 3534742 3576790 3532206 3556519 3591123 3546846 3429402 3428285 3441296 3354888 3360047 3334631
15296 3334631 3452935 3528978 3456434 3501509 3548037 3437781 3414690 3375792 3326102 3266086 3321918
15285 3321918 3458760 3537532 3419811 3302372 3262948 3196742 3313526 3286952 3385437 3412028
15275 3412028 3491561 3405061 3360108 3339557 3172189 3300170 3371286 3356187 3380105 3496472 3398977
15264 3398977 3424823 3410025 3356784 3350105 3418707 3286940 3248643 3298370 3231324 3313311 3460466
$$ packed form
15341C401576k4493o1140l9832M4812M6329m6142J1595m2374o4862J19337J03146
15330C447952M726p5043m1047l258O3130q0963K8262m9371J07753R1111K780j21095
15318C374937j13734N564O9983R2632j56743p0828J8962J04081k5057Q0648J54297
15307C534742M2048m4584K4313L4604m4277j17444j117J3011q6408N159k5416
15296C334631J18304P6043p2544M5075M6528j10256k3091l8898m9690o0016N5832
15285C321918J36842P8772j17721j17439l9424o6206J16784k6574R8485K6591
15275C412028P9533q6500m4953k0551j67368J27981P1116j5099K3918J16367r7495
15264C398977K5846j4798n3241o679O8602j31767l8297M9727o7046Q1987J47155
$$ plain form
15253 3460466 3490814 3358172 3357697 3480147 3533814 3344021 3413693 3363922 3390881 3429332 3345163
15242 3345163 3417492 3398795 3325849 3333622 3335862 3332545 3380589 3479764 3426096 3321088 3247755 3345406
15230 3345406 3287036 3246712 3247946 3219259 3393658 3460408 3397417 3398209 3401765 3280256 3394442
15219 3394442 3458694 3373587 3336827 3251915 3221176 3414652 3385461 3234915 3349997 3423337 3373760
15208 3373760 3255248 3209254 3363725 3496510 3484467 3458364 3532106 3305280 3205221 3286677
15198 3286677 3217510 3294251 3316402 3411584 3417996 3352360 3479161 3451554 3382253 3266859 3241531
15187 3241531 3389856 3355982 3318299 3290113 3247778 3314336 3384253 3400200 3412024 3375505 3366432
15176 3366432 3390054 3358184 3229733 3301048 3372445 3320083 3316229 3286953 3302095 3353471 3488022
$$ packed form
15253C460466L0348j32642m75J22450N3667j89793O9672m9771K6959L8451q4169
15242C345163P2329j8697p2946P773K240l317M8044R9175n3668j05008p3333R7651
15230C345406n8370m0324J234k8687J74399O6750o2991P92L556j21509J14186
15219C394442O4252q5107l6760q4912l0739J93476k9191j50546J15082P3340m9577
15208C373760j18512m5994J54471J32785j2043k6103P3742k26826j00059Q1456
15198C286677o9167P6741K2151R5182O412o5636J26801k7607o9301j15394k5328
15187C241531J48325l3874l7683k8186m2335O6558O9917J5947J1824l6519r073
15176C366432K3622l1870j28451P1315P1397n2362l854k9276J5142N1376J34551
$$ plain form
15165 3488022 3396817 3447666 3438452 3256808 3280747 3362471 3353817 3346710 3437468 3450224 3410773 3433258
15153 3433258 3215187 3211064 3359109 3216797 3148360 3254084 3274893 3281717 3202002 3212773 3385668
15142 3385668 3389604 3403895 3467959 3295380 3346995 3414266 3333716 3342631 3412190 3452524 3379187
15131 3379187 3413561 3486830 3297166 3345188 3419722 3499658 3467273 3403167 3364487 3224528 3228733
15120 3228733 3401000 3527167 3367867 3397289 3431427 3489931 3425856 3392123 3420181 3482215 3529763
15109 3529763 3405256 3244522 3270680 3345300 3427193 3395867 3440408 3447463 3388437 3286660 3368814
15098 3368814 3463553 3351240 3391501 3461438 3399691 3432261 3548281 3447362 3518560 3494861 3467555
15087 3467555 3433081 3532198 3565837 3455878 3550909 3631964 3699190 3627315 3565704 3484128 3527852
$$ packed form
15165C488022r1205N0849r214j81644K3939Q1724q654p107R0758J2756l9451K2485
15153C433258k18071m123J48045j42312o8437J05724K0809O824p9715J0771J72895
15142C385668L936J4291O4064j72579N1615O7271q0550Q915O9559M0334p3337
15131C379187L4374P3269j89664M8022P4534P9936l2385o4106l8680j39959M205
15120C228733J72267J26167j59300K9422L4138N8504o4075l3733K8058O2034M7548
15109C529763j24507j60734K6158P4620Q1893l1326M4541P055n9026j01777Q2154
15098C368814R4739j12313M0261O9937o1747L2570J16020j00919P1198k3699k7306
15087C467555l4474R9117L3639j09959R5031Q1055O7226p1875o1611q1576M3724
$$ plain form
15076 3527852 3508386 3371457 3344692 3373060 3284118 3433592 3440665 3444618 3491272 3465308 3378715
15065 3378715 3278605 3250191 3275486 3330273 3280969 3228940 3348039 3471626 3476311 3478485 3410955
15054 3410955 3366003 3479102 3481364 3426229 3454176 3448925 3504870 3463000 3405304 3502428 3490551
15043 3490551 3509016 3472727 3312786 3279131 3314157 3260305 3342800 3405850 3410054 3362681 3212084
15032 3212084 3235005 3306819 3518317 3353573 3389465 3435888 3479782 3563591 3391495 3394490 3404192
15021 3404192 3392782 3224966 3236875 3383615 3430403 3404683 3407500 3418469 3595445 3570941 3475269
15010 3475269 3413308 3351756 3436888 3470074 3431609 3467444 3435698 3475704 3381265 3302932 3372018
14999 3372018 3404293 3396101 3347001 3458542 3406493 3454437 3492447 3529831 3498466 3413905 3416272
$$ packed form
15076C527852j9466j36929k6765K8368q8942J49474P073L953M6654k5964q6593
15065C378715j00110k8414K5295N4787m9304n2029J19099J23587M685K174o7530
15054C410955m4952J13099K262n5135K7947n251N5945m1870n7696R7124j1877
15043C490551J8465l6289j59941l3655L5026n3852Q2495O3050M204m7373j50597
15032C212084K2921P1814K11498j64744L5892M6423M3894Q3809j72096K995R702
15021C404192j1410j67816J1909J46740M6788k5720K817J0969J76976k4504r5672
15010C475269o1961o1552Q5132L3186l8465L5835l1746M0006r4439p8333O9086
14999C372018L2275q192m9100J11541n2049M7944L8010L7384l1365q4561K367
$$ plain form
14988 3416272 3404671 3382151 3424679 3331846 3452614 3465365 3481395 3490464 3414827 3445773 3483491
14977 3483491 3527187 3449544 3497016 3459063 3498454 3479696 3219651 3234641 3234444 3252404 3199837
14966 3199837 3308429 3424993 3365575 3311102 3378115 3450583 3497731 3365587 3398649 3477307 3423707
14955 3423707 3484082 3481725 3476129 3404203 3392402 3585718 3596443 3600854 3555249 3413162 3416519 3340467
14943 3340467 3504959 3650414 3641414 3588898 3543667 3436315 3397066 3371862 3369255 3436930 3517201
14932 3517201 3532530 3488791 3570004 3595078 3572388 3590761 3561178 3490418 3527950 3428502 3457475
14921 3457475 3497242 3419214 3354443 3437801 3460591 3430778 3303859 3322174 3422578 3373955 3521208
14910 3521208 3599623 3594434 3527921 3483185 3592103 3574984 3536423 3449632 3281621 3300881 3387970
$$ packed form
14988C416272j1601k2520M2528r2833J20768J2751J6030R069p5637L0946L7718
14977C483491M3696p7643M7472l7953L9391j8758k60045J4990j97J7960n2567
14966C199837J08592J16564n9418n4473O7013P2468M7148j32144L3062P8658n3600
14955C423707O0375k357n596p1926j1801J93316J0725M411m5605j42087L357p6052
14943C340467J64492J45455r000n2516m5231j07352l9249k5204k607O7675Q0271
14932C517201J5329m3739Q1213K5074k2690J8373k9583p0760L7532r9448K8973
14921C457475L9767p8028o4771Q3358K2790k9813j26919J8315J00404m8623J47253
14910C521208P8415n189o6513m4736J08918j7119l8561q6791j68011J9260Q7089
$$ plain form
14899 3387970 3431736 3372633 3395622 3295630 3402731 3408742 3476686 3637738 3596114 3534786 3530520
14888 3530520 3374586 3315769 3460981 3427563 3427175 3502833 3491769 3441691 3325778 3391648 3406739
14877 3406739 3425316 3507797 3427025 3529281 3480187 3394961 3649921 3663457 3657192 3570899 3662468
14866 3662468 3632564 3471975 3609218 3617870 3512189 3597816 3544714 3481285 3519041 3476734 3544878
14855 3544878 3592970 3475030 3366184 3492072 3561369 3560854 3704263 3681026 3596963 3566134 3614079
14844 3614079 3531737 3408218 3392302 3493063 3472396 3515133 3642900 3678378 3724932 3632174 3517765
14833 3517765 3590310 3632865 3466982 3512962 3568501 3557469 3494744 3529922 3459059 3546312 3564612
14822 3564612 3653113 3653146 3394494 3442255 3582348 3547643 3441968 3534537 3491187 3479804 3573759
$$ packed form
14899C387970M3766n9103K2989r9992J07101O011O7944J61052m1624o1328m266
14888C530520j55934n8817J45212l3418l88P5658j1064n0078j15913O5870J5091
14877C406739J8577Q2481q0772J02256m9094q5226K54960J3536o265q6293R1569
14866C662468k9904j60589J37243Q652j05681Q5627n3102o3429L7756m2307O8144
14855C544878M8092j17940j08846J25888O9297n15J43409k3237q4063l0829M7945
14844C614079q2342j23519j5916J00761k0667M2737J27767L5478M6554r2758j14409
14833C517765P2545M2555j65883M5980N5539j1032o2725L5178p0863Q7253J8300
14822C564612Q8501L3k58652M7761J40093l4705j05675R2569m3350j1383R3955
$$ plain form
14811 3573759 3437502 3575549 3588388 3554549 3488860 3345852 3492665 3557476 3565487 3430005
14801 3430005 3485174 3483462 3515902 3475719 3359623 3320781 3168027 3441486 3459365 3389432 3524512
14790 3524512 3399874 3356380 3532889 3414025 3457268 3513082 3439753 3531382 3450454 3443906 3327055
14779 3327055 3328303 3436877 3379306 3485519 3509214 3512390 3422914 3369147 3452256 3517308 3722694
14768 3722694 3700643 3490094 3467358 3359142 3510011 3473972 3446147 3468124 3517733 3628092
14758 3628092 3483178 3508769 3684866 3780737 3762424 3632974 3636853 3670414 3743457 3747413 3532954
14747 3532954 3456616 3404572 3690226 3703423 3617573 3617963 3652504 3592832 3551933 3458099 3334428
14736 3334428 3595003 3538788 3559310 3483986 3382158 3529246 3599156 3665913 3623914 3484862
$$ packed form
14811C573759j36257J38047J2839l3839o5689j43008J46813O4811Q011j35482
14801C430005N5169j712L2440m0183j16096l8842j52754K73459J7879o9933J35080
14790C524512j24638m3494J76509j18864M3243N5814p3329R1629q0928o548j16851
14779C327055J248J08574n7571J06213K3695L176q9476n3767Q3109O5052K05386
14768C722694k2051k10549k2736j08216J50869l6039k7825K1977M9609J10359
14758C628092j44914K5591J76097R5871j8313j29450L879L3561P3043L956k14459
14747C532954p6338n2044K85654J3197q5850L90L4541n9672m0899r3834j23671
14736C334428K60575n6215K0522p5324j01828J47088O9910O6757m1999j39052
$$ plain form
14726 3484862 3516057 3582152 3482040 3488142 3346367 3304670 3392238 3505500 3412814 3519527 3566039
14715 3566039 3530406 3631791 3564215 3596164 3600505 3639055 3607519 3467524 3464388 3466312 3489360
14704 3489360 3501710 3468214 3596064 3370332 3298123 3230478 3337950 3482956 3606200 3728283
14694 3728283 3659904 3559369 3438717 3443684 3529254 3509041 3585655 3540323 3498774 3575764 3571909
$$ packed form
14726C484862L1195O6095j00112O102j41775m1697Q7568J13262r2686J06713M6512
14715C566039l5633J01385o7576L1949M341L8550l1536j39995l136J924K3048
14704C489360J2350l3496J27850k25732p2209o7645J07472J45006J23244J22083
14694C728283o8379j00535j20652M967Q5570k0213P6614m5332m1549P6990l855
$$ [...]
##END NTUPLES=NMR SPECTRUM
##END=
