##TITLE=1H_DE-80H_X3
 200.13MHz, d2o
 8 sc
 
 19ns.26.2.2025
##JCAMPDX= 6.0         $$ Bruker NMR JCAMP-DX V2.0
##DATA TYPE= NMR SPECTRUM
##DATA CLASS= NTUPLES
##ORIGIN= UXNMR, Bruker Analytische Messtechnik GmbH
##OWNER= pz
$$ XWIN-NMR		Version 3.5
$$ Tue May  5 10:22:42 2026 Russian Standard Time (UT+4h)  Yarkov@DPX200
##.OBSERVE FREQUENCY= 200.1313
##.OBSERVE NUCLEUS= ^1H
##.ACQUISITION MODE= SIMULTANEOUS
##.ACQUISITION SCHEME= undefined
##.AVERAGES= 8
##.DIGITISER RES= 18
##SPECTROMETER/DATA SYSTEM= spect
##.PULSE SEQUENCE= zg30
##.SOLVENT NAME= CDCl3
##.SHIFT REFERENCE= (INTERNAL, CDCl3, 0, 17.7104)
##AUDIT TRAIL= $$ (NUMBER, WHEN, WHO, WHERE, WHAT)
$$ ##TITLE= Audit trail, XWIN-NMR		Version 3.5
$$ ##JCAMPDX= 5.01
$$ ##ORIGIN= Bruker BioSpin GmbH
$$ ##OWNER= Yarkov
$$ C:/Bruker/XWIN-NMR/data/yarkov2/nmr/H-C/1/pdata/1/auditp.txt
$$ ##AUDIT TRAIL=  $$ (NUMBER, WHEN, WHO, WHERE, WHAT)
(   1,<2026-05-05 10:20:58.79 +0400>,<Yarkov>,<DPX200>,
      <created by zg, POWCHK disabled, PULCHK disabled
       configuration hash MD5:
       00 E9 B6 7A A2 85 ED C7 34 08 36 98 17 FE 4E 26
       data hash MD5: 16K
       2A 56 38 E9 CC 96 E9 11 29 C8 07 9B C8 E3 CC 77>)
(   2,<2026-05-05 10:21:07.21 +0400>,<Yarkov>,<DPX200>,
      <Start of raw data processing
       efp BC_mod = 2 LB = 0.25 FT_mod = 6 PKNL = 1 PHC0 = -5303.516 PHC1 = 11.42193 SI = 16K 
       data hash MD5: 16K
       94 9A 82 55 63 4D 2B 90 2F 23 AC C9 B5 D5 03 4B>)
(   3,<2026-05-05 10:22:19.82 +0400>,<Yarkov>,<DPX200>,
      <pk PHC0 = -5.6 PHC1 = 0 
       data hash MD5: 16K
       0D 8F A0 EC EE 76 BE B0 B8 08 C1 CD 0E BC 87 9D>)
$$ ##END=
$$ 
$$ hash MD5
$$ 4D 68 A5 8C D3 AB 7D 84 15 F4 EF E0 76 9A 76 39
##$RELAX= 
##$RELAX= 
##$RELAX= 
##$RELAX= 
##$RELAX= 
##$RELAX= 
$$ Bruker specific parameters
$$ --------------------------
##$DU= <C:/Bruker/XWIN-NMR>
##$EXPNO= 1
##$NAME= <H-C>
##$PROCNO= 1
##$TYPE= <nmr>
##$USER= <yarkov2>
##$AMP= (0..31)
100 100 100 100 100 100 100 100 100 100 100 100 100 100 100 100 100 100 
100 100 100 100 100 100 100 100 100 100 100 100 100 100 
##$AQSEQ= 0
##$AQ_mod= 1
##$AUNM= <au_zg>
##$AUTOPOS= <>
##$BF1= 200.13
##$BF2= 200.13
##$BF3= 200.13
##$BF4= 200.13
##$BF5= 200.13
##$BF6= 200.13
##$BF7= 200.13
##$BF8= 200.13
##$BYTORDA= 1
##$CFDGTYP= 0
##$CFRGTYP= 5
##$CHEMSTR= <none>
##$CNST= (0..31)
1 1 145 1 1 1 1 1 1 1 1 1 1 1 1 1 1 1 1 1 1 1 1 1 1 1 1 1 1 1 1 1 
##$CPDPRG= <>
##$CPDPRG1= <>
##$CPDPRG2= <>
##$CPDPRG3= <>
##$CPDPRG4= <mlev>
##$CPDPRG5= <mlev>
##$CPDPRG6= <mlev>
##$CPDPRG7= <mlev>
##$CPDPRG8= <mlev>
##$CPDPRGB= <>
##$CPDPRGT= <>
##$D= (0..31)
0 0.7 0 0 0 0 0 0 0 0 0 0.03 0 0 0 0 0 0 0 0 0 0 0 0 0 0 0 0 0 0 0 0 
##$DATE= 1777962058
##$DBL= (0..7)
120 120 120 120 120 120 120 120 
##$DBP= (0..7)
150 150 150 150 150 150 150 150 
##$DBP07= 0
##$DBPNAM0= <>
##$DBPNAM1= <>
##$DBPNAM2= <>
##$DBPNAM3= <>
##$DBPNAM4= <>
##$DBPNAM5= <>
##$DBPNAM6= <>
##$DBPNAM7= <>
##$DBPOAL= (0..7)
0.5 0.5 0.5 0.5 0.5 0.5 0.5 0.5 
##$DBPOFFS= (0..7)
0 0 0 0 0 0 0 0 
$$ [...]
##$SUBNAM2= <"">
##$SUBNAM3= <"">
##$SUBNAM4= <"">
##$SUBNAM5= <"">
##$SUBNAM6= <"">
##$SUBNAM7= <"">
##$SUBNAM8= <"">
##$SUBNAM9= <"">
##$SW= 18.0517328524113
##$SWIBOX= (0..15)
0 0 2 0 0 0 0 0 0 0 0 0 0 0 0 0 
##$SW_h= 3612.71676300578
##$TD= 16384
##$TD0= 1
##$TE= 0
##$TE2= 300
##$TE3= 300
##$TEG= 300
##$TL= (0..7)
0 120 120 120 120 120 120 120 
##$TP= (0..7)
150 150 150 150 150 150 150 150 
##$TP07= 0
##$TPNAME0= <>
##$TPNAME1= <>
##$TPNAME2= <>
##$TPNAME3= <>
##$TPNAME4= <>
##$TPNAME5= <>
##$TPNAME6= <>
##$TPNAME7= <>
##$TPOAL= (0..7)
0.5 0.5 0.5 0.5 0.5 0.5 0.5 0.5 
##$TPOFFS= (0..7)
0 0 0 0 0 0 0 0 
##$TUNHIN= 0
##$TUNHOUT= 0
##$TUNXOUT= 0
##$USERA1= <user>
##$USERA2= <user>
##$USERA3= <user>
##$USERA4= <user>
##$USERA5= <user>
##$V9= 5
##$VALIST= <valist>
##$VCLIST= <CCCCCCCCCCCCCCC>
##$VD= 0
##$VDLIST= <DDDDDDDDDDDDDDD>
##$VPLIST= <PPPPPPPPPPPPPPP>
##$VTLIST= <TTTTTTTTTTTTTTT>
##$WBST= 1024
##$WBSW= 4
##$XGAIN= (0..3)
0 0 0 0 
##$XL= 0
##$YL= 0
##$YMAX_a= 31167
##$YMIN_a= -27394
##$ZGOPTNS= <>
##$ZL1= 120
##$ZL2= 120
##$ZL3= 120
##$ZL4= 120
##$ABSF1= 0
##$ABSF2= 0
##$ABSG= 0
##$ABSL= 0
##$ALPHA= 0
##$AQORDER= 0
##$ASSFAC= 0
##$ASSFACI= 0
##$ASSFACX= 0
##$ASSWID= 0
##$AUNMP= <proc_1d>
##$AZFE= 0.1
##$AZFW= 0.1
##$BCFW= 0
##$BC_mod= 2
##$BYTORDP= 0
##$COROFFS= 0
##$CY= -3
##$DATMOD= 1
##$DC= 0
##$DFILT= <>
##$DTYPP= 0
##$F1P= 0
##$F2P= 0
##$FCOR= 1
##$FTSIZE= 16384
##$FT_mod= 6
##$GAMMA= 0
##$GB= 0
##$INTBC= 1
##$INTSCL= 3.241238e-09
##$ISEN= 128
##$LB= 0.25
##$LEV0= 0
##$LPBIN= 0
##$MAXI= 10000
##$MC2= 0
##$MEAN= 0
##$ME_mod= 0
##$MI= 1.114404
##$NCOEF= 0
##$NC_proc= -8
##$NLEV= 6
##$NOISF1= 3.799351
##$NOISF2= 2.8
##$NSP= 0
##$NTH_PI= 0
##$NZP= 0
##$OFFSET= 17.71035
##$PC= 1
##$PHC0= -5309.116
##$PHC1= 11.42193
##$PH_mod= 1
##$PKNL= yes
##$PPARMOD= 0
##$PSCAL= 0
##$PSIGN= 0
##$REVERSE= no
##$SF= 200.129561993422
##$SI= 16384
##$SIGF1= 3
##$SIGF2= 2
##$SINO= 0.751879
##$SIOLD= 32768
##$SREGLST= <19F.Aceton>
##$SSB= 0
##$STSI= 16384
##$STSR= 0
##$SW_p= 3612.71676300578
##$SYMM= 0
##$S_DEV= 0
##$TDeff= 16384
##$TDoff= 0
##$TI= <>
##$TILT= no
##$TM1= 0
##$TM2= 0
##$TOPLEV= 0
##$USERP1= <user>
##$USERP2= <user>
##$USERP3= <user>
##$USERP4= <user>
##$USERP5= <user>
##$WDW= 1
##$XDIM= 16384
##$YMAX_p= 411781834
##$YMIN_p= -17412473
$$ End of Bruker specific parameters
$$ ---------------------------------
##NTUPLES= NMR SPECTRUM
##VAR_NAME=  FREQUENCY,     SPECTRUM/REAL,   SPECTRUM/IMAG
##SYMBOL=    X,             R,               I
##VAR_TYPE=  INDEPENDENT,   DEPENDENT,       DEPENDENT
##VAR_FORM=  AFFN,          ASDF,            ASDF
##VAR_DIM=   16384,         16384,           16384
##UNITS=     HZ,            ARBITRARY UNITS, ARBITRARY UNITS
##FACTOR=    0.220516191357247, 1,           1
##FIRST=     3544.36459557916, 0,            0
##LAST=      -68.3521674266158, 0,           0
##MIN=       -68.3521674266158, -17412473,   0
##MAX=       3544.36459557916, 411781834,    0
$$ Real data points
##PAGE= N=1
##DATA TABLE= (X++(R..R)), XYDATA
$$ [...]
3190A2611709O3683j00645N88371k52443N91457M01327J51086N49845J37214J392325
3180A6133929N13898q32745R769J093961j65105j554379K243855M19245J40915
3171A8003343l30625R37819R33726j54711j855M74226J210443o05279O58697J883239
3161B3009023n4831J155432J027727l15125k2626J339278O55670O80927J898556
3152B9374031J593042J040567K89343R78195N28332k2297J965731K305137P01283
3143C8753364J664237J857117N78569J898799K225701J805155J497465J787041
3135E2067448K241863L133448K597743K159177L037117K905028K491355J440999
3127G2074178L341805M995061L569769M109084N052190L784033M185076M541230
$$ plain form
3190 12611709 12675392 12574747 13163118 12910675 13502132 13903459 14054545 14604390 14741604 16133929
3180 16133929 16647827 15815082 15824851 16918812 16753707 15199328 17443183 17862428 18003343
3171 18003343 17672718 18610537 19544263 19389552 19387697 19861923 21072366 20467087 21125784 23009023
3161 23009023 22954192 24109624 25137351 24822226 24799600 26138878 26794548 27475475 29374031
3152 29374031 30967073 32007640 32296983 33275178 33803510 33781213 35746944 38052081 38753364
3143 38753364 40417601 42274718 42853287 44752086 46977787 48782942 50280407 52067448
3135 52067448 54309311 57442759 60040502 62199679 65236796 68141824 70633179 72074178
3127 72074178 75415983 80411044 83980813 88089897 93142087 96926120 101111196 105652426
3119A05652426N714319M819044O626821N499335N975437N510114L451733M057362
3111A47306591M894368L662660K910682K394477k40373r16396l90950k161656
3103A57459403l364383n414459m749264o151124o455851n583102o707426p685721
3095A11348073o746501o331451o670216n431750m688155o384489l626515l800660
3087F7668336n837539l215198k527590m565051k843280k413899l353548j796635
3079D1115596j751449j720920k075003l194401k271365o58066j751379O44046
3071B8337059j070112k902492j081412l71883j466909k195837k20782k86639o0779
3062A8680214l87780j777995k25194k046682j303020J434980M81853j510714q22899
$$ plain form
3119 105652426 111366745 116185789 122812610 128311945 134287382 139797496 143249229 147306591
3111 147306591 152200959 155863619 158774301 161168778 160928405 160012009 159621059 157459403
3103 157459403 154095020 148680561 143931297 137780173 131324322 125741220 119033794 111348073
3095 111348073 104601572 98270121 91599905 86168155 81480000 75095511 71468996 67668336
3087 67668336 61830797 58615599 56088009 51522958 48679678 46265779 42912231 41115596
3079 41115596 39364147 37643227 35568224 32373823 30102458 29444392 27693013 28337059
3071 28337059 27266947 24364455 23283043 22911160 21444251 19248414 19027632 18740993 18680214
3062 18680214 18292434 16514439 16289245 14242563 12939543 14374523 14856376 13345662 12522763
3053A2522763l30530o00383q88202R52018n85969o88948l56036p20502j797071
3044G507140j80471J157691R23288j427894p24888M58604j200691m1914J084800
3035G555665p26569r90974K65727N15677j08293o31081m06689n7723r18841K44955
3025D741854J209855o69849j011662M61892R84706L5758j56150j104816p53030
3016C738558n8806J64812P15412L58123m96498o12360m4165j57639J96435l61840
3006C442032p30947R51552M0632J133741m59272m82536p30304o40554M29436j05836
2996B847944J245867Q13336p49397k02415o69742q14170j94001O99834L08776
2987C286032L06200n27155Q47191j35795p51906N47077L49538l66365k0094m21768
$$ plain form
3053 12522763 12192233 11591850 10703648 11655666 11069697 10380749 10024713 9304211 7507140
3044 7507140 7326669 8484360 9407648 7979754 7254866 7713470 6512779 6470865 7555665
3035 7555665 6829096 5838122 6103849 6619526 6511233 5880152 5473463 5415740 4496899 4741854
3025 4741854 5951709 5281860 4270198 4732090 5716796 5752554 5596404 4491588 3738558
3016 3738558 3679752 3844564 4559976 4918099 4421601 3809241 3765076 3607437 3803872 3442032
3006 3442032 2711085 3662637 3703269 4837010 4377738 3895202 3164898 2524344 2953780 2847944
2996 2847944 4093811 4907147 4157750 3955335 3285593 2471423 2277422 2977256 3286032
2987 3286032 3592232 3065077 3912268 3776473 3024567 3571644 3921182 3554817 3534723 3112955
2977C112955O79731l26604o43605J39898j1938j420041j50200J62758m23731J205441
2967B324664l40856j301039o5485J09762n87008J154198M5050k30674M61262r70918
2957E98956Q27079P55052n11107N83026K75452n17983l08041r22944j325762J361712
2947H15440J040087j95790l6136j522283q00182O99736N73185j21508J506572
2938A959121J49969j353972K46480m25531K71739o28353M51874k88039o06450
2929b23162J010237l51913q15073J424923R94983j280673j172M13045j153024
2920A8171J059663R66428l08165K83340N49090j465485o91969O20731q0692M68543
2910A419655L13849l85586O15528M79756n03958q77358P9045P40228L07017n70232
$$ plain form
2977 3112955 3792686 3466082 2822477 2962375 2950437 1530396 1380196 1542954 1119223 2324664
2967 2324664 1983808 682769 617284 727046 140038 1294236 1339286 1108612 1569874 598956
2957 598956 1426035 2181087 1669980 2253006 2528458 2010475 1702434 779490 -546272 815440
2947 815440 1855527 1659737 1623601 101318 -698864 872 574057 452549 1959121
2938 1959121 2109090 755118 1001598 576067 847806 219453 671327 383288 -223162
2929 -223162 787075 435162 -379911 1045012 2039995 759322 758150 1171195 18171
2920 18171 1077834 2044262 1736097 2019437 2568527 1103042 411073 1031804 951112 1419655
2910 1419655 1733504 1347918 1963446 2443202 1939244 1061886 1140931 1881159 2188176 1617944
2900A617944J605867L33328k183203p12205K06547O30820K50125J18454j1216
2891A856461k61834j74899r20278j61990N60291L70921J35173L18023P04998p49588
2881A677278j120345m32429P15994L82159M67721q7014k9249J25512j255142L56629
2871H01114Q08070m02106j145063L83517J097603o1231m54945K8733J38929j06187
2861A088434M96351L12482O7614p3052o9655O39727j98339N88660m54045n56984
2851A841193j58885J280426L91158r98646K07607L52063J048621l82904m70218
2842C110415Q13390J409399J91999o66406R80412p10233j510642k15964J101474
2833D503844p494R9782M0564q83846P154J182614j71362R23425J691716J557474
$$ plain form
2900 1617944 3223811 3557139 1373936 661731 868278 1499098 1749223 1867677 1856461
2891 1856461 1594627 1419728 499450 337460 897751 1268672 1403845 1721868 2426866 1677278
2881 1677278 556933 124504 840498 1222657 1690378 1603364 1574115 1699627 444485 801114
2871 801114 1609184 1207078 62015 445532 1543135 1481904 1026959 1055692 1194621 1088434
2861 1088434 1584785 1897267 1964881 1891829 1822174 2461901 2263562 2852222 2398177 1841193
2851 1841193 1682308 2962734 3353892 2355246 2562853 2914916 3963537 3580633 3110415
2842 3110415 3923805 5333204 5525203 4858797 5839209 5128976 3618334 3402370 4503844
2833 4503844 4496350 4596132 4636696 3752850 3760004 4942618 4771256 5694681 7386397 8943871
2823H943871j066735L5626K378163J836878J648118K698622N994686Q475862J0398418
2814D1343509J0657320P618652O87344n372366q768069p574886q859417p525918
2806B2206169m811381l337308l665499j556693j826397k443487r95466J344106
2798D914044r79829P0239J46046o61850n53366J61693K89744n74323K73333r13259
2788B172472K64979N43136l0848R86021j101643L96301n44552j505836j15362
2779A064668J366229k81989J017614R81464j924218j086828J94292m70197O27685
2770A488720Q31658j4510k529088R05401K12226p71842L05631j15733Q26909q52549
2760B86823j515483J233151J745059p99836m23258J230312j89865j735260K58821
$$ plain form
2823 8943871 7877136 7912762 10290925 12127803 13775921 16474543 22469229 30945091 41343509
2814 41343509 52000829 59619481 60306825 54934459 46166390 38591504 29732087 22206169
2806 22206169 17394788 14057480 10391981 8835288 7008891 4565404 3569938 4914044
2798 4914044 3934215 4004454 4150500 3488650 2935284 3096977 3386721 2812398 3085731 2172472
2788 2172472 2437451 2980587 2949739 3935760 2834117 3230418 2685866 1180030 1064668
2779 1064668 2430897 2148908 3166522 4147986 2223768 1136940 1331232 861035 1488720
2770 1488720 2320378 2305868 -223220 682181 894407 122565 428196 312463 1139372 286823
2760 286823 -1228660 4491 1749550 949714 526456 1756768 1566903 -168357 90464
2751I0464J157480P44074o76647p8905n07332o46498J21716J188750q74789J49940
2741F68253R96870n63534q40540k9263N48218m05326J66320M65045J50643j388551
2731b31865l37040N37898n04492J250028q11563J04265M60718p31099j52344n2695
2721d68189M44470R97523N93032q71754o52993J622546r87306L40889j95013M86608
2711A309813q23742L85326P7165K64008l60302j269118J108751P02726O71325
2702B065952j248074j457266K001178l8026l14890J518050m53343j809885p07265
2693d43569J838828K27811p4521p10997j31115L68499k22249J05810M52113j81753
2683A228857K06143P59517n80382Q41851K47472j643649k04463J669056l49580
$$ plain form
2751 90464 1247944 1992018 1315371 1236466 729134 82636 204352 1393102 518313 668253
2741 668253 1665123 1101589 261049 231786 780004 374678 540998 1006043 1156686 -231865
2731 -231865 -568905 -31007 -535499 714529 -97034 7231 467949 -263150 -415494 -468189
2721 -468189 -23719 973804 1566836 695082 42089 1664635 677329 1018218 823205 1309813
2711 1309813 486071 871397 948562 1212570 852268 -416850 691901 1394627 2065952
2702 2065952 817878 -639388 1361790 1323764 1008874 2526924 2073581 263696 -443569
2693 -443569 1395259 1623070 1548549 837552 706437 1074936 852687 958497 1410610 1228857
2683 1228857 1435000 2194517 1614135 2455986 2703458 1059809 855346 2524402 2174822
2674B174822k75373k2461J483p9193q27575M46868J495626m48689n28552J21066
2664B058022R23155k87075j92392J066731j429730J02412L80719Q97313J75819
2655C694974j568143j084116j58837Q23291J17961P73707p28892q97640k2440
2646I49865L01528J054915L25104l07587m04137L45998k53522m13710J043193
2637B641647j528939R10604J312088q50218o25235l21619k87646K73940J397941
2628B922563P04676N38604j3470p71123Q55701J306250O54227R19133o65317R51179
2618G402423K059218L518112L447449L028843K101993m02056k214491k371809
2610A6569682o89724j315120j506374j22858m91420o96060p22856j64514Q66411
$$ plain form
2674 2174822 1899449 1876988 1878471 1799278 971703 1418571 2914197 2465508 1936956 2058022
2664 2058022 2981177 2694102 2501710 3568441 2138711 2241123 2621842 3519155 3694974
2655 3694974 2126831 1042715 883878 1707169 1825130 2598837 1869945 972305 949865
2646 949865 1251393 2306308 2631412 2323825 1919688 2265686 2012164 1598454 2641647
2637 2641647 1112708 2023312 3335400 2485182 1859947 1538328 1250682 1524622 2922563
2628 2922563 3627239 4165843 4152373 3381250 4236951 5543201 6197428 7116561 6451244 7402423
2618 7402423 9461641 12979753 16427202 19456045 21558038 21155982 18941491 16569682
2610 16569682 15879958 14564838 13058464 12935606 12444186 11748126 11025270 10860756 11727167
2601A1727167J732828J858036J241084J692652J634259J259377J051032P80505
2593B2976940J256570J753857M59768K953221L976175J694693K170403n17145
2585C6724482j190599Q73312J556406J01517L845367J939566k10015j155256j735258
2576D0749522k204086j395579j468877l21810l42847o73205j851447j418108k305179
2567B8768384k813106j969228j796757j906721j328413j275982j687129j424091
2559A4566957j414262k434109j287267k312754j360119j496253q18222L72369
2551C816340J5307q5189o50561K2701j09822j424539O04809k06478J56598q71840
2541A267326J85668J588587J4680j056614q78184M55621k18980p4285K76524P43551
$$ plain form
2601 11727167 13459995 15318031 16559115 18251767 19886026 21145403 22196435 22976940
2593 22976940 24233510 25987367 26447135 29400356 33376531 35071224 37241627 36724482
2585 36724482 35533883 36407195 37963601 38065118 41910485 43850051 43640036 42484780 40749522
2576 40749522 38545436 37149857 35680980 35359170 35016323 34343118 32491671 31073563 28768384
2567 28768384 25955278 23986050 22189293 20282572 18954159 17678177 15991048 14566957
2559 14566957 13152695 10718586 9431319 7118565 5758446 4262193 3443971 3816340
2551 3816340 3831647 3746458 3095897 3118598 3008776 1584237 2189046 1982568 2139166 1267326
2541 1267326 1452994 3041581 3056261 1999647 1121463 1577084 1358104 1283819 1560343 2303894
2531B303894L55548n06218j86472J01332j25296N81377j966074q94736J325825
2522I89180M44156J52293j03882o06496Q2442n35134J30967N81879N56291n76834
2512A114862k09106M03295J422185m06864l79554p05673j45336N37827j99888
2503A431748l79838P91874K80353M60472j257385n06485Q12386n57697j062457
2494A2971O50808P57754q2600q83281o1370j174594P00994O34529l65273j191581
2484a001643L0361j234190J48826J531590J91783L77022K48349j573669k32395
2475a513966j85459J539515K83459M31050o5562o20630p8990R160J281933O00621
2465A681131o47963k75328o00739l72129R25999M62156K89623R56409p52856j866091
$$ plain form
2531 2303894 2659442 2153224 1966752 2068084 1942788 2524165 558091 -336645 989180
2522 989180 1433336 1585629 1481747 875251 957693 422559 553526 1135405 1691696 1114862
2512 1114862 905756 1309051 2731236 2324372 1944818 1239145 1093809 1631636 1431748
2503 1431748 1051910 1843784 2124137 2584609 1327224 820739 1633125 1075428 12971
2494 12971 663779 1421533 1338933 455652 394282 -780312 -79318 555211 189938 -1001643
2484 -1001643 -971282 -2205472 -2056646 -525056 -333273 43749 292098 -1281571 -1513966
2475 -1513966 -1699425 -159910 123549 554599 489037 -131593 -210583 -201423 1080510 1681131
2465 1681131 1033168 757840 157101 -215028 710971 1173127 1462750 2419159 1666303 -199788
2455a99788j336012L18227N16668N60314R740m4145k53810n2577p96824M9691
2445a228516P21562N26805O89312j073693n39583K98126j15608P63029O41959
2436F83393l06315N1784j250908k29077R71996K64649M65271R02206l07992o60738
2426E84269j41041P69734K05294K38402p30688p24656J2761J61968P22675M91911
2416A590629j264444O73798j441609j097707J169251j69183k50424J638605l80170
2407D68746m85026q01447j3557O565O42340q92243J52980j10368Q34662l73319
2397e70667m5247J231832j6283j195693m31373k55849N60488K39462r5301K74717
2387c03914Q32652l47558o81032p33657J579895j30365j331168L67286J935813
$$ plain form
2455 -199788 -1535800 -1217573 -700905 -140591 -130851 -174996 -428806 -481383 -1278207 -1228516
2445 -1228516 -506954 19851 709163 -364530 -904113 -605987 -721595 41434 683393
2436 683393 377078 428862 -822046 -1051123 -79127 185522 650793 1552999 1245007 584269
2426 584269 443228 1212962 1418256 1656658 925970 201314 214075 376043 1098718 1590629
2416 1590629 326185 999983 -441626 -1539333 -370082 -539265 -789689 848916 468746
2407 468746 -16280 -817727 -831284 -824719 -182379 -1074622 -921642 -1032010 -197348 -570667
2397 -570667 -615914 615918 599635 -596058 -1027431 -1283280 -722792 -483330 -578631 -303914
2387 -303914 528738 181180 -499852 -1233509 346386 216021 -1115147 -747861 1187952
2378A187952j350663n85619R91244l33432k92759N40570m20472Q23068j05975
2369D53914j576430O02730J041437r5591N28601p25969l45433k54255p83211N08446
2359f45761J78352o63790J94553K03415n15022N61955j44254k97258J655339Q69560
2349A397089j799759K13828N47946k02942j407246J226089K75540J55256J22075
2340E27876j385937J53688P25191j02646P38625L93160k94666l04467j56931L77582
2330F71475J387819k4456m59803j012492k6787O02064L12148j22969Q1621J92696
2320A601316j202768j365293J798341N1761o93051j184779R93739M91187l31940
2311A58513j263048N20280o04067J062760P01126n19367j64458J57838q6051J41474
$$ plain form
2378 1187952 -162711 -748330 242914 -90518 -383277 157293 -263179 559889 453914
2369 453914 -1122516 -519786 521651 426060 954661 228692 -116741 -370996 -1154207 -645761
2359 -645761 -467409 -1131199 -936646 -733231 -1248253 -686298 -830552 -1127810 527529 1397089
2349 1397089 -402670 -188842 359104 156162 -1251084 -24995 250545 405801 527876
2340 527876 -858061 -704373 20818 -81828 656797 1049957 755291 450824 293893 671475
2330 671475 2059294 2034838 1575035 562543 535756 1137820 1449968 1326999 1408620 1601316
2320 1601316 398548 -966745 831596 883357 190306 -994473 -734 490453 158513
2311 158513 -1104535 -584255 -1188322 -125562 575564 56197 -108261 49577 -36474 105000
2301A05000P40151K49978o40643j39944j50480N16887Q6942j87263N51928K7906
2291A160462j667152n41174J993825q2064J77471P15496m35948n30953n17427
2282B72536J125476p49256j203563J19290J339294P04147p98325j39785q13280
2273a43466o82791L90419J4472l3840K74947R87350n08415j77712R30042o69201
2263C81805j238277m42075K050453j71975O12497p75201m1612M15650r79034l06520
2253d94289J424494r41698n60382J115865J56486r02625O46052r61234N15659
2244a672j21058p40347J83687k57353N7974O62259m240r11554R40545L47039j011612
2233h56332O86744P13259n94842P73913L98635r72998l02579O99529O17338N69953
$$ plain form
2301 105000 845151 1095129 454486 314542 164062 680949 767891 580628 1132556 1160462
2291 1160462 -506690 -1047864 945961 863897 1041368 1756864 1320916 789963 272536
2282 272536 1398012 648756 -554807 -435517 903777 1607924 809599 669814 -143466
2273 -143466 -826257 -435838 -421366 -455206 -180259 807091 298676 120964 1051006 381805
2263 381805 -856472 -1298547 751906 579931 1192428 417227 375615 791265 -187769 -494289
2253 -494289 930205 -11493 -571875 543990 700476 -202149 443903 -517331 -1672
2244 -1672 -122730 -863077 -679390 -936743 -878769 -216510 -220750 -1132304 -191759 155280 -856332
2233 -856332 -169588 543671 -51171 722742 1121377 148379 -154200 545329 1162667 1732620
2223A732620o62451m90743q56551k47574M34513n74027Q15921K12029O54635j83713
2213H34659L58973j522201O8901J506648n78891N89847R07021J62398r90645k8557
2203A308153j21739m71596K47281K57438q57835n6423R1855j06255j34721J663362
2193A819520q43151q21041j58540M01458o68396O81305P54839o03458k51292j050761
2183g39517M66765K12302K9120N11408j103966p34168M21899n59311L70301P43392
2173c81775l67022P93818Q66948j636169N52658O85663r28559Q84621r652k68698
2163A91833M47953N79963j52081m41161m54828J67325K50196j080636K08040L22915
2153C9519q5353J005853K85700j231437p99139m94237J09074J117374P14327K71092
$$ plain form
2223 1732620 1070169 579426 -277125 -524699 -90186 -664213 151708 363737 1018372 834659
2213 834659 1193632 -328569 -259668 1246980 668089 1257936 2164957 2327355 1336710 1308153
2203 1308153 1186414 714818 962099 1219537 361702 305279 397134 290879 156158 1819520
2193 1819520 976369 155328 -3212 398246 -270150 411155 1165994 562536 311244 -739517
2183 -739517 -272752 -60450 -31330 480078 -623888 -1358056 -936157 -1495468 -1125167 -381775
2173 -381775 -748797 45021 911969 -724200 -171542 514121 -414438 470183 460531 191833
2163 191833 639786 1219749 1067668 626507 171679 339004 589200 -491436 -283396 39519
2153 39519 -45834 960019 1245719 14282 -784857 -1279094 -1170020 -52646 661681 932773
2143I32773R5323j765348L23131K96837n32279n5313J331242l15079q19393q68972
2133a377078J236162N36688m09708m32661L25785K77077j36134n65877K24247
2124c21499J065896J90650j429360R9617M69441j70556M33363k84921q1390P97551
2114G68792N61678k431905O36313K252063M9983q72190O39556m05075j750959
2105e51744J51022P13214J86895K74289j186967n31537N60765N37756n72328p91775
2095a210410J324484J055781J03795j595578N7196Q64926J27957M6627n89344
2086A85434M0695m26716j85023k09476J186944L59260r63941K88806J31308j259360
2076h52069Q20936R22039M99757J37186j79613j430952q828P98865Q18245l26195
$$ plain form
2143 932773 1028096 -737252 -414121 -117284 -649563 -704876 626366 311287 -508106 -1377078
2133 -1377078 -140916 395772 -13936 -446597 -120812 156265 20131 -545746 -321499
2124 -321499 744397 935047 -494313 -394696 74745 -95811 337552 52631 -28759 768792
2114 768792 1330470 -1101435 -465122 1786941 1836924 964734 1604290 1199215 -551744
2105 -551744 -400722 312492 499387 773676 -413291 -944828 -384063 153693 -418635 -1210410
2095 -1210410 114074 1169855 1273650 -321928 -264732 600194 728151 774778 185434
2086 185434 226129 -200587 -385610 -595086 591858 951118 -12823 275983 407291 -852069
2076 -852069 -31133 890906 1390663 1527849 1348236 -82716 -91544 707321 1525566 1199371
2066A199371j33946L00088m71657q26624R35540k68387j775179J030532R30390
2057I20128M1451j69384j82697k54079N02107K0512O34061J231425j49354J54065
2047B748235R07614N58627J137866j78927o6806J924551K786180J570588L10331
2038A1698259O36132r69158k184793l333649j922510L02563L70707m73675o45770
2029C478106O15149j098214j283399J503748r19057j098674m48721P80947L93579
2020A923464M36305K1473j607717o4473K84474P86569q57435o69861M20258P37805
2010A410862k30197l4357J5410r64811j097469K72194L82155P98693K61467M0927
2000H54874M19625k071925J058533N35596j056352Q64626J490067j116547J0824
$$ plain form
2066 1199371 1065425 1365513 893856 67232 1002772 734385 -1040794 -10262 920128
2057 920128 961579 792195 609498 355419 857526 878038 1512099 2743524 2594170 2748235
2047 2748235 3655849 4214476 5352342 5173415 5106609 7031160 9817340 11387928 11698259
2038 11698259 12334391 11365233 9180440 5846791 3924281 4226844 4597551 4123876 3478106
2029 3478106 4093255 2995041 1711642 3215390 2296333 1197659 748938 1529885 1923464
2020 1923464 2359769 2381242 773525 709052 993526 1780095 922660 252799 673057 1410862
2010 1410862 1180665 1146308 1161718 196907 -900562 -628368 -246213 552480 813947 854874
2000 854874 1274499 -797426 261107 796703 -259649 604977 2095044 978497 989321
1991I89321K81833m3305r21675n10602L34413M16712m44017O11062J163742q58238
1981A019246j094971P60011R36995j35762n25326p65607j50846L79934O0046J202035
1971A685755J254675k357804k41452N86355j017922K70244M05031m57688O0187
1962A87381R45377j81575k59607o92931j85596J83404o64053J068027J388961
1953A789388J91693q00161k24481m7905L39195o4931l36852m39813k80935M73207
1943E98405K013114K04123L99863J429043P91127o10120K091327J962780L43640
1934I223302l70676O78086j739699j640236k723846r13534q16383m57756N36275
1925A775533J531096k25373j041910q41852m07126l96533J731532N54897j367127
$$ plain form
1991 989321 1271154 1227849 306174 -204428 129985 546697 102680 713742 1877484 1019246
1981 1019246 -75725 684286 1621281 1485519 960193 194586 43740 423674 483720 1685755
1971 1685755 2940430 582626 341174 927529 -90393 179851 584882 127194 187381
1962 187381 1132758 951183 691576 -1355 -186951 -3547 -667600 400427 1789388
1953 1789388 1981081 1180920 956439 908534 1247729 1182798 845946 406133 125198 598405
1943 598405 2611519 2815642 3215505 4644548 5435675 4825555 6916882 8879662 9223302
1934 9223302 8852626 9530712 7791013 6150777 3426931 2513397 1697014 1239258 1775533
1925 1775533 3306629 3081256 2039346 1197494 790368 393835 2125367 2680264 1313137
1916A313137M99133O63056M00008n65123n18364M43210M92645k50499J703193
1907D180396K851096N05125J674471K64446q94016n79809j657077k462646q51925
1898C030061O6545k15172n54897O45441r20866k230893L40479Q58553P16331O9850
1888A805432p25069l48732J306086q10394m93262M10110k20132q43207L90150
1879D70982j15031J412666n21525j225662J79899l2245o20321J104910O72892
1870A326565O6945r2468n77903n46248R49524o05628j142957L3616J239725M888
1860F56059j05039p74462k75061m33006k74729L43295J368090n45980K06852m20526
1850b54507Q99867k65597j86974J06806M52365l49628j416166P80478J011524
$$ plain form
1916 1313137 1812270 2475326 2875334 2310211 1791847 2235057 2727702 2477203 4180396
1907 4180396 7031492 7536617 9211088 9475534 8581518 8001709 6344632 3881986 3030061
1898 3030061 3096606 2881434 2326537 2971978 2051112 -179781 160698 1019251 1735582 1805432
1888 1805432 1080363 731631 2037717 1227323 734061 1144171 924039 80832 470982
1879 470982 355951 1768617 1247092 21430 201329 169084 -451237 653673 1326565
1870 1326565 1393510 1301042 723139 176891 1126415 520787 -622170 -588554 651171 656059
1860 656059 551020 -223442 -498503 -931509 -1206238 -862943 505147 -40833 166019 -254507
1850 -254507 645360 379763 192789 299595 751960 402332 -1013834 -233356 778168
1841G78168n67821O89962J95101n09139j89614o3403j479374J198605K055537
1832B108022j156800K79534L26146n61836j16569j203093l9817J136486o1686
1823G10387j63760O29025j57266r27045L41774M14694K14293O37830q41241l13866
1813E44825R67860Q20645j06915j74313n63423r19175J259607j010511J91048
1804A009648J512418k41139o70223k13858n46854O66878p49998n84008L96419
1795E79283J298262m91601k86441N3801L51069j103696p92515M39230L26737J54107
1785E28236N12069o71339R33432m17099q61071n56137L09915J481831n39180J49086
1775H69743R18753L41337j581472r10393R89841P88557r3988p95568O8438J28438
$$ plain form
1841 778168 210347 900309 1095410 586271 396657 333254 -1146120 52485 2108022
1832 2108022 951222 1230756 1556902 995066 878497 -324596 -364413 772073 710387
1823 710387 546627 1175652 1018386 91341 433115 847809 1062102 1699932 858691 544825
1813 544825 1512685 2333330 2226415 2052102 1488679 569504 1829111 818600 1009648
1804 1009648 2522066 2280927 1610704 1396846 849992 1516870 766872 182864 579283
1795 579283 1877545 1385944 1099503 1153304 1504373 400677 -391838 47392 374129 528236
1785 528236 1040305 368966 1302398 885299 24228 -531909 -221994 1259837 720657 869743
1775 869743 1788496 2129833 548361 -362032 627809 1416366 1322378 526810 595248 723686
1765G23686j121736n83669K091823q7325j113178M17061J52547p35151Q38013
1756E82071p06302J466466J088980j709248J59342M6366l20647R8464k80026m4980
1746C80486K86918q9655q53959L22964J473445j035299j190827K21488J629751
1737A145312l66751o61564L89791J065091l31633r65103J311791L23573j223981
1728F86526q22972N6544J258755M09790j078309j61788k878P79019p58116m4442
1718C22129k93060N58036J525450j031140n98601N88297N80687j415184k63819
1709b7205J371954j014104j466491J318686J533147l74764j039287k12931Q8461
1700A77466P33712q04984k2165N88764M59279N1837q52656O07042R14136p50826
$$ plain form
1765 723686 -398050 -981719 1110104 1022779 -90399 326662 479209 -255942 582071
1756 582071 -124231 1342235 2431215 721967 881309 927675 607028 705492 425466 380486
1746 380486 667404 577749 -276210 46754 1520199 484900 -705927 -484439 1145312
1737 1145312 778561 116997 506788 1571879 1240246 275143 1586934 1910507 686526
1728 686526 -136446 -79902 1178853 1588643 510334 348546 345668 1124687 366571 322129
1718 322129 29069 587105 2112555 1081415 482814 1071111 1651798 236614 -27205
1709 -27205 1344749 330645 -1135846 182840 1715987 1341223 301936 89005 177466
1700 177466 911178 106194 84029 672793 1132072 1183909 331253 938295 1852431 1101605
1690A101605n31143P791N04443j24813n32276L68526J77066R74683r43225m807
1680I97850m4446j004578o67515N31370N58858n57518R74147l91045j375300j300292
1670b278469Q09066J236795o1169O436m56750n60792Q76345J067469J188434J935
1660A829300j204846j550315M96062K005154p3103j331869J748160L2595p61140
1651A189998l4335J62238l65681n36959Q157K26198P61479j095248N58891M24735
1641A299473q77561M71920M80935p07870p25797Q58741n07366K54623J527543
1632B074641q32287j48499n87993j680562J013315m43106L02141K76002l95333
1623d21681k81169J257832K48140j225798J452563o00681p59938Q45356O48380
$$ plain form
1690 1101605 570462 578253 1082696 957883 425607 794133 971199 1945882 1002657 997850
1680 997850 953404 -51174 -718689 -187319 371539 -185979 788168 397123 -978177 -2278469
1670 -2278469 -1469403 -232608 -293777 -287341 -744091 -1304883 -428538 638931 1827365 1829300
1660 1829300 624454 -925861 -429799 1575355 1502252 170383 1918543 1951138 1189998
1651 1189998 1155663 1317901 952220 415261 423418 649616 1411095 315847 874738 1299473
1641 1299473 421912 893832 1374767 666897 -58900 799841 292475 547098 2074641
1632 2074641 1242354 1093855 505862 -1174700 -161385 -604491 -302350 -26348 -421681
1623 -421681 -702850 554982 803122 -422676 1029887 429206 -330732 514624 1163004
1614A163004Q61858r43460j790259R26096J180745j162640K23550J036444j522542
1605b7204J21767J5784j56078j7536K43739O01025J213980n79999j672735K58344
1595A087j77038K58521K5077n5609k78367R37640m51120n93462J107289m71983
1585C02035m97173O8783o06456l86387J289141q6723P47721R32087k107270m06684
1575g50926N82346k14415J162815Q79888m26859J15217J061432j07967J20686
1566B422217o59785k65828O79846l75763J26926M15291n81674j549863r37816
1557g26449J089548M5942J01166P8948Q8592j69126j209592J54942J14234N23692
1547I1897R4440Q4544k34826k19801j48898J1382J293684l67717N68944l99933
$$ plain form
1614 1163004 2024862 1081402 -708857 217239 1397984 235344 458894 1495338 -27204
1605 -27204 94563 110347 -45731 -63267 180472 781497 1995477 1415478 -257257 1087
1595 1087 -175951 82570 107647 52038 -226329 711311 260191 -333271 774018 302035
1585 302035 -195138 -126355 -732811 -1119198 169943 83220 830941 1763028 -344242 -750926
1575 -750926 -168580 -382995 779820 1659708 1232849 1348066 2409498 2301531 2422217
1566 2422217 1762432 1496604 2176450 1800687 1927613 2342904 1761230 211367 -726449
1557 -726449 363099 409041 510207 589155 677747 508621 -700971 -546029 -431795 91897
1547 91897 186337 270881 36055 -183746 -332644 -321262 972422 604705 1173649 773716
1537G73716K29989L30238j249902M77463N59841R08387l39665q91938N8550k30821
1527F25858K46119O75977Q78244q57600K0118m23854L85519O93202q8263j63805
1517A991515k18777j93025j671621j96986M36050k34563L23171k10212n94999
1508e69447q62942N22059J177160L41347p7517J76945j06916p86496J50937L33039
1498B98169M90474k7547r22803M26234K18388K21192p85851J65397P43640k81521
1488E45772n4694j75574J265457O72549m37972j330824m97568M64991j024721
1479e72584m6591J922316Q33105j837002l58172P86425k4109m71j229996J165323
1469F38244Q5378m46758Q08268j93247L04799J38081p31468m89511K72358p32069
$$ plain form
1537 773716 1003705 1333943 84041 561504 1121345 2029732 1690067 798129 856679 625858
1527 625858 871977 1547954 2426198 1568598 1588716 1164862 1550381 2243583 2155320 1991515
1517 1991515 1772738 1579713 -91908 -288894 147156 -87407 235764 25552 -569447
1508 -569447 -1432389 -910330 266830 608177 530660 707605 600689 -185807 -34870 298169
1498 298169 788643 761096 -161707 264527 482915 704107 -81744 83653 827293 545772
1488 545772 491078 315504 1580961 2253510 1815538 484714 -12854 452137 -572584
1479 -572584 -619175 1303141 2136246 299244 -58928 727497 703388 702917 -527079 638244
1469 638244 723622 276864 1085132 891885 1196684 1334765 603297 113786 386144 -345925
1459c45925O33752R98104j24118N56169p35884K03009K92061N58688r06005M40907
1449A570758N12570o82159j61780k29342J16068O94925j4344n67425J70882j125755
1439B84398r57770J846644O22076j27122N7338q59606k3037m4338m57458J68603
1429E09728Q02118j40635l69731Q23063q3258n55961o64340J52292M46959L28893
1419A249128j146575K63658Q8500j74694Q26237j042194j84585J037957q33902
1410H3530N71876J155959O98171l89532k1861k92027K59002j073137r39252K374209
1400B426938p07634j080584L67886O33193p23287m19290m8308o74551N09366O48694
1390I32423Q77462R10252j394129j060059L31174L73588j92371J010755j2230
$$ plain form
1459 -345925 287827 1285931 1161813 1717982 982098 1185107 1477168 2035856 1129851 1570758
1449 1570758 2083328 1401169 1239389 1010047 1126115 1821040 1806696 1239271 1410153 284398
1439 284398 -673372 1173272 1795348 1668226 1725564 865958 842921 798583 341125 509728
1429 509728 1311846 1171211 801480 1624543 1541285 985324 320984 473276 920235 1249128
1419 1249128 102553 366211 454711 280017 1106254 64060 -120525 917432 83530
1410 83530 655406 1811365 2509536 2120004 2098143 1806116 2065118 991981 52729 2426938
1400 2426938 1719304 638720 1006606 1639799 916512 497222 448914 -225637 283729 932423
1390 932423 1809885 2720137 1326008 265949 597123 970711 778340 1789095 1776865
1381A776865m08930m39420m69750N86004R24978N58854n63698K80453M19115m41645
1371B222826L5172l1004N09946j00595j087953k71087J388811n40956j279318
1362H45842O76044M57324j736542m75698Q43797O77247L00231L49496k02246P32102
1352B467597j311465r35926K53817P8125L34200Q22869M64775l80026p72698q92392
1342A28876J108462p8054J52536J157852j370000J2866J258781K6978M3917o9150
1332B373064l09697q28703M73845M74194m13973M19761j37656j85348j227675
1323F37812O75470Q1494J2142P8774M33685Q4039m54976m21044k86428J213510
1313B054478N49802l22858m63344K69674q29342k77731J33648M33244n64518M93243
$$ plain form
1381 1776865 1367935 928515 458765 1044769 1969747 2528601 1964903 2245356 2664471 2222826
1371 2222826 2257998 2226994 2736940 2636345 1548392 1277305 2666116 2125160 845842
1362 845842 1521886 1979210 242668 -233030 610767 1288014 1588245 1937741 1735495 2467597
1352 2467597 1156132 220206 474023 552148 886348 1709217 2173992 1793966 1021268 128876
1342 128876 1237338 1159284 1311820 2469672 1099672 1112538 2371319 2398297 2442214 2373064
1332 2373064 2063367 1234664 1708509 2182703 1768730 2188491 2050835 1865487 637812
1323 637812 1313282 1394776 1406918 1485692 1919377 2003416 1548440 1127396 840968 2054478
1313 2054478 2604280 2281422 1818078 2087752 1258410 980679 1114327 1547571 983053 1476296
1303A476296N39855q52753m16557k5775j92784Q99667m1071J37925M65482m30627
1293A559658l30793Q2376k93987M46925L32869k42466O62975j24638p49016q84378
1283D59525l32087Q23572J97696m1163L67514J143045k86404j394606M11409K94989
1273A643490o12752n2549J508483O59097j030726L97800j172875j22696j80052
1264A037220k6228M91714j08656m34919J80294J81326k7564L37613k71771r59285
1254C99744j23994k89801J267083R81032j95339j20031j448517k86474P0448R66188
1244A220339O74842k3216n14349P65500M66437q33550m82605r02512K57919J098611
1234A727416J424332J38249o08193j803072l61635J89500J204816L41854m23972
$$ plain form
1303 1476296 2016151 1163398 746841 721066 528282 1427949 1386878 1524803 1990285 1559658
1293 1559658 1228865 1311241 1017254 1464179 1797048 1554582 2217557 2092919 1343903 459525
1283 459525 127438 951010 1148706 1107543 1475057 2618102 2331698 937092 1348501 1643490
1273 1643490 1030738 978189 2486672 3145769 2115043 2512843 1339968 1217272 1037220
1264 1037220 1010992 1502706 1394050 959131 1139425 1320751 1293187 1630800 1359029 399744
1254 399744 275750 -14051 1253032 2234064 2038725 1918694 470177 183703 254151 1220339
1244 1220339 1895181 1871965 1357616 2123116 2589553 1756003 1273398 370886 628805 1727416
1234 1727416 3151748 3289997 2681804 878732 517097 706597 1911413 2253267 1829295
1225A829295j18539R60791r19121n61744R63473k11428r40819L93857O84343M04998
1215B485106J78804j582377P09227l66397k83386m8112J871546n01097n62425
1206A900889K05445O0619N42260q06797r49621M59453J05148N91174O20159l26696
1196B402033o50684j44678o25563l60746O84208m37186R2324P68588j0786M7290
1186A764800l87285p96047j264360N07770Q16496Q25462p27458o24854J234765
1177A349289J09178k39975l99545L3327Q97421j280598L81821J369806L34930
1168B555654j155894M648r474k41448k89512m36360O87611L99826n23406m42675
1158E48970J78722J051829k49301q06829N87014k82973J96020P1768m25956n36517
$$ plain form
1225 1829295 1710756 2671547 1752426 1190682 2154155 1942727 1001908 1395765 2080108 2485106
1215 2485106 2663910 1081533 1790760 1424363 1140977 1092865 2964411 2463314 1900889
1206 1900889 2106334 2166953 2709213 1902416 952795 1412248 1517396 2108570 2728729 2402033
1196 2402033 1751349 1606671 981108 620362 1304570 867384 959708 1728296 1717510 1764800
1186 1764800 1377515 581468 -682892 -175122 641374 1466836 739378 114524 1349289
1177 1349289 1458467 1218492 818947 852274 1749695 469097 850918 2220724 2555654
1168 2555654 1399760 1404408 1394934 1153486 863974 427614 1115225 1515051 991645 548970
1158 548970 727692 1779521 1530220 723391 1310405 1027432 1223452 1295220 869264 332747
1148C32747R44147K18445m48346N24008k57932m71758O93210n95089l9291J050930
1138A951071O36954r02035l30232Q51466O5474n03016J59681J70722o97564j6631
1128A385890M13592k72262r7522k81781o96428K78620R86102n69592l17625L3946
1118H62940l96041r27221R54394J89836k60114p87190Q32804P56667j44194Q00462
1108A882343o44378k01842m64264l59398J294432O62663p17512l25743R86257
1099B112558n2098p72622l04794j27424L68434j06679O33436L89710L64174p31920
1089A772775j409979O761O79389P18606o42990p19246N20070j519509O17470J827218
1079A850565r21293o33246J17737N1738L66027K71858l0613M5845r75862k80520
$$ plain form
1148 332747 1276894 1495339 1046993 1571001 1313069 841311 1534521 939432 900141 1951071
1138 1951071 2588025 1685990 1355758 2207224 2272698 1769682 1929363 2100085 1402521 1385890
1128 1385890 1799482 1527220 1429698 1147917 451489 730109 1716211 1146619 828994 862940
1118 862940 466899 -460322 494072 683908 423794 -363396 469408 1226075 1081881 1882343
1108 1882343 1237965 1036123 571859 212461 1506893 2169556 1452044 1126301 2112558
1099 2112558 2060460 1287838 983044 855620 1224054 1117375 1750811 2140521 2504695 1772775
1089 1772775 362796 369557 1048946 1767552 1124562 405316 925386 -594123 23347 1850565
1079 1850565 929272 296026 413763 465501 831528 1103386 1072773 1118618 142756 -137764
1069a37764J312735j40750q44450j76864M25614N60034r7430m53274P89016r1882
1059A144985j087013O33465K74117P31738J37549j308382l35538J068271j432950
1050a73758p57134J180720j25788P7766K37436N49731j85473J2889L90702J68044
1040A375135M98649p77549o61123P3925N71437M11521m58731L24099n03090p67007
1030H7266m00295O98676K3201l54903Q77937l11663l09682n66977L94369K10098
1020C48027l75929p3068m13777Q7994J97878j220251N26565N64601J061887o45585
1010E8342k76764l75029l78297O09849K27678K91471P28323N58677j248366q50073
1000f54189N04548O87635J07165j22697L27464M6699o57939p63118J46957J782927
$$ plain form
1069 -137764 1174971 1034221 189771 12907 438521 998555 901125 447851 1236867 1144985
1059 1144985 57972 691437 965554 1697292 1834841 526459 190921 1259192 -173758
1050 -173758 -930892 249828 124040 201806 439242 988973 803500 816389 1207091 1375135
1040 1375135 1873784 1096235 435112 509037 1080474 1491995 1033264 1357363 854273 87266
1030 87266 -313029 385647 408848 53945 931882 620219 310537 -256440 137929 348027
1020 348027 -27902 -100970 -514747 -426753 -228875 -1449126 -922561 -357960 703927 58342
1010 58342 -218422 -593451 -971748 -361899 -134221 157250 885573 1444250 195884 -654189
1000 -654189 -149641 537994 645159 522462 849926 896625 238686 -524432 -377475 1405452
990A405452J9290j650373j64450J583611o12114o82921R08331K44895o31439o35619
980b15337L25851J91070J172579r46419j096407m7383R72858J69037j636698O15702
970d95147L17701p55932L73176K509395n29245o21617M06723K88022j472984N07322
960E27414P54190J30170j217712P77923j96585l06793m85615J45468J73151j05695
950A95916J009367J125m79293o43280l05131J592620J73416m29042k4630j184644
940i3576p42963R2190R91049l59932L45591n41300j02529m54448q93549Q87949
930h71518P1104P89843Q74085q51006j574093J928434O96054j104375n75225J585442
920I68745j57139l28559N92651O05325j063965r75457R07595K58217P35840O26608
$$ plain form
990 1405452 1424742 -225631 -390081 1193530 581416 -101505 806826 1051721 420282 -215337
980 -215337 110514 301584 1474163 527744 -568663 -616046 356812 525849 -1110849 -495147
970 -495147 -177446 -933378 -560202 1949193 1419948 798331 1205054 1493076 20092 527414
960 527414 1281604 1411774 194062 971985 775400 468607 -17008 128460 301611 195916
950 195916 1205283 1206408 727115 83835 -221296 1371324 1544740 1115698 1091068 -93576
940 -93576 -836539 -744349 246700 -113232 232359 -308941 -411470 -865918 -1759467 -871518
930 -871518 -800414 -10571 863514 12508 -1561585 366849 1062903 -41472 -616697 968745
920 968745 811606 483047 1075698 1681023 617058 -358399 549196 807413 1543253 2169861
910B169861n11499k06799N01935j298497L51039P00583m45759j366984Q70654
901G64534n85311N33505Q03233p30720j401687K78030L2237q20525P4008J630892
891E78196J44278j141889M41105O39597r87599L39354Q80009j127605Q30886K54957
881H51289j212876p02979J213148j18193J71403J534439j002109j167421j018828
872a452127L24146J864639J828660r93820l66631o25421m64310o73369O23849
863F5616J227911r5001k023082N04164k07931q65053M68793J143676k89677P61149
853F90565l66956o28193J30425n87014P23789J413544R58331j848973j214520
844g29002r6262P15677J59215L35023L29779p96596j018342m9907K22541O48947
$$ plain form
910 2169861 1658362 1451563 1953498 655001 1006040 1706623 1260864 -106120 764534
901 764534 179223 712728 1515961 785241 -616446 -338416 -306179 -1126704 -1052696 578196
891 578196 722474 -419415 21690 661287 -326312 13042 893051 -234554 596332 851289
881 851289 -361587 -1064566 148582 30389 201792 1736231 734122 -433299 -1452127
872 -1452127 -1127981 736658 2565318 1571498 1204867 579446 115136 -558233 65616
863 65616 1293527 1198526 -824556 -320392 -528323 -1393376 -924583 219093 -70584 690565
853 690565 323609 -304584 -174159 -761173 -37384 1376160 2334491 485518 -729002
844 -729002 -825264 -109587 49628 384651 714430 -82166 -1100508 -1150415 -927874 -278927
834b78927O26160j24564L04416N08931r97145j204838J729461j74445m23101j197308
824a231360J059226J608136J93379j357434J77302M27051j217538O26353J424603
815A709718r6199o25367k3776K274l09216j4111m03404l55539Q26364m18628k74107
804A8009k90541N32821l92640O4699Q0954N72182r8065k01733n05569N47327O94335
793A021779r38518P9996P21936p33460l79837P25177L88950N50272O9287j749616
783b44034m2841J53067l68180J121328P91691O6811j140512j099431J300013K66544
773H04456p75238p48702J033827M89049J233212j220076j455299R1834o1622n90935
763a199494J176055K87665K17285j148732N15035L24984Q19392k316057J49928
$$ plain form
834 -278927 347233 222669 527085 1036016 38871 -1165967 563494 389049 -34052 -1231360
824 -1231360 -172134 1436002 1629381 271947 449249 876300 -341238 285115 1709718
815 1709718 1613519 988152 964376 966650 657434 643323 239919 -115620 710744 292116 18009
804 18009 -272532 260289 -132351 -67652 13302 585484 487419 285686 -219883 327444 1021779
793 1021779 83261 163257 885193 151733 -228104 497073 886023 1436295 1505582 -244034
783 -244034 -286875 -133808 -501988 619340 1411031 1477842 337330 -762101 537912 804456
773 804456 29218 -719484 314343 803392 2036604 816528 -638771 -546937 -608559 -1199494
763 -1199494 -23439 264226 481511 -667221 -152186 172798 992190 -1323867 -1173939
754a173939K435677N91481q61517M09475n7496q55495m95891l58729J001350L80332
744A015248n06148m4909q5746L80256n3446m0946K696M64926J37202j97228K92538
733A364443P83598M4342k38943j134639p43323J294653p39193j148376J901857
724A384419j133567l00003J065172J52043l50350o90228m95225M44214P68028
715H44503l55356j6127j243143R86904J627391j144496j347038J425918j26143
706F52413K86596l10998l06680j04094J277965j343717K320064J004860l582433
697a06024p26188J786746j730379l42629N86340J125154k81717m57403o97767
688h43867P59721j305180J19852P07140l06467k99785R10481l64989P2523Q96719
$$ plain form
754 -1173939 1261738 1853219 991702 1401177 1343681 488186 -7705 -366434 634916 1015248
744 1015248 509100 464191 378445 758701 705255 664309 667005 1131931 1269133 1071905 1364443
733 1364443 2148041 2192383 1953440 818801 75478 1370131 630938 -517438 1384419
724 1384419 250852 -49151 1016021 1168064 817714 127486 -367739 76475 844503
715 844503 489147 473020 -770123 216781 1844172 699676 -647362 778556 652413
706 652413 939009 628011 321331 217237 1495202 151485 2471549 3476409 -106024
697 -106024 -832212 954534 -775845 -1118474 -532134 593020 311303 -146100 -843867
688 -843867 -84146 -1389326 -1269474 -562334 -868801 -1168586 -258105 -623094 -550571 346148
678C46148l32849o92143R0918k34561R98689j33315k89266J270985N11597j491941
668D4262J100129o82660n73504k54089J372837M28206k11016m67213k85644o2873
658D08435L43504M18795P57777j057282l36134R31782n01983j340300O01665J098378
648A324637j263513p77790O78918R55099j117888P53553J76875J46581p66703
639A09769J70747J861317P21397j684855N74781n15476l41554M58964k36923J28501
629A246668M28580j073269r4160L16508k14153J035389l81686o96528J744634
620B311983m35168j451023L64473J585948j458138J28125J69431P56624k89183
611A683072j732471R2479K697288j374265p15014J009152K1866j790155l65418
$$ plain form
678 346148 13299 -678844 -587926 -822487 176202 42887 -246379 1024606 1536203 44262
668 44262 1144391 461731 -111773 -365862 1006975 1435181 1224165 756952 471308 408435
658 408435 751939 1170734 1928511 871229 535095 1466877 964894 -375406 226259 1324637
648 1324637 61124 -716666 -37748 917351 -200537 553016 729891 876472 109769
639 109769 280516 2141833 2863230 1178375 1753156 1237680 896126 1355090 1118167 1246668
629 1246668 1675248 601979 507819 824327 610174 1645563 1263877 567349 2311983
620 2311983 1876815 425792 790265 2376213 918075 1046200 1215631 1972255 1683072
611 1683072 -49399 43080 2740368 1366103 651089 1660241 1682107 -108048 -473466
602d73466J39382J439422l55767l31266j203960n58584J7929Q25717L35421j25234
592b90406N5100j70403K93088K95768K94827O7213Q27157J78872J34008p75868
582I09356j465982N78260J519020K96247O53629O82431m70830j173666K21288
573A749753J070416K50905p1099P961j90180r65148j149547p03291P59956J32509
563H92235j209035J42859L80347m36530K35033M54880p06431l68723R23956k14580
553I4011n01783J134413J86348m83438o75793J519143J26304r16746j44843J554921
543A892537J3084M73371n2163l49269j23471n33336L186M70323J59367p43689
533A209940N28951R61994n30379j265963l96551p99147J53434J196814M44085
$$ plain form
602 -473466 -334084 1105338 749571 418305 -785655 -1344239 -1326310 -500593 -165172 -290406
592 -290406 -235306 -405709 -112621 183147 477974 545187 1372344 1551216 1685224 909356
582 909356 -556626 21634 1540654 1836901 2490530 3172961 2702131 1528465 1749753
573 1749753 2820169 3071074 2999975 3007936 2817756 1852608 703061 -230 759726 892235
563 892235 -316800 -173941 206406 -230124 4909 459789 -246642 -615365 308591 94011
553 94011 -407772 726641 912989 429551 -246242 1272901 1399205 482459 337616 1892537
543 1892537 1905621 2378992 2326829 1977560 1854089 1320753 1323939 1794262 1953629 1209940
533 1209940 1738891 2700885 2170506 904543 507992 -291155 -137721 1059093 1503178
524A503178k07036Q73083m0830j661023k02546L60028j5144K64228J109191O4519
514B047648n89880J00807M02279L18768j79695l12405J79360p50287N3402n86503
504F83494j56784R74836J06016k49913j04341p58639n43478R70516n90613P75498
494A106592M40584j99704O22644j80276n64484J303762K38300j798825P52462
485A721055J81122j584965L03624J152011L02122O7105p28580l92321Q87352k07133
475A701392o42432J737375N01320m47286r01651L15597J062822n05105j470716
466A351316L43714o56916j82934J37674l19819O17159R66151p63272k83465Q91656
456B101264m53369j399773K47784J092563O61292K86544k51424p0464o85594j262904
$$ plain form
524 1503178 1296142 2169225 2128395 467372 264826 624854 609710 873938 1983129 2047648
514 2047648 1457768 1558575 1960854 2279622 2099927 1787522 1966882 1216595 1269997 683494
504 683494 526710 1501546 1607562 1357649 1253308 494669 -48809 921707 331094 1106592
494 1106592 1547176 1347472 1970116 1789840 1225356 2529118 2767418 968593 1721055
485 1721055 1902177 317212 620836 1772847 2074969 2142074 1413494 1021173 1908525 1701392
475 1701392 1058960 2796335 3297655 2850369 1948718 2264315 3327137 2822032 1351316
466 1351316 1695030 1038114 855180 992854 673035 1290194 2256345 1493073 1209608 2101264
456 2101264 1647895 248122 495906 1588469 2249761 2536305 2284881 2214417 1528823 265919
446B65919O21927L32264j82440J125894J014850j329778K46839K8393l57102J45279
436A912045N04549k90482L24441J28445p80373K89559P93412j114109j74647K60849
426A853689Q474M97374M86037q1777K39505K49189j92878O10768j060798N06423
416C116006m34861k33492P93125j21415n60693Q09729j53156o29191l26007L94987
406B655032Q40506j000601k3458N82166k995K45848N52090j47833n81055K30753
396C350453J74044O54243L45397k81314m79959K24270n4245L54564J84380j043173
386C428660k16563N04085j54125N83634J000452Q10099p83490J53550q1965l382
376E240955O92234J085122k39224m78483j03488N25337r41238j050781J214691
$$ plain form
446 265919 887846 1220110 1037670 2163564 3178414 1848636 2095475 2123868 1766766 1912045
436 1912045 2416594 2126112 2450553 2578998 1798625 2088184 2881596 1767487 1592840 1853689
426 1853689 1862163 2359537 2845574 2763797 3003302 3252491 3059613 3670381 2609583 3116006
416 3116006 2681145 2447653 3240778 3119363 2558670 3368399 3215243 2586052 2260045 2655032
406 2655032 3495538 2494937 2471479 3053645 3050650 3296498 3848588 3700755 3119700 3350453
396 3350453 3524497 4178740 4524137 4242823 3762864 3987134 3932889 4287453 4471833 3428660
386 3428660 3212097 3716182 3562057 4145691 5146143 5956242 5172752 5326302 5244337 5240955
376 5240955 5933189 7018311 6779087 6300604 6197116 6722453 5781215 4730434 5945125
367E945125J465122j495552M89155J326438j187886n6614m32459J077101J455024
358H585454j80216N48412M10310K16192j047782P99027l0460L05522J005192q65999
348I745652l71382J397273K51222j127578K95792J090671M61903k35035l96169
339A1112349K198799J8615j21635Q47897O74631L77304J617181M6512K06260J583915
329A8561828R97019J486333K329493K336952K610151L203859K768364M284359
321C8578358M749444K430547L274304L188013K817966N053663O184860R483057
313G5760212J5309139J8022607K7528687M2530743N6265283P0207903P1913394
306C77537968L4243866k181518l3502888o1981695o1744425n9670827m7737715
$$ plain form
367 5945125 7410247 5914695 6403850 7730288 6542402 6485788 6053329 7130430 8585454
358 8585454 8405238 8953650 9363960 9580152 8532370 9331397 9300937 9606459 10611651 9745652
348 9745652 9374270 10771543 11022765 9895187 10190979 11281650 11743553 11508518 11112349
339 11112349 13311148 13329763 13208128 14056025 14730656 15107960 16725141 16771653 16977913 18561828
329 18561828 19558847 21045180 23374673 25711625 28321776 31525635 34293999 38578358
321 38578358 43327802 45758349 49032653 52220666 55038632 60092295 66277155 75760212
313 75760212 91069351 109091958 136620645 179151388 235416671 305624574 377537968
306 377537968 411781834 409600316 376097428 314115733 252371308 192700481 144962766
299A44962766l6617851k5560299j7416617j1073461q099628n169579k384875k999420
291C5641036l403278k707110k311391k605760m418347j572928j910989j201086
283A5510147l538625j404207O94358l27561j115795K28492M47178k211455o52031
274G630501Q93739m55817N45760r95103j604941q5757k22948r91902K31819Q00188
264E745539N58203n19428j775832Q78745J046978j256576J061093L89303m26510
255E701515n82291q02290j16944l98740j587412R86667R59974j195045j52076
246B813358m76506n00349Q93200l59613n24527J157778o46206r04833J024732
237B477034l1597j98442P61j599793K09101P94971k52271k88989N38328j152834
$$ plain form
299 144962766 108344915 82784616 65367999 54294538 46194910 41025331 38640456 35641036
291 35641036 32237758 29530648 27219257 24613497 20195150 18622222 16711233 15510147
283 15510147 11971522 10567315 11261673 10934112 9818317 10046809 10493987 8282532 7630501
274 7630501 8524240 8068423 8614183 7619080 6014139 5928382 5705434 4713532 4945351 5745539
264 5745539 6303742 5784314 4008482 4887227 5934205 4677629 5738722 6128025 5701515
255 5701515 5119224 4316934 4199990 3801250 2213838 3200505 4160479 2965434 2813358
246 2813358 2336852 1836503 2729703 2370090 1845563 3003341 2357135 1452302 2477034
237 2477034 2445437 2246995 2247756 647963 857064 1652035 1399764 1110775 1649103 496269
227D96269l52735N72025K38999N69133n46720n77584n72712J58195M91539m27570
217D8839P01140n9096o43209q73425Q49202J92288o67626J22367j24690p49393
207a203603n090M11445J54651O24821l39336j46596J221446n62420L59735k39235
197B75818l93349J285464J96037j599071o6640K48896k78205M63632L32073J22794
187E87449Q5529j169111L33696J154154L65792m85163J99012K49146j078635O98680
177I40549r570n25158l0049j87151K06860n95841J50024N69976o58365N79104
167D40379J428818q39806p41738j33j19485N84695Q99846L4049o71389j184612
157a69376l97189p55813q0055N76173K28703J19753l27055l99484J11286m76491
$$ plain form
227 496269 143534 715559 954558 1523691 976971 399387 -173325 -15130 476409 48839
217 48839 749979 690883 47674 -825751 23451 215739 -451887 -329520 -454210 -1203603
207 -1203603 -1208693 -797248 -642597 -17776 -357112 -503708 717738 155318 515053 275818
197 275818 -117531 1167933 1363970 -235101 -301741 -52845 -331050 132582 464655 587449
187 587449 672978 -496133 -162437 991717 1357509 872346 1071358 1320504 241869 940549
177 940549 930979 405821 375772 188621 395481 -200360 -50336 519640 -138725 440379
167 440379 1869197 1029391 287653 287520 168035 752730 1652576 1686625 1015236 -169376
157 -169376 -566565 -1322378 -1402433 -826260 -597557 -477804 -804859 -1204343 -1093057 -1569548
147a569548p1712K59185o7488N86623j59055M39696O62686m65004r70857L39363
137a016111R52548o75678J73078O66462J66736l08784R64497j24416r03773o64419
127g69860q74351R36527J017032j191642J78642J05782J60835K4087j92388l25859
117i31195P2736j40700m86664R07625K29201q88022m83779M07328J121789o40343
107h32024j409321M15820J279689o52788l86063J152427M41548l18445R1380J91149
97b6628K57975o6679l3432j53285J7575l21238k74136N55532O85213R5613j219982
86d83472q77741O55434L82109Q21711P73563j398211k07788o6662r87994J91621
76a197430Q05559l55769J83503L86106m04785j53045k7377n95977J467431N01277
$$ plain form
147 -1569548 -1641260 -1382075 -1449563 -862940 -1021995 -582299 80387 -384617 -1355474 -1016111
137 -1016111 -63563 -739241 -566163 100299 267035 -41749 922748 798332 -105441 -769860
127 -769860 -1644211 -707684 309348 -882294 -703652 -597870 -437035 -412948 -605336 -931195
117 -931195 -858459 -999159 -1485823 -578198 -348997 -1237019 -1720798 -1313470 -191681 -832024
107 -832024 -2241345 -1825525 -545836 -1198624 -1584687 -432260 9288 -309157 -217777 -26628
97 -26628 231347 164668 131236 -22049 -4474 -325712 -599848 -44316 640897 736510 -483472
86 -483472 -1361213 -705779 -323670 498041 1271604 -126607 -334395 -401057 -1389051 -1197430
76 -1197430 -391871 -747640 -564137 -178031 -582816 -735861 -763238 -1359215 108216 609493
66F09493m18099l5895J027575j116857M36236k14394k52815J003522j79296p34972
56A24498M70135L5002M54165k30802N19725J56349j170938j221033R11780J267319
46A316200p70616m43915L63001k50122o30393K76454J143382m67273j41671J37800
36E32847N79657k41346o5555K3444J48687n91126m74995n92633k459J56690L00831
25b25958l70177M46897n1255k23532M77647L6243J96487k44806k90672K07737
15d1389j7533k68576k54691O00392K57299m29652k74150m84679J26681K42379
5e43919L91316L34522J98699l5101Q3191
0D28708
$$ plain form
66 609493 191394 155499 1183074 66217 502453 288059 35244 1038766 859470 124498
56 124498 594633 629635 1083800 852998 1372723 1529072 358134 -862899 48881 1316200
46 1316200 545584 101669 464670 214548 -415845 -139391 1003991 536718 395047 532847
36 532847 1112504 871158 805603 829047 977734 386608 -88387 -681020 -683479 -526789 -225958
25 -225958 -596135 -149238 -200493 -424025 53622 89865 286352 41546 -249126 -41389
15 -41389 -58922 -327498 -582189 18203 275502 -154150 -428300 -912979 -786298 -543919
5 -543919 -152603 181919 380618 345517 428708
0 428708
$$ Imaginary data points
##PAGE= N=2
##DATA TABLE= (X++(I..I)), XYDATA
16383d677936K09818J000610m21699O86261r108k34848q79115J61907N09179q2006
16373c736937M60482L98622o7581l880j235423M28720J36477o34525L54353O10774
16363c288918n377Q01078L40414K1163N46418p95886n25472N75501Q7553J81911
16353b061615P1938J05126l92683L03744o02965q16633L93789M22867q87L87775
16343b189544Q73340q5066n81034m73553M39781k83984P5490K53791k33465m07866
16333b612110P00898o6000j28998P40178k45145q85891M39328L81539M4371K14420
16323a417410j3435q86811O00494L22222l67090j19946M6088n21287k32504Q09223
16313a780456Q14326o66542K41493k28179n2589P19620L79604m29858j05444M03722
$$ plain form
16383 -4677936 -4468118 -3467508 -3889207 -3202946 -3212054 -3446902 -4326017 -4164110 -3654931 -3736937
16373 -3736937 -3276455 -2877833 -2945414 -2949294 -4184717 -3755997 -3619520 -4254045 -3899692 -3288918
16363 -3288918 -3294295 -2493217 -2152803 -2131640 -1585222 -2381108 -2906580 -2331079 -2243526 -2061615
16353 -2061615 -1989677 -1884551 -2277234 -1973490 -2576455 -3393088 -2999299 -2576432 -2577319 -2189544
16343 -2189544 -1316204 -1401270 -1982304 -2455857 -2016076 -2300060 -2224570 -1970779 -2204244 -2612110
16333 -2612110 -1911212 -1977212 -2106210 -1366032 -1611177 -2497068 -2057740 -1676201 -1631830 -1417410
16323 -1417410 -1430845 -2317656 -1717162 -1394940 -1762030 -1881976 -1835888 -2357175 -2589679 -1780456
16313 -1780456 -966130 -1632672 -1391179 -1619358 -1671947 -952327 -572723 -1002581 -1108025 -704303
16303g04303n85062l96185N52552o66442R62902M42943o84294p58956O14306l37164
16293a559703J98516Q18596J51448j0931n33426k22184m16890J24821O97231n83241
16283a335763Q75620k36276j70678k02214L88490O70169K5598n26565r20317j69397
16273a601333J151520P31307n54720k9384M54857l79458m31863K18605J14210
16264c26259N90752j78301L47602L92781n91248m36162j54934J95824j81101N20162
16254A79116l47434p35230L60018N75973k34588k44303J49016L67826n23932r7752
16244e51290R18511l3903J93425k59768J64844q40674n35189J188437J61204l46472
16234E9125j70467o4224N624J51976J375426P3474p94895j330603L06722l61510
$$ plain form
16303 -704303 -1289365 -1685550 -1132998 -1799440 -836538 -393595 -1077889 -1836845 -1222539 -1559703
16293 -1559703 -1361187 -542591 -391143 -402074 -935500 -1157684 -1574574 -1449753 -752522 -1335763
16283 -1335763 -460143 -696419 -867097 -1069311 -680821 -10652 14946 -511619 -1431936 -1601333
16273 -1601333 -449813 281494 -273226 -302610 152247 -227211 -659074 -440469 -326259
16264 -326259 264493 86192 433794 826575 235327 -200835 -355769 -159945 -341046 179116
16254 179116 -168318 -903548 -543530 32443 -202145 -446448 -297432 70394 -453538 -551290
16244 -551290 367221 333318 526743 266975 431819 -408855 -944044 244393 405597 59125
16234 59125 -111342 -175566 -169942 -17966 1357460 1430934 636039 -694564 -387842 -749352
16224g49352J94276j24404K18711R52528r88116J22722j97321p75727J85111O04403
16214e57169N97838l17887N44235n2973n91626j15947k45727k80754J17192N45595
16204c57223K43474p25189j82700K29590n50139K25089J383290l09890l68160
16195d11858R50004J0900K38055l69222p1337J055620n76313q09553n03517J130582
16185F43361Q12829j615709l71965J393373o20746m96698N95035R49502J34194
16176A423176l12850q39178J24777J050459r73803p61728J699695J050757j154636
16167A306669m38547J073404q17328r00546O89566R00743L6673j34264l97314
16158A319056p85744P40300J61899n89499Q3175J9372M75542j088988J011357
$$ plain form
16224 -749352 -555076 -679480 -460769 491759 -496357 -373635 -570956 -1346683 -1161572 -557169
16214 -557169 40669 -277218 267017 214044 -377582 -493529 -739256 -1020010 -902818 -357223
16204 -357223 -113749 -838938 -1021638 -792048 -1342187 -1117098 266192 -43698 -411858
16195 -411858 538146 549046 787101 417879 346542 1402162 825849 16296 -487221 643361
16185 643361 1456190 -159519 -531484 861889 241143 -255555 339480 1288982 1423176
16176 1423176 1110326 271148 395925 1446384 472581 -289147 1410548 2461305 1306669
16167 1306669 868122 1941526 1124198 223652 913218 1813961 1850634 1716370 1319056
16158 1319056 533312 1273612 1435511 846012 929187 948559 1424101 335113 1346470
16149A346470J290993j116057n09039K87224p17377J40333J120368l81381N9334
16140A520868l57879j577296M0919P63103l52858O42777L02723n43736M2857j03626
16130C77852q17891J246002O45079j036230J65018n83045m35410N11751n31954
16121d58828L17392J41570p8386r72201Q64147Q64946r33404p3920K33136N65050
16111D69502M58707r97421J97143R29467k30636o76394K98605k9707o30346n34547
16101g45627K96216J037281L45110R7048K64773n48057J1323L1641J07925j81404
16091G16229N91321n44916k37062o1980o14845m1691j75515l8036p3351l08602
16081g88448P06243J144971o31153j269347J543406n58511j017428K015912K43070
$$ plain form
16149 1346470 2637463 1521406 1012367 1299591 582214 722547 1842915 1461534 1520868
16140 1520868 1162989 -414307 -373388 389715 36857 679634 982357 438621 481478 377852
16130 377852 -440039 805963 1451042 414812 579830 -3215 -438625 73126 -458828
16121 -458828 -141436 134 -78252 -1050453 -186306 678640 -254764 -328684 -95548 469502
16111 469502 928209 -69212 127931 1057398 826762 150368 448973 419266 -211080 -745627
16101 -745627 -449411 587870 932980 1030028 1294801 746744 758067 789708 897633 716229
16091 716229 1307550 762634 525572 463592 -151253 -192944 -368459 -406495 -479846 -788448
16081 -788448 -82205 1062766 431613 -837734 705672 147161 -870267 1145645 1388715
16072A388715q56358l78783R62901N40696P12968j425567n62625L27598N04598
16063A214143K9109O51132N24662p60982r91940l42158M97557M67127N78425L74382
16053B241457K51123j23245j283125j93040R70027L14183l37208n57272K92434
16044A575334l49517l71253P8550L92125K97728p79315N46214M32172j325951
16035D96087j189505J308955N25777l01316L27881j14947o41475n68908k9133
16026a86584M95533k10066j217438j17216J962296j096125P5242K147537j121634
16017G31545p91391L4767N16428p31244N09840N57955o89k20968l19032P14598
16007A001809l03677L20762O25196r99881l01851K129523J438567j787813l47984
$$ plain form
16072 1388715 532357 153574 1116475 1657171 2370139 944572 381947 709545 1214143
16063 1214143 1243252 1894384 2419046 1658064 666124 323966 821523 1288650 1867075 2241457
16053 2241457 2492580 2369335 1086210 893170 1863197 2177380 1840172 1282900 1575334
16044 1575334 1225817 854564 933114 1325239 1622967 843652 1389866 1822038 496087
16035 496087 -693418 615537 1141314 839998 1167879 1052932 411457 -157451 -186584
16026 -186584 308949 98883 -1118555 -1235771 726525 -369600 -294358 1853179 731545
16017 731545 -59846 -25079 491349 -239895 269945 827900 827211 606243 287211 1001809
16007 1001809 698132 1018894 1644090 644209 342358 2471881 3910448 2122635 1774651
15998A774651K90297J15777o60926j57997P45534m35936j275228J30129L99895
15989I26196r86381m43596P17461M02155M12183k66818j40318m99729J13667O79618
15979I14438o09233j009197N92060J442942l50190r80831J085985p13968p29098
15970c57092L57230P28241L67992l29632n71769Q24595M32995k95266q44186K09472
15960E22580O10278j112390L46219J089713q81941p86170Q02159J68539n26430
15951B32557L84700J82640r01461Q47781k74949o81365l8432N19372m65532j359253
15941a553942o73876K021031J230338j892089N4486M83638j748945N62738J533924
15932A7303J097147k89890n40983o84217J075583J82438j025031K82478Q48573
$$ plain form
15998 1774651 2064948 2180725 1519799 1361802 2107336 1671400 396172 526301 926196
15989 926196 -60185 -503781 213680 615835 1028018 761200 620882 121153 234820 914438
15979 914438 305205 -703992 -111932 1331010 980820 -11 1085974 372006 -357092
15970 -357092 138 728379 1096371 766739 194970 1019565 1452560 1157294 313108 522580
15960 522580 1132858 20468 366687 1456400 574459 -211711 590448 758987 232557
15951 232557 617257 799897 -101564 746217 471268 -210097 -248529 270843 -194689 -1553942
15941 -1553942 -2227818 -206787 1023551 -868538 -814052 -330414 -2079359 -1516621 17303
15932 17303 1114450 824560 283577 -400640 674943 857381 -167650 114828 963401
15923I63401l96860J039930N36336r91389M71257J402466j498681r20777J018473
15914A624156R60393q12741j65594R91639l70738p12466N937J21273K69095o17677
15904A293277m78990M02049l3479o75193l24051K17082q8898L86561q434j004084
15894c14160j66711j97702l77369q1471P15125P89580M99625k03721m63356J114741
15884A314581q53079j392329J185304j5990n94419J609079O90072n08039j24395
15875A310785k05199p54470J032459K26493R6312O31790n42341r91807O96446
15866A500468l45687p02246R3104l78111l10830P62520M33743K64727o37131M39543
15856A120100j55744j88001k7576K89594O30280O42311n23402q94608j53307j347857
$$ plain form
15923 963401 566541 1606471 2142807 1151418 1622675 3025141 1526460 605683 1624156
15914 1624156 2584549 1771808 1606214 2597853 2227115 1514649 1520586 1641859 1910954 1293277
15904 1293277 814287 1216336 1182857 507664 183613 400695 311797 698358 689924 -314160
15894 -314160 -480871 -678573 -1055942 -1137413 -422288 367292 866917 663196 199840 1314581
15884 1314581 461502 -930827 254477 238487 -355932 1253147 1943219 1435180 1310785
15875 1310785 1105586 351116 1383575 1610068 1706380 2338170 1795829 804022 1500468
15866 1500468 1154781 452535 545639 167528 -143302 619218 1052961 1317688 680557 1120100
15856 1120100 964356 776355 748779 1038373 1668653 2310964 1787562 892954 739647 -608210
15846f08210q96280J182370M18379n44848J034117P01902q31522n14514L08523
15837B49917O20296N25785j16119k35852J76294l60705M05767N76055j667114
15828A74324m45374L25944j58201Q67651J83912K09259P63542O40930j71381J6522
15818B407128J50257r79122L49653j029440m63530J07006p3482j07558P23585
15809A084497O78956j50040j124741o24845R05426j12418p62385J106959L1686
15800A033095K08142M32592p52202P0788q83152l12966j89181O30176j2690O02265
15790H26867N82541l28737M39281l34104n74608p40380J72328J085521O36467
15781A765176j04299q79985O76353Q5433j158757P8738K63575p62749J41085M89991
$$ plain form
15846 -608210 -1504490 -322120 96259 -448589 585528 1287430 455908 -58606 249917
15837 249917 870213 1395998 1279879 1044027 1220321 859616 1265383 1841438 174324
15828 174324 -271050 54894 -103307 764344 948256 1157515 1921057 2561987 2390606 2407128
15818 2407128 2557385 1578263 1927916 898476 434946 541952 468470 360912 1084497
15809 1084497 1763453 1613413 488672 -136173 769253 656835 -105550 1001409 1033095
15800 1033095 1241237 1673829 921627 992415 109263 -203703 -392884 237292 224602 826867
15790 826867 1409408 1080671 1519952 1185848 611240 -129140 43188 1128709 1765176
15781 1765176 1660877 780892 1457245 1542678 383921 462659 726234 -36515 104570 594561
15771E94561o26747O89663O43998j239849q29781O16138n92892Q88004J926125
15762B069220p91976J12093o09218k32800O1165J736482m26066j609462j34482
15753A74956J51499J03580j145820p7326J067714m29720R38031j33836j216974
15744e67896k95975J623195j99283j11518J969220j186753r23869r28695Q98728
15735B77154J345918j021185j658601N68114J706129j293984P73077J881256r72656
15726A605222k40490m92629P82206J34707o55608J3767j33541o3230p33359k48674
15716c1629j219716J097815L15657r85542K40811L04421R43055j641552N82655
15707c94025J452358J59898n88951j06404k011543J70693J005502J38094P20909
$$ plain form
15771 594561 -32186 657477 1301475 61626 -768155 -152017 -744909 143095 2069220
15762 2069220 1277244 1389337 780119 547319 608484 2344966 1918900 309438 174956
15753 174956 326455 430035 -715785 -793111 274603 -155117 782914 649078 -567896
15744 -567896 -863871 759324 560041 448523 2417743 1230990 307121 -621574 277154
15735 277154 1623072 601887 -1056714 -488600 1217529 -76455 696622 2577878 1605222
15726 1605222 1364732 872103 1654309 1789016 1133408 1147175 1013634 950404 217045 -31629
15716 -31629 -1251345 -153530 162127 -823415 -582604 -278183 664872 -976680 -394025
15707 -394025 1058333 1218231 629280 522876 -1488667 -1317974 -312472 -174378 546531
15698E46531J00113j797639R11050J063905N7357O07718M11713j608540J473113
15689A765321j9012k67818J590785l72232J00439j505103j201670r38851J393801
15680E45660q376k51545J667927l62278q63817q52946J006839j47354k22132O36839
15670A148817m99050N95363n69852k2882R19747K27211O88466j963733j38276
15661C85811L57014Q48282j27499N4451J273670l76986M64960j138155P5857K61380
15651B078785r80084k93192P67395M69709o26538K35702n91386j84592Q22455
15642A698254j348809J06788J64318P58945q22415q27393P35913P11386q01758
15633C75229j20051O60052l86218o57309j61985Q46381q3692o18993Q88390n04504
$$ plain form
15698 546531 646644 -1150995 -239945 823960 881317 1489035 1900748 292208 1765321
15689 1765321 1746309 1478491 3069276 2697044 2797483 1292380 90710 -848141 545660
15680 545660 537284 285739 1953666 1591388 727571 -125375 881464 734110 511978 1148817
15670 1148817 649767 1245130 675278 652396 1572143 1799354 2487820 524087 385811
15661 385811 742825 1591107 1463608 1518059 2791729 2414743 2879703 1741548 1817405 2078785
15651 2078785 1098701 805509 1572904 2042613 1416075 1651777 1060391 875799 1698254
15642 1698254 349445 456233 620551 1379496 557081 -270312 465601 1176987 375229
15633 375229 255178 915230 529012 -128297 -290282 556099 472407 -146586 741804 237300
15623B37300J27189R23289j089526j367997K214628m819j372803J695717l14676
15614A048302j043102J492582M31468o00704J14507l42408q04227P27424p62270
15605B61572O62648K27565K18935Q2118j825127k682J796337L07307m98822P14142
15595A943993o32040j073232R96730k0875K83004M99882j819200m25546R26032
15586F78748m0742o28349O79979j03665Q10924N15782n21158O44716k24695j29089
15576A682451o60700j51192Q53948m61399q10982R34405J338812j415527j435935
15567a26119J129409j27619o34790J758656L38499r60715k84429L41993o48503
15558G86382o43263N00371n25453m20139R16899q89978J34665J235643K17866
$$ plain form
15623 237300 364489 1287778 198252 -1169745 1044883 1040064 -332739 1362978 1048302
15614 1048302 5200 1497782 1929250 1328546 1443053 1100645 296418 1023842 261572
15605 261572 924220 1151785 1370720 1452838 -372289 -374971 1421366 1728673 1229851 1943993
15595 1943993 1311953 238721 1235451 1214576 1497580 1997462 178262 -247284 678748
15586 678748 638006 9657 689636 585971 1396895 1912677 1391519 2036235 1811540 1682451
15576 1682451 1021751 870559 1724507 1263108 452126 1386531 2725343 1309816 -126119
15567 -126119 1003290 875671 240881 1999537 2338036 1377321 1092892 1434885 786382
15558 786382 143119 643490 118037 -302102 614797 -275181 -140516 1095127 1312993
15549A312993j584081j98240P7688L87932R26382J50929R15575m75576j427322
15540H6280p71224J052854J39753o0735l25391J65400K92577j332681q21134J121904
15530d52397R93115j68897J89963k72420m97317K0120k50836P94925J044722n59803
15520H41175o67855n83715J58019Q20664P67589j00735o29650j15821l00545J534
15510A90660Q90811P9542J22644N3564l27152J17994n10904O98198K23993j387204
15500A52146J169284k28997j629168P93826J94673m83214K59282k72405j6102
15491f0675J43092O03779l60505R26377K46995j34513r73307n88415N346J414018
15481A222192N92589j089003k20965L38994p52399l65793J701767J168859j092770
$$ plain form
15549 1312993 -271088 -469328 -391640 -3708 922674 1073603 1989178 1513602 86280
15540 86280 -684944 367910 507663 446928 121537 286937 579514 -753167 -1574301 -452397
15530 -452397 540718 371821 561784 289364 -207953 -187833 -438669 356256 1400978 841175
15520 841175 173320 -410395 -252376 568288 1335877 1235142 605492 489671 189126 190660
15510 190660 1081471 1161013 1283657 1337221 1010069 1128063 617159 1315357 1539350 152146
15500 152146 1321430 1092433 -536735 257091 451764 -31450 227832 -44573 -60675
15491 -60675 82417 686196 325691 1252068 1499063 1364550 391243 -197172 -191826 1222192
15481 1222192 1814781 725778 504813 843807 91408 -274385 1427382 2596241 1503471
15472A503471l02605J57192K44011J18234M29377n61277n77349L20244k80070
15463A051228n61386J19037J298016j667259o96711R02175r882R0558M6493M70234
15453A042503J03890r19173R0025L45990j29223Q78282m3940n58510K10500l16002
15443G04342k31634J090784l15021m11057P66251O7440q43970J27170J65425P60567
15433A880297M84458j545151K70483n94520l13119J197122J018573q72320q23133
15424G02690o09105P70816J73482O58412K38169p53996o86761k29410q10302Q77150
15414C31145N59860O1053L55204j63139q3406p22398r45786O48886J097844l94420
15404G44843O76815r5069o79044R1402q34861R55849N29209j107827n25325J697108
$$ plain form
15472 1503471 1200866 1358058 1602069 1720303 2149680 1588403 1011054 1331298 1051228
15463 1051228 489842 608879 1906895 239636 -457075 445100 435218 525776 572269 1042503
15453 1042503 1146393 227220 317245 663235 534012 1412294 1368354 809844 1020344 704342
15443 704342 472708 1563492 1248471 837414 1603665 1671105 827135 954305 1119730 1880297
15433 1880297 2364755 819604 1090087 495567 182448 1379570 2398143 1525823 702690
15424 702690 93585 864401 1037883 1696295 1934464 1180468 493707 264297 -546005 331145
15414 331145 891005 952058 1307262 1144123 1060717 338319 -607467 41419 1139263 744843
15404 744843 1421658 1326589 647545 738947 -95914 859935 1389144 281317 -244008 1453100
15394A453100k65391m79575J558442n65251j239597O19918j176058M72151R19574
15385A297313O4199l312l29264j141302J237327J103804j072597n81077K71254
15376H46345M01507l06703l0322N42176J36276j543510k82560O73256j02645j313284
15366i79464K83248O9017N43991L96184m18048l97394R48739N32132r18382j44530
15356h4507P45642L9897j219789m14582K187742Q876j828046Q42460P62906k78788
15346G61811J34983M32549R07763j096288J17684Q83019L37774k94875m89838
15337A694582p40286q85386k44660Q82182M70972L21463r98416j247o99735J067196
15327H66665n955m9146N85250m87251l19924J63068k74364o99602J68495k54418
$$ plain form
15394 1453100 1187709 708134 2266576 1701325 461728 1081646 -94412 377739 1297313
15385 1297313 1361512 1358200 1028936 -112366 1124961 2228765 1156168 575091 846345
15376 846345 1247852 941149 910827 1453003 1589279 45769 -236791 436465 333820 -979464
15366 -979464 -696216 -627199 -83208 312976 -105072 -502466 446273 978405 60023 -84507
15356 -84507 661135 701032 -518757 -933339 1254403 1263279 -564767 277693 1040599 761811
15346 761811 896794 1329343 2237106 1140818 1258502 2141521 2479295 2184420 1694582
15337 1694582 954296 68910 -175750 706432 1177404 1498867 500451 499204 -200531 866665
15327 866665 860710 811564 1396814 909563 589639 752707 478343 -221259 -52764 -307182
15317c07182k02727J080252J6153q84897O39084R21067L97665n29940K63470K27093
15307A620038m4541l99320R68601k25724o94993o31439r45051M4898l42715J158280
15297E08034J187890j833110k77551J445411o58406o04010K63553M50383j027895
15288e45701n40905J692656J76526o34780j99765p24318k85484M34528O95518
15279F8275J199667l90009l89403P75416L39825j766793R67112J190973r73413
15270A021650q6180Q80572j46030l48537j94469j46776O04395K8677k06531J54404
15260A561175m02407J289513m11610k196056J054731K44893j448864R8943O65713
15251D56031P02126K4594j236014n08951M12367k61058L0131J138564Q75940q33387
$$ plain form
15317 -307182 -509909 570343 586496 -298401 340683 1261750 1659415 1129475 1392945 1620038
15307 1620038 1575497 1176177 2144778 1919054 1224061 592622 -352429 -307531 -650246 508034
15297 508034 1695924 -137186 -414737 1030674 372268 -231742 31811 482194 -545701
15288 -545701 -1086606 606050 782576 147796 -51969 -776287 -1061771 -627243 68275
15279 68275 1267942 877933 488530 1263946 1603771 -163022 804090 1995063 1021650
15270 1021650 935470 1816042 1670012 1321475 1127006 980230 1584625 1613302 1406771 1561175
15260 1561175 1158768 2448281 2036671 -159385 895346 1140239 -308625 -209682 456031
15251 456031 1158157 1182751 -53263 -562214 -149847 -410905 -380774 757790 1633730 800343
15241H00343m78398j19853J9881o4293l0827K0701P551q88588P27990L19029J01450
15230D14986L74639M7903Q71964n32874q87883N27250P96308o8220K91865M84193
15220B320131l56542j569580o23462K95196J030732P33089J23047m02908O72498
15211B222201o15196r39967k86628O24552m44418k67917Q8065M99264m31975j18350
15201C29631q18759p14739J143133M38319O92826K53165l12511o86693q59197
15192e34825Q95691J674457j95782o78249q70435j407786R10229K283258K31988
15183B308546k48239M2270n71707j437079k71873N98203J282130J080982o6010
15174B717223m4101N2532j837046k157101J391333O52424M69898J312629r4399
$$ plain form
15241 800343 321945 202092 221973 157680 126853 147554 155105 -733483 -5493 313536 414986
15230 414986 789625 837528 1709492 1176618 288735 815985 1612293 1544073 1835938 2320131
15220 2320131 1963589 394009 -229453 65743 1096475 1829564 1952611 1549703 2222201
15211 2222201 1607005 667038 380410 1004962 560544 292627 380692 879956 447981 329631
15201 329631 -489128 -1203867 -60734 377585 1070411 1323576 1011065 324372 -534825
15192 -534825 360866 2035323 1839541 1161292 290857 -1116929 -206700 2076558 2308546
15183 2308546 2060307 2102577 1530870 93791 -178082 420121 1702251 2783233 2717223
15174 2717223 2673122 2725654 888608 -1268493 122840 775264 1245162 2557791 2463392
15165B463392j308879j174134j53346K86560N43699P24690r5563o08682j128988
15156d51251l18347J095498N55869P28830m51767j050035l72922J226995l28416
15147F34454L58530P06496N72468j4089n02795r2463r96680j361363J015213J213665
15137A533436R11835j37205k65971q77082l49879K03111Q0036R79826l96601L70783
15127B052289k34740p59952j398565L18896P76392n07107J28368j04203n95614
15118c24236J19693k40002R30697K095241j402962j069383J71344j95169p57162
15109f71939N8371J620988J038119P2546q72772j545218L60472M89407q10201
15100b60227K26368R17001O2777o17249J016608K00354m45952j215901q6697L2984
$$ plain form
15165 2463392 1154513 -19621 -172967 113593 657292 1381982 1286419 677737 -451251
15156 -451251 -769598 325900 881769 1610599 1158832 108797 -264125 962870 634454
15147 634454 992984 1699480 2271948 2257859 1755064 1662601 665921 -695442 319771 1533436
15137 1533436 2445271 2308066 2042095 1165013 815134 1018245 1098281 2078107 1681506 2052289
15127 2052289 1817549 1057597 -340968 -22072 754320 247213 375581 271378 -324236
15118 -324236 -204543 -444545 486152 2581393 1178431 109048 280392 85223 -671939
15109 -671939 -613568 1007420 2045539 2118085 1245313 -299905 60567 549974 -260227
15100 -260227 -33859 883142 945919 328670 1345278 1545632 1099680 -116221 -202918 -169934
15090a69934J819674N39301j218824K69092L64143j379546j90773m3039M18831
15081D08925L18549N32304p55787n72239K91655k68328K62787R40216O75698q30141
15071A003639j122247m44153J093716m848q69975J102221J07j055331n69620j19111
15061i85602Q67810P56494J32256p42588j25197j18562l31968O98242P60105N65877
15051A476867j194342n84369P22382l46330l92987M08133N56879L20368P42113
15042A708714q81045k25788n01777L88283P18132J321866n19645k70645o38090
15033A100005K7619L33828l61800k76795j59115j743877J278121R80721m56133
15024G22574r50594M81354k87381j107664J421178J162733k70307K01437m61881
$$ plain form
15090 -169934 1649740 2189041 970217 1239309 1603452 223906 33133 -9906 408925
15081 408925 727474 1259778 503991 -68248 223407 -44921 217866 1158082 1833780 1003639
15071 1003639 -118608 -562761 530955 526107 -343868 758353 758460 -296871 -866491 -985602
15061 -985602 -117792 638702 770958 28370 -96827 -215389 -547357 150885 910990 1476867
15051 1476867 282525 -301844 420538 74208 -318779 89354 646233 966601 1708714
15042 1708714 827669 601881 100104 488387 1206519 2528385 2008740 1738095 1100005
15033 1100005 1127624 1461452 1099652 822857 663742 -1080135 197986 1178707 722574
15024 722574 -228020 253334 -34047 -1141711 279467 1442200 1171893 1373330 911449
15015I11449j215099P09899N88658l42818P68719K43106m29314m69861j19176
15006F45563K92029l7813j11839k62046J190942K10074r77474M02028j12565M19080
14996A657979n20135L69604N28719o49529N5710K39645M65972r56326J096592
14987B288231m8619j209978m38438J154979Q26030n82831q45607Q99386j135883
14978I07270l47396L76830M82165o89344P47970J40888m14725o47757K70637j037451
14968b10913k51066J282688J01957N37913J51951n73192l0285j111631R2174J03846
14958I3442n90380J139019J273574o16376j162179N3407K14356k13260m10985
14949b19382O79057J230564r26370j97266M85499P23292j006073n94931N42877
$$ plain form
15015 911449 -303650 406249 994907 652089 1420808 1663914 1234600 764739 645563
15006 645563 937592 899779 787940 525894 1716836 1926910 949436 1351464 1238899 1657979
14996 1657979 1137844 1507448 2036167 1386638 1442348 1681993 2147965 1191639 2288231
14987 2288231 2239612 1029634 591196 1746175 2572205 1989374 1143767 2043153 907270
14978 907270 559874 936704 1418869 729525 1477495 1618383 1203658 555901 826538 -210913
14968 -210913 -461979 820709 922666 1460579 1612530 1039338 1009053 -102578 -10404 93442
14958 93442 -496938 642081 1915655 1299279 137100 190507 404863 191603 -219382
14949 -219382 459675 1690239 763869 566603 1052102 1775394 769321 174390 717267
14940G17267N82161M82754p16309n17035L29340L32403r55874p13342J8513K054799
14930A614677N37552j108132k71197n78991K07095R2775l246J222820j009615
14921G03738q33858P41414R71032l10601j73109o65845J02578O98222P03093q35329
14911A101335q15888J024494Q80730j002993n88980L93233L65373j000416q9307
14902B67581P40024N43598m25101k60019N95565k66559j887136P25415N54807
14893E88175P32176M23699k68147k200977N45122J081045J15458l22500r51074
14884b57023P02779K42046n15059P70289K42000j017895M00823J837387n64741
14875A840606j579834O29208l21976l65067L15749Q28617k19996n39600P45239
$$ plain form
14940 717267 1299428 1782182 1065873 548838 878178 1210581 254707 -458635 -440122 1614677
14930 1614677 2152229 1044097 772900 193909 401004 493779 490533 1713353 703738
14921 703738 -130120 611294 1582326 1271725 1098616 432771 535349 1233571 1936664 1101335
14911 1101335 285447 1309941 2190671 1187678 598698 991931 1357304 356888 267581
14902 267581 1007605 1551203 1126102 866083 1461648 1195089 -692047 33368 588175
14893 588175 1320351 1744050 1475903 -725074 -179952 901093 1016551 694051 -257023
14884 -257023 445756 687802 172743 943032 1185032 167137 567960 2405347 1840606
14875 1840606 260772 889980 568004 202937 518686 1347303 1127307 587707 1332946
14866A332946j05984j446503j25525N18682O49326K92258m40870l17658J74112
14857E30784O63105K34057m51734j995535j32735Q19231J094510N00552P4510
14848A336745M6657j315936m62368K69153P68374k43243K80914K16842N99293
14839A496431l11132j453607p11317J226509j60512R28684m92903n69800M21047
14830C73400K57323j386690O15027J472460j153756o61131J726693j11766M3591
14821A175151o87318r1632J001826j173314n93051N83683R15936L56953l26150
14812A162084l83527K5267q69782L88793J515227J76822j28097j20881J93257
14803A959163k45790q16426q64062Q59628R86704M39429q87186R363j01676j230361
$$ plain form
14866 1332946 1226962 -219541 -345066 173616 822942 1115200 674330 356672 530784
14857 530784 1193889 1427946 976212 -1019323 -1152058 -332827 761683 1262235 1336745
14848 1336745 1383402 67466 -394902 -125749 642625 399382 680296 897138 1496431
14839 1496431 1185299 -268308 -979625 246884 86372 1015056 522153 -47647 373400
14830 373400 630723 -755967 -140940 1331520 177764 -483367 1243326 1131560 1175151
14821 1175151 487833 396201 1398027 224713 -368338 215345 1131281 1488234 1162084
14812 1162084 778557 803824 -65958 322835 1838062 2014884 1886787 1765906 1959163
14803 1959163 1713373 896947 32885 892513 1879217 2318646 1431460 1440823 1339147 108786
14793A08786m57041O17465Q15043o85423N76376J239017o98758p79908M91592
14784A227149j71999j15101R07426K61721j170041M27774m14670Q491l02839N47078
14774A204989n18562l14322M80877o45286P22785m81677o91819J194032O4030
14765A015047K22383L22435r46356q67458J93728R71118p48444N7946L44035N734
14755E70168j91910j10536P69690q28535n51377R99328J246996k01469O58050
14746B360405J34415l96591k25372m22593K41724J216596q31070o55381N76414
14737A998547P7277p34449K30314K6707K98418j098298o45595J248781Q32695
14728B234397j41111l04721l16513j516906q1626j97192l00424O42663P64122
$$ plain form
14793 108786 -348255 269210 1084253 398830 975206 2214223 1515465 735557 1227149
14784 1227149 1055150 940049 1847475 2109196 939155 1366929 952259 960750 657911 1204989
14774 1204989 686427 372105 852982 207696 930481 448804 -243015 951017 1015047
14765 1015047 1237430 1559865 613509 -253949 -60221 910897 162453 220399 564434 570168
14755 570168 378258 267722 1037412 208877 -342500 656828 1903824 1702355 2360405
14746 2360405 2494820 2098229 1872857 1450264 1691988 2908584 2077514 1422133 1998547
14737 1998547 2075824 1341375 1571689 1598396 1896814 798516 152921 1401702 2234397
14728 2234397 2093286 1788565 1472052 -44854 -126480 -323672 -624096 18567 782689
14719G82689j220478R9262R51750j084710L597j16911J005110J075942L0733j51135
14709A375849J52084J91296q72867N58398p8362j142936J190980L31310J30802
14700A836554J9707o11378J95248j219680q0541P62454P36515m57775K93829N36632
14690B011565j127806M87971j37403j422235O38400L98587q13045l07353N64973
14681B93654l46078M87998l87058O7985O06354j244189j4100O98158J009207K28953
14671A400884k61826k53013l89587L56987j56475o69920O01026J485438q76878
14662A236636j249919r20183R66783K88973J85737K78938p31067J83366J16576
14653C55840J36614L84231r1767o16473L54332J105795k29505J46050j199354
$$ plain form
14719 782689 -437789 -338527 613223 -471487 -467890 -584801 420309 1496251 1526984 1375849
14709 1375849 1527933 1719229 846362 1404760 1326398 183462 1374442 1705752 1836554
14700 1836554 1856261 1244883 1440131 220451 139910 902364 1638879 1181104 1474933 2011565
14690 2011565 883759 1371730 1234327 -187908 450492 849079 36034 -271319 293654
14681 293654 -52424 435574 48516 116501 722855 -521334 -535434 162724 1171931 1400884
14671 1400884 1139058 886045 496458 853445 696970 27050 628076 2113514 1236636
14662 1236636 -13283 -933466 33317 322290 508027 786965 55898 239264 355840
14653 355840 492454 876685 784918 168445 522777 1628572 1399067 1545117 345763
14644C45763J63158Q64355j13614l47235p07050O66484N28807m39528l15874K87845
14634I33111k71475q36646J931840R05336j574994P43985r56058j212574Q29308
14625D91833O8513O8891K47271n13909l80051K52202j135841P36078O09006m04317
14615C9676O99592J97819M64544m43448Q05285k31259j093398q44629J217753
14606H11935J757520r98773j127598M11628K03299k51535N13563O13605L05161
14597B238805q83549k50118J038333l74958m30267r22177N21067R69172k62897
14588A643411j530791j082990M69240J432353l71381l42941J123736m82443r41096
14579h2902P0171P56935R91887j027460o34710J04761N36012l23387J9363J159477
$$ plain form
14644 345763 508921 1373276 1259662 912427 205377 871861 1400668 961140 645266 933111
14634 933111 661636 -175010 1756830 2662166 1087172 1831157 875099 -337475 491833
14625 491833 560346 629237 876508 362599 -17452 234750 -901091 -165013 443993 39676
14615 39676 739268 937087 1401631 958183 1763468 1532209 438811 -405818 811935
14606 811935 2569455 1570682 443084 854712 1058011 806476 1320039 1933644 2238805
14597 2238805 1355256 1105138 2143471 1768513 1338246 416069 937136 1906308 1643411
14588 1643411 112620 -970370 -501130 931223 559842 216901 1340637 858194 -82902
14579 -82902 -12731 744204 1736091 708631 73921 178682 714694 391307 410670 1570147
14569A570147l21105j001920N83548r42901J45327J172924O58361L76270m50632
14560A790019k04563r02021l72637n84207J286151P25291P21906M84602j353324
14551A591217K26688j062709o81053R50748J424763q87459p31773J115698j607936
14542C38184N63257M36458k006743L13757R48139l86136O3191R9619j45701k11757
14532A2268M41421P43810o95381k81290L82824N3632j75888k18668M7669P77347
14522A087744O27032j688616L18396J56307o32787j2752J669381Q12729q92732
14513A444702j40151K9493L50079n40533M33586k51526p33797O30843N404q17110
14503D10990M17276M13520q17854L69060N68053j84269m97708k60420n5534N36545
$$ plain form
14569 1570147 1249042 247122 830670 -112231 33096 1206020 1864381 2240651 1790019
14560 1790019 1585456 683435 310798 -273409 1012742 1738033 2459939 2944541 1591217
14551 1591217 1817905 755196 74143 1024891 2449654 1562195 830422 1946120 338184
14542 338184 901441 1337899 -668844 -355087 593052 206916 270107 369726 224025 12268
14532 12268 453689 1197499 502118 220828 603652 657284 481396 262728 310397 1087744
14522 1087744 1714776 26160 344556 500863 -131924 -144676 1524705 2337434 1444702
14513 1444702 1304551 1334044 1684123 1143590 1577176 1325650 591853 1222696 1228100 410990
14503 410990 828266 1241786 423932 792992 1361045 1176776 679068 418648 363114 899659
14493H99659k08323j35964N24457j90225n3551n68680q1801O39150k23122N37723
14483A139323N00305J8293r56796J131117n48747L02810O57906o51066O03173
14474B196318M1385k44319o62925p1848J011566N96217j352021n44313Q80871
14465A850931L16899j096890N57856q980j093424R2264J04902J166689m9225j256862
14455E84160k39790J530278l36785n44177N06616j829829k66318M42043Q5051
14446f8751J513725k66839l88475j375144P07155J72321P72775p42790o93806
14437c69829R22620L29442L19213L49838o02680j629392M91030L20081M5064M24335
14427E99722o45888m84096O79286l65186L43023P25279k94342o10525K33586l06400
$$ plain form
14493 899659 691336 555372 1079829 889604 836053 267373 185572 824722 601600 1139323
14483 1139323 1639628 1657921 701125 1832242 1283495 1586305 2244211 1593145 2196318
14474 2196318 2237703 1993384 1330459 1258611 2270177 2866394 1514373 970060 1850931
14465 1850931 2167830 1070940 1628796 1619816 526392 618656 723558 1890247 1841022 584160
14455 584160 344370 1874648 1537863 993686 1500302 -329527 -595845 -153802 -68751
14446 -68751 1444974 1178135 789660 -585484 121671 293992 1066767 323977 -369829
14437 -369829 552791 882233 1201446 1551284 948604 -680788 -189758 130323 175387 599722
14427 599722 -46166 -530262 149024 -216162 126861 852140 557798 -52727 180859 -125541
14417a25541M88506R00423p99453j55275j95288j057769N79024l64032Q4727N02527
14407a42151N9121K93668j85743l23946j10731l54799K20846J389964P17799q51373
14397G12655K16643l13384q47124J36321J462053j112373P64449k65340K07517
14388I61417p0439J159536j403554J20734R11777L52585Q97858j655500k81816
14379I92598J056074P17570q61435m79962Q36925j616084l51298r481L67476P11525
14369A363908m95560M38584N43139r52875j078459K04686J90841J520564j00546
14360A634282k100801J044172J240337j96031n08377l29505J79497k89685m17276
14351B56613J097663Q14305m83728o66064M9867l58452M14321l63873k61617J821814
$$ plain form
14417 -125541 362965 1263388 463935 308660 113372 -944397 -365373 -729405 -644678 -142151
14407 -142151 -83030 210638 24895 -299051 -409782 -764581 -543735 846229 1564028 712655
14397 712655 929298 615914 -231210 -94889 1367164 254791 1019240 753900 961417
14388 961417 890978 2050514 646960 767694 1679471 2032056 2929914 1274414 992598
14379 992598 2048672 2766242 1904807 1424845 2261770 645686 294388 284907 652383 1363908
14369 1363908 868348 1306932 1850071 897196 -181263 23423 214264 1734828 1634282
14360 1634282 -466519 577653 1817990 1621959 1113582 784077 963574 673889 256613
14351 256613 1354276 2168581 1684853 1018789 1068656 710204 1124525 760652 499035 2320849
14341B320849p28594k98740o4921m294r98392N29795o48124L19658M01181k98584
14331E29834j08128l26681m02359q5584K07274Q33485P6807n11784j026407J475683
14321F62140P10350Q02155j183092m52817r52522L10379O66619R00738J257169
14312B721119j964987m12279R14495p4826j202697p4966J414196k50930Q40019
14303A909144n02976j031094K02140J131571j68804j43860n16957n13729o8774
14294B96661N63099O52726l61184n40110N14182J169684k20455o34544o10215
14285H29844M92185q9378M57407Q18043k94636p68513o04335l8281K38576m64214
14275E76698n98775R16910L14414j019077K12759l84942J336980k3082r77931
$$ plain form
14341 2320849 1592255 1293515 1228594 1224300 225908 755703 107579 427237 828418 529834
14331 529834 421706 95025 -307334 -392918 -185644 647841 724648 212864 -813543 662140
14321 662140 1372490 2174645 991553 538736 -413786 -103407 563212 1463950 2721119
14312 2721119 756132 343853 1258348 1183522 -19175 -94141 1320055 1069125 1909144
14303 1909144 1406168 375074 577214 1708785 1539981 1396121 879164 365435 296661
14294 296661 859760 1512486 1151302 611192 1125374 2295058 2074603 1440059 829844
14285 829844 1322029 1232651 1690058 2508101 2213465 1444952 840617 802336 1040912 576698
14275 576698 -22077 894833 1209247 190170 402929 17987 1354967 1331885 353954
14266C53954Q81621N21922k7450j13667m60511l39518O83817R5579L8843J363746
14256B998336m10507k146214j86698Q97594R42878N00803j937693j42919P08373
14247A223953K73831j016333R37060L14259q16407J70940K1915m66492r88150
14238c45424j87158N87059N38684l34021m94909M01785p90456N40633P74710j674314
14228i83411j86747K406417o78788l59436J320162o361K4573K40392l39188m39384
14218I98229m86006r56820O45514R02660j92311J041629m2457q30699n48970m11674
14208A19095R8746J273387P34927l03435l61330o07854J34542k21756L04466o91150
14198D79638j25772j23657r33098Q57123J771871j528956j61758K263220k74041
$$ plain form
14266 353954 1235575 1757497 1730047 1616380 1155869 816351 1500168 1595747 1634590 2998336
14256 2998336 2587829 441615 254917 1152511 2095389 2596192 658499 515580 1223953
14247 1223953 1497784 481451 1418511 1732770 916363 1087303 1109218 642726 -345424
14238 -345424 -532582 54477 593161 259140 -235769 166016 -624440 -83807 690903 -983411
14228 -983411 -1170158 1236259 557471 198035 1518197 1511836 1536409 1776801 1437613 998229
14218 998229 512223 -444597 200917 1103577 911266 1952895 1910438 1079739 530769 119095
14208 119095 217841 1491228 2226155 1922720 1561390 953536 1088078 866322 1170788 479638
14198 479638 353866 230209 -702889 154234 1926105 397149 235391 2498611 2224570
14189B224570r68994m91148k49743m7040Q65065O47439M94335j088127l73290
14180A013067k18138j148340J315836J64157j173034N55243N78971J07193o76906
14171E18049L3580o85647J556215q29701j475339J978536P98216j016691n49745
14162C27473N1887q05475J60027R322P52784k06561k68111J97735J74761J058011
14152A451853J11896r55853m63975J043177Q69857p16775o61796J295367Q88626
14143B862377r31406n83424j09940p51199n02287j44443R33158J393548j681084
14134D85300p82639J440831j247459m29460J376887k34781M27039P55157j510713
14125B80162k09929J842748r61787N92255P65192j342780j286684N57659M5692
$$ plain form
14189 2224570 1255576 764428 514685 467645 1332710 1980149 2474484 1386357 1013067
14180 1013067 794929 -353411 962425 1126582 -46452 508791 1087762 1194955 518049
14171 518049 551629 -134018 1422197 592496 -882843 1095693 1893909 877218 327473
14162 327473 379360 -426115 -266088 -256766 496018 289457 21346 219081 393842 1451853
14152 1451853 1563749 607896 143921 1187098 2056955 1340180 678384 1973751 2862377
14143 2862377 1930971 1347547 1237607 486408 -15879 -160322 772836 2166384 485300
14134 485300 -297339 1143492 -103967 -533427 843460 608679 1035718 1790875 280162
14125 280162 70233 1912981 951194 1543449 2308641 965861 -320823 236836 282528
14116B82528J475774M64932j335886m20090J363676j96682j505456R67939J76965
14107A273700K486j56044L08541M63550j944021j86857O77785J6678J08125P12987
14097A276930n22874m03988n9261J39210k00473Q94974J460152k43021n78491
14088A763158p43386L0021P17708k06143J97241n3543p18640L93462L88107r62769
14078H05216Q93599M39605o86039L84854N38914o81572n98515k5046N00370J395216
14068B966602q41192q55259P47150n95335j526371R09410O47928j066074N75006
14059I61865k88529J93037Q39211k80420K30754o0379L03118m75283r09810k75925
14049B37639J849287O13879j543181j33068K78442j727668K34934R21202m98948
$$ plain form
14116 282528 1758302 2223234 887348 467258 1830934 1634252 128796 1096735 1273700
14107 1273700 1276186 1120142 1428683 1892233 -51788 -238645 439140 455818 563943 1276930
14097 1276930 754056 350068 290807 430017 229544 1124518 2584670 2341649 1763158
14088 1763158 1019772 1049793 1767501 1561358 1758599 1705056 986416 1379878 1767985 805216
14078 805216 1698815 2138420 1452381 1837235 2376149 1694577 1096062 1071016 1571386 2966602
14068 2966602 2125410 1270151 2017301 1421966 -104405 805005 1452933 386859 961865
14059 961865 673336 866373 1705584 1425164 1655918 1595539 1898657 1423374 513564 237639
14049 237639 2086926 2700805 1157624 1024556 1302998 -424670 -189736 731466 232518
14040B32518l35410o99483n48965J276166K1450p79003P30083P05806p61375n77374
14030g35587O92770J403141J98658K80774r55122k13057K03714L47896n62697
14021F60490N56142J603788j803615j001330J025907L78807j061353l4267P00733
14012A025302K10664P35699j529652K46748K41010l17482l82405J35941O66430
14003A032255p96897m74542N47052N81574J28835k62123j137480L50222R61831
13994I30727l89371K24069L54475J25386m4854k43098K47703K10210q9623N32849
13984A858473P1264j085066p84360J528775M77555q29555O18023m67808l02925
13975A084376k09391p4327P16768M14308j267593k71568Q50502l05011o36897
$$ plain form
14040 232518 -102892 -802375 -1351340 -75174 -53724 -832727 -102644 603162 -158213 -735587
14030 -735587 -42817 1360324 1558982 1839756 884634 671577 875291 1223187 660490
14021 660490 1216632 2820420 1016805 15475 1041382 1420189 358836 324569 1025302
14012 1025302 1235966 1971665 442013 688761 929771 612289 229884 365825 1032255
14003 1032255 235358 -239184 307868 889442 1018277 756154 -381326 -31104 930727
13994 930727 541356 765425 1119900 1245286 1200432 957334 1205037 1415247 1325624 1858473
13984 1858473 1929737 844671 60311 1589086 2066641 1237086 1855109 1387301 1084376
13975 1084376 874985 800658 1517426 1931734 664141 392573 1243075 938064 301167
13966C01167l1304R47849L96449r13250r18772M64723P95474m05672P53344K10975
13956A600983M9851m03367r56398n15747N72422M73295m69707O84104L01737j156681
13946A80492q65075o79918R53220J20543R69211j55267n16860K71266N26935k57668
13936E46879n33454N94359O55182M3726m22554P8407N82065l52966k90446J50214
13926A051412P3275p50289r09182M80849J57838Q05224K06395q76233J50322P0827
13916D60438n71861q33545J970123P12088j058190R797J48249q5237K13143Q43318
13906A808323K58582o78509r06814j48258J406540j61885L14693N15765l05907
13897B102530j63247m14831K09233K41116j28715L95665M73999o63964N15210
$$ plain form
13966 301167 269863 1217712 1614161 700911 -217861 246862 1042336 636664 1390008 1600983
13956 1600983 1650834 1247467 291069 -224678 347744 821039 351332 1035436 1337173 180492
13946 180492 -684583 -1364501 -411281 -290738 678473 523206 6346 277612 804547 546879
13936 546879 13425 607784 1262966 1306692 884138 962545 1544610 1191644 901198 1051412
13926 1051412 1124687 374398 -534784 -53935 103903 909127 1115522 239289 389611 460438
13916 460438 -111423 -944968 1025155 1737243 679053 688850 837099 751862 965005 1808323
13906 1808323 2066905 1388396 481582 333324 1739864 1577979 1892672 2408437 2102530
13897 2102530 1939283 1524452 1733685 1974801 1846086 2241751 2715750 2051786 2566996
13888B566996k90657j342025Q31896J595208j313972o15898j26711o90032M14203
13879A029008J092609j19400M23869j40828q31641j191807P00965K76321q3531
13870A155565p99591N68524J101186j204120k49171M25809M53146o11118j921767
13861a081537k58894J681539R8015q87171J644961J029642j100083r04250m52970
13852b30748l5485K00603p77611J125192J401984k60639j740015J224331k47546
$$ plain form
13888 2566996 2276339 934314 1766210 3361418 2047446 1431548 1304837 614805 1029008
13879 1029008 2121617 2002217 2426086 2285258 1453617 261810 962775 1239096 1155565
13870 1155565 355974 924498 2025684 821564 572393 998202 1451348 840230 -1081537
13861 -1081537 -1340431 341108 439123 -448048 1196913 2226555 1126472 222222 -230748
13852 -230748 -266233 -65630 -843241 281951 1683935 1423296 -316719 907612 660066
$$ [...]
##END NTUPLES=NMR SPECTRUM
##END=
