##TITLE=1H_DE-80H_X3
 200.13MHz, d2o
 8 sc
 
 19ns.26.2.2025
##JCAMPDX= 6.0         $$ Bruker NMR JCAMP-DX V2.0
##DATA TYPE= NMR SPECTRUM
##DATA CLASS= NTUPLES
##ORIGIN= UXNMR, Bruker Analytische Messtechnik GmbH
##OWNER= pz
$$ XWIN-NMR		Version 3.5
$$ Wed Apr 22 10:21:33 2026 Russian Standard Time (UT+4h)  Yarkov@DPX200
##.OBSERVE FREQUENCY= 200.1313
##.OBSERVE NUCLEUS= ^1H
##.ACQUISITION MODE= SIMULTANEOUS
##.ACQUISITION SCHEME= undefined
##.AVERAGES= 8
##.DIGITISER RES= 18
##SPECTROMETER/DATA SYSTEM= spect
##.PULSE SEQUENCE= zg30
##.SOLVENT NAME= DMSO
##.SHIFT REFERENCE= (INTERNAL, DMSO, 0, 15.4637)
##AUDIT TRAIL= $$ (NUMBER, WHEN, WHO, WHERE, WHAT)
$$ ##TITLE= Audit trail, XWIN-NMR		Version 3.5
$$ ##JCAMPDX= 5.01
$$ ##ORIGIN= Bruker BioSpin GmbH
$$ ##OWNER= Yarkov
$$ C:/Bruker/XWIN-NMR/data/yarkov2/nmr/H-C/1/pdata/1/auditp.txt
$$ ##AUDIT TRAIL=  $$ (NUMBER, WHEN, WHO, WHERE, WHAT)
(   1,<2026-04-22 10:20:23.56 +0400>,<Yarkov>,<DPX200>,
      <created by zg, POWCHK disabled, PULCHK disabled
       configuration hash MD5:
       00 E9 B6 7A A2 85 ED C7 34 08 36 98 17 FE 4E 26
       data hash MD5: 16K
       9E BA 8B 75 C0 42 34 64 A2 35 B3 24 DC B6 E2 51>)
(   2,<2026-04-22 10:20:57.89 +0400>,<Yarkov>,<DPX200>,
      <Start of raw data processing
       efp BC_mod = 2 LB = 0.25 FT_mod = 6 PKNL = 1 PHC0 = -5302.316 PHC1 = 11.42193 SI = 16K 
       data hash MD5: 16K
       8F B2 62 F0 1F 9C BF 7E 2F 02 8A 3E 1A 1B FD F6>)
$$ ##END=
$$ 
$$ hash MD5
$$ A7 1D CB 7F 46 E8 00 26 1B D1 B6 C8 F0 B6 79 9B
##$RELAX= 
##$RELAX= 
##$RELAX= 
##$RELAX= 
##$RELAX= 
##$RELAX= 
$$ Bruker specific parameters
$$ --------------------------
##$DU= <C:/Bruker/XWIN-NMR>
##$EXPNO= 1
##$NAME= <H-C>
##$PROCNO= 1
##$TYPE= <nmr>
##$USER= <yarkov2>
##$AMP= (0..31)
100 100 100 100 100 100 100 100 100 100 100 100 100 100 100 100 100 100 
100 100 100 100 100 100 100 100 100 100 100 100 100 100 
##$AQSEQ= 0
##$AQ_mod= 1
##$AUNM= <au_zg>
##$AUTOPOS= <>
##$BF1= 200.13
##$BF2= 200.13
##$BF3= 200.13
##$BF4= 200.13
##$BF5= 200.13
##$BF6= 200.13
##$BF7= 200.13
##$BF8= 200.13
##$BYTORDA= 1
##$CFDGTYP= 0
##$CFRGTYP= 5
##$CHEMSTR= <none>
##$CNST= (0..31)
1 1 145 1 1 1 1 1 1 1 1 1 1 1 1 1 1 1 1 1 1 1 1 1 1 1 1 1 1 1 1 1 
##$CPDPRG= <>
##$CPDPRG1= <>
##$CPDPRG2= <>
##$CPDPRG3= <>
##$CPDPRG4= <mlev>
##$CPDPRG5= <mlev>
##$CPDPRG6= <mlev>
##$CPDPRG7= <mlev>
##$CPDPRG8= <mlev>
##$CPDPRGB= <>
##$CPDPRGT= <>
##$D= (0..31)
0 0.7 0 0 0 0 0 0 0 0 0 0.03 0 0 0 0 0 0 0 0 0 0 0 0 0 0 0 0 0 0 0 0 
##$DATE= 1776838823
##$DBL= (0..7)
120 120 120 120 120 120 120 120 
##$DBP= (0..7)
150 150 150 150 150 150 150 150 
##$DBP07= 0
##$DBPNAM0= <>
##$DBPNAM1= <>
##$DBPNAM2= <>
##$DBPNAM3= <>
##$DBPNAM4= <>
##$DBPNAM5= <>
##$DBPNAM6= <>
##$DBPNAM7= <>
##$DBPOAL= (0..7)
0.5 0.5 0.5 0.5 0.5 0.5 0.5 0.5 
##$DBPOFFS= (0..7)
0 0 0 0 0 0 0 0 
##$DE= 6
##$DECBNUC= <off>
##$DECIM= 32
##$DECNUC= <off>
##$DECSTAT= 4
##$DIGMOD= 1
##$DIGTYP= 9
##$DL= (0..7)
0 120 120 120 120 120 120 120 
##$DP= (0..7)
$$ [...]
##$SUBNAM2= <"">
##$SUBNAM3= <"">
##$SUBNAM4= <"">
##$SUBNAM5= <"">
##$SUBNAM6= <"">
##$SUBNAM7= <"">
##$SUBNAM8= <"">
##$SUBNAM9= <"">
##$SW= 18.0517328524113
##$SWIBOX= (0..15)
0 0 2 0 0 0 0 0 0 0 0 0 0 0 0 0 
##$SW_h= 3612.71676300578
##$TD= 16384
##$TD0= 1
##$TE= 0
##$TE2= 300
##$TE3= 300
##$TEG= 300
##$TL= (0..7)
0 120 120 120 120 120 120 120 
##$TP= (0..7)
150 150 150 150 150 150 150 150 
##$TP07= 0
##$TPNAME0= <>
##$TPNAME1= <>
##$TPNAME2= <>
##$TPNAME3= <>
##$TPNAME4= <>
##$TPNAME5= <>
##$TPNAME6= <>
##$TPNAME7= <>
##$TPOAL= (0..7)
0.5 0.5 0.5 0.5 0.5 0.5 0.5 0.5 
##$TPOFFS= (0..7)
0 0 0 0 0 0 0 0 
##$TUNHIN= 0
##$TUNHOUT= 0
##$TUNXOUT= 0
##$USERA1= <user>
##$USERA2= <user>
##$USERA3= <user>
##$USERA4= <user>
##$USERA5= <user>
##$V9= 5
##$VALIST= <valist>
##$VCLIST= <CCCCCCCCCCCCCCC>
##$VD= 0
##$VDLIST= <DDDDDDDDDDDDDDD>
##$VPLIST= <PPPPPPPPPPPPPPP>
##$VTLIST= <TTTTTTTTTTTTTTT>
##$WBST= 1024
##$WBSW= 4
##$XGAIN= (0..3)
0 0 0 0 
##$XL= 0
##$YL= 0
##$YMAX_a= 462878
##$YMIN_a= -571929
##$ZGOPTNS= <>
##$ZL1= 120
##$ZL2= 120
##$ZL3= 120
##$ZL4= 120
##$ABSF1= 0
##$ABSF2= 0
##$ABSG= 0
##$ABSL= 0
##$ALPHA= 0
##$AQORDER= 0
##$ASSFAC= 0
##$ASSFACI= 0
##$ASSFACX= 0
##$ASSWID= 0
##$AUNMP= <proc_1d>
##$AZFE= 0.1
##$AZFW= 0.1
##$BCFW= 0
##$BC_mod= 2
##$BYTORDP= 0
##$COROFFS= 0
##$CY= -3
##$DATMOD= 1
##$DC= 0
##$DFILT= <>
##$DTYPP= 0
##$F1P= 0
##$F2P= 0
##$FCOR= 1
##$FTSIZE= 16384
##$FT_mod= 6
##$GAMMA= 0
##$GB= 0
##$INTBC= 1
##$INTSCL= 3.241238e-09
##$ISEN= 128
##$LB= 0.25
##$LEV0= 0
##$LPBIN= 0
##$MAXI= 10000
##$MC2= 0
##$MEAN= 0
##$ME_mod= 0
##$MI= 1.114404
##$NCOEF= 0
##$NC_proc= -6
##$NLEV= 6
##$NOISF1= 3.799351
##$NOISF2= 2.8
##$NSP= 0
##$NTH_PI= 0
##$NZP= 0
##$OFFSET= 15.46373
##$PC= 1
##$PHC0= -5302.316
##$PHC1= 11.42193
##$PH_mod= 1
##$PKNL= yes
##$PPARMOD= 0
##$PSCAL= 0
##$PSIGN= 0
##$REVERSE= no
##$SF= 200.130011601975
##$SI= 16384
##$SIGF1= 3
##$SIGF2= 2
##$SINO= 0.751879
##$SIOLD= 32768
##$SREGLST= <19F.Aceton>
##$SSB= 0
##$STSI= 16384
##$STSR= 0
##$SW_p= 3612.71676300578
##$SYMM= 0
##$S_DEV= 0
##$TDeff= 16384
##$TDoff= 0
##$TI= <>
##$TILT= no
##$TM1= 0
##$TM2= 0
##$TOPLEV= 0
##$USERP1= <user>
##$USERP2= <user>
##$USERP3= <user>
##$USERP4= <user>
##$USERP5= <user>
##$WDW= 1
##$XDIM= 16384
##$YMAX_p= 400678658
##$YMIN_p= -2294115
$$ End of Bruker specific parameters
$$ ---------------------------------
##NTUPLES= NMR SPECTRUM
##VAR_NAME=  FREQUENCY,     SPECTRUM/REAL,   SPECTRUM/IMAG
##SYMBOL=    X,             R,               I
##VAR_TYPE=  INDEPENDENT,   DEPENDENT,       DEPENDENT
##VAR_FORM=  AFFN,          ASDF,            ASDF
##VAR_DIM=   16384,         16384,           16384
##UNITS=     HZ,            ARBITRARY UNITS, ARBITRARY UNITS
##FACTOR=    0.220516191357247, 1,           1
##FIRST=     3094.75643597109, 0,            0
##LAST=      -517.960327034693, 0,           0
##MIN=       -517.960327034693, -2294115,    0
##MAX=       3094.75643597109, 400678658,    0
$$ Real data points
##PAGE= N=1
##DATA TABLE= (X++(R..R)), XYDATA
$$ [...]
14184 37372 -127991 -28596 -27788 -303827 -254675 -104875 137540 -11652 63614 25838 -96874
14173 -96874 7346 -177208 -259157 126193 -81514 -551596 -481132 -162203 223459 -18661
14163 -18661 -29802 34214 49488 181763 -307656 -346823 -18640 -50647 -246734 -278245 -408608
14152 -408608 -584410 -403228 9255 155320 10669 -162340 -120213 48494 -251076 -354857
14142 -354857 -131745 -264472 -329433 -171840 -305489 -8212 -85778 -495740 -289348 22465
14132 22465 -367923 -184442 -521621 -557206 -512614 -170025 -424559 -278644 60194 -331358
14122 -331358 -190304 -397953 -360976 -473529 -226946 -417059 -104865 -142981 -335967 -205690
14112 -205690 -216889 30538 51474 -42627 -222301 -254640 -94946 -165329 -152057 -195891 -4154
14101 -4154 230037 33462 -335297 -205120 -219463 -161813 -148008 -172759 -336132 -93676 -270931
14090 -270931 -263582 19531 88680 -163661 27258 279433 101187 280863 -164167 -343175
14080 -343175 -442838 -1870 -7377 -356845 -138495 121063 120674 235016 130645 -95771 -75314
14069 -75314 266757 -68133 -221294 -3453 -425425 -421401 -180883 -91928 24376 -151553
14059 -151553 182301 91473 35160 65999 -135362 -218549 -171361 -284866 -24780 -65689 -304528
14048 -304528 -553746 -71132 -172932 -105528 73536 34374 36785 243014 -131626 -376314
14038 -376314 -361001 -203079 -73635 -349731 -3653 -302171 5072 103547 -182466 -82532
14028 -82532 -3650 52503 -126306 -41316 -46699 -600058 -333911 -582264 -530943 -305631 -173057
14017 -173057 -140685 -196561 -402669 -107424 -218192 -293745 -313875 -131620 3160 -249732
14007 -249732 -617076 -620366 -394216 -28154 -194558 -195358 -6441 -189515 -99514 -440782 -509601
13996 -509601 -467600 -343216 -765416 -635901 -358603 -473187 -549670 -470650 -570069 -262905
13986 -262905 -29773 -381743 -349346 -357968 -540448 -613702 -470245 -287018 18840 -76838
13976 -76838 -56170 26529 -122203 -382874 -11123 304990 53662 -22697 -121740 -204030 -217257
13965 -217257 -368865 -256946 -283946 111407 -54173 -194542 -9419 35319 -15130 -169969
13955 -169969 -400298 26170 18356 58340 -335821 -402750 -41894 -121174 -276802 -371893 197444
13944 197444 109558 -89204 -399154 -151400 -310263 -239647 -178733 35387 -91044 -409776
13934 -409776 -482387 -176547 -269010 -152858 -477357 -200657 -891 -158273 -237781 -207258
13924 -207258 97647 117386 -290474 -273462 69859 -182104 -288156 -394413 -203315 -29755
13914 -29755 -325861 -489709 -377159 22096 127899 -609357 -228756 -175605 75885 45647
13904 45647 -208260 -81147 -179067 -97612 -290873 19826 44635 -257025 -392816 -24802
13894 -24802 115737 -18801 -207870 -258398 -5437 -133108 -173510 -249409 -485579 -94742
13884 -94742 -295187 -548364 -529782 -689019 -605146 -472002 -468186 -309116 -198306 22069
13874 22069 -241682 -275005 -272835 -521456 -511951 -571604 -642351 -564352 -301170 -467631 -497209
13863 -497209 -442543 -123800 -310596 -155351 -297822 -463489 -384371 -580722 -706907 -468395
13853 -468395 -655428 -532558 -132755 -213743 -656143 -501634 43333 -65006 -203701 -380529
13843 -380529 -345210 -188389 -211645 -574129 -641198 -328928 -421211 -577633 -358160 -86720
13833 -86720 -312812 -503077 -390701 -369487 -141749 -160192 -151304 -128749 -314578 147098 -51955
13822 -51955 175803 7635 -142720 -211283 -28922 -262022 -437257 -184920 -82301 23813
13812 23813 -109448 -100587 -322240 -255921 -371555 -438352 -424993 -229302 -354879 -487898 -759939
13801 -759939 -487090 -315899 -363881 -386455 -23301 104153 91719 208580 -6641 33026
13791 33026 -276982 -321822 -219741 -332319 -261024 -319462 -267682 -214389 -49015 -52672 -59880
13780 -59880 276163 -114071 -487720 -263700 -459517 -574361 -378878 -362819 -473980 -90691
13770 -90691 -151923 -23951 23923 95210 -182244 -213189 218783 34625 -62232 -122645 171914
13759 171914 285729 -196812 -619212 -297849 -237058 -182530 -182865 -365674 -165417 -259581 -284828
13748 -284828 -270844 179280 204783 -269583 -107468 66914 -249101 -306964 -519304 -561430
13738 -561430 -308356 -150163 -39852 58089 -92403 -100908 -264396 -289990 -278341 -375864 -220367
13727 -220367 -621862 -563861 -682786 -575080 -556072 -526686 -122668 -68971 -201596 -478424
13717 -478424 -561053 -432429 -297503 -530214 -227170 -45287 -340715 -118436 -97556 -64449
13707 -64449 -259669 -147319 -312825 -284550 -488519 -537520 -319096 -270151 -148161 -539022
13697 -539022 -365950 13060 254088 13905 -378592 -176248 -247584 -252019 -174944 -151363
13687 -151363 -11464 -290433 -424576 45496 318943 258730 -118886 16980 313977 -159280
13677 -159280 -197243 114488 191321 86574 -224729 -198781 35144 -12320 -169352 -282474
13667 -282474 240100 218397 -125377 -167347 -54656 356170 235439 211738 135389 119068
13657 119068 255131 134282 32311 -43634 -6924 -31982 141245 -37411 -127342 232694
13647 232694 45479 -111854 161467 -82271 278834 414436 162532 -127640 -214934 -159351
13637 -159351 -169102 85838 -81341 -70141 47458 73836 1774 172019 77218 176588 -160258
13626 -160258 -220023 -62930 -256562 -333594 -550507 -440128 -198245 -353918 -453897 -897456
13616 -897456 -405055 -398202 -371073 -527139 -442846 -250046 -359879 -378472 -211561 -88068
13606 -88068 -155941 -318320 -283201 -341707 -271982 -82979 -199856 -150188 -332986 -273109 -122944
13595 -122944 8080 -190814 -281715 -143265 -16599 -423762 -350123 -508928 -301506 -410333
13585 -410333 -457248 -28473 124209 84899 128892 -102062 -14171 -177889 -92316 -244005
13575 -244005 -100227 143887 21567 -275455 21265 -125315 -434874 -331244 -48466 57513
13565 57513 -229165 -461565 -755084 -492991 -41833 -404259 -153087 -289969 -46710 -149208
13555 -149208 8396 -391916 26656 -17632 -32188 70294 -273247 -138632 -227099 -35081
13545 -35081 -393092 -456318 96151 -13183 -140285 129992 -108948 -105893 -323511 -147616
13535 -147616 -582601 -50587 -230632 -329506 -406405 241303 -189168 101637 77315 149963
13525 149963 56671 57147 -73407 -40152 91485 141615 -6413 -30382 -132240 -59801 21107
13514 21107 31353 63762 -92890 -410286 -509575 27413 -148889 231302 -10441 -204978
13504 -204978 -267569 -118082 168051 265960 96144 -170735 -331246 100363 -129230 -260857
13494 -260857 -183383 -155166 -642 360257 2496 46192 75577 87429 -320252 -478959
13484 -478959 -410045 -436683 162875 -127964 -345677 -119574 19329 -268757 187187 468916
13474 468916 232536 -107770 63086 -441133 -356017 -123555 85471 192923 463660 2447
13464 2447 -438360 181740 282810 46211 4860 77086 -292083 -265892 -330954 -465262 -317181
13453 -317181 -244002 -483823 -131238 239165 403492 233796 75113 -107838 -294352 -237242
13443 -237242 90342 -126268 -311148 -525848 -474090 -414519 -250152 -157864 5655 534696
13433 534696 -25745 -500787 -473453 -643756 -581951 -512770 -560537 -580009 -367384 -222461
13423 -222461 -102811 51923 113194 -318788 -367693 -236142 -332948 -581123 -300620 11155
13413 11155 -141365 -411776 -460369 -300808 -49911 115626 -134991 -355348 -454346 -432291
13403 -432291 -485205 -345822 -631490 -670225 -74503 361252 -15423 -65369 -27354 -112230
13393 -112230 -249749 -305403 -408584 -7532 -11235 -454079 -328835 -96113 -127422 -137529
13383 -137529 -212752 10890 -54600 -608340 -688620 -714095 -413799 -494600 -57088 74619
13373 74619 308523 -176696 -302452 37231 -233833 -637396 -723394 -88581 -101746 -295474
13363 -295474 -401181 -203731 261710 -73022 -138729 -10001 229026 -181276 -229913 -413807
13353 -413807 -229882 -291690 -613584 -162742 13743 -149279 -516053 18141 358388 413867
13343 413867 120318 148149 274810 154460 -545747 -487831 -222511 -298804 -498014 -413158
13333 -413158 -166301 -107677 -155813 -233146 -37408 -4673 -304293 -477060 -191569 -407603
13323 -407603 -518941 -497785 -370099 -162000 -274652 -326032 -292099 65231 -231169 -263644
13313 -263644 -211026 -34015 -37195 -525500 -586950 -408514 -498648 -818810 -581453 -262439
13303 -262439 -276260 -336188 -239505 -242254 -314745 -430207 -680334 -565378 -349016 -376300 -297710
13292 -297710 -320831 118083 -160086 -332296 -169662 -140281 -118535 -206781 -282394 -284892 -42444
13281 -42444 -396598 -242269 -21100 -95418 -325620 -163575 16585 -174508 -277097 -173483
13271 -173483 -118103 167409 21915 -156006 -146200 -6024 -328490 -343891 -192406 75332
13261 75332 262450 129434 71788 127121 182575 -201557 -227928 109973 80305 81551 -401187
13250 -401187 -149180 -202249 -200874 -287199 -168944 -349863 -205861 86472 -103870 283975
13240 283975 214492 68209 -28515 81745 -131842 -272301 -152197 -179680 -28969 76210
13230 76210 -140033 -43205 83700 158853 -217873 -124104 -246378 -173055 -122241 30483 -297145
13219 -297145 -64594 7455 -251185 -213925 -12979 -170257 -277699 -137437 -229689 -157810
13209 -157810 -182661 -230337 247586 343574 -122599 -297107 -366740 -349690 -189967 -207575 -15324
13198 -15324 -13349 -236792 -319880 172845 -239298 -395929 -255024 -238079 -39140 -173932
13188 -173932 -466200 -169484 -40613 -465949 -425223 -110895 -213270 -231702 -316570 -161539
13178 -161539 189789 -119414 -739079 -245801 19814 -32043 -500745 -448273 -131362 -15629
13168 -15629 -530435 -509840 73250 -52672 -120166 -275854 -142539 -218171 -195128 -137519 347798
13157 347798 276295 -156857 -389336 -207952 -78897 -359642 -424169 -289773 -101153 -100850
13147 -100850 -117012 150609 -51994 -135373 -609427 -437975 -126823 -353286 -271926 31687
13137 31687 214815 172721 -261318 -26603 69535 119746 -150134 -447831 -463063 -630178
13127 -630178 -468968 -465170 198690 440753 -90446 -343844 -358465 -227377 -510670 -412817
13117 -412817 -733607 -423917 -526124 -564958 -356224 -41478 -241171 -261292 153857 348219
13107 348219 121875 -201675 -166626 44752 -272645 -644536 -329453 144272 95047 127341
13097 127341 93482 35909 -104978 -452256 8157 199150 -2464 -114453 -662809 -228241
13087 -228241 9201 139914 -78511 316374 459061 212958 161739 -132384 152157 77646
13077 77646 -48659 42178 96764 170382 222675 237895 248751 54664 39456 -415124 -38461
13066 -38461 415876 286741 215365 9506 -282930 -14918 201807 354942 125468 110372
13056 110372 -109019 92849 304863 20643 -169214 159218 100539 67936 -152736 -417605
13046 -417605 -309890 29796 28655 -128032 -141743 110681 16044 67926 -209930 -336057
13036 -336057 -601552 -335541 -330294 -86130 304266 -198535 -117920 -243927 -75787 -59531
13026 -59531 71561 284593 -130014 -283025 -405697 -401014 15076 -354502 -373174 -252695
13016 -252695 -372579 -133635 -563351 -232737 -76808 -185993 -214998 -520263 -717093 -270361
13006 -270361 -153813 -167955 -179864 -243795 -384733 -203814 136814 -27267 -298736 -381259
12996 -381259 -634004 -449910 -165842 -516782 -177846 231175 19761 -580980 -410968 -131448
12986 -131448 -239318 -401930 -589781 -363465 -250236 -520136 -531364 54036 -100930 -237815
12976 -237815 -368459 -372489 71035 -5273 76345 35111 -430570 -592516 -478731 -500899 58594
12965 58594 -428527 -457882 -683741 -29592 -371240 53682 67329 154044 282389 -86261
12955 -86261 -523809 -728557 -412827 -391301 -92653 -450111 -258930 -295796 -157505 -99533
12945 -99533 -157603 -256157 -161115 -228333 -47989 -319245 -406535 -444292 -544456 -606010 -551692
12934 -551692 -576764 -220894 -242399 -248744 86457 -181843 -368461 -363783 -26322 -148181 -280630
12923 -280630 -275567 -437855 -201992 -367108 -441081 40575 -166851 -383028 -289763 -333625
12913 -333625 -496321 -266822 -430434 -438227 -427567 -294928 -218747 -421408 -693027 -461839
12903 -461839 -368445 -655670 -675892 -619730 -374669 -227664 -271324 -483278 -455559 -439203 -727827
12892 -727827 -416529 -299224 -143691 -73359 -337138 -359499 -564520 -568361 -414547 -416399 -225508
12881 -225508 -401735 -529083 -392388 -382127 -630998 -464163 -257451 -164827 -57677 -424486
12871 -424486 -362724 -194973 -229127 -476678 -261268 -194230 -351482 -464605 -420997 -378741
12861 -378741 -310557 -370010 -271457 156667 322971 -102429 -324208 -248602 -103525 -530061
12851 -530061 -406213 27477 -243176 79254 -106935 -191566 -1668 -57843 151494 95397
12841 95397 110595 -126781 -36711 -20298 100383 43137 -138893 -70753 -215935 -251757 -237764
12830 -237764 -179237 -378020 -285118 -110047 -114210 -2433 -106290 -19510 -179060 1788
12820 1788 58728 175280 36265 -1326 -188562 -305835 -186762 -213291 42424 -3067 -134681
12809 -134681 110023 13967 -74558 40061 61502 -7402 -400577 -535572 -526872 -568180 -464985
12798 -464985 -290063 80967 -112351 -213969 -336242 -101589 159212 -123747 55184 36500
12788 36500 -286278 -285037 -43214 -148566 -158504 83182 -15631 -219012 246090 194097 89586
12777 89586 112309 -28193 -124954 -161356 83630 -213996 -268847 30171 -502505 -525760 -340047
12766 -340047 -11506 -45370 45254 -14635 -231963 -398833 -15615 99261 385840 225945
12756 225945 -380910 -209511 -8343 -143584 -205031 -127214 -31012 47987 -42916 -437784
12746 -437784 2922 61952 10161 247073 -163417 -515365 -450964 -83512 -157498 126479
12736 126479 20632 -264694 -328433 -269103 24851 -9317 -305216 -49293 -57218 -354269
12726 -354269 39774 -56186 -10920 -303729 -17433 -33038 -327216 -103610 -305649 -289116
12716 -289116 -339157 -280295 -611814 -511251 13500 243353 48853 230897 -293652 -88621
12706 -88621 181253 59980 -14728 -29316 89250 -433294 -568847 -368906 -377429 -78576
12696 -78576 -89329 77310 -36666 -240988 -172337 -335378 -96420 -116200 -272998 -353331
12686 -353331 -580156 -422306 -268861 -215088 -263960 -448689 186128 31071 395460 402232
12676 402232 -16581 283478 -29266 -303423 -23673 45940 -331483 -408521 -156060 -169760
12666 -169760 -469876 -547864 -371427 263710 70792 -253175 -23344 -310761 -389179 -290254
12656 -290254 -748225 -99463 -266927 -511079 -473963 -206078 -113111 -130246 -205170 -338311
12646 -338311 -24246 -61729 -285115 -198625 -88370 -315358 -269483 -548701 -74835 -295376
12636 -295376 -276860 -68737 -226806 -392385 -390211 -385757 -256958 69408 -308349 -476514
12626 -476514 46130 -139578 -436538 -147339 -176891 -145135 -54088 -197180 -235006 -463712
12616 -463712 -423584 -227990 138863 -157700 -430657 -106064 -51742 -17690 -50491 -22930
12606 -22930 -173126 -155011 -99612 -154696 81717 358830 -33549 -121704 392247 217969
12596 217969 -77380 -32890 15741 228241 14330 -229964 -249197 -98199 -168301 -163553 60619
12585 60619 -85753 48713 -248083 -306923 -234029 -221746 -165245 64159 -17625 -82336 -89961
12574 -89961 32347 -59058 49539 -1166 -129891 107620 -187771 143473 -107790 67429
12564 67429 -320161 8944 84290 32049 5942 -212049 -120886 -219539 -224112 -502627 -109355
12553 -109355 -258060 -234625 -57439 403836 -232386 -251540 -138409 -83496 -104611 -238797
12543 -238797 -147119 -125922 -41069 -162856 -158044 46008 -95846 -390447 100930 -196506
12533 -196506 15575 -265300 -208943 -89808 -138091 -333841 -211983 199737 67250 -151504
12523 -151504 85858 -51068 -20092 -181860 -412223 -311593 -104371 -455498 -437068 -417857
12513 -417857 -465879 -532058 -505822 -58825 -188298 -291941 -715822 -393789 -468941 -501675
12503 -501675 -410989 -493176 -287032 -464443 -413519 -499473 -207670 -379681 -586657 -485717
12493 -485717 -88820 -101804 -373437 -97679 -262980 -116786 -520336 -533311 -483233 -430812
12483 -430812 -835899 -590876 -653195 -719074 -523019 -502343 -458229 -245393 -231146 -578395
12473 -578395 -502290 -282864 -309256 -191294 -290386 -298071 -391251 -376915 -189280 -326691 -240645
12462 -240645 56875 -224025 -209237 -264084 -271830 -80755 40685 24189 -210644 -5019
12452 -5019 -297059 -84372 -141046 -147442 -252195 -423312 -452292 -331627 -24057 -151800 -383604
12441 -383604 -270059 -18376 297737 334377 -225364 -17593 -15005 -107728 -298213 -629536
12431 -629536 -242109 -228670 -153678 -454358 -177799 178638 47406 8605 -59386 217692
12421 217692 370170 -92478 -265215 64286 188507 22094 -586003 -499341 -10542 -13647
12411 -13647 284930 14919 9461 8980 -165751 -269952 42514 79957 -379637 -118295 -225893
12400 -225893 -371052 -553589 -322684 -110484 110165 -267505 -287954 -123367 -119858 -173380
12390 -173380 -500845 -387305 -166517 -75151 -261750 251289 -64907 -211725 -376309 -675353
12380 -675353 -364371 -303181 -363217 -707812 -372258 -445564 -670989 -604307 -214909 -8803
12370 -8803 110955 -399428 -426508 -380487 -451649 -841354 -956896 -360611 -462619 -527507 -645759
12359 -645759 -414741 167098 383840 -371195 -269272 -208911 123245 -227201 -527176 -660669
12349 -660669 -303374 -94504 -319368 19138 139445 392593 323427 192369 -59455 -72774
12339 -72774 -27193 -317213 -377659 -127692 -360315 -155264 -190472 -120160 -44680 81066 -152202
12328 -152202 -182061 -102002 -261644 -112687 -163872 -104670 45313 164293 -250707 13705
12318 13705 256799 140438 143160 34273 141561 -29560 -228160 -122441 67220 29027
12308 29027 37929 -75160 -70858 -30272 -358130 -222219 -321682 -302399 -507218 46480 -51856
12297 -51856 -307889 -282855 47979 -143614 -89379 -273311 -364725 130391 212068 -190864
12287 -190864 -321884 -274372 -116836 -231745 -96633 86399 -26730 -25069 -403648 -390427
12277 -390427 -393733 -237085 -138651 41794 -240109 -68463 -258187 -314740 -184892 55383
12267 55383 -20738 -169174 -36421 -21021 -183802 -23756 -263660 -384722 -100458 -285292
12257 -285292 -173690 -117227 -394899 64683 -277495 -352300 -435281 -232322 -311649 107330
12247 107330 -12750 -394466 -357580 -121978 -384958 -48486 186545 28158 365575 24990
12237 24990 50964 -152845 -68219 -27940 -273823 -273944 -95967 -124603 -170717 -1118 -26642
12226 -26642 -193448 -413198 -77347 941 8383 -89865 -152541 -236552 -307871 -161156 -342943
12215 -342943 90682 307110 15880 -225878 -50544 -425905 -94538 -13581 197978 191774
12205 191774 -44322 -212310 -346270 -250884 -386651 -60975 -88462 -189585 -79510 -135443
12195 -135443 -309568 -26045 -45338 -221033 -52433 -162077 31784 -303993 -290100 -481169
12185 -481169 -442610 -509032 -530769 -369222 42469 164436 -181158 -271595 -140920 -82006
12175 -82006 -13974 219226 -141359 -557993 -580608 -250578 -189719 -322647 -29112 510937
12165 510937 469360 46511 23189 -324 203840 148384 -140156 -335392 -100369 -340313
12155 -340313 -471574 122410 93012 -139093 -50730 224139 480216 11369 189046 -42496
12145 -42496 -8138 -355266 -491934 -119241 46293 54071 -225925 130690 62669 399265
12135 399265 194136 270228 277813 80730 -561243 -455091 -462261 -626919 -479088 -354537
12125 -354537 -345506 -286476 -254703 -143418 143043 -134065 -302734 -184441 -184385 -192956 -193701 -244332
12113 -244332 -150042 -237323 -607634 -233110 -271588 -116035 153707 -61186 -117695 -349844
12103 -349844 -536367 -215668 -70088 -305283 -340409 -110907 -12871 -471601 -350828 -271959
12093 -271959 118156 149135 -525314 -552793 -162674 -180695 -244428 -523801 -362460 -199236
12083 -199236 22689 202495 -186849 -320579 -147414 -538561 -384116 -199468 -166251 -68422
12073 -68422 -287063 -225461 -466889 -113918 -356319 25332 434227 122526 -150109 -315560
12063 -315560 -244573 15707 -158670 -359741 75215 79174 -41681 5034 59203 165250
12053 165250 321538 182725 -180550 270446 78481 62221 -108349 -111317 -11552 -9672 262395
12042 262395 237109 176023 33697 142547 177322 46124 -68317 520092 676394 355475
12032 355475 -92457 -267157 -28921 -43338 211900 -237793 -199266 284758 -153052 -22630
12022 -22630 75216 36274 96539 150398 -136950 4675 -257195 -562128 -243943 -71939
12012 -71939 -484808 -115376 173970 -277783 -152897 -127663 -298783 -23386 198546 -228332
12002 -228332 7178 30413 -128937 -226713 -228891 -345278 -266049 -706 -169157 68700
11992 68700 -305248 -532619 -219700 -407918 -236748 -166107 -202897 -194505 109754 -198016
11982 -198016 -339473 261112 -152753 -156266 -153071 -169815 -390833 -61043 -662538 -370427
11972 -370427 8914 -235132 -21607 162168 166893 -286464 -37176 -425655 -133827 -393641
11962 -393641 -437532 -527826 -372186 -243506 -487177 -497110 -318726 57456 -84864 356714
11952 356714 121399 199652 706 -78153 -530189 -740277 -622209 -422286 -441036 -614281
11942 -614281 -491840 -325231 -89984 -166495 -156784 -205420 107682 -222567 -432019 -681913
11932 -681913 -722743 -316147 107051 -97229 -61309 245188 334044 13745 -81827 -181730
11922 -181730 -43788 61698 -112392 -277014 81714 26042 -571894 -453190 -237098 -115525
11912 -115525 -99730 111495 8172 -93192 -243198 -414664 -465107 -89638 -94151 -92432 176171
11901 176171 272723 196071 50004 22993 304894 190575 -22142 -347881 -194321 -140931
11891 -140931 -351512 -46618 -347882 88564 381281 93648 -86061 -336767 -291122 -255020
11881 -255020 -365532 -489056 -263987 68856 -183996 110613 -232919 -275872 -242441 -283764
11871 -283764 -174064 15420 -310091 -519776 -240932 -571301 -538413 -469235 -348291 -338300
11861 -338300 -212226 -176261 -149862 -100012 -194556 -190294 -17194 -173722 125237 -84815 -178014
11850 -178014 82607 45209 -319659 -65462 349045 228704 -40298 -297568 -503459 -323224
11840 -323224 -292697 -265907 -63448 316954 259925 257819 48037 -96318 274850 -63892
11830 -63892 -165945 205015 167254 113477 316122 206479 267490 256826 373102 83038
11820 83038 102651 -220939 -72396 -207459 -87094 -441313 -183573 -14215 161664 -356827
11810 -356827 -288150 -176357 -168896 -74535 27816 -53632 119575 251595 -92584 -122045 54511
11799 54511 -39633 -70197 -95929 -310910 -133998 -258234 -76560 -344576 -159745 -479318
11789 -479318 -381547 -118578 9934 25517 389729 422712 220782 -184166 92500 -107845
11779 -107845 -88545 60446 280882 142455 423698 359551 413951 461769 122968 -43270
11769 -43270 85212 -3461 -412750 -490072 -206907 -275601 -25680 -149565 11076 184581
11759 184581 312289 117536 -127649 -95080 -109495 -101097 533058 677652 234895 166712
11749 166712 5499 29938 165233 43666 -61932 498602 262254 -76871 -32606 141767
11739 141767 -221900 -81085 -268463 -230094 226096 -320720 -642615 -356750 -114901 34204
11729 34204 -168963 -149524 256586 681769 311597 31968 -107595 349073 163967 -166398
11719 -166398 -218899 -43174 -251595 -319408 -181524 -87528 241760 462602 -56244 22396
11709 22396 232193 -159218 -164278 -309883 -364380 -111114 -120050 -158434 203991 291961 24569
11698 24569 -86975 -252291 -294953 -407304 -147847 19889 -352398 -615922 -280436 -100856
11688 -100856 -64954 -237728 -275071 -183925 106334 -409406 -455638 21603 -22176 -169132
11678 -169132 107731 87838 338062 197864 -74809 150673 32050 3402 47234 72308
11668 72308 333748 304300 -86220 185286 -251600 -295739 -241544 215868 78255 198199
11658 198199 1165 -388581 -56196 -136179 -89093 431815 85491 -109668 -235758 -110879
11648 -110879 49374 23777 -164298 -158001 5832 -212803 200104 178273 152761 84378 -248789
11637 -248789 -189764 100634 148099 -175139 1226 -12149 -139140 -583540 -293519 135419
11627 135419 316017 330088 -84362 -290686 -452109 -440116 -159868 -40687 55083 -212225
11617 -212225 37432 -34131 -303228 -39262 -177157 -302570 -67473 60514 38386 -50389
11607 -50389 115887 76455 118737 48860 -227092 101754 616797 202996 -350064 -268312
11597 -268312 -447681 -103263 167660 215666 350846 331830 -375964 -518094 -110046 -14708
11587 -14708 74110 60556 2246 242462 -229064 -472989 -152996 73228 -13901 185908
11577 185908 124630 53113 87570 -153024 -39301 30945 -154064 -424791 -23702 408238
11567 408238 236851 -119087 -93828 -73832 27186 91134 -21138 110448 -33458 -362838
11557 -362838 -544898 -58967 -24598 87556 220874 175994 -12962 -117103 50777 127485
11547 127485 14360 -53282 -29538 2123 -26188 -49794 93953 33074 -65922 -394590 -37678
11536 -37678 -11156 72115 335722 192479 -408513 -438515 -440820 -467513 -200320 -183306 -297297
11525 -297297 -162022 -113360 -426945 -441489 -2237 -142965 -231908 -282241 -391414 -119927
11515 -119927 -374564 -139140 -561714 -422276 -366366 -268063 -108877 55820 76548 -183557
11505 -183557 -409163 -266549 -179931 -215819 88427 -196639 -460976 -476353 -478515 -209736
11495 -209736 164385 226377 -180620 -232946 -152791 -397125 -445746 -286186 -224207 -159159 8563
11484 8563 -112085 -87992 185134 -43213 -123870 -240363 -599394 -602107 -203372 -102600 -229369
11473 -229369 -182810 -313713 -510636 224380 127634 -15361 273251 76841 -245479 -675547
11463 -675547 -503797 -187542 80291 -48680 -374081 -484478 339758 115528 -45845 142212
11453 142212 156861 -262865 -670033 -329652 -347571 -555796 -249761 -481978 -294729 -192432
11443 -192432 121718 198190 507538 260797 -502077 -445459 -110036 -319086 -319679 -219770 -471793
11432 -471793 -252351 -313192 -367032 -11247 531146 203063 -170402 -183344 -184048 72819 108355
11421 108355 -191997 8214 65909 -238347 -298683 -15684 198472 164118 102501 -100915
11411 -100915 -430828 -256702 -202317 -49700 -62732 -131547 -399861 -132460 348115 195673
11401 195673 -267505 -457587 -252206 -454125 -307029 -74141 198161 68354 61344 27272
11391 27272 -196421 50356 293091 -80692 -155932 178160 -420059 -528984 -237701 -27583
11381 -27583 40207 -119929 -383894 -309059 35765 -314266 -477593 -418782 -249266 -277826
11371 -277826 -406263 -155010 130686 148177 -231418 -278370 -272052 -29484 -108658 -7309
11361 -7309 -230016 -226092 -248232 -506454 -336933 22964 482669 105257 -72902 165241
11351 165241 -186446 -416007 -387770 -345023 -463711 -492173 -23807 81157 62880 -81372
11341 -81372 -189850 -122540 225039 106915 -155967 -186106 -24259 -522483 -627234 -322933
11331 -322933 -272990 -18072 267972 167315 -85854 -576296 -633919 -143632 -204171 -413976
11321 -413976 -403161 -522570 -210855 -156774 -294857 -348943 -27798 -260598 -215995 -86705
11311 -86705 -263208 -129039 -417568 -299131 -479350 -363609 -176777 23240 -31626 88621
11301 88621 -59843 -368082 -456846 -116239 -5306 -193531 -397486 -284837 -410243 -73750
11291 -73750 36326 61446 -230417 13434 95081 198217 116878 -191489 -106727 115631
11281 115631 -88214 -176493 -59382 -6190 329505 259027 80909 48555 -39303 -276863
11271 -276863 50641 281359 -33948 -525283 -409187 -504513 -74375 145155 -164479 -149334
11261 -149334 277206 414132 -100388 -151958 -112673 -403475 -299751 -236865 -68985 138608
11251 138608 -122309 -309248 229439 314113 -22586 -67683 414689 183961 121763 -215878
11241 -215878 -547036 -143088 -147325 -65112 184272 543538 -43087 -337300 109860 104306
11231 104306 -177365 -386743 -237878 171614 -91667 -440220 -206963 194543 402927 203955
11221 203955 123174 233819 236836 -111699 -329174 -327805 -255871 -241849 108481 21298 231417
11210 231417 352110 32674 -2486 -88498 -111133 78890 -175042 -321060 -389846 -354049
11200 -354049 -399043 -100888 -134442 -346126 -25626 219816 2064 -194507 -419496 -414319
11190 -414319 -382538 -135651 -231582 -373751 -190104 -112781 -155360 -235639 -158940 -90254 127390
11179 127390 -149137 -50397 85960 -200328 -319478 -234306 -129567 154835 23384 -22319
11169 -22319 189809 219163 -273275 -608493 -127434 -68140 -76402 -163106 -199586 26146 -64752
11158 -64752 -502405 -404946 -10956 53951 119667 -273494 -55049 -123951 86151 -228458
11148 -228458 -189389 26053 -106322 133366 -48478 -155072 -40116 249870 34526 -286656
11138 -286656 -138784 -203184 -245837 -247980 -414938 -769817 -357169 -261776 -87231 -90200 -91467
11127 -91467 -173828 -55535 -230751 -499500 -157382 -228128 -372727 -72656 -247905 -317865
11117 -317865 -182830 -93164 -79909 20593 19555 -193053 -341625 -169414 -265872 -48988
11107 -48988 -217945 -481580 -384888 -91580 -21575 -336738 81102 218166 59479 -203100
11097 -203100 75919 180700 353347 -19446 -273448 -22744 164032 -357109 -252586 145568
11087 145568 189119 -316316 -411997 -418170 -304533 -110880 -186705 -383435 20786 -327119
11077 -327119 -519872 -495363 -321604 -319991 -424944 -277120 -187179 -280075 -20325 -321165
11067 -321165 -387592 37264 -118666 -460115 -463759 -239589 -270104 -129049 -566370 -452100
11057 -452100 -179145 -102491 -306957 -155024 -269589 -479853 -746872 -727402 -623216 -13159
11047 -13159 -323447 -207635 -378589 -227969 -59949 -486641 -437248 -14740 -375025 -498767
11037 -498767 -204794 -476944 -455432 -500853 -51435 156940 340606 71706 -152432 456203
11027 456203 668713 235426 -172056 -162054 -202582 -366927 35248 251255 -124958 -61986
11017 -61986 182021 185995 329613 -61123 -14560 -32648 56059 -645521 -393925 -186848 18094
11006 18094 -94017 -200960 52454 -97593 61446 -30316 101969 332378 127750 -465189
10996 -465189 -169614 197829 287223 79369 6258 -274203 -93103 433791 -164337 -227234
10986 -227234 234627 204604 -85208 95382 -108114 -435560 149509 343606 36536 -82896
10976 -82896 -187608 -354091 415532 496671 -286271 -361520 -111201 -112672 68362 355193
10966 355193 -72974 -110531 -320411 -449030 -264544 -62969 -209505 -356039 -99952 -136603
10956 -136603 -246885 -45090 -69283 244125 445669 251257 -14158 7721 192387 -118148
10946 -118148 41892 -58745 -252347 -236872 -344812 -232890 29127 -173167 -376173 -431168
10936 -431168 -231630 -167361 -253486 -396857 -267736 -605383 -554555 -730165 -611013 -143659
10926 -143659 202574 -29422 -265555 -183471 -20066 103731 129417 -58807 -375308 3103
10916 3103 62050 121698 -81754 106695 157084 88596 -55805 -186437 -343578 284753 49203
10905 49203 -73172 173067 -206708 377397 431537 292589 468893 348787 -133286 -167378
10895 -167378 393728 -32299 -144031 180122 -82122 13884 -82671 -77697 97465 358207
10885 358207 173079 70948 -18865 93858 -140201 -10826 305208 404166 -345436 -48545
10875 -48545 256732 380784 571768 -36271 -399213 -184488 -53220 74599 -33709 -226870
10865 -226870 -130761 77660 35527 -315282 -149197 -312178 -396883 -486041 -724245 -781646
10855 -781646 -586998 -352532 -63832 34254 291027 -179359 -396192 -256547 31095 25907
10845 25907 176082 -51212 -289613 -142041 -44932 -56693 -105932 -229263 -9054 -134134
10835 -134134 -39060 141615 -225022 -238381 15600 38815 -158533 -318795 -22176 -128576
10825 -128576 -183749 -367074 -597060 -26889 166481 176881 380289 195391 211696 -85155
10815 -85155 -226796 12644 191376 88002 -198456 -55236 -208675 -439058 -101747 -146624
10805 -146624 335807 463563 221205 262385 -15161 -116303 -163848 -82283 -355345 -28775
10795 -28775 -331086 -563248 123695 217857 -403170 -276115 -360235 -106222 18012 -332843
10785 -332843 -526400 -167238 -87412 -374260 -157708 277997 88659 -108904 -313784 -112965
10775 -112965 -138917 -171632 -116812 -270015 302562 339935 -69510 6398 -19923 -66828 319710
10764 319710 66719 -305433 -126111 116029 -148527 305244 145543 -393187 -52351 -232236
10754 -232236 -82279 -71661 -123814 62197 121803 65126 -66248 35331 92405 335691
10744 335691 230260 -44045 -138950 -167744 -256009 218468 -32952 -297220 -106249 72202
10734 72202 100041 509075 267403 411821 478021 354387 37483 28769 -22805 -323455 -382429
10723 -382429 -217996 40820 -196357 55460 186569 39853 153896 -24000 -183263 7851
10713 7851 116723 -63360 -147208 -244167 -808187 -293702 -35938 -2643 341325 105198
10703 105198 -235291 -103844 -38890 -133814 -39679 228183 -59170 -100022 -365250 -145245
10693 -145245 -283336 -269666 -591150 -436448 -156241 -20808 -211088 -320186 -91324 -426083
10683 -426083 -332654 -404545 -60252 130370 127479 4594 -364877 -572823 -406035 -418963
10673 -418963 -217393 154918 150204 6653 -63818 29775 -27366 155316 -280899 -360324 -201493
10662 -201493 -307515 -310125 67910 -259200 -187396 -25018 -115251 45462 209104 7994
10652 7994 -125167 -1194 -832963 -957554 -954347 -211345 217593 230839 -228455 -642077
10642 -642077 -477109 -437769 -262789 -219700 -175408 -261106 -120190 -43425 -332958 -582672
10632 -582672 -397518 -226483 -95111 -23170 -11995 70161 -276575 -433582 -326424 -511243
10622 -511243 -300347 82061 332694 83854 -160677 -508680 -976193 -489875 -179149 -84661
10612 -84661 -65045 -173952 -85009 -179280 -155316 -104587 192493 302391 -738 -26615 -47642
10601 -47642 -265676 -317256 -325032 -205636 376607 -11478 90569 -22488 293747 297958 -48544
10590 -48544 -285279 -327418 340439 374446 -82304 -197078 9831 51016 -127787 -283979
10580 -283979 -338495 -110558 -124749 -165696 -293269 -309278 -128081 -226338 -281428 -401040 50763
10569 50763 79531 -178538 -62603 -127340 -246212 -260674 -235990 -366697 21366 -19267 -59182
10558 -59182 -52455 -108786 -61953 69141 180535 55930 339373 318455 -142140 -343780 -617676
10547 -617676 -493540 -361375 -527778 -294687 -39220 108202 10052 -268346 -311268 78508
10537 78508 375603 25837 -183643 93102 -90860 -438566 -397930 -42346 58909 -102790
10527 -102790 -260511 20450 -20392 101853 113765 -17995 186458 -5247 -11697 -101963
10517 -101963 -158071 -68936 -120127 102120 -9549 -214863 76394 60941 214547 -65682
10507 -65682 -382826 -39705 82692 36154 111531 87328 33319 94131 -46207 9986 28741
10496 28741 181750 -288763 -88903 -116587 -187085 -154489 101253 122824 293748 95938
10486 95938 156218 68980 -84220 513375 351396 -212849 -296803 -223581 -425982 -364006 -196235
10475 -196235 -251464 -75779 -185845 -139207 -29092 406654 -110929 -104081 -335265 -459005
10465 -459005 -110828 -456795 -173228 83802 -19778 -83917 153316 75707 64591 -180395
10455 -180395 -81260 -342712 -144434 -700053 -569673 -69725 85987 -183040 -186585 -136758
10445 -136758 -14377 -235664 -261884 -236581 -237517 -192139 -400968 26747 83449 -8240 -50905
10434 -50905 261425 -5158 -54206 -58298 -379714 -220097 23519 -607696 -627222 -158560
10424 -158560 -170841 -85664 60253 143002 7893 55991 -59797 23083 100101 -92383 -30902
10413 -30902 -88026 -94002 135175 175882 548171 241937 211106 227451 232209 -194741 -241223
10402 -241223 -99946 77137 304871 104739 -212795 114091 223153 185740 284505 -27730
10392 -27730 83474 67762 150787 25768 176828 278241 337732 489509 549900 477786 424021
10381 424021 593660 303643 -25891 171679 474014 310648 176540 362647 49508 141335
10371 141335 -188166 -2849 357704 464660 234433 234350 279476 65965 122031 97334 112976
10360 112976 232872 192082 77659 212043 77398 -129779 -268765 107405 -63244 -40920
10350 -40920 -71494 81906 -3219 167038 148777 86572 252473 61183 40240 91464 -94754
10339 -94754 -476485 -583707 -90626 -16132 -108389 155756 36168 216077 -179989 -163752
10329 -163752 -267967 -93438 -179583 -15336 -327196 -253721 -334524 -498789 -476989 -333320
10319 -333320 -127283 14041 307526 99956 -68316 -132533 -20918 183694 -16196 -172450
10309 -172450 58067 199025 35035 -89253 87291 256713 153838 72152 103347 107114
10299 107114 171933 -238263 -235006 -50660 368275 20130 275745 373372 308258 -13888
10289 -13888 78795 71658 521556 343675 233680 308903 431734 283410 102983 8476 176977
10278 176977 384080 -17121 89451 142446 239107 354280 408622 70632 185818 132159
10268 132159 20468 82478 102869 247201 88618 11424 41321 249774 193379 186124 298864
10257 298864 131419 89105 -79450 81578 275271 188155 -31892 73271 103024 130222
10247 130222 -154531 -56643 -271247 52806 -113897 -93574 -301849 304809 132879 -43737
10237 -43737 -140206 -141608 146001 213135 332128 -280302 -38831 -101444 -484058 -251307 -133905
10226 -133905 -38197 255454 296274 -244481 -144828 -179085 10333 24608 -121127 -275029
10216 -275029 -359904 -100013 -138011 -34651 -66618 71710 184046 -29946 -200902 29219
10206 29219 -112094 88839 -258965 -243523 3300 128839 30411 -56050 10224 -77333 -97339
10195 -97339 59207 -90934 44797 276768 -106837 -112950 -114162 -82518 244235 263470 42918
10184 42918 -32600 22546 176421 169851 45361 184063 184518 156126 48659 262653 108693
10173 108693 36339 277110 129937 296920 17591 -228971 23173 553505 279351 33532
10163 33532 188776 146967 207131 -94699 132701 157086 53144 -190903 -283991 -184378 56140
10152 56140 142071 147901 66041 346052 255820 15190 -155509 65344 67222 32706 -114013
10141 -114013 66458 173856 -5597 84280 151111 176644 138412 -208045 67737 -36362
10131 -36362 54657 -582394 -402306 -87458 35572 39917 -64072 -8218 -8456 -105968 -209166
10120 -209166 -49445 -219978 -33364 66550 -245908 -401448 -226359 -213537 132627 183330
10110 183330 159385 -68285 205213 -397457 -449274 -328298 -420370 -198763 -172697 -209662
10100 -209662 52253 -157582 164345 130407 98864 -82948 179674 25779 -33816 -113783
10090 -113783 -19784 9111 453496 116878 80839 354922 304234 211447 -131653 -17053
10080 -17053 136675 168361 2159 -4432 223087 113124 -195819 233308 402609 183075
10070 183075 146730 104313 302324 428702 222230 101991 151059 510836 98958 147893
10060 147893 6827 52224 154312 239480 218476 58676 -222993 -129158 -180407 -202258 -151804
10049 -151804 -19665 -133303 -274704 -247686 -456613 -362273 582 -196272 81470 420763
10039 420763 -202302 151279 84096 -123289 -111533 -50090 -164827 -302923 -188582 -338362
10029 -338362 -3599 15253 -221438 146083 153817 252148 82301 -84937 -20833 -102551 -294498
10018 -294498 -107988 -60347 56621 394502 58833 113744 169250 19673 61581 540444
10008 540444 311628 130059 250733 182795 461002 578089 170243 259638 301742 332151
9998 332151 267122 312769 641073 649372 453075 324360 501663 630721 899134 953098 1349699
9987 1349699 1156247 1054444 590071 1005604 833140 973570 1132501 988409 1033896 1087905
9977 1087905 951121 1248464 1263820 1226008 1232320 1242012 1177978 712216 686258 359176 523434
9966 523434 347753 842932 913261 1109157 825275 708081 366958 178739 -5486 109410
9956 109410 437808 376447 243413 83828 -135275 176984 158850 328138 276854 378471
9946 378471 273182 417797 209046 -152742 -34123 249227 3379 118792 45071 219706
9936 219706 361739 289868 171730 322178 418584 274244 214730 3060 -57062 -191375
9926 -191375 -122513 -220592 200752 330164 66969 36297 231099 341383 129041 42162
9916 42162 322243 332772 460365 248929 311999 259945 370761 -108266 111892 52549 362773
9905 362773 202997 275117 382445 287583 255238 -87849 -180720 -109900 112498 5434 227795
9894 227795 145704 377091 597008 472891 471895 279717 123776 199698 280609 335271 183233
9883 183233 221131 113032 319565 287057 301450 391584 434003 160517 142932 163978 65071
9872 65071 124028 20101 147151 302297 84190 -125378 194398 186988 382580 300314 630004
9861 630004 449492 660536 646468 369104 334752 371788 152684 190151 430797 619288
9851 619288 536485 333931 278221 267950 257136 242078 101683 556060 526269 279655 198528
9840 198528 139892 289484 128619 237893 345403 204883 434365 240566 349321 665924
9830 665924 251224 138325 348246 441187 291712 502424 254804 425114 550665 478496
9820 478496 617965 832275 531991 361251 427999 640470 253949 463338 490985 974872
9810 974872 806113 819472 717837 281604 690640 746210 693164 514479 668840 571486
9800 571486 746283 629972 579800 706210 691099 837559 665174 678707 755124 694797 1149448
9789 1149448 847837 856190 1046916 1010546 1151869 1020515 957908 953303 1279568 1264550 1047794
9778 1047794 1249361 1344983 1501152 1231579 1215582 982578 1506740 1276654 1087738 1381584
9768 1381584 1130123 1381227 764516 931121 891264 1153591 1207932 1224933 918189 1200232
9758 1200232 1079175 968346 956444 894335 969239 1067670 1150639 1014949 1057598 1084477 855241
9747 855241 982384 989116 703869 1143339 1334980 1110404 947113 1137170 665888 977285
9737 977285 1122708 1119748 1061292 1085405 864062 882911 1260043 998169 1184699 1577978 1547018
9726 1547018 1312820 1456607 1176480 1493227 1567993 1271578 1165541 1412470 2047975 1590407
9716 1590407 1776052 2036612 1713342 1998659 1814441 1889058 2369324 2361933 1965617 2111039
9706 2111039 2337699 2286615 2522344 3001011 3075669 3184206 3068713 2749318 3140177 3028443
9696 3028443 2876758 3063790 3085082 2850738 3051578 2892174 2936097 2663616 2780716 2837341
9686 2837341 2936169 2839425 2797408 2754069 2885135 2596676 2492422 2830278 3048220 3113297
9676 3113297 3377609 3271162 3301212 3245680 3140650 3341276 3625355 3913501 3705293 3850547
9666 3850547 3940693 4279822 4444411 4430818 4389334 4541890 4571606 4857924 4550320 4629853
9656 4629853 5002036 5298586 5478649 5689466 5842920 6113022 6466364 6537180 6555056 6891184
9646 6891184 7139314 7589314 8102013 8530346 8806936 9483739 10100966 10643068 11515449 12093727
9636 12093727 12422988 13366439 14191875 15152764 16300936 17759415 19330748 20804941 22758826
9627 22758826 24782672 27262194 30060741 33108917 36697859 41502374 47502186 56475395
9619 56475395 68521762 82736206 97579595 110874453 123318513 134631612 146267933
9612 146267933 157648827 169216313 180387826 190757242 199918410 204876526 205764832 203192684
9604 203192684 198283350 191660362 184546090 175741067 166560059 156508262 144898294 130889994
9596 130889994 115385418 100373126 87359732 75722994 66132109 57932524 50683196
9589 50683196 44593598 39729646 35226388 31513016 28320713 25008456 22348388 20104556
9581 20104556 17765784 15985979 14752642 13423426 12327145 11826720 10547560 10149334
9573 10149334 9804528 9038639 8914079 8756393 8659072 8084066 7968310 7592696 7225154 6669740
9563 6669740 6535132 5951332 5884475 5319801 5482737 5464490 5533158 5206700 4819320 5224315
9553 5224315 5368564 5116986 5146706 4860618 4381136 4502293 4377952 3994147 4080310 4002565
9543 4002565 4309001 4215843 4177062 3903183 4002132 4123313 3785945 3547327 3542557 3397452
9533 3397452 3060846 2742042 2926646 2900715 2782069 2751915 2726748 3132586 3179004 2634069
9523 2634069 2755890 2613238 2082952 2224555 2405812 2245012 2160319 2133236 1743165 2202557
9513 2202557 1903031 1722898 1502457 2126208 1629504 1883230 1423602 1444745 1660733 1577787
9503 1577787 1449579 1293425 1840183 1861727 2114979 1946025 1525673 1347496 1499591 1738785
9493 1738785 1888640 1970172 1715703 1681032 1819723 1614651 1421823 1864092 1813037 1637970
9483 1637970 1847260 1652092 1440788 1191290 1186896 1172524 1208829 1239144 1047327 849292
9473 849292 1064797 956499 1254045 1087876 936232 1115827 1565442 1783057 1229055 930871
9463 930871 693520 807465 869585 1037093 1306367 1711425 1726512 1221484 1398512 1679517
9453 1679517 1926196 1655293 1726522 1818612 1669153 1391579 1346460 1545557 1737240 1681606
9443 1681606 1504295 1509557 1565683 1638700 1538563 1159464 1090581 839582 827817 879578 915081
9432 915081 951433 920671 712334 893428 733843 724544 1031740 993877 992561 390490 596055
9421 596055 409129 788771 952215 1022473 878026 803763 631249 456336 622946 716586
9411 716586 661395 739927 765683 270104 728757 1139766 998014 760664 606715 553479
9401 553479 1092816 1533097 1850022 2306717 2369272 2236835 1719331 1396719 1050059 1128592
9391 1128592 1088517 698211 386521 553807 749974 660371 548822 726499 713928 536773
9381 536773 504072 503613 953778 1081984 886965 796611 990654 847191 838578 1117644 1376191
9370 1376191 1303068 942605 1056515 1030955 909157 901936 742674 675922 830470 652281
9360 652281 507673 924759 995634 645099 856363 991268 689753 707460 545425 643952
9350 643952 590948 313264 482895 1030044 957253 999466 818457 915073 1235466 910779
9340 910779 562866 742749 1430113 1417779 1214493 1286039 1354673 1496719 1266795 1036640
9330 1036640 1539739 1660890 1212376 1353003 1560821 1366955 1142966 1311084 1408927 1320422
9320 1320422 1661573 1361949 1649307 1937532 1425069 1244991 1409577 1201477 806065 1181906
9310 1181906 1032395 874215 1400875 1110530 1298661 1640135 1856104 1585043 1549775 1555186
9300 1555186 1262812 1240390 1021457 1193453 1246574 1677047 1705460 2061312 1839626 2174654
9290 2174654 2168564 2295472 2348475 2106150 2519727 2259670 2158626 2241205 2048718 1896654
9280 1896654 1841620 1992970 1866889 1920989 2150967 1893895 1571720 1859027 1675947 1666833
9270 1666833 1671406 1793488 1650702 1760259 1819000 1553809 1880401 2042804 1945109 2066430
9260 2066430 2143024 1761865 2094549 1765043 1672087 2011632 2364377 2082841 2005414 2093302
9250 2093302 2293742 2198428 2227446 2355073 2167653 2126259 2203689 2144697 2476095 2304924
9240 2304924 2419155 2543655 2774699 2679309 3151632 3575217 3455947 3506553 3670898 3381790
9230 3381790 3399761 3094909 2970787 3317545 3215009 3148075 3368791 3732232 3912760 3793324
9220 3793324 4036761 3750275 3661653 3544426 3424028 3768040 3588078 3679516 3499325 3864439
9210 3864439 4296306 4686072 4665921 4647209 4902878 4678031 4456777 4627558 4639190 4689511
9200 4689511 4829581 4886617 4605115 5014302 5213661 5490796 5865011 5993750 5926111 6242618
9190 6242618 6472376 6547831 6951403 7069712 7431835 7744661 7992820 8887129 9536297 10142253
9180 10142253 10188845 10760762 11503360 12073047 12818843 13329377 14283174 15421372 16505168
9171 16505168 18109632 19563629 22283586 25331573 29151585 34614013 41679119 50038571
9163 50038571 60372183 69777737 77409353 82769286 85629335 86110349 85903942 86637101
9155 86637101 87787772 89422817 90370537 90621218 89236521 85515254 79429684 72276943
9147 72276943 64606738 57255378 49854553 43868536 39176810 35227149 32316927 30329002
9139 30329002 28514229 27478669 27390524 27271507 27044396 27978799 28590492 29739886 31142254
9130 31142254 33729652 37235295 42108175 48805705 57012972 68129878 81882291 95894896
9122 95894896 107794478 117262129 123313989 126184629 126358644 126003432 126789799 129087132
9114 129087132 131655152 131953236 131081531 127320367 119668897 109385758 97444348 85434026
9106 85434026 73247486 61454848 51779062 44085797 37736624 32649679 28030757 25039821
9098 25039821 22399038 20231322 18762752 17615033 16134637 15193247 14544786 13696823 13418964
9089 13418964 13027529 12419708 11998791 12430867 11771015 11471158 11563415 11557338 11570194 11427403
9079 11427403 11315175 11278981 11230119 11150189 10562858 10313309 9895855 9312763 8780160 9254247
9069 9254247 9054214 9184837 8631138 7935547 8054062 7663872 7163855 6832989 7084835 6418178
9059 6418178 6359439 6250760 6298800 6270235 6540062 6049496 6203378 6143513 5878238 6159032
9049 6159032 6289285 6168174 6153535 5788565 5818311 5939956 5731861 5653792 5808378 5509219
9039 5509219 5233646 5268742 5342138 5093543 5402976 5599110 5465097 5435619 5349649 5184796
9029 5184796 5245506 5400678 5333085 5523247 5617324 5625071 5529614 5878106 5646478 5530993 5659848
9018 5659848 5478282 5806017 6266474 6096174 6247032 6080517 6040908 6062791 6394116 6422735
9008 6422735 6627314 6684161 6614228 6835524 7311434 7035439 7005517 7505598 7649347 7957085
8998 7957085 7900733 7952814 8479412 9085571 9206864 9606680 9566430 9929604 10603649 10788104
8988 10788104 10960805 11613887 12268304 12715979 13659512 14586772 15455938 16598089 17199273
8979 17199273 18062441 19113640 20119269 21299109 23345394 24771544 27243200 29429659
8971 29429659 32076513 35727784 40315552 46410573 53597905 62215019 72126714 83996304
8963 83996304 96751682 110383295 122792892 134246910 143587048 150364100 153115632 152382954
8955 152382954 148380460 140837061 131353898 120445930 108662937 96306007 83933535
8948 83933535 73161168 64939553 57997300 52209502 48058159 45127364 43657636 42596007
8940 42596007 41910861 42094341 43033927 44441081 46647904 49948789 54326147 59369380 66509310
8931 66509310 75830508 91295171 119476635 170098954 250466799 347354821 400678658
8924 400678658 381580980 324639757 268608256 231025188 204192977 185128321 170269947
8917 170269947 155449155 141229612 129899419 118432681 107079840 95571930 84272710
8910 84272710 73667703 64578113 56211047 49391667 44061401 39684941 36104841 33212903
8902 33212903 30824298 28689134 27241893 25449325 24272835 22879362 21889557 20561571
8894 20561571 19326155 18545614 17450175 16421031 15901287 14770228 14111374 13569298 12680379
8885 12680379 11968715 11311416 11315873 11255560 10982996 10646299 10093063 9853451 9124015 8804799
8875 8804799 8591918 8060878 8200091 7660491 7462992 8092225 8311902 8166842 8633514 8833797
8865 8833797 9469206 9769552 9874870 9539128 9643363 9828958 9419745 9327094 9082884 8795261
8855 8795261 8378810 7782965 7015039 6481257 6254328 5644766 5611927 5457441 5012746 4468625
8845 4468625 4258994 4066098 3517317 3444789 3486274 3346156 3533621 3363353 2908818 3122662
8835 3122662 2983536 2905025 3028977 3143753 2865434 3199681 3147924 2731863 2402795 2378164
8825 2378164 2250061 2548591 2443451 2360705 2413218 2296753 2180284 2658577 2546006 2553776
8815 2553776 2470370 2323751 2090982 2231057 2208473 2324192 2616611 2656798 2940831 2859441
8805 2859441 3082002 3197991 2884766 2598577 2702934 2809184 2789881 2784912 2685236 2931409
8795 2931409 3153896 2657927 3044413 3285722 3238623 3328334 3234846 2855656 3313507 3278663
8785 3278663 2885745 3404791 3648043 3525308 3380166 3001152 2927149 3214695 3274493 3026289
8775 3026289 3160084 3263372 2876486 2711038 2915225 3230461 3192154 3191677 3610060 4080346
8765 4080346 4634418 4575713 4407039 4635530 4974343 4263609 4293283 4217381 4079279 3867726
8755 3867726 3304548 2862065 2793025 2463408 2328981 2079261 2074580 1877344 1626936 1529004
8745 1529004 1635269 1358472 1295648 1275155 1178299 885196 1005273 1166148 1022474 1782518
8735 1782518 1639094 1570639 1878589 1800060 1701777 1919564 1902493 1875275 2075567 2318885
8725 2318885 2275281 2775436 3182699 2877311 2828686 3104280 2744027 2952900 2526883 1988347
8715 1988347 1606741 1839915 1453144 1076768 1001861 1227187 696947 1079923 845254 644642
8705 644642 1012667 1072035 727838 858269 795399 436778 101982 270597 222256 282266
8695 282266 571883 261895 368260 461365 123792 125151 270591 52030 252439 -141441
8685 -141441 -37334 105961 419524 210133 385808 610356 910743 755428 530794 459624
8675 459624 571958 96285 114723 156712 174547 242912 377419 118061 -43750 58246
8665 58246 53263 239855 451525 182340 119887 237476 146614 -130462 -242103 -51045 30311
8654 30311 278470 -50477 28449 369340 427023 168945 522151 479383 504100 209840 -101626
8643 -101626 123976 -78424 -24409 -413221 -184754 -308289 -80738 144681 279406 147649
8633 147649 -50146 924 205384 440281 170960 10350 182140 295571 36400 -33231
8623 -33231 -222926 226873 394457 245818 214093 228043 256115 -32000 3416 -21696 -223417
8612 -223417 -19633 -138759 307007 103945 -119465 -41767 -77350 -91206 50887 -66965
8602 -66965 288191 392444 -134388 -81225 62178 239677 471375 410346 234593 611352
8592 611352 604448 81875 360484 792548 751352 448143 439882 100193 100827 45950 -264144
8581 -264144 59408 100659 -196330 -210482 100149 336133 -28957 -316773 -57827 -45591
8571 -45591 128303 -210057 -413684 163243 -29580 -289785 -390734 -173811 180896 86401
8561 86401 242733 -144983 7692 -91945 -247995 -175904 102942 144523 205581 -49198 297099
8550 297099 285332 330239 427528 306348 24630 -66505 20283 -4200 19302 -148868 -247543
8539 -247543 54638 197122 431844 149857 3961 -46062 -178879 -265956 -394356 -483507
8529 -483507 -417239 18243 185690 94123 210276 84535 -264103 230287 -253878 -43477
8519 -43477 -158306 -498004 -510897 -388123 -505694 -518742 -165052 171706 -155166 164948
8509 164948 -39723 -237720 -304678 -42371 -512977 -524339 -340514 -434818 -474384 -53817
8499 -53817 -15305 -365877 263585 149180 -57538 114460 501070 -330384 -339033 -445199
8489 -445199 -458554 -583327 -262832 -248633 -210513 -1734 -253087 -319892 -272896 -71245 48210
8478 48210 334565 -575098 -805564 -320856 -414551 -341494 -181081 -336443 -285128 32443
8468 32443 91728 20912 318028 142317 77032 -33852 -73444 -66147 -4251 273617 451338
8457 451338 -47164 25667 426720 249946 514396 634591 476427 778294 1228860 1398544
8447 1398544 1594338 1434184 1345501 957602 711060 451704 103997 43402 253260 217943
8437 217943 -180850 -329110 158549 141992 159405 129903 103021 -43517 -16978 -223677 -95315
8426 -95315 180243 12133 -404890 -578304 -147660 -109044 109127 293457 314996 -40297
8416 -40297 -248147 -496388 -25619 276196 -230318 51289 375889 221626 -219301 15312
8406 15312 348764 263602 133549 -342598 -363935 4718 -204729 -424834 -84057 -59605
8396 -59605 -11471 -58304 33732 163067 88944 19658 -312841 -499979 -79450 -18666 87900
8385 87900 336818 82288 -186103 -54963 -40599 289436 325026 78657 -226090 -32729
8375 -32729 -66499 -610265 -98195 -181415 -139002 -291519 -585990 -215814 -385986 -299858 -56887
8364 -56887 -188109 -256168 -287326 -63343 -86093 275497 -161971 -300441 -240337 -47241 -215830
8353 -215830 -156325 -170816 -150150 152946 -106327 -288382 144009 68904 -67367 -258401
8343 -258401 -280956 -366928 -183367 -128119 -121030 202525 85453 -9338 -202706 235721 226410
8332 226410 527517 232789 -171319 -325488 -108879 -53127 19842 -143761 36545 23620
8322 23620 84389 -198838 -402452 -261580 -315428 -313206 -205065 -328533 -76635 -137056 50891
8311 50891 85442 26596 78521 -46938 411070 491949 349628 -78079 -193248 -244389 9182
8300 9182 77673 -215451 -317190 -8502 -151113 -538168 -447472 -259915 -193092 -160444 -488415
8289 -488415 -233160 -159030 -433927 -107319 57395 -96187 -189308 75000 381333 296372
8279 296372 281778 262124 237858 79497 -330100 123039 420738 107298 -166190 -125906
8269 -125906 -196153 26233 -574761 -227746 -130288 79317 -23709 -35036 266990 -436142
8259 -436142 -45662 -501853 -317378 -134090 124490 49127 244689 237434 -161701 -380697
8249 -380697 -347799 -95243 -170312 210728 -284792 -452376 -557505 -527063 -374656 30078
8239 30078 241222 -107722 -162558 -282196 -309089 -299473 -522247 -378950 72566 107723 419743
8228 419743 402066 276488 -116535 -413159 -270302 180888 -52928 -290965 -55872 -367608
8218 -367608 -298050 -389256 -923658 -290897 464922 243152 -288142 117707 -645746 -444186
8208 -444186 -143973 -286536 -534151 -118477 -420797 -372205 234596 -36359 -30546 -217242
8198 -217242 321982 -254979 -221544 308700 -128430 -178385 -2294115 -2059241 -393082 -917572
8188 -917572 -766219 -794276 361053 -1051506 -1250962 -958680 -204180 -133765 -20706 -718028
8178 -718028 -597930 -162688 -591502 -282425 -407150 -603352 -809327 -491382 -245119 -102004
8168 -102004 -85274 -232172 -209664 60725 -362420 -174376 -354647 -215800 -151879 -63837
8158 -63837 -398722 -207656 -319988 -226165 312523 497158 113270 -371195 -188226 224285
8148 224285 -36290 25277 -295313 -335939 -186455 -182310 -43341 123378 299096 -152600
8138 -152600 -100194 77739 -23641 -440028 -559470 -589452 -231138 -423128 -693984 -66226
8128 -66226 -267814 77112 33415 -13794 42279 -274210 -109045 239289 23228 -513684
8118 -513684 -361403 -354579 -277642 -96917 -82186 -394864 67116 -121916 -334308 93598
8108 93598 142501 -42385 -249056 -313237 -487013 -443202 -715368 -761217 -77301 440195 -26708
8097 -26708 -295582 164428 115678 194930 143845 -221025 -79863 -7120 -96629 22482 58158
8086 58158 -187346 -105011 256835 -39105 78156 -282557 -443882 -744594 -623405 -683853
8076 -683853 -485086 -401797 -324417 40469 150133 -57646 -179650 -236361 -158370 -2838
8066 -2838 -16594 22707 -345984 -76255 117889 139903 206657 -44972 157290 11434 -501045
8055 -501045 -659371 -480852 -375061 -621417 -659273 -475004 108202 -299239 -367076 -107151
8045 -107151 127563 -248882 -386277 -343034 -128828 -30577 -31073 -153065 69381 159544 162954
8034 162954 170186 29105 -241242 -127491 -412261 -559666 -504839 -222315 -165963 -273829
8024 -273829 -45241 77418 137808 99057 -24365 93924 -3573 -285976 -335312 -88661
8014 -88661 211616 345576 281316 262708 182944 -136369 82836 -142207 -37032 -72308 -153369
8003 -153369 -112259 136227 -106419 -55250 47840 69304 -21269 48271 -12420 165090 31659
7992 31659 -19661 56497 533218 150401 309482 276566 127857 135065 -418022 -657665 -242664
7981 -242664 -65063 -296953 -237634 -66537 -178539 -379073 -161551 -84101 -88602 -220336
7971 -220336 -320856 -391200 -251502 -385137 -68710 -175416 158606 109606 100799 20137 -20284
7960 -20284 -213229 -46927 -287805 -969004 -700961 -307684 -131925 -315098 -216753 -367343
7950 -367343 -317466 -211196 -569378 -289687 -82017 -517340 -395189 -15049 5336 149417
7940 149417 195055 -48438 92596 371927 -179566 -378498 -373083 -236593 -219150 -166776 -498274
7929 -498274 -175464 191498 124322 -54831 -98994 -208832 -200835 -91038 -21062 212747 33646
7918 33646 46540 192333 119105 63942 201324 201534 177935 165772 -16505 -102765 -163606 -81828
7906 -81828 -170749 -65599 -143041 -326733 -206641 -230232 -62630 -117432 24279 -153116 -63216
7895 -63216 50983 28368 159822 33837 146138 236970 146297 24496 -111661 99245
7885 99245 313512 257646 4437 4708 -107674 -250615 -244993 -62767 -203967 -154594 -181218
7874 -181218 250008 379609 32774 -7232 -116239 -37372 251139 -189945 -287320 -60840
7864 -60840 -52731 -550193 -130624 37227 189124 139917 203535 -48682 135575 -411837 -801708
7853 -801708 -287629 -279725 -196049 -240881 -95917 -31854 184143 192984 518704 250602 177875
7842 177875 -6685 172061 6771 -249787 -358000 -127875 88613 -47239 -233617 141275
7832 141275 66379 196444 -126167 -450168 -422172 -238268 -217467 -155428 -16371 42439 32171
7821 32171 342990 486750 107741 348019 257350 17250 39974 216116 127373 260653
7811 260653 151825 24934 -79295 215728 247714 135740 -79795 134991 106146 -242675
7801 -242675 -188719 -212949 -165168 21658 -21143 -184216 17744 142689 270830 691908
7791 691908 367809 96147 244706 275754 245644 81829 -125289 -46881 212047 -144707
7781 -144707 70955 -98036 475192 600945 273668 291435 195198 233891 104730 133214
7771 133214 -161149 -70976 338601 138718 297240 278416 125179 284230 387162 56743
7761 56743 294489 389193 157758 -63698 -414974 -351210 -327958 -155334 110509 224099
7751 224099 147321 -6135 -88158 -122511 175480 20678 -78875 95125 31419 -213413 -15296
7740 -15296 170259 57121 -169786 -53167 -242040 -230190 -100442 -488826 -407311 -82504
7730 -82504 -73269 -226242 248417 519237 79781 153092 -162883 -425477 -258745 -288113 -146559
7719 -146559 165578 -151165 -98096 209592 363006 322970 101005 13009 -114111 214833
7709 214833 -268474 -80452 -173169 277215 2926 -78315 -182664 153759 323425 506426
7699 506426 384075 203273 -199935 -94360 -199517 -42236 347935 25575 -224778 30558
7689 30558 -405619 -315362 -389417 -112355 -195317 -447916 -423679 -571932 -34765 -460826 -291371
7678 -291371 -229970 -44462 -102750 -134275 -176599 328511 100357 -272779 -490753 -37464
7668 -37464 141973 245734 -77051 -204173 -433886 -159767 -135144 52299 162484 -21690
7658 -21690 -298418 -45340 47470 -362837 10683 116456 172598 -244419 -190536 -137757 -26653
7647 -26653 580034 758077 433139 550775 220749 223845 104604 152937 -45721 58982
7637 58982 121008 -286485 -10456 330774 189197 531537 519171 282983 595849 464027
7627 464027 36124 17257 51727 -260892 -78532 449471 321550 373213 352000 -113637
7617 -113637 51812 -123339 -128190 -27281 243104 -203294 -443126 -480293 -533370 -225836
7607 -225836 -185838 -139943 115103 -142129 -250719 -447061 -279896 -482133 -276736 -38538
7597 -38538 -175865 10665 -124758 -209910 -334542 -233088 -304138 -672030 -346533 -158570
7587 -158570 -444949 -506692 -395074 -465250 -404271 -321376 -267226 -139889 -96596 -181123 -248321
7576 -248321 -448863 -600872 -418610 -102513 -304860 -256746 -22929 120549 73260 -237344
7566 -237344 -112116 -33777 -11505 5933 8616 -235053 -190585 -130518 -435600 -219143 -53498
7555 -53498 -77601 43813 282388 210462 -308517 -292 140267 19394 -17537 -31655 -4127
7544 -4127 154624 224642 -175281 -195829 197042 100259 116578 200513 269921 -213856 243108
7533 243108 -140293 -33314 9170 178570 -798 496581 400283 -23378 147071 79125
7523 79125 199772 131117 363974 52790 -108705 123553 -78284 62053 178489 137767
7513 137767 34697 15493 333507 -209534 115431 219281 -15150 -2569 675427 343746
7503 343746 71102 -6725 233267 142423 189880 -28584 -54703 257175 452129 -20423
7493 -20423 31718 134464 -181962 -288188 39730 -87250 -74060 12029 -227009 -86315
7483 -86315 118946 48464 -285641 397296 271679 -305974 22104 98592 23066 -150921
7473 -150921 -226080 18186 181990 391001 71829 160065 420562 186732 -215755 -26066
7463 -26066 -40407 38865 -64532 44803 -266617 -390107 -182296 86085 236859 425258
7453 425258 331932 164538 411284 307561 62524 -88163 9876 193466 440958 341704
7443 341704 67719 188466 166228 86049 3787 191920 -72979 388685 133503 37903
7433 37903 -7751 -205057 -417454 -129165 143987 401615 192418 -357470 -211819 45806
7423 45806 137691 -56193 308208 84813 -99693 220672 215321 -34100 109623 -113141
7413 -113141 108509 105880 282383 -95243 80088 -2759 -225830 -405610 -302855 -194765
7403 -194765 12740 253403 -102383 -174050 -255493 -223718 120308 283945 380113 20313
7393 20313 87757 99099 271261 283143 -7165 189458 202957 88397 110721 -99985 6061
7382 6061 285460 413 -213513 96221 6784 58013 72702 -268356 -383558 -172689 -461452
7371 -461452 -310417 261819 261534 167285 121530 -113792 -233546 -70437 230849 326438 -188820
7360 -188820 -240931 148753 365224 200855 482928 57247 -77746 -71865 -290733 -197311
7350 -197311 309856 232031 107922 192909 343773 367678 523499 474117 411005 596054 47021
7339 47021 -108269 103335 203256 227807 501164 492187 214004 -35775 551146 564708 392010
7328 392010 372252 -279954 94657 525768 313934 175592 479273 410076 310807 434294
7318 434294 620518 546854 861808 454195 371806 254296 -220476 94240 824099 818304
7308 818304 574742 226017 -137398 229418 529552 242347 121424 260481 76194 135669
7298 135669 372597 320227 411020 436718 484666 443932 398867 240844 182798 431028 436408
7287 436408 592513 718338 582550 493628 635869 304584 -106840 -349834 7815 -102466
7277 -102466 412684 446142 333492 416303 383632 161622 456228 419734 196938 -259104
7267 -259104 -49906 174108 -81161 161992 345659 722028 725254 404676 -35594 136263
7257 136263 257393 83011 117748 -119238 -378274 -422457 -768 -87633 -245786 -275701
7247 -275701 -570004 344311 513680 -67119 -321760 188691 250173 106082 -38466 47241
7237 47241 31083 270548 203749 207015 316780 291781 128142 373594 304513 559367 340381
7226 340381 338015 481555 336842 329910 139217 279457 36620 -29388 174729 653675 565592
7215 565592 551874 598289 733362 581503 358253 160931 197045 242259 260646 41331 339226
7204 339226 582278 814392 685337 775324 818346 420345 310765 233418 159653 42434
7194 42434 -3151 345383 662442 579497 312838 388412 583948 602099 432713 58183 471642
7183 471642 411577 254288 359173 589392 216720 155784 50772 192813 140859 153517
7173 153517 159481 90859 265149 349171 396514 153856 83052 127326 248548 371912 465754
7162 465754 27077 38547 -64374 109757 5623 -28066 -8070 -108360 -65212 95339
7152 95339 42445 52930 -58601 123363 156542 240089 -33206 -54627 -47673 25662 156932
7141 156932 145974 -112476 126110 128081 -87979 -8467 -34235 111720 93945 569009 372269
7130 372269 173493 176961 216976 -263057 -247331 -116480 -477170 -209502 171508 24503
7120 24503 88644 320123 131645 144587 519901 48671 163083 120975 122192 63731 414784
7109 414784 266502 61145 196106 221278 658019 500687 131464 -16401 301168 69686
7099 69686 200584 140982 308361 422599 576136 419248 679366 39192 -166825 185876
7089 185876 394519 563314 152815 211137 66418 686886 190285 275580 638886 896134
7079 896134 754651 625830 314593 48892 119780 -57070 84730 261249 518604 435743
7069 435743 67826 285231 204033 104154 382090 406365 429926 220960 84705 -240845
7059 -240845 22006 63651 153656 442602 644503 160961 83338 63249 80633 -43353 -141161
7048 -141161 167464 150342 453790 158915 98648 183985 541205 111518 243566 554834
7038 554834 367667 363362 103647 -93684 188695 97086 36700 583916 787880 555733
7028 555733 205413 295480 324765 365903 301552 397540 434800 338171 96009 128992 205963
7017 205963 498700 457328 235044 639056 661345 607270 842887 558256 550365 251111 304884
7006 304884 424262 618424 807131 486034 832775 739406 403558 370213 715521 705975
6996 705975 517370 575063 231267 119118 -75083 95740 13100 96882 308840 42129
6986 42129 243282 201777 238691 251449 469976 277035 207983 398071 143471 133190 220211
6975 220211 -342703 -206619 73861 240656 229274 542864 371418 -33743 -100826 -348592
6965 -348592 302238 434854 376699 144694 475616 486032 105068 197470 256479 652131
6955 652131 103554 228521 108656 265267 351095 85377 287368 129539 446944 99571
6945 99571 160310 465286 584038 151863 -53939 107647 121204 263099 359289 220537
6935 220537 199365 21902 227630 70746 301360 360181 473886 527556 372886 169601
6925 169601 63640 197690 280115 496812 -218304 36459 302633 534306 244503 263990
6915 263990 46137 353501 386460 240946 325856 675763 170058 -126463 116241 224519
6905 224519 615526 388254 328753 636817 440799 192440 420140 236348 323680 343568
6895 343568 298412 -78091 459427 324616 263552 866021 1020216 676497 517651 388489
6885 388489 744955 478061 255741 -224045 238030 189698 526379 454277 452532 433415 368116
6874 368116 449724 169621 485731 354142 23237 -92466 -66253 50167 440663 479904
6864 479904 263536 488132 307672 179659 490133 588147 351616 174604 494275 121120
6854 121120 131354 -71034 268012 687878 593708 163992 142210 434770 663383 312300
6844 312300 14735 78753 486515 387072 257107 379068 620944 336058 301163 496178
6834 496178 705063 725953 656729 779047 553020 268866 173074 340183 531532 684451
6824 684451 640191 226641 406189 320815 516247 900468 1023008 524615 324042 550013
6814 550013 286125 389999 698313 184050 119692 270393 528112 593642 736402 670934
6804 670934 353734 416846 654688 288510 198759 483484 655067 696280 272299 28516
6794 28516 399216 557520 744798 472175 257604 -58172 221076 591277 508202 517028
6784 517028 660103 587568 467950 477276 314217 486955 266074 230309 40263 106841 440061
6773 440061 650705 485521 838777 571148 378924 338935 568537 508148 515777 416843 -41095
6762 -41095 -248344 220959 337042 663748 736808 377346 331431 380051 204910 197177 211868
6751 211868 142664 -100422 130256 291741 418308 418732 548851 595211 947093 284491 308767
6740 308767 430319 359371 235716 -81354 -47557 -95631 639000 466821 632501 441692
6730 441692 267249 -28859 217901 86517 106257 425018 169081 -9821 218492 -1710
6720 -1710 178380 260053 323097 227537 382743 459501 140582 583134 585439 434474 189132
6709 189132 393414 291712 277012 140695 -202244 52647 271958 -32195 216035 534491
6699 534491 698707 475661 663940 459999 530941 266203 312709 131514 417561 220684
6689 220684 157012 418595 389616 319723 429328 632870 693638 347029 633328 680201 571205
6678 571205 337106 204134 302239 371240 618704 595707 651631 682568 729474 317585 731673
6667 731673 603207 497756 445417 486339 257513 388637 630888 221795 231351 458136
6657 458136 373997 609247 483994 315461 96457 421864 -2605 180160 355589 498824
6647 498824 571232 484801 534840 829812 795669 870526 276555 645172 649172 372681 46169
6636 46169 240855 342707 327027 -101795 119507 330779 720211 551325 71865 492505
6626 492505 292086 30727 -51858 204751 422185 101925 248802 553894 665854 699489
6616 699489 335649 478080 795719 609825 457688 468884 841711 858476 299725 387077
6606 387077 399887 357847 394980 347906 375536 205632 -375900 -213206 306609 906651 640637
6595 640637 822353 837184 798421 662352 651848 303659 888569 616789 379247 524590
6585 524590 496045 236926 411093 375005 464268 626285 745085 840370 582465 333161
6575 333161 178748 449717 301059 -153041 309759 657548 446106 451150 176740 545539
6565 545539 734101 715594 766955 655014 503621 273717 252895 663271 566813 669020
6555 669020 625190 451658 326721 254947 348280 731096 453792 385916 355449 295627 544257
6544 544257 203235 279692 386599 521520 554051 680147 1108055 1105544 767372 952238
6534 952238 733461 733896 663433 455055 509643 648668 150216 309718 661005 1016530 899267
6523 899267 673496 552399 574428 348598 321217 110205 519648 600025 364027 542531
6513 542531 556327 698983 671407 1000418 1140687 1042000 788493 1056778 638489 1055430
6503 1055430 503595 635998 855502 441315 790288 716148 1146698 706108 498215 663030
6493 663030 824584 789121 686188 600871 374554 613389 671406 653245 639610 743534 645925
6482 645925 541816 912804 802833 787445 785953 617197 1046798 1089007 1003602 849911 1255645
6471 1255645 981205 874412 883491 1054323 1236597 1395095 1557586 1407441 1678242 1512545
6461 1512545 1423895 1861051 1786209 1959055 1896544 1814418 2053765 2066884 2151891 2118098 2214781
6450 2214781 2275765 2345649 2391753 2099235 2099745 2163300 1712710 1602864 1812470 1780844 1861738
6439 1861738 1597864 1559294 1498200 1278492 1307833 1406404 2099000 1618304 1065503 1105191
6429 1105191 1352946 1387130 1348783 1585968 1691898 1712053 1384389 1330134 1449949 1688762
6419 1688762 1132309 886506 1430890 1531751 1113438 1312879 1242146 1211406 1356170 1378584
6409 1378584 1028758 1525997 1754431 1551788 1632632 1663139 1423666 1681997 1938518 1946840
6399 1946840 2089560 1778839 1815066 2055305 2207371 2323660 2702052 3172227 2984923 2917944
6389 2917944 2816946 3111992 3119655 3052169 3154945 3006699 3358305 3287268 3500388 3587113
6379 3587113 3835732 3468707 3493511 3647590 3832794 3370945 3357319 3172817 2916264 2723462
6369 2723462 2592592 2420354 2623172 2497758 2610965 2332740 2461064 2200093 1863018 2095533
6359 2095533 1710055 1676408 1603904 1346529 1442278 1324801 1456490 1530260 1373402 1595369
6349 1595369 1340982 1536324 1619922 1604443 1433667 1479836 1674254 1666637 1325832 1057655
6339 1057655 1250563 1344768 1429092 871468 1399436 1873118 1698241 1867881 1622021 1714794
6329 1714794 1902195 1900678 1359010 1652621 1444696 1465898 1657987 1913706 1723727 1805165
6319 1805165 2005345 1751953 2232910 2305989 1999861 2064714 2016678 1816896 1631227 1870000
6309 1870000 2102423 2025983 2027440 2220598 2224502 2424868 2232918 2059788 2298992 2282583 2225332
6298 2225332 2226983 2243633 2307569 2296859 2180719 2388414 2384692 2460631 2573552 2629946 2390896
6287 2390896 2111771 2202105 2200976 2562325 2616092 2457800 2923746 2596502 2407355 2340246
6277 2340246 2424115 2797079 3357286 2672358 2575494 2623201 2600071 2635713 2646215 2812231 2664235
6266 2664235 2946786 2734550 2627622 2800881 3132493 2776429 2857884 3228105 3335090 3131463
6256 3131463 3137427 3132180 3022709 3032194 2881874 3244409 3570697 3440478 3732153 3531543 3153070
6245 3153070 3220497 3449849 3443061 3635871 3388684 3114364 3344341 3386738 3366126 3459621 3789990
6234 3789990 3782803 3787115 3546602 3530250 3620371 3712972 3752584 3729359 3825190 4101893 4125476
6223 4125476 4145237 4651235 4522201 4364777 4196560 4346547 4623021 4996183 4987666 5004447
6213 5004447 5404375 5663430 5879577 6269994 6430140 6423478 6545733 6396651 6465485 6518385
6203 6518385 6486066 6307631 7004541 7389901 7365133 7697260 8154752 8325972 8741835 8813333
6193 8813333 8684101 8942022 9263105 9544842 9619198 9844834 9662268 9988081 10224082 10385442
6183 10385442 10368266 10564229 10607374 10647298 10284612 10426378 10669877 10641024 11288879 10940394
6173 10940394 10967622 11266865 11524341 11373927 11600410 11867482 11762365 11737833 11837727 11240621
6163 11240621 11528712 11596911 11401408 11373419 11332680 11501018 12170665 12194575 12112688 12648229
6153 12648229 13696731 14318011 14956137 16022017 17131706 18380825 19343018 20571845 21922903
6144 21922903 23542894 24662873 26173988 27552080 29062020 30092773 31657663 33233827
6136 33233827 35178277 36668428 38491251 40303447 42712302 44957399 47922230 51318260
6128 51318260 54432938 57609036 61039759 63812552 66585352 68933254 70276742 71779275
6120 71779275 72240476 72087520 72299453 72770190 72294220 71710131 71692785 71921915 72135764 72462394
6110 72462394 72398293 72980183 73977317 74574289 75232550 76269757 77155609 77983176 78642965
6101 78642965 79093002 78776299 77741432 76396498 74440702 72134656 69853170 66488893
6093 66488893 63475588 60656476 57813712 54512519 52073894 49805005 47505235 45584062
6085 45584062 44127321 42850141 41812849 40811883 39447583 38337483 37047635 36247466
6077 36247466 34974115 34192042 32895987 31536870 30277954 28705523 26563342 25173287
6069 25173287 23925316 22120871 20459824 18882021 17215947 16260111 15750238 14150707
6061 14150707 13628450 12946990 12570955 12279647 11862565 11583605 11258898 11346765 11225547 10667650
6051 10667650 10392698 9954150 9822692 9773925 9546132 9449389 8929566 9575080 9614440 9676841
6041 9676841 10060922 9861186 10014965 9576844 9681893 9802666 10225768 10129288 10293216 10117135
6031 10117135 10946445 11077956 10791221 10837020 10733206 10807361 10292122 10211775 9565362 9666150
6021 9666150 9532353 8979117 9051765 9322868 8951159 9373572 9659833 9454801 9184232 9057665
6011 9057665 8561388 8525917 8873589 8782000 8498962 8229358 8387874 8040948 7855607 7304560
6001 7304560 6804316 6848547 6606653 6086175 5681062 5463338 5267282 5115630 4982132 4987845
5991 4987845 4843025 4948575 4770361 4665902 4161772 3825920 3991490 3859948 4147623 4332780
5981 4332780 4097725 4153873 4121215 3857969 4068510 4341191 4151874 4028733 4174209 4023471
5971 4023471 4189858 4059028 3487046 3935420 4400199 4488610 4282108 4411438 4197259 4348757
5961 4348757 4536725 4106182 4466792 4797523 5121691 5012819 5076205 5246808 5205639 5341736
5951 5341736 5786538 6311585 6691842 6894748 6783594 7194352 7313939 7619340 7431977 7950118
5941 7950118 8075230 8210227 8606638 8621221 8506604 8736598 9013147 9314664 9535478 9968072
5931 9968072 10527595 10854895 11375146 11488510 11907526 12580620 13401278 14034998 14433346 14896451
5921 14896451 15058399 15508968 15666797 15824662 16664554 16983242 16937141 17306057 17667949 17839344
5911 17839344 18312203 18543506 18965704 19623226 20332664 20524597 21410186 21569923 21904179
5902 21904179 22690972 22803980 22950748 23501754 23665100 23810900 23864033 24112573 24127547 24608755
5892 24608755 24857294 25122747 26219187 26426535 26819153 27061968 27293360 27333074 27768785
5883 27768785 27948773 27491417 27734711 27815803 27465339 27720433 27649211 27167489 27079145 27059166
5873 27059166 26682779 26614224 26871951 26421329 26214326 26430512 26525161 26676193 26825012 26588101
5863 26588101 27014259 27278236 26497463 25764343 25537216 25324485 24600750 23927361 23439533
5854 23439533 23150472 22698991 21874827 21315963 21015769 20493029 20029574 19614457 19296623
5845 19296623 19295170 18916536 18732148 18534526 18520953 17945525 17653021 17331580 17174174 16741823
5835 16741823 15983409 15191680 14821886 14211398 13389707 13340542 13063970 12386013 11785143 11560973
5825 11560973 11220516 10883985 10479636 9940566 9788730 9743533 9569350 9140479 8841694 8337148
5815 8337148 8037838 8003785 7689593 7273243 7247345 6747395 6107556 6095299 5860749 5600440
5805 5600440 5460840 5805868 5542405 5306359 4976097 4496407 4380824 4506081 3935974 4121741
5795 4121741 4070588 3980603 3708556 3284892 3358207 3166245 3369760 3062017 2712071 3169703
5785 3169703 3054250 2963973 2739238 2703418 2762419 2785636 3050817 2636295 2452201 2407662
5775 2407662 2164625 1906232 1984430 2037554 2343084 2257752 1971419 1716931 1987877 1972846
5765 1972846 1781895 2120066 2087255 2075977 2005969 1966769 1844198 1943432 1772844 1669148
5755 1669148 1956564 2013897 1827142 1814925 1977951 2323153 2275909 1888434 1825152 2058717
5745 2058717 2130107 1773271 1560008 1715419 1493099 1199444 1250240 1887630 1865474 1912697
5735 1912697 1747939 1800293 1708108 2021641 1913957 1985318 1661413 1440832 1642572 1734338
5725 1734338 1531542 1505687 1555625 1611526 1881482 1918829 1910395 1888956 1878226 1955500 1792607
5714 1792607 1810274 2324566 2449055 2691488 2573870 2454037 2104391 1989605 1840814 1487142
5704 1487142 2076858 1977356 1669182 1466991 1461155 1582534 1841344 1842405 1781575 2107748 1929697
5693 1929697 1602267 1549502 2064055 1868035 1850387 1844837 1967960 2064876 2144928 2530874 3060672
5682 3060672 3573827 3853170 3753615 4212876 3849740 3729214 2999408 2718005 2467858 2452539
5672 2452539 1999179 1857589 2055082 1903194 1491240 1934780 1927200 2295848 2112505 1856571
5662 1856571 2053748 2108589 1775836 2031898 2208867 2095888 2413912 2534244 2416145 2503834
5652 2503834 2897267 3419653 4155244 4408539 4059709 3893789 3973580 3449863 3238741 2907771
5642 2907771 2779281 2613112 2532885 2436664 2042816 1984616 2025394 1491507 1800926 1888275
5632 1888275 1867669 1846050 1846400 1951309 2260670 2218404 2158390 1940860 2109097 2157084 1961683
5621 1961683 1977010 1963080 2094015 2463176 2713354 2696811 2233800 2520881 2278059 1810601
5611 1810601 2129945 1892785 1794082 2154716 1943184 1780930 1776344 1711336 1368391 1705132
5601 1705132 1653948 1552098 1697960 2227343 1960145 1789802 1969288 1843450 1801933 1883804
5591 1883804 1960574 1855369 1945846 1645317 1871669 2226191 2211826 1622931 2080455 2315739
5581 2315739 2072782 1984532 1991241 1973687 2186977 2030440 1954034 2381089 2362699 2009111 1863893
5570 1863893 2268900 2228393 2132103 1972516 2453003 2352474 2034961 2071234 1805181 1695646
5560 1695646 2250969 2285785 2127504 2325024 2209362 1829018 2317451 2097014 1835391 2206566
5550 2206566 2330938 2280529 2174173 2349576 2178031 2358980 2274244 1998359 2182974 2127172
5540 2127172 1898013 1846576 1951721 2082808 1805621 1876159 2220731 2208818 2023196 1771652
5530 1771652 1685881 1995477 1955507 2022701 2312945 2464574 2060183 2147010 2406407 2258736
5520 2258736 1904510 2129213 1981993 2259628 1951814 2258020 2282903 1957835 2066743 1989173
5510 1989173 1996467 1993541 1801632 1644938 2180493 2340777 1840094 1898139 2116475 1851975
5500 1851975 2358985 2404275 2027499 2226903 2191332 2107663 2196421 2189121 2000500 1674065 1980267
5489 1980267 2156413 1892558 1887236 1933823 2000261 2248648 1969992 1836187 2061402 2424208
5479 2424208 1817079 2005339 2258083 2278491 2062556 2332706 2136881 2433022 2177597 1661227
5469 1661227 1855861 2202386 2250168 2087170 2314112 2341950 2266531 2158203 2290990 2025987
5459 2025987 2236578 1768603 1809951 2093239 1968154 1784587 1891302 2080317 2226465 1864151
5449 1864151 1702196 1526633 2065526 2172272 1961830 1885074 1726908 2038392 2210639 1731240
5439 1731240 1668617 1819886 1733484 1738232 2047260 2261280 1938796 1883074 2042358 1997281 1979887
5428 1979887 2217337 1968881 2120518 1938786 1648916 1504038 1434222 1436444 1603002 1850609
5418 1850609 1631879 1635323 1443685 1269409 1593080 1961603 2148027 1574584 1414336 1650399
5408 1650399 1682441 1277950 1386213 1695742 1789360 1895605 1613394 1772036 2050327 1603139
5398 1603139 1172929 1729729 1809458 1747913 1854802 1905854 1607580 1796831 1544368 1271768
5388 1271768 1465084 1782247 1712606 1606057 1766757 1552190 1566105 1964863 2247012 2146768
5378 2146768 1846451 1933397 1608845 1830482 1500372 1433086 1555154 1811856 1917463 1751401
5368 1751401 1810798 1613418 1949747 1972393 1807191 1601720 1942172 1720632 1798171 1968659
5358 1968659 1916903 1579700 1655479 2102230 2108185 1936411 2093017 2015945 1842178 1915700 1939591
5347 1939591 1801757 1934967 1707386 1767283 2043901 2108925 1583923 2331872 1960016 1696721
5337 1696721 1917415 2109985 1620283 1573912 1627509 1891828 1924391 1568367 1669932 1775177
5327 1775177 2291359 1547581 1654146 1688314 1643045 1695016 1843476 1899677 1826949 2101040
5317 2101040 2234596 1869778 1895114 1810620 1648832 2025815 1965539 1774913 1854815 1701830
5307 1701830 1977589 1899513 1929964 1732750 1965164 2200870 1603696 2050418 1873333 1907998
5297 1907998 2375840 2356857 1962016 2223174 2243919 2112426 2504431 2265365 2382007 2595898
5287 2595898 2722821 2238494 2511758 2669405 2819927 2960273 2527834 2687445 3133146 3169371
5277 3169371 3102031 3021567 3143931 3246999 3281691 3240793 3432000 3374245 3532175 3565065 3690601
5266 3690601 3956186 3806208 3990538 4148329 3828678 3834196 4001979 4216423 4297728 4402879
5256 4402879 4245935 4293669 4344452 4248869 4606937 4534837 4534172 4844028 4603031 3990239 4262527
5245 4262527 4280040 4399274 4339832 3965499 3648052 3884462 3732219 3822464 3799588 3647828
5235 3647828 3748401 3950450 3755196 3388793 3440826 3573329 3398812 3057387 3226019 3470101
5225 3470101 3246119 3028932 2956321 2809708 2514325 2252509 2438759 2712611 2627137 2367523
5215 2367523 2578485 2438793 2327025 2553761 2488248 2306156 2124389 1844915 1933897 2044229
5205 2044229 2069222 1815438 2046417 1958446 2161905 1969614 2057013 2092468 2288762 2050816
5195 2050816 1950744 1895530 1848168 1972286 2285003 2175731 1998583 2076496 1587822 1609415
5185 1609415 2061710 2627591 2384672 2170280 2031194 2315844 2320767 2015764 1835885 2316085
5175 2316085 2323782 2147427 2211956 2226589 1936198 2003726 1808309 2009306 2067203 2018797 2166037
5164 2166037 2521820 2376074 1894281 2081504 2080300 2221180 2564474 2293170 1952462 2365434
5154 2365434 2016720 1750676 2153801 2410224 2327374 2134938 1916814 2103362 2124557 1954280
5144 1954280 1872497 2503243 2415456 2059932 2226785 2160728 2154817 2332492 2278100 2223568 2125642
5133 2125642 1939123 2013604 2353938 2522531 2082166 1928068 1994662 2197202 2441725 2299154
5123 2299154 2210323 2301435 2280936 2353394 2093773 2081534 2189217 2416850 2155704 2253357 2446662
5112 2446662 2576187 2550232 2494171 2622252 2470583 2421535 2195697 2393064 2651081 2531466
5102 2531466 2439397 2410701 2611141 2356032 2561557 2392317 2577168 2339624 2058544 2249108
5092 2249108 2233738 2292241 2522646 2611812 2208171 2349662 2572829 2572295 2440857 2359550 2492177
5081 2492177 2449776 2488183 2482834 2941090 2818442 2499456 2742901 2509120 2626555 2754362
5071 2754362 2794230 2788363 2865574 2475213 2424773 2980983 2746732 2323451 2374017 2770902 2507138
5060 2507138 2554335 2598730 2697387 2985232 2843642 2772143 2787651 3101029 2949519 2932278 2928855
5049 2928855 3048682 2922372 3036590 3090744 3248206 3236445 3036393 3265473 3388060 3189780
5039 3189780 3201832 3485648 3665421 3381388 3124477 3343409 3594487 3579776 3593188 3642368
5029 3642368 3593671 3707919 3835700 3682255 3754964 3731994 3607481 3860585 4389630 3902944
5019 3902944 4095648 4586815 4408932 4302071 4501845 4642168 4682068 4728235 4791116 4952455
5009 4952455 5736588 5911697 6173804 7053028 7642184 7891159 8851413 9536811 10056598 10814615
4999 10814615 11290508 11442873 11607062 11309263 10825357 10956660 10374018 9563201 9358730
4990 9358730 9240437 9102970 9212097 9315711 9663812 10280553 10530271 11101203 11770135 11945028
4980 11945028 12089693 12378032 11892840 11658184 11552533 10919832 10707172 10771147 10302028 9427637
4970 9427637 9775059 9858938 9838594 10280798 10542163 10853960 11708473 12185759 12799067 13680486
4960 13680486 14296074 14162053 14497338 15028988 14709991 14694363 14792285 14392130 14470675 14564374
4950 14564374 15144513 15799654 17021838 17933145 19015111 20071173 20895509 20980166 21061089
4941 21061089 20899403 19991634 18815453 18022469 17039681 16056559 15410424 14698783 14205265
4932 14205265 13975713 13769311 13755397 14211802 14607529 14814398 15488207 15876345 15485855 15633432
4922 15633432 15448989 14955043 14070890 13302176 12759690 12037799 11947003 11572410 11452080 11392575
4912 11392575 11583044 11726233 12400639 13299456 13889275 14248877 14966800 15375945 15163361
4903 15163361 15284336 15096591 14618449 13845437 13296581 12641837 12711013 12627994 12147300 12214059
4893 12214059 13103546 13319403 13318821 14117635 14916369 15198433 16010079 16233163 16583998 17121112
4883 17121112 17214024 17148487 17469597 17333863 16697371 16561393 16046995 15367638 14784215 14308467
4873 14308467 13372933 12854295 11978284 11454768 11129628 10815815 10441179 10040905 10778984
4864 10778984 11032094 11295055 11710489 12102944 11772094 11675567 11311398 10831764 10290113 10258118
4854 10258118 9367355 9168775 9181880 8820083 9096968 9195726 9661663 9695784 9858823 10218232
4844 10218232 10520353 10600868 10566449 10808876 10795991 11450756 11958096 12379930 13262025 13868041
4834 13868041 14089045 14614447 15266649 15011855 15895600 16392562 17113469 18236433 18820104
4825 18820104 19433476 20297097 21121152 21030459 21222067 20805549 20269708 19853042 19139453 18248443
4815 18248443 17732045 17120608 16165784 16105132 16217464 16448836 16472119 16710747 17053851 17220825
4805 17220825 17366481 17268241 16666899 16257868 15359933 14258001 13369528 12733252 11988739
4796 11988739 11225713 10982634 10773315 10315099 10005395 10014428 10083734 10364474 10576657 10550117
4786 10550117 11088708 12024724 13010036 13643540 14813556 15834875 16247469 17003539 16569258
4777 16569258 16295658 16053838 15638856 14428393 13725808 13199589 12800099 12858869 12671623
4768 12671623 12513782 12755053 13170662 13387436 14409825 14892308 15387566 15372627 15047677
4759 15047677 14543056 13966740 13356911 12446912 11566958 11109778 10519404 9356042 9063762
4750 9063762 8953738 8076677 7751057 7311810 6769065 6636354 6651960 6215116 6183253 6573847
4740 6573847 6032350 5884839 5928313 5857516 5895679 5731006 5550280 5445834 5410848 5167901
4730 5167901 5588310 5803059 5869257 5373322 5216725 5451890 5671382 5677262 5493174 5580002
4720 5580002 5795969 5637725 5596105 5686859 6219211 6264624 5749658 5610475 5777361 5890611
4710 5890611 5674098 5956051 6082480 5888070 5974752 5912614 5750412 6156105 6156787 6275033
4700 6275033 6388114 6319922 6150143 6732752 6980354 7188891 7360366 7424449 7730633 8162988
4690 8162988 8093191 8478573 9263784 9677058 10051640 10747010 12061030 13063452 14408033
4681 14408033 15515585 16376460 16972595 16944684 16748491 16524772 16238944 15275709 14721664
4672 14721664 14441264 14640852 15117716 15442982 15773013 16522779 16511165 16564431 16802019 16560013
4662 16560013 15879032 15262556 14570741 13760836 13004427 12595712 12068764 12297775 12266487 11724662
4652 11724662 12033581 12480607 12804937 12879405 13987847 14678186 15803884 16715989 17589724
4643 17589724 18905870 20181072 20415318 20409429 20605910 20366466 20295830 20627445 20833077 21189462
4633 21189462 22304579 23610792 24828105 26668897 28519765 29619902 30265374 30436047
4625 30436047 30173144 29915443 29499446 28249211 26746376 26217655 25286811 24349831 23508615
4616 23508615 23585305 23869720 24369637 24820040 25197014 26574665 26941734 26799651 25952309
4607 25952309 25332938 23623449 22107433 20888146 19743372 18953361 18388319 17629015 17144410
4598 17144410 17430222 17121309 17333132 18243946 19278202 19828597 20823663 21804029 22219601
4589 22219601 22668521 22839820 22684833 22545249 22209497 21732867 21028922 20879122 20924629 20565587
4579 20565587 20984151 21879637 23458642 25232213 26739356 27997260 29216675 29590174 29019112
4570 29019112 27754429 26205930 24546217 22907550 20879263 19284115 18365926 17456463
4562 17456463 16440301 16328416 16189631 16165143 16373516 16621469 17171727 17579954 17854863
4553 17854863 17453002 17310191 16702871 15957370 15257265 14967597 14584781 14300942 13967106
4544 13967106 13675846 13891777 13955510 13953081 14151093 14600559 15153865 15982363 16541387 16474465
4534 16474465 16461502 16404273 16131732 15392654 15052462 14759392 14396774 14126570 14030461 13588744
4524 13588744 13549175 13875970 14107578 14583145 15260099 15712487 15550070 15691667 14999751 14235376
4514 14235376 13804665 12976747 12293722 11677389 10753235 9834764 9559057 8801671 8236313
4505 8236313 7928985 8018460 7593243 7329705 7229523 6949757 7256087 6855834 6386733 6467091
4495 6467091 6642286 6620643 6334150 6016808 6051891 6105395 6226939 6006396 5933723 6241131
4485 6241131 6020880 5881386 5741915 5778603 5905327 5766190 5939551 5944333 5881074 5750365
4475 5750365 5837225 5660832 5903692 5940587 5989481 5962784 6043147 5976600 5951890 6080027 5645165
4464 5645165 5572573 5671743 5584880 5706673 5747784 5568462 5588431 5638931 5454681 5219058 5469018
4453 5469018 5254719 5217693 5306250 5482028 5275789 5433754 5444246 5251390 5454107 5466492
4443 5466492 5290612 5509266 5347280 5294279 5124137 5186105 4873549 4893209 5185548 5066923
4433 5066923 5388304 5416092 5610759 5233196 5510825 5381085 5479705 5369360 5349406 4942532
4423 4942532 5023208 5263685 4881156 5161336 5434119 5390461 5586603 5643611 5221591 5220815 5217804
4412 5217804 5050860 5198975 5193261 4979373 5171550 5159866 4984497 4844499 4938644 4994864
4402 4994864 5198552 5411179 5273719 5622070 5381105 5453700 5474414 5324936 5463622 5574120
4392 5574120 5656353 5848246 5804292 5864769 5848463 6210919 6143826 6686678 7386802 8043584
4382 8043584 8921182 10243319 10907701 10766194 10201656 8903732 8248511 7675936 7271022
4373 7271022 6517035 6552819 6224110 6116156 6111810 6166287 5550199 5362165 5108801 4942718
4363 4942718 5205954 5303049 5042404 5515609 5958959 5794118 5762666 5658599 5258718 5312962
4353 5312962 5252972 5175295 5266357 5477212 5121713 5176923 5583339 5385504 5575614 5745862
4343 5745862 5971817 5875765 5878236 5764742 5418090 5486397 5721313 5529657 5484713 5671479
4333 5671479 5661393 5506732 5746811 5836080 5840103 5697092 5950419 6040527 5933117 5943406 5579332
4322 5579332 5796702 6046506 6064265 6174134 6457646 6699388 6320903 6494232 6628579 6478866
4312 6478866 6267231 6408846 6701664 6996346 6825271 6251764 6954764 7310485 7002946 7173384
4302 7173384 7330450 7431542 7560438 7592191 7152463 7561422 7813765 7479832 7887802 8479833
4292 8479833 8346521 8064909 8358942 8733934 8877876 8842929 9176400 9359684 9499065 9345027
4282 9345027 9114682 9154661 9359371 9600726 9841126 10358955 10508915 10692379 10951889 11493106
4272 11493106 11931311 12053051 12314571 13740607 15123729 16032972 17098641 17896509 18684134
4263 18684134 19194250 19877094 20744958 22379851 23798455 24417499 25051321 24994751 24896004
4254 24896004 25188949 25242455 25518511 26007088 25801481 25393669 24994665 24424061 23845286 23143224
4244 23143224 22545544 21521047 21092799 20432575 19576586 18725156 18145474 18097992 18147008 18234096
4234 18234096 18405538 18608079 19932092 21469280 22784468 25041296 28254633 30945771
4226 30945771 33267910 34895015 35807076 36564911 37967711 39153701 41356878 43517708
4218 43517708 45063156 46219906 47155029 47635173 46999716 45813645 44228264 42855882 41346466
4209 41346466 40486747 39551618 39096068 37882164 35753580 32728780 29644534 26488032 22973238
4200 22973238 20678141 18557820 16370076 14763583 13282694 12609665 11882322 11675789 10688730
4191 10688730 10382325 9956513 9683700 8893157 9068571 8727071 8428915 8325885 8040376
4182 8040376 7866352 8003480 8051505 7746141 8194617 8235015 7578279 7500443 7412952 7259936
4172 7259936 7543009 7469511 7492656 7304306 7580886 7147064 7158602 6982466 7028636 6784269
4162 6784269 6767477 6705228 6932558 6653649 6550911 6261045 6223112 6254823 6153440 6002934
4152 6002934 6436486 6623718 6323755 6236105 6241618 6310146 6264371 6466158 5943187 6225351
4142 6225351 5819146 5933701 5939908 6351094 6217519 6094545 6140739 6299917 6512482 6354971
4132 6354971 6633654 6659269 7064977 7292237 7108711 7042948 7591857 7410873 7443695 7808293
4122 7808293 8204414 8691403 9452794 9883977 10648791 11033461 10607148 10605689 10761046 10788560
4112 10788560 10829924 10581141 10144360 10241268 10478699 10510126 10758830 10696034 10756273 10625914
4102 10625914 10974818 10975435 11065838 10900784 10969849 11406044 11384789 11108070 10620830 10516729
4092 10516729 10583518 10561886 10518659 10430917 10428454 10651770 9942197 9558396 8983114 8703276
4082 8703276 8430497 8332361 7991595 7847004 7647519 7074372 6958442 7203827 7194782 6816588
4072 6816588 6709914 6383277 6617871 6362566 6400186 6102500 6024163 6048818 6012767 6048940
4062 6048940 6076529 6418869 6213740 6203066 6451068 6338997 6128321 6262690 6418315 6368405
4052 6368405 5900139 5819660 6047226 6257563 6784997 6706937 6538243 6441383 6376971 6564541
4042 6564541 6666129 6428610 6390763 6240134 6343825 6403841 6756749 6764466 6633732 6777740
4032 6777740 6811150 6559860 6464826 6881713 6870590 6967573 6933346 6774950 6916436 6878394 7403148
4021 7403148 7327021 7755588 7702319 7440321 8001784 8065062 8291673 8204468 8405189 8149485
4011 8149485 8629403 9068165 9837658 10171883 11036630 10729489 11372125 12608607 13778742
4002 13778742 14671021 16187995 17891663 20149918 22170280 23964209 26014282 28247701
3994 28247701 29405981 29402765 30162476 30357519 30822810 30981492 30885900 29868859 28678450
3985 28678450 27152118 25445687 24048457 22528001 21245647 20364362 19997530 19964538 20167351
3976 20167351 21145853 22580513 24180310 25901605 27724318 30139250 32094007 33182247
3968 33182247 33719576 33888719 33831081 34219968 33906658 33492797 32919582 31721112 29877313
3959 29877313 26910892 24328925 22470503 21032189 18963224 17288545 16155754 15148086
3951 15148086 14134151 13372720 12877932 12573598 12281159 11602836 11420733 11738240 11835638
3942 11835638 11431194 11289753 11621164 11235705 10978789 11178354 11322318 11341168 11294370 10727784
3932 10727784 11164144 11287204 11163713 11062983 11336316 11440041 11324885 10912457 11088909
3923 11088909 11072701 11283149 10796556 10897989 11174908 11186961 11183615 11387699 11528969 11158947
3913 11158947 10874319 10707097 10683432 10730193 10636428 10223902 10178027 10543188 10683996 10727839
3903 10727839 10793416 10840597 10905355 10488299 10376784 9956951 9804832 9989202 10047598 9883177
3893 9883177 10331291 10389703 10456009 10711596 10936397 10884823 11210972 11347690 11332162 11453226
3883 11453226 11665130 11347572 11572573 11768016 11755613 12384252 12451998 12308207 12382323 12298775
3873 12298775 12238041 12374474 12769296 12627752 12563864 12532945 12593082 12668095 12534597 12089036
3863 12089036 12415076 12898361 12712958 12932378 12539106 13041383 13277091 12934928 13052439
3854 13052439 13217634 13479671 13688521 14369557 14445542 14199443 14685333 15195111 16020774 16815259
3844 16815259 16987657 17624438 18690748 18793209 19256153 19835287 20864364 21525826 22141250
3835 22141250 23034642 23711817 24897835 25413749 25858653 26847656 27834665 28701936 29937860
3826 29937860 31415957 33171285 34762814 36758376 38408414 40411823 42654254 44715742
3818 44715742 46614492 48119208 49285691 50001789 51471879 52582344 53763699 55098502
3810 55098502 56490589 57745004 59107351 59765634 60679142 62347737 63563705 65186777
3802 65186777 66561976 67813903 68984563 70027399 70344556 70635532 70356932 69738604 69244567
3793 69244567 67982575 66472715 65515718 64342854 63303446 62453566 61274481 60501802 59343291
3784 59343291 57327814 55051513 53113511 51028905 49189959 47421362 45457367 43955827
3776 43955827 41849831 40241098 38435197 37365850 36800452 36318837 36043791 36200553 36219275
3767 36219275 36475774 37052532 37531775 38741258 39873702 40625135 41462734 42958516 43988203
3758 43988203 45269931 47139160 48565873 50443289 52952477 54894497 57377143 59502590
3750 59502590 60906073 62518716 64426175 65590795 66579797 67252187 67320445 67558317 67528613
3741 67528613 67079862 66388186 66311084 65890607 65220049 64561714 63471058 62163103 61084752
3732 61084752 59879381 58332720 56747384 55140993 53167269 50935649 49547369 47482753
3724 47482753 45583588 44035949 42688612 41453651 40246031 38554844 37426015 36905709
3716 36905709 35797382 35222359 35167920 35149947 34662336 34729069 34793105 34745243 35015995 34822361
$$ [...]
##END NTUPLES=NMR SPECTRUM
##END=
