##TITLE=1H_DE-80H_X3
 200.13MHz, d2o
 8 sc
 
 19ns.26.2.2025
##JCAMPDX= 6.0         $$ Bruker NMR JCAMP-DX V2.0
##DATA TYPE= NMR SPECTRUM
##DATA CLASS= NTUPLES
##ORIGIN= UXNMR, Bruker Analytische Messtechnik GmbH
##OWNER= pz
$$ XWIN-NMR		Version 3.5
$$ Wed Apr 22 10:33:26 2026 Russian Standard Time (UT+4h)  Yarkov@DPX200
##.OBSERVE FREQUENCY= 200.1313
##.OBSERVE NUCLEUS= ^1H
##.ACQUISITION MODE= SIMULTANEOUS
##.ACQUISITION SCHEME= undefined
##.AVERAGES= 8
##.DIGITISER RES= 18
##SPECTROMETER/DATA SYSTEM= spect
##.PULSE SEQUENCE= zg30
##.SOLVENT NAME= DMSO
##.SHIFT REFERENCE= (INTERNAL, DMSO, 0, 15.4615)
##AUDIT TRAIL= $$ (NUMBER, WHEN, WHO, WHERE, WHAT)
$$ ##TITLE= Audit trail, XWIN-NMR		Version 3.5
$$ ##JCAMPDX= 5.01
$$ ##ORIGIN= Bruker BioSpin GmbH
$$ ##OWNER= Yarkov
$$ C:/Bruker/XWIN-NMR/data/yarkov2/nmr/H-C/1/pdata/1/auditp.txt
$$ ##AUDIT TRAIL=  $$ (NUMBER, WHEN, WHO, WHERE, WHAT)
(   1,<2026-04-22 10:32:45.84 +0400>,<Yarkov>,<DPX200>,
      <created by zg, POWCHK disabled, PULCHK disabled
       configuration hash MD5:
       00 E9 B6 7A A2 85 ED C7 34 08 36 98 17 FE 4E 26
       data hash MD5: 16K
       A0 4F 41 23 7D 31 BB A8 94 FD E9 E0 EE 0D 02 C9>)
(   2,<2026-04-22 10:32:51.84 +0400>,<Yarkov>,<DPX200>,
      <Start of raw data processing
       efp BC_mod = 2 LB = 0.25 FT_mod = 6 PKNL = 1 PHC0 = -5302.316 PHC1 = 11.42193 SI = 16K 
       data hash MD5: 16K
       68 95 2D DB 6E F2 11 74 62 6F 82 90 9B AC 59 0A>)
$$ ##END=
$$ 
$$ hash MD5
$$ 2E 74 A6 2E BD 58 D9 E0 19 8B 9E 69 7D 15 B0 5A
##$RELAX= 
##$RELAX= 
##$RELAX= 
##$RELAX= 
##$RELAX= 
##$RELAX= 
$$ Bruker specific parameters
$$ --------------------------
##$DU= <C:/Bruker/XWIN-NMR>
##$EXPNO= 1
##$NAME= <H-C>
##$PROCNO= 1
##$TYPE= <nmr>
##$USER= <yarkov2>
##$AMP= (0..31)
100 100 100 100 100 100 100 100 100 100 100 100 100 100 100 100 100 100 
100 100 100 100 100 100 100 100 100 100 100 100 100 100 
##$AQSEQ= 0
##$AQ_mod= 1
##$AUNM= <au_zg>
##$AUTOPOS= <>
##$BF1= 200.13
##$BF2= 200.13
##$BF3= 200.13
##$BF4= 200.13
##$BF5= 200.13
##$BF6= 200.13
##$BF7= 200.13
##$BF8= 200.13
##$BYTORDA= 1
##$CFDGTYP= 0
##$CFRGTYP= 5
##$CHEMSTR= <none>
##$CNST= (0..31)
1 1 145 1 1 1 1 1 1 1 1 1 1 1 1 1 1 1 1 1 1 1 1 1 1 1 1 1 1 1 1 1 
##$CPDPRG= <>
##$CPDPRG1= <>
##$CPDPRG2= <>
##$CPDPRG3= <>
##$CPDPRG4= <mlev>
##$CPDPRG5= <mlev>
##$CPDPRG6= <mlev>
##$CPDPRG7= <mlev>
##$CPDPRG8= <mlev>
##$CPDPRGB= <>
##$CPDPRGT= <>
##$D= (0..31)
0 0.7 0 0 0 0 0 0 0 0 0 0.03 0 0 0 0 0 0 0 0 0 0 0 0 0 0 0 0 0 0 0 0 
##$DATE= 1776839565
##$DBL= (0..7)
120 120 120 120 120 120 120 120 
##$DBP= (0..7)
150 150 150 150 150 150 150 150 
##$DBP07= 0
##$DBPNAM0= <>
##$DBPNAM1= <>
##$DBPNAM2= <>
##$DBPNAM3= <>
##$DBPNAM4= <>
##$DBPNAM5= <>
##$DBPNAM6= <>
##$DBPNAM7= <>
##$DBPOAL= (0..7)
0.5 0.5 0.5 0.5 0.5 0.5 0.5 0.5 
##$DBPOFFS= (0..7)
0 0 0 0 0 0 0 0 
##$DE= 6
##$DECBNUC= <off>
##$DECIM= 32
##$DECNUC= <off>
##$DECSTAT= 4
##$DIGMOD= 1
##$DIGTYP= 9
##$DL= (0..7)
0 120 120 120 120 120 120 120 
##$DP= (0..7)
$$ [...]
##$SUBNAM2= <"">
##$SUBNAM3= <"">
##$SUBNAM4= <"">
##$SUBNAM5= <"">
##$SUBNAM6= <"">
##$SUBNAM7= <"">
##$SUBNAM8= <"">
##$SUBNAM9= <"">
##$SW= 18.0517328524113
##$SWIBOX= (0..15)
0 0 2 0 0 0 0 0 0 0 0 0 0 0 0 0 
##$SW_h= 3612.71676300578
##$TD= 16384
##$TD0= 1
##$TE= 0
##$TE2= 300
##$TE3= 300
##$TEG= 300
##$TL= (0..7)
0 120 120 120 120 120 120 120 
##$TP= (0..7)
150 150 150 150 150 150 150 150 
##$TP07= 0
##$TPNAME0= <>
##$TPNAME1= <>
##$TPNAME2= <>
##$TPNAME3= <>
##$TPNAME4= <>
##$TPNAME5= <>
##$TPNAME6= <>
##$TPNAME7= <>
##$TPOAL= (0..7)
0.5 0.5 0.5 0.5 0.5 0.5 0.5 0.5 
##$TPOFFS= (0..7)
0 0 0 0 0 0 0 0 
##$TUNHIN= 0
##$TUNHOUT= 0
##$TUNXOUT= 0
##$USERA1= <user>
##$USERA2= <user>
##$USERA3= <user>
##$USERA4= <user>
##$USERA5= <user>
##$V9= 5
##$VALIST= <valist>
##$VCLIST= <CCCCCCCCCCCCCCC>
##$VD= 0
##$VDLIST= <DDDDDDDDDDDDDDD>
##$VPLIST= <PPPPPPPPPPPPPPP>
##$VTLIST= <TTTTTTTTTTTTTTT>
##$WBST= 1024
##$WBSW= 4
##$XGAIN= (0..3)
0 0 0 0 
##$XL= 0
##$YL= 0
##$YMAX_a= 227843
##$YMIN_a= -291910
##$ZGOPTNS= <>
##$ZL1= 120
##$ZL2= 120
##$ZL3= 120
##$ZL4= 120
##$ABSF1= 0
##$ABSF2= 0
##$ABSG= 0
##$ABSL= 0
##$ALPHA= 0
##$AQORDER= 0
##$ASSFAC= 0
##$ASSFACI= 0
##$ASSFACX= 0
##$ASSWID= 0
##$AUNMP= <proc_1d>
##$AZFE= 0.1
##$AZFW= 0.1
##$BCFW= 0
##$BC_mod= 2
##$BYTORDP= 0
##$COROFFS= 0
##$CY= -3
##$DATMOD= 1
##$DC= 0
##$DFILT= <>
##$DTYPP= 0
##$F1P= 0
##$F2P= 0
##$FCOR= 1
##$FTSIZE= 16384
##$FT_mod= 6
##$GAMMA= 0
##$GB= 0
##$INTBC= 1
##$INTSCL= 3.241238e-09
##$ISEN= 128
##$LB= 0.25
##$LEV0= 0
##$LPBIN= 0
##$MAXI= 10000
##$MC2= 0
##$MEAN= 0
##$ME_mod= 0
##$MI= 1.114404
##$NCOEF= 0
##$NC_proc= -7
##$NLEV= 6
##$NOISF1= 3.799351
##$NOISF2= 2.8
##$NSP= 0
##$NTH_PI= 0
##$NZP= 0
##$OFFSET= 15.46152
##$PC= 1
##$PHC0= -5302.316
##$PHC1= 11.42193
##$PH_mod= 1
##$PKNL= yes
##$PPARMOD= 0
##$PSCAL= 0
##$PSIGN= 0
##$REVERSE= no
##$SF= 200.130012044551
##$SI= 16384
##$SIGF1= 3
##$SIGF2= 2
##$SINO= 0.751879
##$SIOLD= 32768
##$SREGLST= <19F.Aceton>
##$SSB= 0
##$STSI= 16384
##$STSR= 0
##$SW_p= 3612.71676300578
##$SYMM= 0
##$S_DEV= 0
##$TDeff= 16384
##$TDoff= 0
##$TI= <>
##$TILT= no
##$TM1= 0
##$TM2= 0
##$TOPLEV= 0
##$USERP1= <user>
##$USERP2= <user>
##$USERP3= <user>
##$USERP4= <user>
##$USERP5= <user>
##$WDW= 1
##$XDIM= 16384
##$YMAX_p= 342498356
##$YMIN_p= -4988155
$$ End of Bruker specific parameters
$$ ---------------------------------
##NTUPLES= NMR SPECTRUM
##VAR_NAME=  FREQUENCY,     SPECTRUM/REAL,   SPECTRUM/IMAG
##SYMBOL=    X,             R,               I
##VAR_TYPE=  INDEPENDENT,   DEPENDENT,       DEPENDENT
##VAR_FORM=  AFFN,          ASDF,            ASDF
##VAR_DIM=   16384,         16384,           16384
##UNITS=     HZ,            ARBITRARY UNITS, ARBITRARY UNITS
##FACTOR=    0.220516191357247, 1,           1
##FIRST=     3094.31422285388, 0,            0
##LAST=      -518.402540151896, 0,           0
##MIN=       -518.402540151896, -4988155,    0
##MAX=       3094.31422285388, 342498356,    0
$$ Real data points
##PAGE= N=1
##DATA TABLE= (X++(R..R)), XYDATA
$$ [...]
5957A0640696J016811O47873R09636O73275J71642J697092J43510Q59844J404981
5948A8165360K8619O48816o25227j36256L8033n99693K59877J94923J077192K52770
5938A9304414R17743J864119O01188M59256N88690N96138L58390M99437N81553
5929B5770928O38613l45563n55367l64093q59209k88659N26833j70812P03605
5920B5056276P90251M73536N90041M80685J118251O33286J90006J277901P43597
5911C1353830Q81816P14652J60081k63519q68230q82405o86090n91577p16794
5902B9101764m65222q9801L25306N49989M05146j64776m61805J058261q7138O26302
5892C0798026J223492K03931o71065j09311p73144j376473j034972o24680j82672
$$ y = [10640696, 11657507, 12305380, 13215016, 13888291, 14059933, 15757025, 15900535, 16760379, 18165360, 18193979, 18842795, 18217568, 18081312, 18119345, 17519652, 17779529, 17974452, 19051644, 19304414, 20222157, 22086276, 22687464, 23146720, 23735410, 24331548, 24689938, 25189375, 25770928, 26409541, 26063978, 25508611, 25144518, 24285309, 23996650, 24523483, 24352671, 25056276, 25846527, 26320063, 26910104, 27390789, 28509040, 29142326, 29332332, 30610233, 31353830, 32235646, 32950298, 33110379, 32846860, 31978630, 31096225, 30410135, 29818558, 29101764, 28636542, 28546741, 28872047, 29422036, 29827182, 29662406, 29200601, 30258862, 30171724, 30798026, 32021518, 32225449, 31554384, 31445073, 30671929, 29295456, 28260484, 27635804, 27453132]
5883B7453132o55596k39682l10914K52782j015847o2508p95290Q8854Q7634o727
5873B4795838k96898m4936j104236r76143p75675o74822j057439P552l10405q96713
5863A8666123r2794j24518O66868Q9514L13525k97787n83680k29965o63584p85478
5853A6958224R8365l66379q46124j179474j57850j155944j167008m37260j07560
5844A1638990j70696r10731p40621M64467m35296l94720L20969j214472m7806
5835H510084N98880J78278n2718m90599n99061J80962p98892K04623j87801p56996
5825F786760P5660k02147j92722j231176Q65065l2074j386636J048144q3266o64140
5815D983468J20459N4756K00828n55372p43564N45012J31155K56648k80499o12142
$$ y = [27453132, 26797536, 26557854, 26246940, 26499722, 25483875, 25421367, 24626077, 24714931, 24802565, 24795838, 24498940, 24454004, 23349768, 22373625, 21597950, 20923128, 19865689, 19873241, 19562836, 18666123, 18573329, 18448811, 19115679, 19205193, 19518718, 19220931, 18637251, 18407286, 17743702, 16958224, 17056589, 16690210, 15844086, 14664612, 14506762, 13350818, 12183810, 11746550, 11638990, 11468294, 10557563, 9816942, 10281409, 9846113, 9451393, 9772362, 8557890, 8510084, 9108964, 9287242, 9234524, 8743925, 8144864, 8325826, 7526934, 7731557, 7543756, 6786760, 6862420, 6660273, 6467551, 5236375, 6101440, 6069366, 4682730, 5730874, 5647608, 4983468, 5103927, 5158683, 5359511, 4804139, 4060575, 4605587, 4736742, 4993390, 4712891, 4100749]
5805D100749p10017K64426k83277n1773L19794J19612N56603l37127p03280P74684
5795D050394k12641k65555L94105Q0367m57501n01095J93990J96297M59553l21603
5785C616311J14869N0260j6804K69568M36771p98311J56398j56377n00155j30757
5775C041773J50404o62434Q60083n76475j29908Q90613L28558N51238o28676o05275
5765C219901p08355l49701L61036j66347P60299M19928M8325M28788r16121j45551
5755B952202J49629K51827N83078j89771k64835n6020k33817j71705L7102P68282
5745C825972j99147K80671o40753j41115K37642K78425M86896k57214O0741r80087
5735B952031j049818O76050k12622M52191J171535k96098p01577M71961J15189
$$ y = [4100749, 3390732, 3655158, 3371881, 3320108, 3639902, 3759514, 4316117, 3978990, 3275710, 4050394, 3837753, 3572198, 3966303, 4046670, 3589169, 3088074, 3282064, 3478361, 3937914, 3616311, 3731180, 3781440, 3764636, 4034204, 4470975, 3672664, 3829062, 3672685, 3172530, 3041773, 3192177, 2529743, 3389826, 2813351, 2683443, 3574056, 3902614, 4453852, 3825176, 3219901, 2511546, 2161845, 2522881, 2356534, 3116833, 3536761, 3585086, 4013874, 3097753, 2952202, 3101831, 3353658, 3936736, 3746965, 3482130, 3426110, 3192293, 3020588, 3057690, 3825972, 3626825, 3907496, 3266743, 3125628, 3363270, 3641695, 4128591, 3871377, 3932118, 2952031, 1902213, 2578263, 2365641, 2817832, 3989367, 3693269, 2991692, 3463653, 3578842]
5726C578842k30742l54458O56587j3997m51583K8311j23297r7585M21430K29091
5716C642599l4824K04315n90609K42651o87197L94377N26463o9097j01841L99933
5706C926770q49320K74040J84978J68435j04196k92551q95958m98510P92084J072389
5696C778161k22371n23977j07400k74341N65664j01774k38437P59542r06542l81318
5686B347207P83088j48911P43569L95843m08169p14634M04058K19565m68879M06571
5676C559308M98657n35595J83304k32919o6801K17953j78765l45237k57602M44148
5666C286451q7481J49217o75758J66620M99902o03660K78866m13298L85516P99626
5656C786001p31637j75233k51825K3405N49021l20028J168159n28650q17400K73902
$$ y = [3578842, 3348100, 2993642, 3650229, 3636232, 3184649, 3212960, 3089663, 2992078, 3413508, 3642599, 3607775, 3812090, 3221481, 3464132, 2776935, 3171312, 3697775, 3628678, 3526837, 3926770, 3077450, 3351490, 3536468, 3704903, 3600707, 3308156, 2412198, 1913688, 2705772, 3778161, 3555790, 3031813, 2924413, 2650072, 3215736, 3113962, 2875525, 3635067, 2728525, 2347207, 3130295, 2981384, 3724953, 4120796, 3712627, 2997993, 3402051, 3621616, 3152737, 3559308, 4057965, 3522370, 3705674, 3472755, 3405954, 3623907, 3445142, 3099905, 2842303, 3286451, 3198970, 3348187, 2672429, 2839049, 3338951, 2735291, 3014157, 2600859, 2986375, 3786001, 3054364, 2879131, 2627306, 2650711, 3199732, 2879704, 4047863, 3519213, 2701813, 2975715]
5646B975715J60631R023N6892P52918K05308q33709j18334k19366K52724l079
5636C238723M02272q2598q09143M13050K34007J13226o26510P45007m17522p85045
5626B425467R82804l71961p42313O31049j51019P67004k6302j75027m44464p1474
5616B823764J209414n95813l68718k01521l15917P7449L41567N97194K33483l87000
5606C413902L30113o5386j62868M75655R37470n6110K88122n80838j229760m79865
5596B870435K82475O74382O04351m82177k31505p20409M44838P6469n42520R20275
5586C896614K62189m27152j86580l18256n71464R05332P15745j31720j131641
5577C013067K95240M88246l08724N17717J81986J31057P1971r59569J88179K62147
$$ y = [2975715, 3136346, 3145369, 3202261, 3955179, 4160487, 3326778, 3208444, 2989078, 3241802, 3238723, 3640995, 3558397, 2749254, 3162304, 3396311, 3509537, 2883027, 3628034, 3210512, 2425467, 3408271, 3036310, 2293997, 2925046, 2774027, 3541031, 3514729, 3339702, 2895238, 2823764, 4033178, 3437365, 3068647, 2867126, 2551209, 2628658, 2970225, 3567419, 3800902, 3413902, 3744015, 3678629, 3515761, 3991416, 4928886, 4872776, 5160898, 4580060, 3350300, 2870435, 3152910, 3827292, 4431643, 3949466, 3717961, 2997552, 3442390, 3518859, 2976339, 3896614, 4158803, 3731651, 3545071, 3226815, 2655351, 3560683, 4276428, 4144708, 3013067, 3308307, 3796553, 3487829, 4005546, 4187532, 4318589, 4390560, 3430991, 3619170, 3881317]
5567C881317j122830M3774L61964P91017k28209n99809P52683O7021k19398O5472
5557C793002k16041o27285n29510O58593P91982o50845L28388N66853p59741m72169
5547B883227M41633m4475J90316J19264k74862l93170o4184L88575P05890l95181
5537C557033l38823J39549K43768M69031R6063j2149l58663r0359N91719o72197
5527C624972j77060j27583j080634M94481O8775n4217L70982N60914J81878n00865
5517C361643m15716o4384j46958P27586J47789p3163l95070K44629J99670J56319
5507C742345j13916K8938N64842o22945r140J22984p56830p68052R75198M07464
5497C570888k91305K45034J82560q65933O00500N0502k86750p62734M01936J04149
$$ y = [3881317, 2758487, 2802261, 3164225, 3955242, 3727033, 3127224, 3879907, 3946928, 3727530, 3793002, 3576961, 2949676, 2420166, 3078759, 3870741, 3219896, 3548284, 4115137, 3355396, 2883227, 3324860, 3280385, 3470701, 3589965, 3315103, 2921933, 2857749, 3246324, 3952214, 3557033, 3218210, 3357759, 3601527, 4070558, 4166621, 4154472, 3795809, 3705450, 4297169, 3624972, 3447912, 3320329, 2239695, 2734176, 2802951, 2748734, 3119716, 3680630, 3862508, 3361643, 2945927, 2881543, 2734585, 3462171, 3609960, 3536797, 3141727, 3386356, 3586026, 3742345, 3628429, 3657367, 4222209, 3599264, 3590124, 3713108, 2956278, 2188226, 3163424, 3570888, 3279583, 3524617, 3707177, 2841244, 3441744, 3492246, 3205496, 2442762, 2844698, 2948847]
5487B948847m01557q6348Q94614j72891m13870N21814L04579j011903L90840J158367
5477D132492p08262n96684l77392J051783k62677L40505j042Q3029k29647k38640
5467C193465J48972K92668l39664J0042P0292J37899q52799K1193L88385p12801
5457B357652J296388M94145n31106q93434m70130l01440O69050N54587N35803
5448C711515o43582n59702k41379l37697k11534R25310J161851r87111M19650
5439C237321K62210o620O372K46114p65412n63548l38487N54940L12777O21306
5429C566973P61616l67109p55045M3819m24461q23254J06692J94815K47864L75693
5419B927603L56491m75849K75721q50412N29759J59568p61650o03050N45704k19523
$$ y = [2948847, 2547290, 2460942, 3355556, 3182665, 2768795, 3290609, 3595188, 2583285, 2974125, 4132492, 3424230, 2827546, 2450154, 3501937, 3239260, 3579765, 3578723, 3661752, 3432105, 3193465, 3342437, 3635105, 3295441, 3305483, 3375775, 3513674, 2660875, 2682068, 3070453, 2357652, 3654040, 4148185, 3617079, 2723645, 2253515, 1952075, 2621125, 3175712, 3711515, 3067933, 2508231, 2266852, 1929155, 1717621, 2642931, 3804782, 2817671, 3237321, 3499531, 3492911, 3499283, 3745397, 2979985, 2416437, 2077950, 2632890, 2945667, 3566973, 4328589, 3961480, 3206435, 3250254, 2825793, 2002539, 2109231, 2304046, 2551910, 2927603, 3284094, 2808245, 3083966, 2233554, 2763313, 2922881, 2161231, 1558181, 2103885, 1884362]
5409A884362L81836Q04525O19727J00508n83684o26678J35118K4023n25956Q32163
5399C045944r2060J45319m68199o02043k5040M97612m09261J060544R0555m7500
5389C195871m80986j63582r426j59129J0234J72983M8262o54235l62151N50344
5379B148185J92819l11146M15100l08643J55291M09076m24646J67722l92347o8528
5369A982883J02701p0651K85618N60437P5941l86707N0518o05611N37258o4025
5359B468362l00029Q06660J29392r57957k3841N71309K33004m03497O72784J56785
5349C352972J14695j4290l35347L44839m83238j09109M95397m26028n67461N28126
5339B900556L06414J51949L29058M51812k98491k58467m95270L13591N04373k39237
$$ y = [1884362, 2266198, 3070723, 3690450, 3790958, 3207274, 2580596, 2715714, 2739737, 2213781, 3045944, 2953884, 3099203, 2631004, 2028961, 2003921, 2501533, 2092272, 3152816, 3243371, 3195871, 2714885, 2551303, 2541877, 2382748, 2392982, 2565965, 2614227, 1959992, 1597841, 2148185, 2341004, 2029858, 2444958, 2136315, 2291606, 2700682, 2276036, 2443758, 2051411, 1982883, 2085584, 2014933, 2300551, 2860988, 2936929, 2550222, 2600740, 1995129, 2532387, 2468362, 2168333, 2974993, 3104385, 2146428, 2122587, 2693896, 2926900, 2523403, 3196187, 3352972, 3467667, 3453377, 3118030, 3462869, 2979631, 2870522, 3365919, 2939891, 2372430, 2900556, 3206970, 3358919, 3687977, 4139789, 3841298, 3582831, 3087561, 3401152, 3905525, 3666288]
5329C666288M4183M70329M39317K47555N01912R32511R24536P60701L9051m06300
5319G620083l06204j882k4655N8733m58671N67368J326643J064770J334120P23193
5309A1903498J125726m90890k84493P54914k97691j73506j70453k45033R46004
5300A3068076Q47918J357743M61608j201556m86737M86314N09668Q14424O33714
5291A6491172K13238q30001o34950L1498M49046M03244m97735j389554J118579
5282A5354537J025276K41559J85674n85353k233124n18301J05334m40477m7088
5273A3088037m61602j59117O6901K9345L14453K56007r34170j225892k431940
5264H542022l51886j028768l55580K53014M9184P40773l41000m24974M56014j204256
$$ y = [3666288, 3710471, 4180800, 4620117, 4867672, 5369584, 6302095, 7226631, 7987332, 8026383, 7620083, 7313879, 7311997, 7287342, 7346075, 6887404, 7454772, 8781415, 9846185, 11180305, 11903498, 13029224, 12538334, 12253841, 13008755, 12711064, 12537558, 12367105, 12122072, 13068076, 13915994, 15273737, 15735345, 14533789, 14047052, 14533366, 15043034, 15857458, 16491172, 16704410, 15874409, 15239459, 15270957, 15720003, 16123247, 15625512, 14235958, 15354537, 16379813, 16621372, 16807046, 16221693, 13988569, 13470268, 13575602, 13135125, 13088037, 12626435, 12467318, 12534219, 12563564, 12878017, 13134024, 12199854, 10973962, 8542022, 8190136, 7161368, 6805788, 7058802, 7107986, 7848759, 7507759, 7082785, 7538799, 6334543]
5254F334543m01250n43542j130373M51565l92630o8642n96001l49955R52601n22809
5244C733507j75002M60021p18038k54142j45618K39887N34535P5446j4067J29434
5234C865963n02561j106456J48959O04264m78718O10912k05882K08889l64234
5225B781136J08566L654k37039k3993n96075L97353O76130j173083L81583N36334
5215B854566m47000j89835m02596J31524o0810l511N85697K30277m54842K59330
5205B502800j00036n66253K92176K43681L39379k41552j05034M86860j034695
5196A817326M35679Q17354K58991N0544J18879p14165m83660j38628O85528l38300
5186B509548M46102k98270k54516k94608N4489K11388K47112K47819r22517j83672
$$ y = [6334543, 5933293, 5389751, 4259378, 4710943, 4318313, 4249671, 3653670, 3303715, 4256316, 3733507, 3558505, 4018526, 3300488, 3046346, 2900728, 3140615, 3675150, 3750596, 3736529, 3865963, 3363402, 2256946, 2405905, 3010169, 2531451, 3142363, 2936481, 3145370, 2781136, 2889702, 2893356, 2656317, 2632324, 2036249, 2433602, 3109732, 1936649, 2318232, 2854566, 2407566, 2217731, 1815135, 1946659, 1885849, 1882338, 2468035, 2698312, 2243470, 2502800, 2402764, 1836511, 2128687, 2372368, 2711747, 2470195, 2365161, 2852021, 1817326, 2253005, 3070359, 3329350, 3379894, 3498773, 2784608, 2300948, 2162320, 2847848, 2509548, 2955650, 2657380, 2402864, 2108256, 2162745, 2374133, 2621245, 2869064, 1946547, 1762875]
5176A762875j74689l51778O18726k45834O55789Q18830n60024k4625k36305R3998
5166B356963l44026K33383J003253r56657p7140J72617O5823q2355O3944L50178
5156B785983n37910n47479L31892N00194j87197n64563J66112j05034K93017Q1098
5146B216113m22679J39039j138063M44490j45421k73116J165837m64124p8697
5137A443379p7748L50190M89185p76414K26922p25485j30798J89694M14413N22337
5127A925675n76051L04855L85939o54884N1500L26928N72780l85877l93649K19123
5117A776339J42123r3570q197N27728J52735j11866J27047j088069n67588M13540
5107A270222L92867L92379k83255m99690j74917l06969K45295J634392j02784
$$ y = [1762875, 1588186, 1236408, 1855134, 1609300, 2265089, 3083919, 2523895, 2499270, 2262965, 2356963, 2012937, 2246320, 3249573, 2292916, 2215776, 2388393, 2454216, 2371861, 2435805, 2785983, 2248073, 1700594, 2032486, 2532680, 2345483, 1780920, 1947032, 1841998, 2135015, 2216113, 1793434, 1932473, 794410, 1238900, 1093479, 820363, 1986200, 1522076, 1443379, 1365631, 1715821, 2205006, 1428592, 1655514, 930029, 799231, 988925, 1403338, 1925675, 1349624, 1654479, 2040418, 1385534, 1437034, 1763962, 2336742, 1950865, 1557216, 1776339, 1918462, 1824892, 1816695, 2344423, 2497158, 2385292, 2512339, 1424270, 856682, 1270222, 1663089, 2055468, 1772213, 1272523, 1097606, 790637, 1035932, 2670324, 2567540]
5098B567540k23686N43057q13403P4517K91785k39269j72868j17104L67141j45250
5088B132460K02757j64658R8630J07804l05787K89340j48441l12813L07025K9730
5078B236047L27099j52007k17926M15611j055128L50294O62932j3670l13277J04138
5068B344113l00051n08281R20671L52368m99450r1727o75165O84980N00310J06519
5058B834287M57115j57534m57245J28628K77714n76432n0113L08943K33895R17366
5048C916624L90957M18931M0343m71267k92416J308085L82853M54713O27062N3625
5038F829510P24119K209733J990779K030877J078287J100749j29759q53447K52170
5029A5233018j631563j712472j512006j003730J11020m56620L50822L36623L1691
$$ y = [2567540, 2343854, 2886911, 2073508, 2148025, 2439810, 2200541, 2027673, 1910569, 2277710, 2132460, 2335217, 2170559, 2269189, 2376993, 2071206, 2360546, 2212105, 1899292, 2206317, 2236047, 2563146, 2411139, 2193213, 2608824, 1553696, 1903990, 2566922, 2553252, 2239975, 2344113, 2044062, 1535781, 2456452, 2808820, 2309370, 2217643, 1542478, 2227458, 2727768, 2834287, 3291402, 3133868, 2676623, 2805251, 3082965, 2506533, 2456420, 2765363, 2999258, 3916624, 4307581, 4726512, 4766855, 4295588, 4003172, 5311257, 5694110, 6148823, 6775885, 6829510, 7553629, 9763362, 11754141, 13785018, 14863305, 15964054, 15834295, 14980848, 15233018, 13601455, 11888983, 10376977, 9373247, 9484267, 9027647, 9378469, 9715092, 9746783]
5020I746783Q17053M85550J649567J170224J475855J032169P25125j110860j431418
5011A4560048j985766j266581q18451p04815n79924q70137j597352J30603m36177
5002F431448L05094P07557K51495l53518j43354K98725N27373M12600L75765m68442
4992H344743o74236L18242l49285M53710J51989K02157R40619O32186J088471
4983A1108596K191574J536692J818341L092480K390989J773900P76523o92373
4975B3996722k028164k115954j239203j239209j298782j475377q16967p33815
4967A3049251n22563M19483R50191K64844J403294J827175J403611J038038N67395
4958B0400719p40150j264613j680059j242417j987080k492655p01491n04616j404728
$$ y = [9746783, 10563836, 11049386, 12698953, 13869177, 15345032, 16377201, 17102326, 15991466, 14560048, 12574282, 11307701, 10489250, 9784435, 9204511, 8334374, 6737022, 6867625, 6431448, 6736542, 7444099, 7695594, 7342076, 7198722, 7497447, 8024820, 8437420, 8813185, 8344743, 7670507, 7988749, 7639464, 8093174, 8245163, 8447320, 9387939, 10020125, 11108596, 13300170, 14836862, 16655203, 19747683, 22138672, 23912572, 24689095, 23996722, 21968558, 19852604, 18613401, 17374192, 16075410, 14600033, 13783066, 13049251, 12526688, 12946171, 13896362, 14161206, 15564500, 17391675, 18795286, 19833324, 20400719, 19660569, 18395956, 16715897, 15473480, 13486400, 10993745, 10292254, 9787638, 8382910]
4949H382910k00336k7736p09288m81829J64811J361491o04817R298R11952N18298
4939I324754K62158k41303l00153j503132o81434R96830q59808q8507K47179p75340
4929F381244l27768m8596O565p3753p2377K55025M04733Q03173N05930j57487
4919G676689m51025n35401m50870k77790N45565j19049q32981n4330o02269K52738
4909E151277J061312M56383j63810j96975L84263P39026Q89555N02027o19377
4900H203681k75640M5122q92515K85431p10470q71410L04722j1397J364480L39203
4890G781207r13459l08369l17590J090402R22259J748597N02907k82746j049920
4881I173288q3794M54560L69479l32770P18444M96983Q93164L429139M579877
$$ y = [8382910, 8182574, 8154838, 7445550, 6963721, 7128532, 8490023, 7885206, 7894504, 8806456, 9324754, 9586912, 9345609, 9045456, 7542324, 6860890, 7857720, 6997912, 6909405, 7156584, 6381244, 6053476, 6004880, 6011445, 5937692, 5865315, 6120340, 6525073, 7328246, 7834176, 7676689, 7225664, 6690263, 6239393, 5961603, 6507168, 6388119, 5555138, 5500808, 4898539, 5151277, 6212589, 6668972, 6505162, 6308187, 6692450, 7431476, 8321031, 8823058, 8203681, 7928041, 7973163, 7080648, 7366079, 6655609, 5784199, 6088921, 6077524, 7442004, 7781207, 6867748, 6559379, 6241789, 7332191, 8254450, 10003047, 10505954, 10223208, 9173288, 9089494, 9544054, 9913533, 9580763, 10299207, 10796190, 11689354, 15118493, 19698370]
4872A9698370K478826R20135n42947j726503j837624j312132p52143n83560l89183
4863A5953239Q99209J627730J321011K051892J260640J791896J351523J756464
4855B8013604L134127L390971K491065L368680J147628m44135k431988l292974
4847C5376978k567778k086871q65592p74622l98667o45254j675802o65150p04815
4838B4992427j676168J26001m29324J143900K770405J837221Q22395j098140k962337
4829B5526380j745048j815622k335162k249109k686938q35231j640878J61434
4821A2379826l35452j095862n62151m78837K86129Q2416k98771j58999O73306
4812A0491605M96739P9499J018655J377385Q07370K337350L357069K996561K056235
$$ y = [19698370, 22177196, 23097331, 22554384, 20827881, 18990257, 17678125, 16925982, 16342422, 15953239, 16852448, 18480178, 19801189, 21853081, 23113721, 24905617, 26257140, 28013604, 31147731, 34538702, 37029767, 40398447, 41546075, 41101940, 38669952, 35376978, 32809200, 30722329, 29856737, 29082115, 28683448, 28038194, 26362392, 25697242, 24992427, 23316259, 23442260, 23012936, 24156836, 26927241, 28764462, 29586857, 28488717, 25526380, 23781332, 21965710, 19630548, 17381439, 14694501, 13859270, 12218392, 12379826, 12044374, 10948512, 10386361, 9907524, 10193653, 10276069, 9977298, 9818299, 10491605, 10988344, 11067843, 12086498, 13463883, 14271253, 16608603, 19965672, 22962233, 25018468]
4803B5018468J645541J74524j037974j040200k052304j092651j551975k634074
4795A7429355n66372j679686o50749J113790P48627J629639J311440J798690K099892
4786B3234626J060548Q89510l68514j332641j972211k550212k503043k623598
4778A3834465j789811m10474j346738q53276o42694j372276n45920J62808N74053
4769G610137j013296m21870R2170j014452n10760Q67261p52756j31329N46562
4760E271667j66119o4455k01137j61386n72538m20782K0352J1049J23053l43485
4750C496219j89325K19072k76311N48256M9964l23001j0460J29659o3728j66719
4740C413626P28423l21719p39760M22472O81235l42016l84722J72569n7053m3986
$$ y = [25018468, 26664009, 26838533, 25800559, 24760359, 22708055, 21615404, 20063429, 17429355, 16862983, 15183297, 14532548, 15646338, 16394965, 18024604, 19336044, 21134734, 23234626, 24295174, 25184684, 24816170, 23483529, 21511318, 18961106, 16458063, 13834465, 12044654, 11634180, 10287442, 9434166, 8791472, 7419196, 6873276, 7036084, 7610137, 6596841, 6174971, 6267141, 5252689, 4741929, 5609190, 4856434, 4725105, 5271667, 5105548, 5041093, 4839956, 4678570, 4106032, 3685250, 3705602, 3716651, 3839704, 3496219, 3306894, 3525966, 3249655, 3797911, 3847875, 3524874, 3514414, 3644073, 3580345, 3413626, 4142049, 3820330, 3080570, 3503042, 4184277, 3842261, 3457539, 3630108, 3573055, 3529069]
4730C529069J48853J51533k26306k91418j55902p07905k27251M29242P78999J48653
4720C577567L22578J22828K21808m53936J02241k94734j40626k19867O9031k09806
4710C097084m34176M42648j84001P20848j35860P40342j70478j42228L071L78175
4700D315425N57719j0336l29119Q13053k35849J79526O14993m56871N67473O91850
4690F707864R75184J133914K34547M96194O03585j18644K068310J442377K956419
4681A6499750M137565J864116R27379k68172q61655j182527j841107n11347p77807
4672A7986195r65926k69805j054670n67744p31217r8111M6988j344809m42141
4663A2558760j239781j132777m64234r0160l29256m43787K16594q3284m27618
$$ y = [3529069, 3677922, 3829455, 3603149, 3311731, 3155829, 2447924, 2220673, 2649915, 3428914, 3577567, 3900145, 4022973, 4244781, 3790845, 3893086, 3598352, 3457726, 3237859, 3306890, 3097084, 2662908, 3105556, 2921555, 3642403, 3506543, 4246885, 4076407, 3934179, 3937250, 4315425, 4873144, 4862808, 4533689, 5346742, 5110893, 5290419, 5905412, 5448541, 6016014, 6707864, 7683048, 8816962, 9051509, 9547703, 10151288, 10032644, 12100954, 13543331, 16499750, 20637315, 22501431, 23428810, 23160638, 22298983, 21116456, 19275349, 18764002, 17986195, 17020269, 16750464, 15695794, 15128050, 14396833, 14298722, 14345710, 13000901, 12558760, 11318979, 10186202, 9721968, 9631808, 9302552, 8858765, 9075359, 8992075, 8564457]
4654H564457k13996R60524Q99375j7309M01671L65528K55993R29490R72219K481562
4644A5599514K049765J567354K353180K174516J453814L30075p10237k16081j039766
4635B3562134q30629m59367J1379j18687l82090M3400o82350j246695L11199Q89974
4625B1098268J393870R95330L62529j275928n70475j538834j218519r49146K12850
4616A8509945J182959m55501J34080L91222R29169J349355J704555K124035Q84359
4607B6754178j319753j361462j887216j920252j638796j168274q78163j157493
4599A5422769o83650p9361J53048N07951K52435K01847J85258M3853n03119L14216
4589A5815247Q05653J259862J049812J999224J490940M38065K50349j99602J16357
$$ y = [8564457, 8350461, 9310985, 10210360, 10193051, 10594722, 10960250, 11216243, 12145733, 13117952, 15599514, 17649279, 19216633, 21569813, 23744329, 25198143, 25528218, 24817981, 24601900, 23562134, 22731505, 22272138, 22283517, 22164830, 21782740, 21826140, 21143790, 19897095, 20208294, 21098268, 22492138, 23487468, 23849997, 22574069, 22003594, 20464760, 19246241, 18297095, 18509945, 19692904, 19237403, 19371483, 19762705, 20691874, 22041229, 23745784, 25869819, 26754178, 25434425, 24072963, 22185747, 20265495, 18626699, 17458425, 16580262, 15422769, 14739119, 14659758, 14812806, 15320757, 15573192, 15775039, 15960297, 16004150, 15501031, 15815247, 16620900, 17880762, 18930574, 20929798, 22420738, 22858803, 23109152, 22909550, 23025907]
4580B3025907L93376M80490Q79334J663549L475787M616720M598797L843678J493696
4571D4471334k13206k736120l124478l453542l176432k001547j494495L07913
4563B8579427R02074K692192K261256m66715j976176j235253j490454k88851J335053
4554C0312553K307320K960386K102200l22943k280810l939207m096389k684672
4546B4358438j805051j205336m69570K06733J102662K245839K049782j01456j406483
4537B4975558k595814l684963k062875j595870j797689j204879o38674p29673
4529A0665121j108572k39897l44231l9145J15566P33264J635m7177M53946R77110
4519A1167620J152615J354705J082638J423012J74657n55071o69685k289446o86651
$$ y = [23025907, 23419283, 23899773, 24779107, 26442656, 29918443, 34535163, 39133960, 42977638, 44471334, 44258128, 41522008, 38397530, 34943988, 31767556, 29766009, 28271514, 28579427, 29481501, 32173693, 34434949, 33968234, 31992058, 30756805, 29266351, 28977500, 30312553, 32619873, 35580259, 37682459, 37359516, 35078706, 31139499, 27043110, 24358438, 22553387, 21348051, 20878481, 21085214, 22187876, 24433715, 26483497, 26382041, 24975558, 22379744, 18694781, 16631906, 15036036, 13238347, 12033468, 11394794, 10665121, 9556549, 9316652, 8972421, 8933276, 9048842, 9782106, 9783741, 9736564, 10190510, 11167620, 12320235, 13674940, 14757578, 16180590, 16355247, 15800176, 15130491, 12841045, 12154394]
4510A2154394j87833p25053j436769j131266p50172q43971m45769R8793j004726
4501E727628L44992r70616l83516M92392l89848n11369q0687m85255L0259P2588
4491C846568j63617J8391O65337L8205l08334L68671j234837M5J44178n1208l03283
4480C020116M89906K79783j76023J68361p8721m00641J121843j76236q18621r6377
4470C333390J38765P5848o86090J61218j23645p3013M36348k2855L179j96872
4460C046273o98945J002417J91763n4790j98923N2578m72557q53410O79840O666
4450B700912J11311N6018n35229M57145j68581k80657L61111P8348K10349j19399
4440B871328L72344q10347n42457L61976k7608M29775m56477j70991N64354p58472
$$ y = [12154394, 11966561, 11241508, 9804739, 8673473, 7923301, 7079330, 6633561, 6732354, 5727628, 6072620, 5102004, 4718488, 5210880, 4821032, 4309663, 4228976, 3743721, 3773980, 3846568, 3682951, 3701342, 4366679, 4404884, 4096550, 4465221, 3230384, 3230429, 3374607, 3323399, 3020116, 3510022, 3789805, 3613782, 3782143, 3703422, 3302781, 4424624, 4248388, 3429767, 3333390, 3472155, 3548003, 2861913, 3023131, 2899486, 2826473, 3262821, 3239966, 3243145, 3046273, 2347328, 3349745, 3541508, 3486718, 3287795, 3340373, 2867816, 2014406, 2694246, 2700912, 2812223, 2868241, 2333012, 2790157, 2621576, 2340919, 2702030, 2780378, 2990727, 2871328, 3243672, 2433325, 1890868, 2252844, 2225236, 2655011, 2198534, 2027543, 2591897, 1833425]
4430A833425m46942Q88804j47012K02138K68122j57037m14857P92950j18731k31292
4420B469568r57123J40893O71496q6023L77994m13021m99047R2129k20351N21554
4410B098069N75667n6189o42828o1070N40804l64938P85206K38432l07147J61837
4400B967843r5024m78777j23095j39514M75306M25960J452j4752J649749M07989
4390E077137J342166L97717j675828J06319p62875o84958n33181p82882P01624
4381C185239n32112l99319J61127o67085L93187j44309R77315m91989m63180R7856
4371B116730l89100K41106n49005L56215L32242l02826J68187j55671o39253R3679
4361A272304J96972P36660l3557N45691p04049K55814L4880m29599R46003o4255
$$ y = [1833425, 1386483, 2275287, 2128275, 2330413, 2598535, 2441498, 2026641, 2819591, 2700860, 2469568, 1512445, 1653338, 2324834, 2238811, 2616805, 2203784, 1704737, 1796866, 1576515, 2098069, 2673736, 2617547, 1974719, 1913649, 2454453, 2089515, 2874721, 3113153, 2806006, 2967843, 2872819, 2394042, 2270947, 2131433, 2606739, 3032699, 3034151, 3019399, 4669148, 5077137, 6419303, 6817020, 5141192, 5247511, 4484636, 3799678, 3266497, 2483615, 3185239, 2653127, 2253808, 2414935, 1747850, 2141037, 1996728, 2974043, 2482054, 2018874, 2116730, 1727630, 1968736, 1419731, 1775946, 2108188, 1805362, 1973549, 1817878, 1178625, 1272304, 1469276, 2205936, 2172379, 2718070, 2014021, 2269835, 2304715, 1875116, 2821119, 2756864]
4351B756864p33737L1195J06882M59127l64228K60629o2266r90316L8357k52530
4341A249977Q93128J40600M2116j14927j14050L57017N96134j94582k07584l34932
4331B312897J02439J10833L56458J49322m65983O9289j2077k84983j9718J02320
4321B420797k91787J80391M53327l48516K2356M70813l3522n71176p83267J004112
4311B523528M17306L70271L01513k644l16390q77218O44758N34139k99430p1625
4301C224208Q94966P7419n87542K17287L5192p16852J73862L44782M60953K71365
4291D395640j64086N77499n55707m53379l74206L94632K60986P86982O50681m47334
4281E071708l07234O88844J17749J15814n97072N26338M4014j046819O18766k60915
$$ y = [2756864, 2023127, 2054322, 2161204, 2620331, 2256103, 2516732, 2454466, 1464150, 1502507, 1249977, 2143105, 2283705, 2325821, 2210894, 2096844, 2453861, 3049995, 2855413, 2647829, 2312897, 2415336, 2526169, 2882627, 3031949, 2565966, 2635255, 2623178, 2338195, 2318477, 2420797, 2129010, 2309401, 2762728, 2414212, 2436568, 2907381, 2873859, 2302683, 1519416, 2523528, 2940834, 3311105, 3612618, 3609974, 3293584, 2416366, 3061124, 3595263, 3295833, 3224208, 4119174, 4196593, 3609051, 3826338, 3861530, 3144678, 3318540, 3663322, 4124275, 4395640, 4231554, 4809053, 4253346, 3799967, 3425761, 3820393, 4081379, 4868361, 5519042, 5071708, 4764474, 5453318, 5571067, 5686881, 5089809, 5616147, 5660161, 4613342, 5232108, 4971193]
4271D971193k23203J54206K03762l20682l13719p442P38133M99586N62341L22275
4261F586450l10068r29204n1167O85848n87820K13304N73870J09902L01394j55919
4251F436590O86845O61779K66900N1487j87908j09380P67624J216378J119599
4242A0909914J000762K87995Q24683J975966J809726K611077K744830M064011
4234B6228964M386133M830315M276539M478456L382316J059511J539013J836912
4226E2018159J78036Q48135J135193j74339j150868k147799k598173k356891j891845
4217D3859608j249792R38010J220462L311065L038020P19361m57682l05188l13537
4208E0760327j71243J01070J208844j522902k261650l313921m495485n150791
$$ y = [4971193, 4747990, 4902196, 5105958, 4785276, 4471557, 4464115, 5202248, 5701834, 6264175, 6586450, 6276382, 5347178, 5296011, 5981859, 5394039, 5607343, 6181213, 6291115, 6592509, 6436590, 7123435, 7785214, 8052114, 8103601, 7915693, 7806313, 8573937, 9790315, 10909914, 11910676, 12198671, 13023354, 14999320, 16809046, 19420123, 22164953, 26228964, 30615097, 35445412, 39721951, 44200407, 47582723, 48642234, 50181247, 52018159, 52196195, 53044330, 54179523, 54005184, 52854316, 50706517, 48108344, 45751453, 43859608, 42609816, 43547826, 44768288, 48079353, 51117373, 51836734, 51379052, 51073864, 50760327, 50589084, 50690154, 51898998, 50376096, 48114446, 44800525, 40305040, 35154249]
4200C5154249n122675k363336l066375l496535k371764j831419k360704j563920
4192A2977521o20455j21542j200086q62853n06973o38172j048656M32128l84886
4183H026026k27914r8552j86688j065017j63675J114092k75521k71090j71004
4174F680657m2857k96587j45207P3925j23731n94043L39507J44557r28620J57927
4164E265528K79o17285P62424N69614r04148L70617m50642l28019j58815R513
4154D519066J220379N5076k55917K57596J56062m92254L41419J567747N88006
4145G957180K31521J562861J395536M741196Q903006J1505124N806450k915935
4137C9186939p107041o036085o092369m352577k529154j422020j460148j388009
$$ y = [35154249, 30031574, 27668238, 24601863, 21105328, 18733564, 16902145, 14541441, 12977521, 12357066, 12235524, 11035438, 10172585, 9665612, 9027440, 7978784, 8410912, 8026026, 7798112, 7699560, 7512872, 6447855, 6284180, 7398272, 7122751, 6851661, 6680657, 6637800, 6341213, 6196006, 6269931, 6146200, 5552157, 5891664, 6036221, 5107601, 5265528, 5265807, 4648522, 5410946, 5980560, 5076412, 5447029, 4996387, 4668368, 4509553, 4519066, 5739445, 5794521, 5538604, 5796200, 5952262, 5460008, 5801427, 7369174, 7957180, 8188701, 9751562, 11147098, 15888294, 24791300, 36296424, 42102874, 39186939, 32079898, 26043813, 19951444, 15598867, 13069713, 11647693, 10187545, 8799536]
4129H799536j167394j754857r88246L74003r2448k9958K71172m20223n04471M6225
4119D533339N68666k692J60844m51137j070309o23619L50090l93475J147122J20914
4109D339743l05593k75214n04168k67941M77541M80285P377L47259o76927o32208
4099B990154M70647j70764k44916J095885j19238r96620m85679L3161l82080J036917
4089C227467N61700m63336m48068k48707J38126N62296j61278L01023M85459J73953
4079D128635j007632k67458P44035m20388L1286L95341J61458L8075m71715M19945
4069C751582l62483k61180Q59803M20095m03853m89381j46605M72022o1287l62965
4059C415748N75945m68290R3799l5695K99955J36764P6975k03598N67989m9591
$$ y = [8799536, 7632142, 5877285, 4889039, 5263042, 5170594, 5140636, 5411808, 4991585, 4487114, 4533339, 5102005, 5099313, 5260157, 4809020, 3738711, 3115092, 3465182, 3071707, 4218829, 4339743, 4034150, 3758936, 3254768, 2986827, 3464368, 3944653, 3952030, 4299289, 3622362, 2990154, 3460801, 3290037, 3045121, 4141006, 4021768, 3025148, 2539469, 2572630, 2190550, 3227467, 3789167, 3325831, 2877763, 2629056, 2767182, 3329478, 3168200, 3469223, 3954682, 4128635, 3121003, 2853545, 3597580, 3177192, 3208478, 3603819, 3765277, 3803352, 3331637, 3751582, 3389099, 3127919, 3987722, 4407817, 4003964, 3514583, 3367978, 3840000, 3778713, 3415748, 3991693, 3523403, 3617202, 3581507, 3881462, 4018226, 4095201, 3891603, 4459592, 4410001]
4049D410001j81255m3794k69755j358766L99728Q91886K63225k49301L02440j56385
4039D008024k95675M41749o54251L2990L00946o7198M16113n26879O46015O49905
4029D951739j371883K29050M34944k05759L72005n7616l64520j92074Q6335L76914
4019D259135O5209n99423O61471K2123l20772Q52401P154N81659L1631l94922
4009E165666P04690R27012J055712J36808O11806J735480Q45506J691230R73738
4000A3847648J213454Q94758K33710N43226O99676J1395P61041K91512l845p6355
3990A8416220r02944j182063m91454j109930j063433J1934j511267q32653m48227
3981A0886183p65405k87246P33946j5092j2794k51920M87122P1530N26963J232808
$$ y = [4410001, 4228746, 4184952, 3915197, 2556431, 2956159, 3848045, 4111270, 3861969, 4164409, 4008024, 3712349, 4154098, 3499847, 3532837, 3833783, 3766585, 4182698, 3655819, 4301834, 4951739, 3579856, 3808906, 4243850, 4038091, 4410096, 4352480, 3987960, 3795886, 3882221, 4259135, 4324344, 3724921, 4386392, 4408515, 4087743, 4940144, 4947298, 5528957, 5560588, 5165666, 5870356, 6797368, 7853080, 7989888, 8601694, 10337174, 11182680, 12873910, 13847648, 15061102, 15955860, 16189570, 16732796, 17432472, 17443867, 18204908, 18496420, 18492575, 18416220, 17513276, 16331213, 15839759, 14729829, 13666396, 13678330, 12167063, 11334410, 10886183, 10120778, 9833532, 10567478, 10552386, 10539592, 10287672, 10774794, 10846324, 11373287, 12606095]
3971A2606095L15917P84625L25749O11984K75427J43078N17145j42661m47948
3962A4989411L60592n31549l17689q67457q53829j57246j284949r47332j44112
3953A0245840m56055p15799j11876r88554j85791n48998j0889l90423l51869j18640
3943F366946j56816O43024o0909l54199R59021j49728n01329L47932j27863k55212
3933F710867j3878O69913k32762o21176L13435J63484J70413j37691o64759Q24029
3923G181875M3382o80679M49900P77739r48668j80152Q35955J35295r11514K42459
3913F945592Q3554K6793J29243M09000n47536k70171m37612J663p6817n76324
3903E687385J05768R82833J90602L26471q3370m78178O82834j3138o59033l62885
$$ y = [12606095, 12922012, 13706637, 14032386, 14644370, 14919797, 15062875, 15580020, 15437359, 14989411, 15350003, 14818454, 14500765, 13633308, 12779479, 12622233, 11337284, 10389952, 10245840, 9789785, 9073986, 8962110, 7973556, 7787765, 7238767, 7227878, 6837455, 6485586, 6366946, 6210130, 6853154, 6792245, 6438046, 7397067, 7247339, 6746010, 7093942, 6966079, 6710867, 6696989, 7366902, 7134140, 6512964, 6826399, 6989883, 7160296, 7022605, 6357846, 7181875, 7225257, 6544578, 6994478, 7772217, 6823549, 6643397, 7479352, 7614647, 6703133, 6945592, 7029146, 7055939, 7185182, 7594182, 7046646, 6776475, 6338863, 6340526, 6263709, 5687385, 5793153, 6775986, 6966588, 7293059, 7209689, 6731511, 7414345, 7401207, 6742174, 6379289]
3893F379289K90672J3356m4585J010234M0545k56164L44134q3826p61738J32938
3883G064855M22316L88281o5389o35931p7084l00320l5505J42108N30566J1610
3873G445507n01581L4688J275162l64320K15541j24149k23792n23970M50285M02333
3863H085704L80539J16640M81523L38912l09906q8696J24302L84197K9228L3356
3853I575799l06995o4878N26912O73646K07675Q66829M60763n31540K2867J155826
3843A2586904J34463N62633J191942l21847m51132O40139P23817J003527J295612
3834A7366058J416741K41763J167079K393227J581389J455943J100105J450995
3826B8173300J514307K144845J658660K644456J938257J772187J852487J878824
$$ y = [6379289, 6669961, 6683317, 6638732, 7648966, 7689511, 7433347, 7777481, 7693655, 6931917, 7064855, 7487171, 7875452, 7810063, 7174132, 7097048, 6796728, 6761223, 6903331, 7433897, 7445507, 6943926, 6978614, 8253776, 7889456, 8104997, 7980848, 7757056, 7233086, 7683371, 8085704, 8466243, 8582883, 9064406, 9403318, 9093412, 9004716, 9129018, 9513215, 9542443, 9575799, 9268804, 9203926, 9730838, 10404484, 10612159, 11478988, 11939751, 11408211, 11431078, 12586904, 12721367, 13284000, 14475942, 14154095, 13702963, 14343102, 15066919, 16070446, 17366058, 18782799, 19024562, 20191641, 22584868, 24166257, 25622200, 26722305, 28173300, 29687607, 31832452, 33491112, 36135568, 38073825, 39846012, 41698499, 43577323]
3818D3577323J324980J487532J745699J368071K427663K399853P73066K091827
3810E7196014K691792J204566L275330K225450J593893J213457N95732l28397
3802F9667837q2308M47373k45374r03413j365795j740361n41002n37646p21959
3793F3977352k1652q84927q13128j278889j231588j771660k374315k404623k134376
3784E1062194k304251j598044j673891k237821k170663k098351k256919j618193
3776C5104061j743436j932051p31012j168957n90936n20581n61716M71169Q39769
3767B9166310R27053J532615J037076M1718Q88285J410048J067651J649726K215923
3758C9936405J056743J354053J368552J326946P21938J552052J550077P26370
$$ y = [43577323, 44902303, 46389835, 48135534, 49503605, 51931268, 54331121, 55104187, 57196014, 59887806, 61092372, 64367702, 66593152, 68187045, 69400502, 69996234, 69667837, 69585529, 70032902, 69787528, 68884115, 67518320, 65777959, 65236957, 64699311, 63977352, 63955700, 63070773, 62257645, 60978756, 59747168, 57975508, 55601193, 53196570, 51062194, 48757943, 47159899, 45486008, 43248187, 41077524, 38979173, 36722254, 35104061, 33360625, 31428574, 30697562, 29528605, 28937669, 28417088, 27855372, 28326541, 29166310, 30093363, 31625978, 32663054, 32704772, 33593057, 35003105, 36070756, 37720482, 39936405, 40993148, 42347201, 43715753, 45042699, 45764637, 47316689, 48866766, 49593136]
3750D9593136P13148P70230Q30633j11337J2099M80095J72640m88160j117251
3741E0855233r03283o81437j511209L29792q9005o33253j757008k030349j898987
3732D1680494j545096r79435q22267j659839j185282j304468l83692q95290o23479
3723C2281646o72941r06014n32307l42582N8371l91299l22791o42169l94243N88404
3713B8724075R60595K13170O44764L76950j25198J90988J813974L57473j57906
3704C2998885J35774P0238O85257J033019J537805J219032N59650O81188L00927
3695C9221775J44950j08080O35212R09423J199498J331690N71377N72202J120760
3686D5598807m92067O79185K60339j26543j86395n47632N91779p95987m88512
$$ y = [49593136, 50306284, 51076514, 51907147, 51795810, 51807909, 52288004, 52460644, 51972484, 50855233, 49951950, 49270513, 47759304, 48089096, 48000091, 47366838, 45609830, 43579481, 41680494, 40135398, 39155963, 38333696, 36673857, 35488575, 34184107, 33800415, 32905125, 32281646, 31608705, 30702691, 30170384, 29827802, 29886173, 29494874, 29172083, 28529914, 28135671, 28724075, 29684670, 29897840, 30542604, 30919554, 30794356, 30985344, 32799318, 33156791, 32998885, 33134659, 33204897, 33890154, 34923173, 36460978, 37680010, 38239660, 38920848, 39221775, 39366725, 39258645, 39893857, 40803280, 42002778, 43334468, 43905845, 44478047, 45598807, 45106740, 45785925, 46046264, 45919721, 45733326, 45185694, 45777473, 44981486, 44492974]
3677D4492974j93927j726252j587411j173214p80101p15956o75051l86619j524899
3668C5729544r67474j372747p98001o07022j845037p76187j28998k50093o64417
3659B8319568m1031L45147l40252N48842Q30207J553060O50873K03044K411454
3650C4480912J699081P98260J554895J222281J520582J239588K639383K579716
3642D7734698J208506L34928K09637j76392M36480J731127K067245J076373J023577
3633E5646179O62299M46286L47595K0239N32176l82044j09618O75411M65123n21947
3623E7781699o49420n71561j401120j165088j571321j769037j588235j425131
3615D7640786n84990q57047o51687r68872k006497j292012l78339O47383J447490
$$ y = [44492974, 44299047, 42572795, 40985384, 39812170, 39032069, 38316113, 37641062, 37254443, 35729544, 34762070, 33389323, 32591322, 31984300, 30139263, 29363076, 29234078, 28983985, 28319568, 28278537, 28623684, 28283432, 28832274, 29662481, 31215541, 31866414, 32069458, 34480912, 36179993, 36978253, 38533148, 39755429, 41276011, 42515599, 45154982, 47734698, 48943204, 49278132, 49487769, 49311377, 49747857, 51478984, 53546229, 54622602, 55646179, 56308478, 56754764, 57102359, 57122598, 57654774, 57272730, 57163112, 57838523, 58303646, 57781699, 57132279, 56560718, 55159598, 53994510, 52423189, 50654152, 49065917, 47640786, 47055796, 46198749, 45547062, 44578190, 42571693, 41279681, 40901342, 41548725, 42996215]
3606D2996215J171649R71809o16308J13009N9515q5750k35642n90607K81167M74433
3596D4539490M65358J177256P11367K81270j74746M56662O72814J06957o43341
3587D7593087j360725n17462j780233j031753K1600n56857J126162R44154O16989
3578D5054962N53555N53807Q15398J45254J044718J625953J667690J629169J394061
3569E4484567J733717R82348J247002O38387p3915q0384n44599j29215k76641
3560E7981267j029446q35604j270303k040133j343568l60842q86314j033764J65836
3551D9347129P4346R49884O59142Q89585N63690N21653J73236k3450p08615o93312
3541E1753288k19415j977378k168566q50780r30043n82465n18764m68203K74378
$$ y = [42996215, 44167864, 45139673, 44523365, 44636374, 44695889, 44610139, 44374497, 43783890, 44065057, 44539490, 45004848, 46182104, 46893471, 47174741, 46999995, 47456657, 48129471, 48236428, 47593087, 46232362, 45714900, 43934667, 42902914, 42924514, 42367657, 43493819, 44437973, 45054962, 45608517, 46162324, 46977722, 47122976, 48167694, 49793647, 51461337, 53090506, 54484567, 56218284, 57200632, 58447634, 59086021, 59012106, 58931722, 58387123, 58257908, 57981267, 56951821, 56116217, 54845914, 52805781, 51462213, 51101371, 50215057, 49181293, 49347129, 49421475, 50371359, 51030501, 51920086, 52483776, 53005429, 53178665, 53155215, 52446600, 51753288, 51533873, 49556495, 47387929, 46537149, 45607106, 45024641, 44505877, 44037674, 44312052]
3532D4312052j438389O2383K2113q54572L0320j53595m20827r6809r4512R19415
3522D2287579M15861O02689J883039J805438J862750J922163K221946J873298
3514E4874763O66024R20500J445507N58398J188761K031735J671400K060830K523340
3505F7941258K743025K692948L584543M921206N824535O983059P294285O601009
3497A08585868O362696N391655M613210K585853P60651j048520k337681m276315
3489A20637417n923019n832997n399442l531004l565754l819266l604641l461461
3481H5499833l287241k363404k961565k724436l570782l351244l188366l166167
3473F0886628l193293l091550k660134j579753k163447k059598j967925k030458
$$ y = [44312052, 42873663, 42936046, 42958159, 42103587, 42133907, 41980312, 41559485, 41462676, 41368164, 42287579, 42703440, 43306129, 45189168, 46994606, 48857356, 50779519, 53001465, 54874763, 55540787, 56461287, 57906794, 58465192, 59653953, 61685688, 63357088, 65417918, 67941258, 70684283, 73377231, 76961774, 81882980, 87707515, 94690574, 101984859, 108585868, 114948564, 120340219, 124953429, 127539282, 128299933, 127251413, 124913732, 120637417, 114714398, 108881401, 103481959, 99950955, 96385201, 92565935, 88961294, 85499833, 82212592, 79849188, 76887623, 74163187, 70592405, 67241161, 64052795, 60886628, 57693335, 54601785, 51941651, 50361898, 48198451, 46138853, 44170928, 42140470]
3465D2140470k247221j878949j094020j630013j147961j035290j179051m96431
3457C1431534m36226J39065J016823l85351m19048j42770q61877m07236L34665
3448C0269579L5445o02699O71606L74851N2362N64517l95099l66110K17726L42306
3438C1164484K45964l80049j65599P80584P10400Q57175L54844K38714K67164
3429C4073681j80867m11761K67629J31482J128390J98953j24377P30195l09739
3420C5503586R8895M55245L21262L96567m56200L03667L47722p19290m58457k32740
3410C5560257J94477q48030r63907j37244q06131n13014M88615L85524L28431
3401C3688978k64545J000933J344986J605296L13034l78822K49830L45304p574
$$ y = [42140470, 39893249, 38014300, 36920280, 35290267, 34142306, 33107016, 31927965, 31431534, 30995308, 31134373, 32151196, 31765845, 31346797, 31204027, 30342150, 29934914, 30269579, 30305024, 29702325, 30373931, 30748782, 30801144, 31365661, 30970562, 30604452, 30822178, 31164484, 31410448, 31030399, 30864800, 31645384, 32355784, 33212959, 33567803, 33806517, 34073681, 33892814, 33481053, 33748682, 33880164, 35008554, 35207507, 35083130, 35813325, 35503586, 35602481, 36057726, 36378988, 36775555, 36319355, 36623022, 36970744, 36251454, 35792997, 35560257, 35754734, 34906704, 33942797, 33805553, 32999422, 32486408, 32975023, 33360547, 33688978, 33424433, 34425366, 35770352, 37375648, 37688682, 37309860, 37559690, 37904994, 37897420]
3392C7897420N09543L28577M8171M21494L34226O14920P89469N02045m91440L51792
3382D1306217j283544l50243L93927K04467M79099P75612L63113J141387j58551
3373D2871484r32552j167479j587144j351622j598316n49145k94322p85138j212252
3364C3393514J50195J26175L81954M75406k82541M93191K72773J002888P89790
3355C6803345J303320J151792J161475J820257J078138K165371L796339L197602
3347E2477639M035709L264536K370643K065099j58397Q1726O41476J377940K107520
3338F8263891K534668J967332P98640k32957q52765j070001j138448k297505j778644
3329F6194211j899179j355897n87936r73159r82422j342064k403041l060962k587188
$$ y = [37897420, 38406963, 38735540, 38783711, 39205205, 39539431, 40154351, 40943820, 41445865, 40954425, 41306217, 40022673, 39672430, 40066357, 40270824, 40749923, 41525535, 41888648, 43030035, 42871484, 41938932, 40771453, 39184309, 37832687, 36234371, 35685226, 35390904, 34605766, 33393514, 33543709, 33669884, 34051838, 34527244, 34244703, 34737894, 35010667, 36013555, 36803345, 38106665, 39258457, 40419932, 42240189, 43318327, 45483698, 49280037, 52477639, 56513348, 59777884, 62148527, 64213626, 64055229, 64136955, 64778431, 66156371, 68263891, 70798559, 72765891, 73564531, 73331574, 72478809, 71408808, 70270360, 67972855, 66194211, 64295032, 62939135, 62351199, 61378040, 60395618, 59053554, 56650513, 53589551, 51002363]
3320E1002363k829332k516702j447561j337034k84568k23442k16733R83230J226873
3311D4357094J780941J981227J950604K865936K813159K054234L233779L489393
3303F4526367L584094M953504M606709L843261L895450L474854M654652N469287
3295I9008178O783774Q793260J0943988J5445978K1621107K8332417L4586401
3288B25515103L3484245K2417760M152059j2206713k2210654k6038324k4591914
3281B00521562k2573598j8866976j5369785j2773260r037704o552363o010674
3274A09337202n466989n511127n347552m130192l364358l095478o03548K65535
3266H2083493Q84820J714109K569869K280777K182436M913499P070151P420254
$$ y = [51002363, 48173031, 45656329, 44208768, 42871734, 42587166, 42363724, 42146991, 43130221, 44357094, 46138035, 48119262, 50069866, 52935802, 55748961, 57803195, 61036974, 64526367, 68110461, 73063965, 77670674, 81513935, 85409385, 88884239, 93538891, 99008178, 105791952, 114585212, 125529200, 140975178, 162596285, 190928702, 225515103, 258999348, 281417108, 285569167, 273362454, 251151800, 225113476, 200521562, 177947964, 159080988, 143711203, 130937943, 121900239, 115347876, 109337202, 103870213, 98359086, 93011534, 88881342, 85516984, 82421506, 81817958, 82083493, 82968313, 84682422, 87252291, 89533068, 91715504, 96629003, 103699154, 111119408]
3258A11119408J1237448J6587778K3878572L2516356L8018669L5846207K2802768
3251B92007206N241854j0986249j8216899j7019755j4157880p636428k759806
3244B26472043l519731n642134r168121j3415149j5333253j4373250j1735299
3237A53285106q821047n860689m241111j065731J05051R90144L303913N025055
3229A42720691O933565R333580J2603356J5994748J8465132K0522818K2721234
3222B49295124K4589775K6153796K3740954J5870800K847907r167359j6894294
3215C16436703j9347331j8721038j7303748j2390498o930153k32542P740240J3771174
3207B63022807J4677807Q393379l575771j6376613k3081947k6822334k6497368
$$ y = [111119408, 122356856, 138944634, 162823206, 195339562, 233358231, 269204438, 292007206, 297249060, 286262811, 268045912, 251026157, 236868277, 229231849, 226472043, 222952312, 217310178, 208142057, 194726908, 179393655, 165020405, 153285106, 144464059, 138603370, 134362259, 133296528, 133401579, 134391723, 137695636, 142720691, 149654256, 158987836, 171591192, 187585940, 206051072, 226573890, 249295124, 273884899, 300038695, 323779649, 339650449, 342498356, 333330997, 316436703, 297089372, 278368334, 261064586, 248674088, 241743935, 241511393, 249251633, 263022807, 277700614, 286093993, 282518222, 266141609, 243059662, 216237328, 189739960]
3200A89739960k3252595j9765861j6346977j2890549j0722447q149424o439348
3193I2172759m782973m304500l175033k803862k735887p10449j011144j86496
3185G2462415K5658k95595P6319j67689L80975J338594J685796J733016P22907
3176G7962396P30694l20804p75107q45041q96885r92572j843881j232650r88367
3167G0797783j257991r14861j108791r00609r97594q53779k76871J25984M171
3158F4617442K00135J600249R53985O01639J573681J744263K815212M174345Q426368
3149H6707319J3076807J2246081N236209l321053p860524j0565268j0404486q396320
3141G6718765o934809n062411l778396l221910k879311k572871j562565k018721
$$ y = [189739960, 166487365, 146721504, 130374527, 117483978, 106761531, 98612107, 92172759, 87389786, 83085286, 79910253, 77106391, 74370504, 73660055, 72648911, 72462415, 72488073, 72192478, 72268797, 72101108, 72482083, 73820677, 75506473, 77239489, 77962396, 78693090, 78372286, 77597179, 76752138, 75855253, 74862681, 73018800, 71786150, 70797783, 69539792, 68624931, 67516140, 66615531, 65617937, 64764158, 64487287, 64613271, 64617442, 64817577, 66417826, 67371811, 67973450, 69547131, 71291394, 74106606, 78280951, 86707319, 99784126, 112030207, 117266416, 113945363, 106084839, 95519571, 85115085, 76718765, 69783956, 64721545, 60943149, 57721239, 54841928, 52269057, 50706492, 48687771]
3133D8687771o27405J2872n91562J04557o11813j29399J17613N47288J98057K34005
3123D7941984J152944O57270K083104L128474K343789K909575L284397O08482
3115F4110019j41390L06700N00101j54406K926099M014991N022383P233807J0017551
3106I3835855R816135R127834P800042L203982j335999n708210r044685j0451311
3098I7243643j1181089j0243598q474969o863306o674848n378181k580791l541024
3090D2305837k691895j816761j869729j425385j540564q71046o64371p87673J32582
3081C0770995n65429j81444o91030K11588M89302j83480O23207M66179M69131
3072C1409019R58161J055343J155272J496664J419912K144342K306593L832047
$$ y = [48687771, 48060366, 48073238, 47481676, 47586233, 46974420, 46845021, 46962634, 47509922, 47707979, 47941984, 49094928, 49752198, 51835302, 54963776, 57307565, 60217140, 63501537, 64110019, 63968629, 64275329, 64775430, 64621024, 67547123, 71562114, 76584497, 83818304, 93835855, 103651990, 112779824, 120579866, 123783848, 122447849, 116739639, 107694954, 97243643, 86062554, 75818956, 67343987, 60480681, 53805833, 48427652, 45846861, 42305837, 39613942, 37797181, 35927452, 34502067, 32961503, 32090457, 31426086, 30638413, 30770995, 30205566, 30024122, 29333092, 29544680, 30033982, 29850502, 30473709, 30939888, 31409019, 32367180, 33422523, 34577795, 36074459, 37494371, 39638713, 41945306, 45777353]
3064D5777353L094828L509410N173195M799686O556005Q401943J0169171J4840385
3056A02321976J8497115K1716833K5347738K2869754J7537496Q066979J51657
3049B16509548q497548j2103153j1187272q025338l192349L404891J0151573J5814388
3041B02874740J5577927J1566273K467034o767221j5909666k1358910k2099114
3034A66351063k2298800k0096765j7145774j4076575j2015323r579356p463594
3027F3674876o362105n151391m327410m969412k342341l137873k976118j017251
3019C3390975j715087k188366j489542j850906q22341l05908j478456p75413k36087
3010B2528869j712013o75001n63673o18791j42298j25371p33003m02191m20137
$$ y = [45777353, 48872181, 52381591, 57554786, 62354472, 68910477, 77312420, 87481591, 102321976, 120819091, 142535924, 167883662, 190753416, 208290912, 216357891, 216509548, 208012000, 195908847, 184721575, 176696237, 173503888, 176908779, 187060352, 202874740, 218452667, 230018940, 232485974, 225718753, 209809087, 188450177, 166351063, 144052263, 123955498, 106809724, 92733149, 80717826, 71138470, 63674876, 57312771, 52161380, 47833970, 42864558, 40522217, 37384344, 34408226, 33390975, 31675888, 29487522, 27997980, 26147074, 25324733, 25018825, 23540369, 22764956, 22528869, 20816856, 20141855, 19578182, 18959391, 18817093, 18691722, 17958719, 17556528, 17136391]
3001A7136391q25808n14714n67656n74251N26525J09756p29221j000240j379673
2992A2181109L54393k04248K05685O40850p37248o68773L69388k99322J70901
2983A2012735M67868q25680j275732j61010j18765M87929L06451k58937l38745
2974A0296114q47062q47408N93199R8141K75227l31839j85599j1644K87121k41371
2964I084879O96694j09950j647025N18497q05n82402k41840K13582n12823L55339
2954G774146M5040p6194j151722J53569J57098L36957l89472O20245k5662r35796
2944F508209k98693O0099K54395K80671k92540O37097j23688j4225K07384m3504
2934G175205m00945o52607M44228J84924r2831l4913k75806n42649k51707j60985
$$ y = [17136391, 16310583, 15795869, 15228213, 14653962, 15180487, 15290243, 14561022, 13560782, 12181109, 12535502, 12331254, 12536939, 13177789, 12440541, 11771768, 12141156, 11841834, 12012735, 12480603, 11654923, 10379191, 10218181, 10099416, 10587345, 10893796, 10634859, 10296114, 9449052, 8601644, 9194843, 9292984, 9568211, 9236372, 9050773, 9039129, 9326250, 9084879, 9781573, 9671623, 8024598, 8543095, 8542290, 7959888, 7718048, 7931630, 7418807, 7774146, 7819186, 7742992, 6591270, 6744839, 6901937, 7238894, 6849422, 7469667, 7444005, 6508209, 6209516, 6269615, 6524010, 6804681, 6512141, 7149238, 7025550, 7011325, 7218709, 7175205, 6774260, 6121653, 6565881, 6750805, 6657974, 6623061, 6347255, 5804606, 5552899, 5391914]
2924E391914R5472L18K0632l50114k34725N90721k51102R7650P23162l51549r89099
2913D743280L20911j48156m53220L1248m68169L81568k85881j53919K27253J55186
2903D350101k43020O8533k11633P0417o77348O52813J63151o17706K77227L46798
2893D179333j19530l32839L98973J68509K6324n85350k32362O547N64344J33370
2883D207319n22406o3373L07758R4961k9651k44051M58094q6713p45934N02230
2873C878234K73497J8071j29361l73630j74014k94859L81356P68944m03818M5122
2863C989542J56374q6537l92081J99402K17796j07438p50812J00710L60860k6175
2853C661641J7473j68038M3712q20593J81343N3267n14284J10O85803M9906m02273
$$ y = [5391914, 5487386, 5487704, 5508336, 5158222, 4923497, 5514218, 5263116, 5360766, 6083928, 5732379, 4743280, 5064191, 4916035, 4462815, 4494063, 4025894, 4407462, 4121581, 3967662, 4194915, 4350101, 4107081, 4175614, 3963981, 4034398, 3357050, 4009863, 4173014, 3555308, 3832535, 4179333, 4059803, 3726964, 4125937, 4294446, 4320770, 3735420, 3503058, 3509605, 4073949, 4207319, 3684913, 3621540, 3929298, 4024259, 3994608, 3750557, 4208651, 4121938, 3376004, 3878234, 4151731, 4169802, 4040441, 3666811, 3492797, 3197938, 3579294, 4348238, 3944420, 3989542, 4145916, 4059379, 3667298, 3866700, 4084496, 3977058, 3226246, 3326956, 3687816, 3661641, 3679114, 3511076, 3554788, 2734195, 2915538, 2968805, 2454521, 2454631, 3140434, 3190340, 2788067]
2842B788067L97504l83243Q2924j18561J85155M4165J06116P1231p00150k99767
2832B173441O96392n80720N46501k68760m55854O82963o57027M06687K4314k72138
2822B295799M1110j12507O35007k00621J34239k7044p77891L1939p7739N11572
2812B453864n01484n57846O78846k87225m50237L72446J022814j08805p62650
2803A859723N62505m59247j62170n64488K54442P93223j216157R12646K18993
2794B199470n07462n22679N658P42480L41415k48587q064K4607r93672r5577O86879
2783A624468L82133n133l06746r12716O17631m59032j29075O29146K7701M76283
2773A944660P7904N23859p69492J19176M90699k59721R42398J02749j04854o74183
$$ y = [2788067, 3185571, 2802328, 2885252, 2766691, 2951846, 2996011, 3102127, 3173358, 2473208, 2173441, 2869833, 2289113, 2835614, 2566854, 2111000, 2793963, 2136936, 2543623, 2567937, 2295799, 2336909, 2224402, 2859409, 2658788, 2793027, 2765983, 1988092, 2020031, 1942292, 2453864, 1952380, 1394534, 2073380, 1786155, 1335918, 1708364, 2731178, 2622373, 1859723, 2422228, 1962981, 1800811, 1236323, 1490765, 2283988, 1067831, 1980477, 2199470, 1692008, 1169329, 1174987, 1917467, 2258882, 2010295, 2002231, 2026838, 1033166, 937589, 1624468, 2006601, 2001468, 1694722, 782006, 1399637, 940605, 811530, 1440676, 1468377, 1944660, 2022564, 2546423, 1776931, 1896107, 2386806, 2127085, 3069483, 3172232, 3067378, 2393195]
2763B393195q13365o5831L18660N98574L87389j67586k77695K53254N69786o1120
2753C135261N68177r65356q90680K75985p87496O33308K82725n87812M3586o76435
2743A031263p1452K9062q9264k69583J15894L20924M44469K57371J13684m93996
2733A388372k40581J56843j40715J63172J23758n62837Q619M16567J56009Q22606
2723B291813o00800j36725m70375o59892J057815K01544k14410J66770O9740n22051
2713A183429n00670M5973Q85162k37612k30157L47698j13829k20946J24318J92173
2703A475539O1578j54381L09778l64140o60769n81596O1983M15382L81232K08295
2693A152901M07441r7159p23856j46613J27686J017116n13550k82067N00209k7743
$$ y = [2393195, 1579830, 1513999, 1832659, 2431233, 2818622, 2651036, 2373341, 2626595, 3196381, 3135261, 3703438, 2738082, 1847402, 2123387, 1335891, 1969199, 2251924, 1664112, 1707698, 1031263, 959811, 988873, 899609, 630026, 745920, 1066844, 1511313, 1768684, 1882368, 1388372, 1147791, 1304634, 1163919, 1327091, 1450849, 888012, 896631, 1313198, 1469207, 2291813, 1691013, 1554288, 1083913, 424021, 1481836, 1683380, 1468970, 1635740, 1705480, 1183429, 682759, 728732, 1613894, 1376282, 1146125, 1493823, 1379994, 1159048, 1283366, 1475539, 1537117, 1382736, 1692514, 1328374, 667605, 86009, 147992, 563374, 944606, 1152901, 1560342, 1463183, 739327, 592714, 720400, 1737516, 1223966, 941899, 1442108, 1414365]
2683A414365k95724P33107L56365m5955r4827o99368k34372j00284M41330J96729
2673A671366K64732n58259m75148j259J36129Q7057O7647M9316k30574M68519
2663A479526j40223P43787m08214k82259j0889J85157n68301j83094K1743K61520
2653A098753J70018k72412K76838k01131q3358O22698j31614J52614L05452o64228
2643A273630q78335N8684O91502Q02033J48513M6460k9992o89983o87241Q625
2633G43896J036344j11994J54351j006234M13283K71698m2361K93102J51557p41170
2623A162472K95754N14165q88247q1627P08975Q7484K18334J07185o14178k61047
2613A249270m47979L45917M588M74252J85903K11746n97282o68842P05377r2867
$$ y = [1414365, 1118641, 1851748, 2208113, 2162158, 2067331, 1367963, 1133591, 1033307, 1474637, 1671366, 1936098, 1377839, 902691, 901432, 1037561, 1124618, 1192265, 1241581, 1011007, 1479526, 1339303, 2083090, 1674876, 1392617, 1381728, 1566885, 998584, 815490, 837233, 1098753, 1268771, 996359, 1273197, 1072066, 988708, 1611406, 1479792, 1632406, 1937858, 1273630, 395295, 453979, 1145481, 1947514, 2096027, 2142487, 2112495, 1422512, 735271, 743896, 1780240, 1668246, 1822597, 816363, 1229646, 1501344, 1458983, 1752085, 1903642, 1162472, 1458226, 1972391, 1084144, 1002517, 1711492, 1798976, 2017310, 2124495, 1510317, 1249270, 801291, 1147208, 1151796, 1626048, 1811951, 2023697, 1426415, 757573, 1462950, 1370083]
2603A370083J50667K44508o49254O4295n73760J59173L33284J05898L62160l02647
2593A264407l72873R3805L4277N12921p68336j26646K94563L61927j74518q74
2583A118653N09986k31926l62308k78449j120924L40114O61478N55364m01570
2574G90418K82956M87362n80967L71167j98098n87775J50533l44762J511L97339
2564G69684K25813N22691p89698l50072J93433j64270J05714P36743L25345R0874
2554A666257m56164l59346o81680J58624K31797K59950l00691Q31274q88985N68219
2544A029255m79695L10393N98577l50255m28599J65388m58791l23253J015590
2535A078610R99039m83296j162294m06538l58286L50873J7418J506725J13708
$$ y = [1370083, 1520750, 1765258, 1116004, 1180299, 606539, 765712, 1098996, 1204894, 1567054, 1264407, 891534, 985339, 1019616, 1532537, 764201, 637555, 932118, 1294045, 1119527, 1118653, 1628639, 1396713, 1034405, 755956, -364968, -24854, 636624, 1191988, 790418, 1073374, 1560736, 979769, 1350936, 1152838, 565063, 715596, 370834, 372345, 769684, 995497, 1518188, 728490, 378418, 571851, 407581, 513295, 1250038, 1575383, 1666257, 1210093, 850747, 169067, 327691, 559488, 819438, 518747, 1350021, 461036, 1029255, 549560, 859953, 1458530, 1108275, 679676, 845064, 386273, 63020, 1078610, 2077649, 1594353, 432059, 25521, -332765, 18108, 35526, 1542251, 1655959]
2526A655959o20144o78514j02629K53018L01313O26427L06498n47930n01214q7239
2516F05545M68318N7951j4070M61581m35981p60158j6811P4997R26836J77798
2506A546006J93585o650j008900k9202L39457l42354O66655J89292j13419K4302
2496A458772l27019j60495r9630P95677r9522M22467J94043j125903k18170n89111
2486B51109K28424Q72714O59120l94324o98471j48523n02669J037488M8928l77779
2476I76017J25562k28153k22618K71240Q3693O53388l03214m5405k39065K13866
2466A285311P2091r7899m53761M7060J74609j46935J26923j09475J72802J63254
2456A233980j55370n8834O6821j7662j56926j89416O44894j44998L29234n30160
$$ y = [1655959, 1035815, 357301, 254672, 507690, 809003, 1435430, 1741928, 1193998, 692784, 605545, 1073863, 1131814, 1117744, 1579325, 1143344, 383186, 366375, 441372, 1368208, 1546006, 1739591, 1732941, 724041, 694839, 1034296, 691942, 1358597, 1547889, 1434470, 1458772, 1131753, 971258, 871628, 1667305, 1567783, 1990250, 2184293, 1058390, 840220, 251109, 479533, 1352247, 2011367, 1617043, 918572, 770049, 267380, 1304868, 1353796, 976017, 1101579, 873426, 650808, 922048, 1005741, 1659129, 1355915, 1310510, 1071445, 1285311, 1357402, 1259503, 805742, 852802, 1027411, 880476, 1007399, 897924, 1070726, 1233980, 1078610, 1019776, 1086597, 1068935, 912009, 722593, 1367487, 1222489, 1551723, 1021563]
2446A021563n19432J02436m72936L78717N75201q92214N68210Q97738l05935l0784
2436A322564k27975o94489J7924p969P29935J87255l76615J82972L66364l20798
2426A179168N08539L47371k46982O3416K3051K63295L01289o77153N0703m20327
2416A392370L37780n58050J2689L85063n77570J419378K90497n64249Q15006j136155
2406A816759r23293k28073J6088M80189M023Q77078j138n0743p6376J64185k69144
2395A809555j75866l03677L59048Q28392M24432o32686N58504p15281K895P66365
2385B921681J94282l15433O00O46233q31370q5668Q31660Q650J26225K90751O85067
2374D472678M19037l48614Q12560M35873k58999J201895K057183J100441J072793
$$ y = [1021563, 502131, 604567, 131631, 510348, 1085549, 193335, 761545, 1659283, 1353348, 1322564, 1094589, 400100, 418024, 410055, 1139990, 1327245, 950630, 1133602, 1499966, 1179168, 1687707, 2035078, 1788096, 1851512, 1874563, 2137858, 2439147, 1761994, 1812697, 1392370, 1730150, 1172100, 1184789, 1569852, 992282, 2411660, 2702157, 2137908, 2952914, 1816759, 893466, 665393, 681481, 1161670, 1165693, 2042771, 2041633, 1990890, 1914514, 2078699, 1809555, 1633689, 1330012, 1689060, 2517452, 2941884, 2309198, 2867702, 2152421, 2155316, 2921681, 3115963, 2800530, 2801130, 3447363, 2615993, 2530325, 3361985, 3370635, 3496860, 3787611, 4472678, 4891715, 4543101, 5355661, 5791534, 5532535, 6734430, 8791613, 9892054, 10964847]
2365A0964847P78297L3230m1753J358668Q06660J294930K167016K047310L708290
2356B3117495N662610Q035253J6343732L3220772N1464045L6266437n495023k6775773
2348A41839548k9856386k6376367j9812325j4347168j0736983p796575o449080
2341B6464664m622817l190468l308722j069311k60923j9035o39406j399077j373694
2332A0581211j240747o26838q63721n46742l77648o87205m55023k32366o19519
2323D931402o8279Q0145Q4900o77060P5054j5139q3199q49130k60423J181201
2313D399472m09987p66265n19390k1821O20850J08781M58363l10012q86567O37019
2303C310443m37469j39175K24433J42053l34371p22722N06733L19468k56551M6686
$$ y = [10964847, 11743144, 11776374, 11734621, 13093289, 13899949, 15194879, 17361895, 19409205, 23117495, 28780105, 36815358, 53159090, 86379862, 137843907, 174110344, 168615321, 141839548, 111983162, 85606795, 65794470, 51447302, 40710319, 32913744, 26464664, 21841847, 18651379, 15342657, 14273346, 14012423, 13993388, 13353982, 11954905, 10581211, 9340464, 8713626, 7849905, 7303163, 6925515, 6238310, 5783287, 5550921, 4931402, 4863123, 4943268, 5028168, 4351108, 4426162, 4411023, 4327824, 3478694, 3218271, 4399472, 3989485, 3223220, 2703830, 2682009, 3302859, 3411640, 3870003, 3559991, 2673424, 3310443, 2872974, 2733799, 2958232, 3100285, 2765914, 2043192, 2549925, 2869393, 2612842, 2659528]
2293B659528k48705K61409m62442k63736Q36181j52377n8290l34117m72411j38749
2283A626291L20952L33190p28489M44334k20826O4145N90811m48321l58467o98267
2273I25353O34324J85347n11861O26561l37929j87048K84095J84235J87831n21324
2263A469584j67949k13981q4343j17138k8324O67345K56757j59120N3221n74865
2253A101187M0836L84868L12846o94374O3853J67800n1739l95652k16345O87115
2243A400395N67036o8671j8589l86006j71523l26808l86280J0553Q5094J93769
2233H98970o99457J391528M66368o18651j14213P3062k12641K30029j26358j60077
2223A128560l12310m41407K61456K14531K90348K3751O87325k23383p7368p7868
$$ y = [2659528, 2410823, 2672232, 2209790, 1946054, 2782235, 2629858, 2571568, 2237451, 1765040, 1626291, 1947243, 2280433, 1551944, 1996278, 1775452, 1839597, 2430408, 1982087, 1623620, 925353, 1559677, 1745024, 1233163, 1859724, 1521795, 1334747, 1618842, 1803077, 1990908, 1469584, 1301635, 1087654, 1003311, 886173, 857849, 1525194, 1781951, 1622831, 1676052, 1101187, 1142023, 1526891, 1839737, 1145363, 1209216, 1377016, 1325277, 929625, 713280, 1400395, 1967431, 1898760, 1880171, 1494165, 1322642, 995834, 609554, 620107, 705201, 898970, 199513, 1591041, 2057409, 1438758, 1324545, 1397607, 1184966, 1414995, 1288637, 1128560, 816250, 374843, 636299, 850830, 1141178, 1164929, 1852254, 1628871, 1551503, 1473635]
2213A473635k65011P25966j89608o52288j86483n62059N55967M73176m4027l95946
2203I33322N09195K81574o74355N13699p04593Q0969O89264o17727m8909j58519
2193H03920l16960L41501j64009J3672m36192j25017j0839J12930M57642k68063
2183D08585r108m15136J96280J34532n6230K39129J87057O72096R1453j253013
2173A95645m25398L28461R9219J96031Q58736q75058n12366J08302m15617P08551
2163B66506L04936J66532N56317j21820p23457M94534k32228k62421m65904k69804
2153b86809r2707j43648L58852J332074p19804M14540Q4073P3134l33377o49845
2143C6483L7857j64344j88517Q66352L00777m17888q8466J41192M88270o66327
$$ y = [1473635, 1208624, 1934590, 1744982, 1092694, 906211, 344152, 900119, 1373295, 1329268, 933322, 1442517, 1724091, 1049736, 1563435, 858842, 939811, 1629075, 1011348, 962439, 803920, 486960, 828461, 664452, 678124, 241932, 116915, 106076, 219006, 676648, 408585, 399477, -15659, 180621, 315153, 258923, 498052, 685109, 1357205, 1448658, 195645, -229753, 98708, 197927, 393958, 1252694, 377636, -134730, -26428, -442045, 266506, 571442, 737974, 1294291, 1172471, 449014, 943548, 711320, 448899, -17005, -286809, -379516, -523164, -164312, 1167762, 447958, 862498, 946571, 1019705, 686328, 36483, 74340, -90004, -278521, 587831, 888608, 470720, 382254, 523446, 1011716, 345389]
2133C45389M31901K3307m44548n7979P79515K28569r6139n07269m036k08342l14463
2122A75905J69130P02016l91911J87693o50849p67693P75308J04270K20872j89084
2112C35657j99006J86535m68205j44877P76009k03267M17683M65832n20873q32597
2102a87109R4354L14889K09446m09144m14317j17468K5498O84967O88390L43432
2092A232938o02581m22456J1935k06725N07832M95571m88398L03853j81815K0517
2082F70671j38766J89182k57319l47585O62121q8942l39616L50729J330j65858
2072E35947L38185o9809j32340L0371l56586p09426L66530n445R14054M61275
2062A372756j034128j63859R70700R6609k91520j35872l76246j11941N3276J56993
$$ y = [345389, 777290, 800597, 356049, 298070, 1077585, 1306154, 1210015, 702746, 698710, 490368, 175905, 345035, 1047051, 655140, 842833, 191984, -575709, 199599, 303869, 524741, 335657, 136651, 323186, -145019, -289896, 486113, 282846, 700529, 1166361, 645488, -187109, -92755, 222134, 431580, 22436, -391881, -509349, -483851, 201116, 889506, 1232938, 630357, 207901, 219836, 13111, 520943, 1016514, 528116, 831969, 650154, 670671, 531905, 721087, 463768, 116183, 778304, 689362, 349746, 700475, 701805, 535947, 874132, 804323, 671983, 702354, 345768, -363658, 2872, -2573, 911481, 1372756, 338628, 174769, 1145469, 1242078, 950558, 814686, 438440, 326499, 379775, 536768]
2052E36768K09814k62899l88931K86591J00732M66140k78871L58404n08338r83420
2042d64010K02800R03356n32068k14822K63872O94111k27897k60921K01042k4325
2032E41138m36358K22344K44893o39112J84409M01101j31391k59563L63852J32524
2022F23837P3168m6429N2954j54052K88980l08379K78275K5063n45995Q38795
2012A126217n31997q49764K75026M81631P60471n22976M9080M8226o80211k0517
2002A35186J35480k09893J01742M05115m14111M75544P70940j40498m3291q14433
1992D01781l38251K36310j58231P45276j8705J82444K3043k47753m00705p5818
1982C49391R22525m99902J9625O19829o51593k68314L31732k35413j44068J27163
$$ y = [536768, 746582, 483683, 94752, 381343, 482075, 948215, 669344, 1027748, 519410, -464010, -261210, 642146, 110078, -104744, 159128, 853239, 625342, 364421, 565463, 541138, 104780, 327124, 572017, -67095, 117314, 518415, 387024, 127461, 491313, 623837, 697005, 650576, 703530, 549478, 838458, 530079, 808354, 833417, 287422, 1126217, 594220, -255544, 19482, 501113, 1261584, 738608, 787688, 835914, 155703, 135186, 270666, 60773, 162515, 567630, 153519, 629063, 1400003, 1259505, 1216214, 401781, 63530, 299840, 141609, 886885, 868180, 1050624, 1073667, 825914, 425209, 349391, 1271916, 772014, 791639, 1411468, 759875, 491561, 823293, 587880, 443812, 570975]
1972E70975N22434j82203p50996o75171R92354J67218L61527L7337j120610P7409
1962B74k19514L01053P82105k20339j95053k30977l08860m63012K09369O02131
1952B57177j01715P58829j62382j4528n90882j63993L41291N05398M90586Q129
1942A327910j70119k97387o23196n17337N52992K29275m62863m40737O71838q30128
1932e59752J32991J166007P59088p04272j022124r54137L12156j89226M26901
1923f32368J168801L10710j0429m46800p91753l13360l0370N07864Q72908j98611
1913D36592l63985k42529k36159k85290R71737Q1419m52493K88385p03723N0907
1903d55139K62104M16152J91251n24978j10108r2340k36875J3550L4767M93158
$$ y = [570975, 1093409, 911206, 160210, -514961, 477393, 644611, 1006138, 1043475, -77135, 274, -219240, 81813, 863918, 643579, 448526, 217549, -91311, -554323, -344954, 257177, 155462, 914291, 751909, 737381, 146499, -17494, 323797, 829195, 1319781, 1327910, 1157791, 860404, 237208, -280129, 272863, 502138, 39275, -401462, 270376, -559752, -426761, 739246, 1498334, 794062, -228062, -1182199, -870043, -1059269, -632368, 536433, 847143, 836714, 389914, -401839, -715199, -745569, -237705, 635203, 436592, 72607, -169922, -406081, -691371, 280366, 361785, -90708, 197677, -506046, -455139, -193035, 223117, 414368, -110610, -220718, -313058, -549933, -536383, -501616, -8458]
1893h458L37331M2411m04051k17405m92035j030126R94755O34869L35973n08457
1883c15193l03552k12653l00934Q41748P20066l92397K79657m17233n1734R329
1873a42896O02089m3940l85259N60024q18960l29417N40279M50371j44832l31003
1863d3544K6996o5112K7778J00350j61691k05758l85799L27563j6098j75497K08373
1852c62439j77059J83358K78019P24562J31809o30810j59688J22602k53321r8115
1842b41082m5456n91768L37592Q03032R0917o476n00574k15061L49402j93232
1832b12706L37968J91671j11568n87125K92872l40977J81146O81595m97010L46273
1822B82139L01152n95323k36599M94306Q5079m01297N9761L31196r54169P54208
$$ y = [-8458, 328873, 371284, -32767, -250172, -742207, -1772333, -777578, -142709, 193264, -315193, -618745, -831398, -1132332, -290584, 429482, 37085, 316742, -100491, -152225, -142896, 459193, 415253, 29994, 590018, -228942, -558359, -18080, 432291, 287459, -43544, -16548, -81660, -53882, 46468, -115223, -320981, -706780, -379217, -395315, -570812, -362439, -539498, -356140, -78121, 646441, 778250, 147440, -12248, 110354, -142967, -241082, -286538, -878306, -540714, 262318, 353235, 346759, -153815, -368876, -19474, -212706, 125262, 316933, 205365, -381760, -88888, -429865, -248719, 432876, -64134, 282139, 583291, -12032, -248631, 245675, 330754, -70543, -10782, 320414, -633755, 120453]
1812A20453o6560J6002Q6530L34683K43078n80865n25707Q9208J82632J269565
1802A169019N3860n92259O24495r04643l12607P34186j81162j58604Q1330k17761
1792B95854j82357O55663k19238p69760M73731K27768k84846O251J76962J58829
1782E38857l18790M30367M75088k14989m72531j70621M4679n79787J65048R01391
1772G98712O9740j111901m26369N15650M24537j10939N10135p22647l73594P5196
1762c51480P11508j26214J4979K326m6125o66508p4611L90369p7806J57990O17408
1751E51836J30754p50811J75291k66620J716N53571j1984r9557l3946q07023O7471
1740d89302j23359P28706M47698K32942q6493j029431k12772O54656R68094R383
$$ y = [120453, 53893, 69895, 156425, 491108, 734186, 153321, -372386, -283178, -100546, 1169019, 1222879, 630620, 1255115, 350472, 37865, 772051, 590889, 432285, 513615, 295854, 113497, 769160, 549922, -219838, 253893, 481661, 196815, 203066, 380028, 538857, 220067, 650434, 1125522, 910533, 438002, 267381, 312060, -267727, -102679, 798712, 868452, -243449, -669818, -154168, 270369, 159430, 669565, -53082, -426676, -351480, 360028, 233814, 248793, 251119, 204994, -461514, -536125, -145756, -223562, -65572, 551836, 682590, -68221, 107070, -159550, -157834, 395737, 383753, 284196, 250250, -556773, -489302, -612661, 116045, 563743, 796685, 710192, -319239, -532011, 122645, 1090739, 1100122]
1730A100122j00394o59499l3266o0918K75036L16148l82372l97365M12869O62919
1720A133280J90189j065637j80459j26073k1041J061578k8011m55826j53317q2096
1710B72587Q827m65791J42519L12099K24916M16318n2810n50338O4810K03686
1700E76823j90100l71900J16827J87761M09488n48014J0241J3745L25810K1637
1690E52318J14748L05981j101815l7238N04269q8897M18434l34643m06745K10197
1680A36609M94875J68230k81733j15644o22394M10989J000592j95007q93242l25885
1670b22610l16740N38792j19232O3722P51042J9422j028153P10262j22640n48081
1660b74216N44605O31594n72186m5144L86487m1510l29326Q61867j98462j61251
$$ y = [1100122, 999728, 340229, 306963, 246045, 521081, 837229, 454857, 57492, 470361, 1133280, 1323469, 257832, 77373, -48700, -69741, 991837, 963826, 508000, 354683, 272587, 281414, -184377, -41858, 270241, 495157, 911475, 858665, 308327, 373137, 576823, 386723, 14823, 131650, 319411, 728899, 180885, 191126, 204871, 530681, 552318, 667066, 973047, -128768, -166006, 338263, 249366, 667800, 333157, -73588, 136609, 631484, 799714, 517981, 402337, -220057, 190932, 1191524, 996517, 103275, -222610, -539350, -558, -119790, -56068, 694974, 714396, -313757, 396505, 273865, -274216, 270389, 901983, 329797, 284653, 671140, 629630, 300304, 1162171, 963709, 802458]
1650H02458n6208l68081N49729n65832l83267O4851P5872M99332k06488K722N76121
1639I91209m73512n9295l79517o77188K11379O25866l74183L6443J04046J94495
1629A99743K77392M01306n03447k87041n27555n6308N13879P46883J14553o84086
1619A95319n0380m93213J72490k20635N26383J722R2363J64498N9404r29790O58108
1608A76269o3313j021718J64382J017236K07828P60091m8935k52593k66063m48427
1598B24757K82963L58460j81352r95351R3275L88155K74380q0180j8647j00620
1588B45840k2520k78614K84804O5197n19347N26624J030081O410n52297j49844
1578F36334k93599m24922J09300M96902L83844K29214K10610j25903j019376n85952
$$ y = [802458, 746250, 378169, 927898, 362066, -21201, 43650, 119522, 618854, 412366, 415088, 991209, 517697, 458402, 78885, -598303, -386924, 238942, -135241, -98798, 5248, 199743, 477135, 878441, 374994, 87953, -439602, -495910, 17969, 764852, 879405, 195319, 144939, -348274, -175784, -396419, 129964, 131686, 224049, 388547, 447951, -481839, 176269, 112956, -908762, -744380, 272856, 480684, 1240775, 1191840, 939247, 673184, 224757, 507720, 866180, 684828, -310523, -217248, 170907, 445287, 365107, 346460, 245840, 223320, -55294, 229510, 294707, -224640, 301984, 1332065, 1338475, 786178, 636334, 342735, -82187, 27113, 524015, 907859, 1137073, 1347683, 1221780, 202404, -383548]
1568c83548L79867R32621o6508p96475K64349j02608k26830K87022K77168j06140
1558D58918k33447K99367N42647j175026l77264O33868R22063L20863J47741J37306
1548A677036m60398j267728M48549L30596k26319m01347P28438j85425m59158
1539A84244m32507j79045N46369K32557L50118k22975n56216J07917L92325N26570
1529I49357l11758o7986M62688k79155l67720J70716l25245O08136j13491K9628
1519G55170o0604l14788L97942K35622L28642J175n58842p7613J39361r01066
1509e5001J195564k15761r24149M0374R64961l90528Q8343j9440N66395p42798
1499E07960K52212o30497J36420K51541o25809M60436J52655l35630m65864L41240
$$ y = [-383548, -3681, 928940, 862432, 65957, 330306, 227698, 868, 287890, 565058, 458918, 225471, 524838, 1067485, -107541, -484805, 149063, 1071126, 1391989, 1539730, 1677036, 1216638, -51090, 397459, 728055, 501736, 100389, 828827, 643402, 184244, -248263, -427308, 119061, 351618, 701736, 478761, -77455, 30462, 422787, 949357, 637599, 569613, 1032301, 753146, 385426, 556142, 230897, 839033, 725542, 755170, 694566, 379778, 777720, 1013342, 1341984, 1343159, 784317, 706704, 846065, -55001, 1140563, 924802, 653, 41027, 1005988, 615460, 703803, 684363, 1250758, 507960, 760172, 129675, 266095, 517636, -108173, 352263, 504918, 169288, -296576, 44664]
1489D4664k78039n19684J142629J244158j151269m55667o18796P29883L8260J006000
1479A182139M76151n14989p96337m19324J35682N77768r17316Q78991l76577n95602
1469c69414P81717p4029m99234k1732N50382k93909O3651L57691L55029o07953
1459B42199o76032J28245O0138R7224N3504k98984n86494j73738J036618J158864
1449A041544j47727j0073k8910p43232k6637k0873k85021k78146O78359J41678
1439C20962N57035j61508l94859j041778P90362N42345Q57649N6278k88828j128093
1429A09565l2610q04311O5499N78135O51772j87474n23231L98673m743n53289
1419c02014O36926m55858k78257N36682r55466Q75794j1092r2714Q74159N95023
$$ y = [44664, -233375, -753059, 389570, 1633728, 482459, 26792, -592004, 137879, 176139, 1182139, 1658290, 1143301, 346964, -72360, 63322, 641090, -276226, 602765, 226188, -369414, 412303, 338274, -160960, -182692, 367690, 73781, 137432, 495123, 850152, 242199, -433833, -305588, -245450, -148226, -94722, -393706, -980200, -1153938, -117320, 1041544, 893817, 883744, 854834, 111602, 84965, 64092, -220929, -499075, 179284, 320962, 877997, 716489, 321630, -720148, 70214, 612559, 1470208, 1526486, 1237658, 109565, 76955, -727356, -661857, -83722, 568050, 380576, -142655, 256018, 251275, -302014, 334912, -120946, -399203, 137479, -817987, 57807, 46715, -45999, 828160, 1423183]
1409A423183m72237n48845j499632O95298o10350M02443R98368J227498j099344
1400E16382r36580N78542l0227k45003R19442m14591m71250L10507k0720o1555
1390A44947j39486M58073M05528k86837l47778N05254p34764l59514J97433P66783
1380F09639M40987q84208j342962N55985p50399N00486J753582n07045o33512
1371b57447M73490j14420l80521r7099M32365j4618j69956l83071K80340J25197
1361a05740K95221M05346J115748p48697p00873j61551n79408o08013L10244O01395
1351a76328O52582o17708O37856J93238j589552N07337N43311j20151J41493l65067
1341a92989q53285N08031N1440J26043J56770N55307o45756J52866k50019J63457
$$ y = [1423183, 950946, 402101, -1097531, -402233, -1012583, -610140, 388228, 1615726, 516382, -420198, 158344, 128117, -116886, 802556, 387965, -83285, 227222, 206502, 144947, 5461, 463534, 869062, 582225, 234447, 739701, 4937, -354577, -157144, 609639, 1050626, 166418, -1176544, -620559, -1370958, -870472, 883110, 376065, -257447, 216043, 101623, -278898, -375997, 56368, 41750, -128206, -511277, -230937, -105740, 189481, 594827, 1710575, 961878, 261005, 99454, -479954, -1087967, -777723, -176328, 476254, -141454, 496402, 689640, -899912, -392575, 150736, 30585, 172078, -192989, -1046274, -538243, -486803, -360760, -203990, 351317, -294439, -141573, -391592, -228135]
1331b28135L232m4031M34421j91594o71917l97405j8578Q40335N26988P31441
1321I84757l66303o45502L5996O32511M5644m5178L27657m58158o93736n19571
1311g01883J07514L47724N51845m10738P8454J72336l79093j00802N31646n5046
1301A41957m56937Q22038p50692j16809J25982m7792M03620k7079l52411K86281
1291B8158L00014J00919k74189J44437J63955m22915L43653n04265N79194P23010
1281A181971l98684o37784l3950k72394k777K36312Q34590o17447k57684r24176
1271h92023K3142P61471K43064J144779j98396o89731j080219j74480K95842m12365
1261i78916P03146P96857K94814k81424j748560O63523l43759J48410J321003
$$ y = [-228135, -224903, -268934, 165487, -26107, -698024, -1095429, -1114007, -273672, 253316, 984757, 618454, -27048, 8948, 641459, 687103, 641925, 969582, 511424, -182312, -701883, -594369, -246645, 305200, -105538, -27084, 145252, -233841, -334643, 197003, 141957, -314980, 507058, -243634, -360443, -234461, -282253, 121367, 94288, -258123, 28158, 328172, 429091, 154902, 299339, 463294, 40379, 384032, -120233, 458961, 1181971, 783287, 145503, 111553, -160841, -163618, 72694, 907284, 289837, 32153, -892023, -868881, -107410, 135654, 1280433, 1082037, 392306, -687913, -862393, -566551, -978916, -275770, 521087, 815901, 534477, -1214083, -550560, -894319, -745909, 575094]
1252E75094M41570o4253j026082l37121L09885k02933J618559K53819j282783
1243B85755o46655K04684L77864J93076O52757K56619m38189j173654k97405J021460
1233D36312n57373K93666M22872k14440l67026J61198M95695l01948J500m77322
1223a06866o16828J91769M84476K49579J81710N07027M73274j35793k71741k61842
1213F94765r55925l61397J685313k23139N1254j60935q65108n5354P53463Q069
1203E71006M39127r29749l34993j98277Q77000O1693k58968j81024K52987l63713
1193f4911n50369R4848J81925M28979N05824o26911k60454M21145l2453L00365
1183C97988o01550m57817n46905Q33735M14934l33100L90973M16070j00836j626
$$ y = [575094, 1016664, 952411, -73671, -410792, -100907, -303840, 1314719, 1568538, 285755, -360900, -156216, 221648, 414724, 1067481, 1324100, 885911, -287743, -585148, 436312, -121061, 172605, 595477, 381037, 14011, 175209, 670904, 368956, 370456, -106866, -723694, -531925, -47449, 202130, 383840, 890867, 1364141, 1228348, 956607, 694765, -261160, -622557, 1062756, 839617, 890871, 729936, -135172, -190526, 562937, 571006, 1010133, 80384, -254609, -452886, 424114, 485807, 226839, 45815, 298802, -64911, -615280, -520432, -338507, 90472, 596296, -30615, -291069, 130076, 97623, 397988, -203562, -661379, -1208284, -374549, 40385, -292715, 98258, 514328, 413492, 411866]
1173D11866o94475K89828k62892q31416J769484K72064j520606K23563k40479
1164e83063L52326L62329M41533J15483r73567l46055k19410l8375J04498O16513
1154a67788J05152M82362k6011p87076J28494M33802j10306J07474j81230p5994
1144i1121J88688k29396J05208K18287J11321N1643L21424q926r99765R36322
1134F03685Q4909m38769J97461q25374K37105M70687m14212O81581m60075L25146
1124D62144j29781p62319M98255j6331L97523P39487K38155p43664q78070l51731
1114e46332P04165k55384R23550Q6452n68615r96725P60703K85148k11191q2721
1104I9050R50656n58551j189624L70091J35493q601N20186j90247K41332l43553
$$ y = [411866, -282609, 7219, -255673, -1087089, 682395, 954459, -566147, -342584, -583063, -230737, 131592, 573125, 688608, -284959, -631014, -850424, -888799, -784301, -167788, -62636, 419726, 393715, -393361, -264867, 168935, 58629, 166103, -15127, -91121, 97567, -131829, -26621, 191666, 302987, 354630, 676054, 667128, -332637, 603685, 688594, 249825, 447286, -378088, -140983, 329704, -84508, 597073, 136998, 462144, 332363, -429956, 68299, 51968, 449491, 1188978, 1427133, 683469, -194601, -546332, 157833, -97551, 825999, 912451, 343836, -652889, 107814, 392962, 181771, 99050, 1049706, 491155, -698469, -328378, -192885, -201486, 318700, 128453, 369785, 26232]
1094B6232K44351J015545q76013r88561l53092J100901P80393K59416j35632L8681
1084A112221j056009N6993j07209l74724M22454j74486L06184O02853j117026
1075c28749l36548O08497K38461N92599j66288m65528p75422l09958N24082N13889
1065I5035Q89133K34783q59247j07238q02312N2974o9632J251659K95290n78914
1055D01531m42336j11278J3678K05579q1434L7859M23925N1357M62357J25351
1045A086589m94083q67266P57635n62155j62600N27973k24311O0305k34968J78544
1035F5663J53424k32686L10336J45013P1506j87871k7910P19493j341212M70365
1025A46121l2604n46211R12903P066j24945j34565L04668M99905J47125j27652
$$ y = [26232, 270583, 1286128, 410115, -578446, -931538, 169363, 949756, 1209172, 1073540, 1112221, 56212, 113205, 5996, -368728, 53726, -120760, 185424, 788277, -328749, -665297, -56800, 181661, 774260, 607972, 142444, -632978, -942936, -418854, 95035, 984168, 1218951, 359704, 252466, -549846, -496872, -566504, 685155, 980445, 401531, -40805, -152083, -138405, 67174, -14260, 23599, 447524, 498881, 961238, 1086589, 592506, -274760, 482875, -79280, -241880, 286093, 61782, 122087, -112881, 65663, 219087, -13599, 296737, 441750, 513256, 325385, 297475, 1016968, -324244, 146121, 113517, -432694, 480209, 487275, 362330, 227765, 532433, 1032338, 1179463, 1051811]
1015A051811k59317j149281J53974j50536M02101N0308O96182o346n0651k66534
1005D71711l57333l90765O05405j80126k77416j38061K46268j84348N12179L98362
995G05876o80544k99219k3486P84050l05359m34079j0478R4918J1050Q59140k5129
984F76740m73631j66238K43158m56335l33188J24441K01853N04772j460L0389
974C50501P3160m03531k49294O4506j09567k26976K42525L23736m63448k31364
964f29752q1151N60721m5853M14695M99666q00979k19004K96473J4925K14021
954B23762Q78836n52470j123851N60416Q4487n03764K81805l40819P05451o268
944B07585m60421J168586k92564p09068J95227L89325q2274l73586L45023l4680
$$ y = [1051811, 792494, -356787, -202813, -353349, 48752, 99060, 795242, 788896, 738245, 471711, 114378, -276387, 329018, 148892, -128524, -266585, -20317, -204665, 307514, 705876, 25332, -273887, -297373, 486677, 181318, -252761, -263239, -168321, -157271, 701869, 676740, 203109, 36871, 280029, -176306, -509494, -385053, -183200, 321572, 320112, 350501, 423661, 20130, -229164, -164658, -274225, -501201, -258676, 65060, -398388, -629752, -710903, -150182, -196035, 218660, 718326, -82653, -301657, -5184, 9741, 223762, 1102598, 550128, -573723, -13307, 71180, -432584, -150779, -491598, 213853, 207585, -252836, 915750, 623186, -85882, 109345, 498670, 416396, 42810, 387833, 353153]
934C53153l73873L75245K74900J89811l20401O4812j17115k97979n43418m15350
924h10215M8766O4735J081465K33887k98860N96819q23547m09532L6693L35791
914E6002o5195m07335O65203n95608p52539R87469p6887M5617N45392j85604J85860
903D02375k03872O22754o10711n68056l80014L77706L82886q04568M56964K18785
893a05751n63202R2375K80826N13432l49111M36397o93544k49818O35405m82640
883d85631k76640Q60190k46942Q46309k49784j69163j90761K85517R7646p0077
873D00664K60847m40355l37290j16840K27986L81299L74835J31280M0401p32679
863A90148R3886l39633m36187m96781P00730N33031M06136j65627l73322J39370
$$ y = [353153, -20720, 354525, 629425, 819236, 498835, 563647, 446532, 148553, -394865, -810215, -761449, -696714, 384751, 618638, 319778, 916597, 93050, -316482, -279789, 56002, -9193, -416528, 248675, -346933, -1099472, -112003, -188890, -143273, 402119, 216515, 402375, 198503, 821257, 210546, -357510, -737524, -359818, 23068, -781500, -324536, -105751, -668953, -576578, -295752, 217680, -131431, 304966, -388578, -638396, -2991, -485631, -762271, 97919, -149023, 697286, 447502, 278339, 87578, 373095, 470741, 400664, 661511, 221156, -116134, -232974, -4988, 376311, 751146, 882426, 922827, 190148, 284034, -55599, -491786, -988567, -287837, 245194, 651330, 485703, 112381, 251751]
853B51751r1725M27647J83133l55350L38108l1270o13653m03109j28792K26373
843a96887O31263M2693n43727J9928M13475N8079J79241j34488j1734n75087K48672
832A31428N02155j42247l57160L17888k52140n82216j23778L11800l1083J74781
822e0572M68187R8499r675q97942M39720N15811l60314K0361n60386j07196J042438
811E98931j7352K04711J51217P5581r80595n28554n4820P28471k1196M01663M03069
800I61126J61100p64973J25283k71247m69261m00049M26655J12032J03800Q88212
790H72678o87705k11628J35905P30258m30735m74379L93993M04286r82674R97942
780G47941j184739L29212Q98697q8670k77553K73539o37553L47401j16520k42953
$$ y = [251751, 160026, 587673, 770806, 415456, 753564, 722294, 108641, -294468, -423260, -196887, 434376, 477069, -66658, -46730, 366745, 424824, 604065, 469577, 457843, -117244, 131428, 633583, 491336, 134176, 452064, 199924, -382292, -506070, -194270, -225353, -50572, 417615, 516114, 506439, -391503, 48217, 564028, 203714, 224075, -336311, -443507, 598931, 581579, 786290, 937507, 1013088, 32493, -496061, -550881, 177590, 156394, 558057, 961126, 1122226, 357253, 482536, 211289, -257972, -658021, -231366, -119334, -15534, 872678, 184973, -26655, 109250, 839508, 408773, -65606, 328387, 732673, -250001, 747941, -436798, -107586, 791111, 702441, 424888, 698427, 60874, 408275, 291755, 48802]
770D8802K07524l72492J97171J53746k62595m5227K0305m79011L71858R92533
760H32614m25721p94602J60435j28720J84781r735N86819l11541L70736K68677
750G33743o41570k75208K49207J333072j02362j263973K59575n90271K93715N74829
740E70757j000860L94432l38330M93505J007852k84234J4860m89289k69467L2296
730A31522O1443M2893R2891J8662n4209M91498J93551r02143L42631j37534L49916
719F31121l27905K83091o3413l79879j03994O2835K87226J1878j99928K70687
709D71719q71115j058532J187545Q17885M53402n22535n76186r5886K67720L1324
699A05341J31592p84365j29649K96905j16183R00189O25312q89802J04234j29851
$$ y = [48802, 256326, -116166, 81005, 234751, -27844, -73071, -52766, -531777, -159919, 832614, 406893, -387709, -227274, -355994, -171213, -180948, 405871, 94330, 465066, 733743, 92173, -183035, 66172, 1399244, 1296882, 32909, 292484, -297787, -4072, 570757, -430103, -35671, -374001, 119504, 1127356, 843122, 857982, 368693, 99226, 131522, 192965, 235858, 328749, 347411, 293202, 784700, 978251, 76108, 418739, 281205, 631121, 303216, 586307, 522894, 143015, 39021, 101856, 389082, 400960, 201032, 471719, -399396, -1457928, -270383, 547502, 1000904, 478369, -97817, -193703, 74017, 105341, 236933, -547432, -677081, -380176, -496359, 403830, 1029142, 139340, 243574, 113723]
689A13723n81485J16151L00145M80201m98091J30376J44923j44185L11565J86163
679E59486L02163n90701l54668K16392n52062L15553M92031k0000M04036N33794
669A306024q29378j171386p6374Q43959M97314K75601o1141k54246k42864N5826
659C43335K95469l0823n79375N41273O19814o82439k50289j96208L06658M35632
649H03047k08690O61044l22805r75767K6932M42621l4251p3177L52584P709J26362
638H05609j103888l27730L57430j85211M84845l07087l18803R16387o9729j04145
628A47678k47383K13067k31190k58039P73379n29209K96144j45072o63353J338663
618F94685J61484r15338m59539o68140M46014l2876L16672L62986M8110k12521
$$ y = [113723, -467762, -351611, -51466, 428735, -69356, 61020, 205943, 61758, 373323, 559486, 861649, 270948, -83720, 132672, -419390, -103837, 388194, 368194, 772230, 1306024, 476646, -694740, -771114, 72845, 570159, 845760, 784619, 530373, 287509, 343335, 638804, 607981, 28606, 569879, 1189693, 507254, 256965, 60757, 367415, 803047, 594357, 1255401, 932596, -43171, -16239, 426382, 392131, 318954, 671538, 679247, 805609, -298279, -626009, -268579, -453790, 31055, -276032, -594835, 321552, 251823, 147678, -99705, 113362, -117828, -375867, 397512, -131697, 164447, 19375, -643978, 694685, 856169, -59169, -518708, -1186848, -740834, -773710, -457038, -94052, -45942, -258463]
608b58463J46687o34463l89896P41602R64184K65635m36462j81013k94069l44330
598d20588n2410k63872M14503J30782Q9323M82686n20375R87283L81276r78995
588B49613m68402o39816j06763N15133n0111J081716P58211q29870l72515j39330
578b134K49721k79374k9191P0483M25754L38415p34835J71720J40198J93640k91018
567B53379P44704m61992p70255k93580O81494R0954l7866K24786K8801j036473
557e76048K0768K48728P34439R60804m53421k66221p06428m99946Q20458K59772
547E42905j68348j05554r8136J51754o85931L033k08734K66412P9272M41158P74222
536I92053K37359n61918m31887R6438m71080j8732K83741L41658J31907n34254
$$ y = [-258463, -111776, -746239, -1136135, -394533, 569651, 835286, 398824, 217811, -76258, -420588, -472998, -736870, -322367, -191585, -102262, 380424, -139951, 847332, 1228608, 249613, -218789, -858605, -965368, -450235, -500346, 581370, 1339581, 509711, 137196, -2134, 247587, -31787, -60978, 9505, 435259, 773674, 38839, 210559, 350757, 544397, 253379, 998083, 536091, -234164, -527744, 153750, 244704, 206838, 431624, 460425, -576048, -555280, -306552, 427887, 1388691, 935270, 669049, -37379, -537325, 283133, 542905, 374557, 269003, 170867, 322621, -363310, -360277, -569011, -302599, -223327, 217831, 992053, 1229412, 667494, 235607, 332045, -139035, -157767, 125974, 467632, 599539, 65285]
526F5285P67497l56408k63370J91089q1375k59424l85331J71579P20435k64725
516C05252O2541K23736n56827J3336J26782r3299m40424M85722N04625j49578
506D81866P0200L22346q09236O90616M89496J8354j53026m27691J7496J81177
496H81598j098483N2843K92784J48982O2171k19816L1519m31909J39433O2082
486g8796o08299M42636Q72134m29068l71531N14336K06902L0751M23525o25526
476C77064j69299k45853Q11100k38541K84451L60177o05165j075944L22698K42214
466F2902O58273o5163p75819N04303j20464M03395p9693k49491k6132k41634m69489
455c99012l59999J021506J39534N71676J27530m26085p37167R7361j76930j40900
$$ y = [65285, 832782, 476374, 213004, 404093, 322718, 63294, -322037, -150458, 569977, 305252, 367793, 591529, 34702, 48038, 174820, 81521, -358903, 126819, 631444, 481866, 552066, 874412, 65176, 755792, 1245288, 1263642, 1110616, 682925, 700421, 881598, -216885, -164042, 128742, 277724, 339895, 120079, 151598, -280311, -140878, -78796, -687095, -244459, 627675, 198607, -172924, 341412, 548314, 579065, 1002590, 377064, 207765, -38088, 773012, 534471, 818922, 1179099, 573934, -502010, -179312, 62902, 721175, 656012, -119807, 384496, 264032, 667427, 587734, 338243, 312111, 70477, -399012, -759011, 262495, 402029, 973705, 1101235, 675150, -62017, 35344, -141586, -282486]
445b82486K49663M83507k20472l76839j19274n38903N15123M61292K92353L5048
435D99012j77880l55483L8601P5974N05715l84515L66635l69682K49762M12787
425H60926k2605k65387j45951q01471K16857K08850p69200k47122K52882J32038
415e80183L220L72456N17241j85689J80016N21619p11615j19864J29901l39753
405b12651L2197O60432j87202M89672j86613n59710n64673L95151P2620N60165
395D99388M64201k45692j59232q07734K60510M85368m06108N4181M11467j48730
385D07619m65288M20671J6198n03512O53201k20545Q9867l81685p96267R9902
375f79839J52879K30581J265549J59909o00757j72390m96793m94843o3123j45869
$$ y = [-282486, -32823, 450684, 230212, -146627, -265901, -804804, -289681, 171611, 463964, 499012, 321132, -34351, 4250, 80224, 585939, 201424, 568059, 198377, 448139, 860926, 838321, 572934, 426983, -374488, -157631, 51219, -717981, -965103, -712221, -580183, -576963, -204507, 312734, 127045, 307061, 828680, 117065, -2799, 127102, -212651, -180454, 479978, 292776, 782448, 595835, 36125, -528548, -133397, -60777, 499388, 963589, 717897, 558665, -249069, 11441, 496809, 90701, 144882, 556349, 407619, -57669, 363002, 379200, -124312, 528889, 308344, 398211, 16526, -779741, -679839, -526960, -296379, 969170, 1129079, 528322, 355932, -140861, -635704, -698827, -844696]
365h44696P7420L92396N64502j11728n10020J77158O21151r08039j20003P67377
355A05518j77378p33639O80791j90425k26788M8306r6106M78699j76243K70515
345a6750l92936l68856K3350L2473M28504r0120M03727l02466p52980M05938q57435
334a487551O86645P83865k95004Q7274r07059L87233R71299K39426M18664j42523
324G42269n05084n24079K008O255J37298N32751K47191m50662K85142q2759m73804
313h3474l81276J12210j51020K10682N12410M9620R849K34784K34531j204230
$$ y = [-844696, -767276, -374880, 189622, 77894, -432126, -254968, 366183, -541856, -661859, 105518, -71860, -805499, -124708, -315133, -541921, -493615, -589721, -111022, -287265, -16750, -409686, -778542, -755192, -722719, -294215, -384335, 19392, -283074, -1036054, -630116, -1487551, -800906, -17041, -312045, -224771, -1131830, -744597, 226702, 466128, 884792, 742269, 237185, -286894, -284886, -278631, -141333, 391418, 638609, 187947, 473089, 390330, -83474, -464750, -352540, -503560, -292878, 219532, 269152, 279001, 513785, 748316, -455914]
$$ [...]
##END NTUPLES=NMR SPECTRUM
##END=
