##TITLE=1H_DE-80H_X3
 200.13MHz, d2o
 8 sc
 
 19ns.26.2.2025
##JCAMPDX= 6.0         $$ Bruker NMR JCAMP-DX V2.0
##DATA TYPE= NMR SPECTRUM
##DATA CLASS= NTUPLES
##ORIGIN= UXNMR, Bruker Analytische Messtechnik GmbH
##OWNER= pz
$$ XWIN-NMR		Version 3.5
$$ Wed Apr 22 11:03:21 2026 Russian Standard Time (UT+4h)  Yarkov@DPX200
##.OBSERVE FREQUENCY= 200.1313
##.OBSERVE NUCLEUS= ^1H
##.ACQUISITION MODE= SIMULTANEOUS
##.ACQUISITION SCHEME= undefined
##.AVERAGES= 8
##.DIGITISER RES= 18
##SPECTROMETER/DATA SYSTEM= spect
##.PULSE SEQUENCE= zg30
##.SOLVENT NAME= DMSO
##.SHIFT REFERENCE= (INTERNAL, DMSO, 0, 15.4946)
##AUDIT TRAIL= $$ (NUMBER, WHEN, WHO, WHERE, WHAT)
$$ ##TITLE= Audit trail, XWIN-NMR		Version 3.5
$$ ##JCAMPDX= 5.01
$$ ##ORIGIN= Bruker BioSpin GmbH
$$ ##OWNER= Yarkov
$$ C:/Bruker/XWIN-NMR/data/yarkov2/nmr/H-C/1/pdata/1/auditp.txt
$$ ##AUDIT TRAIL=  $$ (NUMBER, WHEN, WHO, WHERE, WHAT)
(   1,<2026-04-22 11:02:42.62 +0400>,<Yarkov>,<DPX200>,
      <created by zg, POWCHK disabled, PULCHK disabled
       configuration hash MD5:
       00 E9 B6 7A A2 85 ED C7 34 08 36 98 17 FE 4E 26
       data hash MD5: 16K
       A7 72 D2 B5 CD 3C 9E 31 82 78 64 2D 69 EA 62 19>)
(   2,<2026-04-22 11:02:46.95 +0400>,<Yarkov>,<DPX200>,
      <Start of raw data processing
       efp BC_mod = 2 LB = 0.25 FT_mod = 6 PKNL = 1 PHC0 = -5308.116 PHC1 = 11.42193 SI = 16K 
       data hash MD5: 16K
       CA 12 5B 8F 23 1E 4F 8E 13 FC 6B 72 83 21 E3 9C>)
$$ ##END=
$$ 
$$ hash MD5
$$ 04 CC 4B 22 0F BA A0 0E F9 5D B7 FF 4B 9E 80 4A
##$RELAX= 
##$RELAX= 
##$RELAX= 
##$RELAX= 
##$RELAX= 
##$RELAX= 
$$ Bruker specific parameters
$$ --------------------------
##$DU= <C:/Bruker/XWIN-NMR>
##$EXPNO= 1
##$NAME= <H-C>
##$PROCNO= 1
##$TYPE= <nmr>
##$USER= <yarkov2>
##$AMP= (0..31)
100 100 100 100 100 100 100 100 100 100 100 100 100 100 100 100 100 100 
100 100 100 100 100 100 100 100 100 100 100 100 100 100 
##$AQSEQ= 0
##$AQ_mod= 1
##$AUNM= <au_zg>
##$AUTOPOS= <>
##$BF1= 200.13
##$BF2= 200.13
##$BF3= 200.13
##$BF4= 200.13
##$BF5= 200.13
##$BF6= 200.13
##$BF7= 200.13
##$BF8= 200.13
##$BYTORDA= 1
##$CFDGTYP= 0
##$CFRGTYP= 5
##$CHEMSTR= <none>
##$CNST= (0..31)
1 1 145 1 1 1 1 1 1 1 1 1 1 1 1 1 1 1 1 1 1 1 1 1 1 1 1 1 1 1 1 1 
##$CPDPRG= <>
##$CPDPRG1= <>
##$CPDPRG2= <>
##$CPDPRG3= <>
##$CPDPRG4= <mlev>
##$CPDPRG5= <mlev>
##$CPDPRG6= <mlev>
##$CPDPRG7= <mlev>
##$CPDPRG8= <mlev>
##$CPDPRGB= <>
##$CPDPRGT= <>
##$D= (0..31)
0 0.7 0 0 0 0 0 0 0 0 0 0.03 0 0 0 0 0 0 0 0 0 0 0 0 0 0 0 0 0 0 0 0 
##$DATE= 1776841362
##$DBL= (0..7)
120 120 120 120 120 120 120 120 
##$DBP= (0..7)
150 150 150 150 150 150 150 150 
##$DBP07= 0
##$DBPNAM0= <>
##$DBPNAM1= <>
##$DBPNAM2= <>
##$DBPNAM3= <>
##$DBPNAM4= <>
##$DBPNAM5= <>
##$DBPNAM6= <>
##$DBPNAM7= <>
##$DBPOAL= (0..7)
0.5 0.5 0.5 0.5 0.5 0.5 0.5 0.5 
##$DBPOFFS= (0..7)
0 0 0 0 0 0 0 0 
##$DE= 6
##$DECBNUC= <off>
##$DECIM= 32
##$DECNUC= <off>
##$DECSTAT= 4
##$DIGMOD= 1
##$DIGTYP= 9
##$DL= (0..7)
0 120 120 120 120 120 120 120 
##$DP= (0..7)
$$ [...]
##$SUBNAM2= <"">
##$SUBNAM3= <"">
##$SUBNAM4= <"">
##$SUBNAM5= <"">
##$SUBNAM6= <"">
##$SUBNAM7= <"">
##$SUBNAM8= <"">
##$SUBNAM9= <"">
##$SW= 18.0517328524113
##$SWIBOX= (0..15)
0 0 2 0 0 0 0 0 0 0 0 0 0 0 0 0 
##$SW_h= 3612.71676300578
##$TD= 16384
##$TD0= 1
##$TE= 0
##$TE2= 300
##$TE3= 300
##$TEG= 300
##$TL= (0..7)
0 120 120 120 120 120 120 120 
##$TP= (0..7)
150 150 150 150 150 150 150 150 
##$TP07= 0
##$TPNAME0= <>
##$TPNAME1= <>
##$TPNAME2= <>
##$TPNAME3= <>
##$TPNAME4= <>
##$TPNAME5= <>
##$TPNAME6= <>
##$TPNAME7= <>
##$TPOAL= (0..7)
0.5 0.5 0.5 0.5 0.5 0.5 0.5 0.5 
##$TPOFFS= (0..7)
0 0 0 0 0 0 0 0 
##$TUNHIN= 0
##$TUNHOUT= 0
##$TUNXOUT= 0
##$USERA1= <user>
##$USERA2= <user>
##$USERA3= <user>
##$USERA4= <user>
##$USERA5= <user>
##$V9= 5
##$VALIST= <valist>
##$VCLIST= <CCCCCCCCCCCCCCC>
##$VD= 0
##$VDLIST= <DDDDDDDDDDDDDDD>
##$VPLIST= <PPPPPPPPPPPPPPP>
##$VTLIST= <TTTTTTTTTTTTTTT>
##$WBST= 1024
##$WBSW= 4
##$XGAIN= (0..3)
0 0 0 0 
##$XL= 0
##$YL= 0
##$YMAX_a= 72404
##$YMIN_a= -66616
##$ZGOPTNS= <>
##$ZL1= 120
##$ZL2= 120
##$ZL3= 120
##$ZL4= 120
##$ABSF1= 0
##$ABSF2= 0
##$ABSG= 0
##$ABSL= 0
##$ALPHA= 0
##$AQORDER= 0
##$ASSFAC= 0
##$ASSFACI= 0
##$ASSFACX= 0
##$ASSWID= 0
##$AUNMP= <proc_1d>
##$AZFE= 0.1
##$AZFW= 0.1
##$BCFW= 0
##$BC_mod= 2
##$BYTORDP= 0
##$COROFFS= 0
##$CY= -3
##$DATMOD= 1
##$DC= 0
##$DFILT= <>
##$DTYPP= 0
##$F1P= 0
##$F2P= 0
##$FCOR= 1
##$FTSIZE= 16384
##$FT_mod= 6
##$GAMMA= 0
##$GB= 0
##$INTBC= 1
##$INTSCL= 3.241238e-09
##$ISEN= 128
##$LB= 0.25
##$LEV0= 0
##$LPBIN= 0
##$MAXI= 10000
##$MC2= 0
##$MEAN= 0
##$ME_mod= 0
##$MI= 1.114404
##$NCOEF= 0
##$NC_proc= -8
##$NLEV= 6
##$NOISF1= 3.799351
##$NOISF2= 2.8
##$NSP= 0
##$NTH_PI= 0
##$NZP= 0
##$OFFSET= 15.49458
##$PC= 1
##$PHC0= -5308.116
##$PHC1= 11.42193
##$PH_mod= 1
##$PKNL= yes
##$PPARMOD= 0
##$PSCAL= 0
##$PSIGN= 0
##$REVERSE= no
##$SF= 200.13000542945
##$SI= 16384
##$SIGF1= 3
##$SIGF2= 2
##$SINO= 0.751879
##$SIOLD= 32768
##$SREGLST= <19F.Aceton>
##$SSB= 0
##$STSI= 16384
##$STSR= 0
##$SW_p= 3612.71676300578
##$SYMM= 0
##$S_DEV= 0
##$TDeff= 16384
##$TDoff= 0
##$TI= <>
##$TILT= no
##$TM1= 0
##$TM2= 0
##$TOPLEV= 0
##$USERP1= <user>
##$USERP2= <user>
##$USERP3= <user>
##$USERP4= <user>
##$USERP5= <user>
##$WDW= 1
##$XDIM= 16384
##$YMAX_p= 479502294
##$YMIN_p= -4241609
$$ End of Bruker specific parameters
$$ ---------------------------------
##NTUPLES= NMR SPECTRUM
##VAR_NAME=  FREQUENCY,     SPECTRUM/REAL,   SPECTRUM/IMAG
##SYMBOL=    X,             R,               I
##VAR_TYPE=  INDEPENDENT,   DEPENDENT,       DEPENDENT
##VAR_FORM=  AFFN,          ASDF,            ASDF
##VAR_DIM=   16384,         16384,           16384
##UNITS=     HZ,            ARBITRARY UNITS, ARBITRARY UNITS
##FACTOR=    0.220516191357247, 1,           1
##FIRST=     3100.93043333397, 0,            0
##LAST=      -511.786329671807, 0,           0
##MIN=       -511.786329671807, -4241609,    0
##MAX=       3100.93043333397, 479502294,    0
$$ Real data points
##PAGE= N=1
##DATA TABLE= (X++(R..R)), XYDATA
$$ [...]
7267 1277571 1495863 1550916 1940338 2527987 2867820 2145085 3878809 2772001 1180492
7258 1180492 1408632 1691751 744575 1270911 2467131 1757462 1155793 200957 -1108515
7249 -1108515 -664056 110424 1318748 167424 -170137 -504137 -1121979 46072 98461
7240 98461 -724907 -1561467 -623476 -400302 -848039 282715 231245 -1812802 -922157 -382224
7230 -382224 -142553 165616 378579 105097 -555361 1425082 410318 587795 1249228
7221 1249228 -63234 -1354173 -366138 179160 -643702 1372824 622988 2849 -102529
7212 -102529 1721210 1034788 631666 489696 -27185 299204 1715478 966671 926168 2018905
7202 2018905 489279 -118132 270454 707312 -223749 297511 1151600 1495649 702928
7193 702928 397167 1073370 939276 1037037 836658 1964930 596564 446829 614491 -577891
7183 -577891 128756 706786 -283847 529345 1704487 1268266 -135931 1280159 665692
7174 665692 -862547 393752 966762 212041 606981 -595261 -330587 1298364 1394627
7165 1394627 -1151 301446 1229703 -711423 467183 771759 -22915 -1387343 -30512
7156 -30512 557751 459677 1279817 -89831 -436974 -993832 -311926 -700536 -393152 77940
7146 77940 -665573 -1083446 -1565997 -1963236 -232437 539568 -301877 137391 1484556 1840868
7136 1840868 477267 1735771 1326691 127857 714885 1761049 953169 -523556 -87200
7127 -87200 -210050 815079 774433 13557 -22669 1237406 120295 -1079390 -501717 953859
7117 953859 942498 205748 1174230 894846 -87572 225076 1438887 779877 947925 716469
7107 716469 913043 234960 -144055 -417038 122334 1059833 1419643 1170802 597794 1923732
7097 1923732 1567771 184770 310788 1376355 621131 -703085 1054767 1009430 284494
7088 284494 480234 1375919 1632259 968916 1566744 -217914 -570046 940656 534112
7079 534112 977757 1391805 636281 -874895 -566002 251854 469527 493860 691806 -377418
7069 -377418 -295328 187349 336096 -387180 429435 598537 -70032 -5827 82293 -65428
7059 -65428 -1136154 -870729 -759433 -465056 -1075549 -1907393 -974131 -1230508 -1027018 -557298
7049 -557298 -330071 -142918 -1221450 -62167 466193 142841 136649 966013 1553762 703389
7039 703389 920466 658042 1488371 525612 880108 1540567 2368522 1253082 1620205 2052342
7029 2052342 2052323 819504 579282 616909 -603213 160584 1034833 1243504 -126998 -27168
7019 -27168 -258568 -479278 1418476 1281194 535970 -386761 -639352 -251990 459998 1719464
7009 1719464 1173354 751939 514419 1053796 728718 803976 -538979 303687 -95044 88122
6999 88122 -253730 261137 -22192 -757944 312820 39625 650445 -433815 -670366 474335
6989 474335 99781 503294 656877 1010118 -335598 -1005460 -292971 -1183180 -975389 -865367
6979 -865367 -93763 190908 755687 844933 10723 -78804 -107060 798300 1082769 1392239
6969 1392239 195132 198191 467588 1828826 1217333 1498481 1343955 1413353 1412711 3385009
6959 3385009 2783159 -217663 1269557 927841 372351 1614211 1987678 1259627 802019
6950 802019 1503263 -81855 722661 751504 -589277 -979785 -717564 -1075740 -858286 660531
6940 660531 40160 389950 371619 204637 223799 -194098 -1486596 -536949 411084 51578
6930 51578 -676047 -478025 -1410235 -252219 957713 -119818 440141 927375 -870713
6921 -870713 -367608 1551195 1797554 561148 505603 1790513 1656837 1875414 1443745
6912 1443745 1414303 797891 1042448 2069349 2054192 1341436 1744562 2249983 1258245 455803
6902 455803 573104 972904 1885281 1163209 217874 1009582 925748 -413005 -675855 343826
6892 343826 -214735 -350683 -325582 -664927 -331067 1944543 1006452 625512 367083 200103
6882 200103 112429 547184 1133957 781575 1295271 608769 -476674 106321 411510 -918745
6872 -918745 -530290 543317 334382 2117562 1435512 97422 -1510320 111284 -286720
6863 -286720 1362033 2591905 2098228 2318075 1491727 347825 -81831 2204900 1068834
6854 1068834 1119283 1599987 1275153 935722 1789269 1111632 730040 1821393 1553121 -142454
6844 -142454 959529 1387088 5669 804965 308267 430210 234579 1130179 987020
6835 987020 48913 411158 576085 809368 1281321 394760 435610 -141152 143276 705814
6825 705814 312171 -523861 -1165547 -824925 -1268750 -226782 531728 262745 -914020
6816 -914020 625699 1380200 86791 994822 2094190 1343560 1507598 776627 1145576
6807 1145576 675012 1098255 107658 392106 1492759 643260 996683 1198330 -559222
6798 -559222 -525271 -191639 -390832 23049 750363 1328899 2062347 2189606 1493261 1067313
6788 1067313 1877486 1168559 1163558 1622760 1524554 1573782 2707772 2828432 3030564 2756866
6778 2756866 629443 865664 1377289 2379711 2306588 1627757 1229792 1536248 1119967
6769 1119967 158726 1010231 1486611 210394 47808 1579808 999213 1502955 1028445
6760 1028445 350455 1112286 345755 1280339 1064099 470883 91987 914360 593510 -1093366
6750 -1093366 -1132377 -812379 -1014080 -924823 437362 109333 768167 -160757 -1003764 142592
6740 142592 379582 424742 305401 1302189 461723 1211638 1780852 1205727 1397 1616666
6730 1616666 1222244 283203 824160 1360548 1547530 653332 1595573 2465763 2362316 1373055
6720 1373055 410018 586094 1223644 2602609 2648974 3126562 1594783 1160966 1872609
6711 1872609 1533827 1675435 1014573 2425667 2034032 973540 895007 1032996 948170 532758
6701 532758 866558 887024 -362858 -489954 -18424 -437517 493308 182651 -1023302 -704603
6691 -704603 269070 560301 1186519 2003254 1492810 1726890 1837980 806871 -84223 1719060
6681 1719060 1929057 1929798 2902337 1220944 2042866 1823674 -303881 -793431 1029014 1692455
6671 1692455 596719 1234340 678855 238030 1906907 2338172 1215769 2099131 1273165
6662 1273165 396129 1544270 2489375 517973 330349 1986889 2567469 1725066 3195120
6653 3195120 3178420 748836 1067881 866635 1818831 1978432 1573826 1679574 1334576 929823
6643 929823 194753 1304098 1999794 289551 1529874 3065427 1898942 1443125 1152528
6634 1152528 463799 -214583 1100978 2290518 1758812 2334165 1295069 987029 974138
6625 974138 206766 3160 366198 -475105 -554743 1536484 833150 635289 775191 1505654
6615 1505654 1287376 1702990 1981018 2013632 1929727 1312400 1150442 2141534 1389145 641376
6605 641376 1097739 -441731 -826389 154482 557224 571871 438062 824647 337761 54595
6595 54595 11566 -743722 623580 618235 858207 911090 965107 1539197 2128682 2002755 1593501
6584 1593501 1375501 1474348 1274395 1731684 2870554 2125127 890978 1450049 2502506
6575 2502506 2313082 1266449 1140714 804150 619465 1208128 1620825 1618956 895267 217577
6565 217577 1411672 2382435 2014191 2507602 2524545 1422813 1025822 1375730 2216526 2046929
6555 2046929 1641144 1051680 2020763 1598062 1589323 1557048 1079161 1410417 1741535 2424805
6545 2424805 2100605 2069409 1446973 1614582 2914049 3929424 3988936 3275327 2689794 2584388
6535 2584388 3019158 1947484 1856403 1945343 2722668 3387859 2604833 2109290 1862884 860715
6525 860715 166114 3157005 3655605 2110384 2145524 2429737 1660821 1358521 2392991
6516 2392991 1169788 1535417 1072435 265996 1697863 2550800 1782411 925761 965983
6507 965983 1032106 512918 1522873 1613062 721407 1199479 292378 1331575 590667 360347
6497 360347 927229 896887 1705444 2037308 2329505 2613628 2502498 2552951 1850417 3093140
6487 3093140 3809006 3519131 4190515 5272392 4993719 4725411 4407329 5068195 5353278
6478 5353278 5877780 5389169 5608318 4561780 5810563 5869643 6587508 7120567 5853847
6469 5853847 5599939 5279563 6938699 6564346 6510090 6129305 6387096 7497959 7937680
6460 7937680 7447659 8114987 6781392 5649193 7317092 8312892 8652595 7593569 9317409
6451 9317409 9809580 9786690 9835031 8111999 8891859 9480852 9686376 9184403 10644230 9751730
6441 9751730 9331429 9926141 10813109 11143911 11707431 12839215 12258303 12345831 12089317 12364950
6431 12364950 11395434 11551750 11356922 11890557 13391281 13367389 11689617 11062166 13504104
6422 13504104 12884972 12607738 13517888 13650131 12717421 12766247 14994088 15466780 15391701 14623406
6412 14623406 14232045 15478000 16529630 16219735 16111473 16703509 16344376 16608116 17127460
6403 17127460 16531255 16183435 17489969 17522286 17235152 16297463 16796406 16957106 18133401
6394 18133401 18484854 17647472 17960507 18614939 17869035 19264356 19530404 18855617 18690362
6385 18690362 19769693 21100219 21542230 22367978 21019249 20727128 20563720 21651108 21947309
6376 21947309 23423980 23159611 22704216 22999486 23194897 24142966 25330532 26056920 26349468
6367 26349468 26758772 28906480 29872861 30391379 30862656 32170258 34317439 37229596 39255385
6358 39255385 40841976 42769453 45747645 47505224 48546553 51847809 52843526 54266964
6350 54266964 56170595 58661635 58307533 59651976 59988456 59104881 57540212 57616473 57065557
6341 57065557 55269434 55680914 55676191 54066193 53445157 52668224 51030109 50081429 50378147
6332 50378147 47941434 45839228 45263651 42945686 40264955 39829884 38080435 36273292
6324 36273292 35891824 33891959 31223446 30066478 31421756 28893623 28318146 29321105
6316 29321105 28562157 26143452 25445859 24096953 22552217 23751442 23097051 21064009 20760980
6307 20760980 20349352 18630117 18109411 19468682 18716250 17753959 17578453 16700575 17005802
6298 17005802 17142238 15622810 14420248 15124202 15300305 13201698 13040014 11835828 10193143
6289 10193143 11908818 12597681 10184226 8227430 8262597 7512613 6229875 7443715 7525487
6280 7525487 6386283 6903357 6740819 6164637 5689442 7714801 5782228 4694029 5385434
6271 5385434 5123284 5112480 4274142 5671553 4801572 5159589 4578502 4346811 4860935 4250209
6261 4250209 2729042 3967872 4620831 3765339 2768096 3030438 2549620 2878260 4598556
6252 4598556 4448189 3076392 3746055 3782798 3513648 2561587 3007626 3542554 4135354 3410255
6242 3410255 2151742 1965446 1293702 2925300 3759875 4621738 3053803 3301198 3810900
6233 3810900 2514100 1820912 2962176 3518132 3127559 3523078 3421292 2497485 1832644
6224 1832644 2194809 2115309 2387903 2665156 1358388 2263103 667115 516639 1350431
6215 1350431 2949751 2575263 1046099 1749484 971617 1926601 2325633 1857050 1738997
6206 1738997 2115361 2354906 2002248 1343051 1765608 2337149 3231465 3491689 2552399 2312809
6196 2312809 1228803 1555004 1290460 1236125 1479533 1489689 1392408 850640 1970380 2379903
6186 2379903 1742877 361457 756416 911133 332975 555172 366190 407657 1626844
6177 1626844 2553412 455092 -1231547 -494441 -115216 -1104976 311929 -453330 -795957
6168 -795957 -1581208 -1550010 -1258683 845539 1468398 -588041 -1305992 417365 1044613
6159 1044613 1359605 1234704 -409895 -1090071 -380224 1625855 1284943 981895 837030
6150 837030 1070478 415301 980726 1131965 631705 432012 398516 918621 2000303 2331250
6140 2331250 1434629 734876 660501 1570840 757389 275105 95140 1531969 1430297 934912
6130 934912 1527729 522361 1110222 126956 560956 587627 1015663 1055449 -2803 394769
6120 394769 327390 951390 1071883 1012575 805307 1456885 1548266 2024780 2347990 3033631
6110 3033631 2546647 2431314 2478121 1990201 2680595 1393741 2170774 1144174 915108
6101 915108 962304 2185743 1145366 37586 1535489 1438696 -18923 69684 617758
6092 617758 958807 77304 292859 937168 788212 803994 545533 839462 131860 -297824
6082 -297824 211776 123466 -296986 156796 310916 -25587 -894474 441155 338651 -321917
6072 -321917 386233 648072 954951 74702 1159228 522992 963351 1711705 1923319 709896
6062 709896 1054772 1577053 2215212 1559784 1346230 1137116 2138029 1282159 -691420
6053 -691420 336096 943739 1771844 716129 1456101 312286 217219 -216058 300342
6044 300342 693913 1269299 720600 1121945 1108282 1152165 1442441 1254057 1070802 -801195
6034 -801195 -219647 220204 -2287 342337 -105940 1396990 -4736 -459041 -123297
6025 -123297 947881 90846 147096 1225281 703826 1010626 621104 540155 -436479 2432619
6015 2432619 2434164 1743806 1041920 1093692 1058542 1736605 2507050 1530340 2312051 1587426
6005 1587426 1392541 507894 1410730 1441765 2604360 2488365 1276395 1572513 1518197 1209395
5995 1209395 1072046 1813422 2384725 2638628 2248972 349145 279226 960702 1040776 1400397
5985 1400397 2349320 433860 645818 1363016 -433028 -552908 -333162 1342871 254037
5976 254037 1491484 1021975 382892 61173 69875 2131448 2172624 1179785 1017471 1057502
5966 1057502 -158433 1052160 1195305 573790 579756 1664002 710315 878429 874841 -666338
5956 -666338 -124081 -287109 71828 -78631 2330652 699335 434288 1166962 1360635
5947 1360635 1272196 1277043 601448 701551 1307701 2118832 2854731 1991927 506086 -541562
5937 -541562 1791227 1969839 2778151 2315634 1628874 1630063 1393900 881987 1209574 1705420
5927 1705420 365439 1747224 2391019 2270913 2376631 2721942 1903794 1087230 858667
5918 858667 1573304 1669585 1090133 1216292 1084921 1295655 -35950 -249571 -847313 -1031356
5908 -1031356 5865 433247 -435438 -435392 -557245 -729234 -1587271 324945 310674 -968230
5898 -968230 214418 -109870 -50142 -432239 756817 611852 939497 735752 562936 -1052963
5888 -1052963 -1421844 -1042858 784101 1990634 933506 732406 1151150 1538940 1072473
5879 1072473 2069515 2092675 2460434 2433983 3060569 2364940 1429022 1825906 1844289 1906877
5869 1906877 1832166 2354137 3394038 2458354 1376722 515973 1810505 2819266 2031298
5860 2031298 866053 1036407 733216 1160736 2480005 2165601 1610394 236247 1122317
5851 1122317 1532280 2003540 1893577 1041184 1281328 1128187 2145190 2749018 796864
5842 796864 -625423 471706 1378950 949457 1017478 1201845 755981 765535 860527 -178951
5832 -178951 1046612 2139946 196017 975847 2491608 2775773 2048707 2239654 1631492
5823 1631492 2303555 2701653 3454448 2691238 2891758 827166 1399622 3411579 3005870
5814 3005870 2854821 3182006 1870749 1347170 2367750 3383521 2305681 2881918 2483432
5805 2483432 2170849 3575601 1817858 1598461 2602131 3953421 2738770 2111783 2297682
5796 2297682 2834236 2874719 2653007 2239593 2563045 2619958 3673565 3287201 3897790 3784935
5786 3784935 5345585 3760307 4067741 3874288 3461488 4145847 5130168 5752581 6752248
5777 6752248 7001678 7039719 8127294 8738256 7979167 8824021 13147631 14063681 16656137
5768 16656137 20858362 25281116 35381794 55113898 80602578 99931520 101809625 89424202
5760 89424202 71901288 56342832 41802389 29908065 23160859 19025861 14857888 12324119
5752 12324119 11741130 9588398 8813591 6827777 5665084 5226658 6791183 5715984 4679484
5743 4679484 4724217 4874900 3173454 3934954 3776893 2499273 2611585 3629092 3990504
5734 3990504 2963130 1758870 1663913 2720668 3008731 2179155 2137670 2915267 367758
5725 367758 205968 1441236 2282784 2071732 3148138 3041405 2677069 2457667 2570158
5716 2570158 1951522 1935249 2094987 3136900 2740775 1574292 1415420 1907296 972925
5707 972925 1269035 3227507 2462051 2083748 3066074 1796940 1861366 2177403 3412659
5698 3412659 3147486 3156113 2595554 2112264 4423379 2717645 2051217 3043718 1416468
5689 1416468 625351 1642114 2554840 1056460 1965606 1938619 -125978 -247066 2009665
5680 2009665 882552 58185 1214099 2875861 2468150 1676131 1740804 833718 179617
5671 179617 1039954 2185931 661268 1527107 2426703 1365976 1051460 -143939 443572
5662 443572 962421 1802295 364635 -77111 1879894 308785 -298568 45716 -128542
5653 -128542 887550 2143196 1171725 1279023 1965267 1749170 684141 599725 1224591
5644 1224591 1307383 2471326 1811491 1366167 1304547 1078455 872959 779448 809091 695051
5634 695051 1375439 1266934 1650053 1769453 1346943 1340789 -18850 1119798 2768695 2579252
5624 2579252 613511 214892 2386006 2333665 1805439 1116347 1220393 1094898 1751954
5615 1751954 995416 1625567 983098 889016 991669 1192729 606128 603678 2445678 1795123
5605 1795123 856996 1446598 1994502 878852 769925 2056995 2536744 3072573 2592024
5596 2592024 2877647 1493711 1870733 2026365 1812860 2062926 1363186 1917945 1782450
5587 1782450 1066131 942417 2250736 1779783 113352 1851206 2702557 1531997 789974
5578 789974 2153375 2047567 2631698 3037397 1574808 1159690 2900077 3440998 3449509 3466045
5568 3466045 2031604 815432 945317 1972320 1446972 2519776 2259547 927639 2384529
5559 2384529 2642439 2069071 776803 796851 767393 752835 1578944 2002695 1965517 1656130
5549 1656130 884968 1678801 1355464 2303350 807781 917724 1843953 2094706 2734242
5540 2734242 2359805 1230544 -78749 1492198 2701096 2117808 1652520 1960574 552005
5531 552005 1818336 1103799 1473609 1480020 3256760 1946294 599200 1905126 1524467
5522 1524467 913617 1376641 1016389 558560 1192593 1652355 330855 1659794 2222589
5513 2222589 171549 844706 1783662 1508774 981532 1657801 2520588 1578072 3288959
5504 3288959 2743275 2319123 1737356 2200732 3235555 3249186 4279161 3915403 3870204 2140505
5494 2140505 814168 1290616 2316633 3416166 3245385 3251736 2706945 1777549 2384085
5485 2384085 2272104 2636552 3047572 3033788 3191777 1618229 1512512 1359290 1907297 2421550
5475 2421550 2061307 3720678 3623397 3087028 2698961 2651803 3400006 1657123 2813743
5466 2813743 2371171 3084053 3214170 2552889 2902000 2849454 3781457 3171672 2533132 2102087
5456 2102087 2484047 3627049 2589614 2293513 2057030 1627873 2854809 3672600 4207580
5447 4207580 2131642 2267836 2581941 1013973 2012516 2340163 2043841 1631352 1931991
5438 1931991 2831803 1168269 2902976 2667586 2007083 2532026 2354803 2102703 1383724
5429 1383724 1906884 1563811 1732702 3576410 2273041 2355791 2785962 3485289 3358170
5420 3358170 3028656 3897958 2469530 2847308 3327349 4218116 4501763 4475780 5069882 5921697
5410 5921697 5635919 4097086 3588083 4418963 4246185 4481214 5504750 5030115 4583939
5401 4583939 3031516 4755445 5068276 5927169 5703759 5010109 5708805 5348438 6238757
5392 6238757 5696168 5356750 5237188 4635873 6153893 6458106 6259072 5278013 5979360
5383 5979360 5940023 6406053 7463029 7381959 6747926 6258083 6495623 6559854 7975028 7804695
5373 7804695 8419406 9156210 9426392 8858857 8258003 8336785 8615250 11717233 11108889 10359538
5363 10359538 9114479 9503930 8950571 10765335 11597633 9847754 9147505 10676938 10721156
5354 10721156 10396123 11647033 9886637 9652935 8854417 10245368 11382454 12537138 10756275
5345 10756275 9944033 11236352 11853292 11233286 11177640 10850624 9771513 9990208 10974171
5336 10974171 11656712 11104433 10772462 10306582 10233932 10257885 11296480 11090600 10987843 11436961
5326 11436961 11021880 12303486 12543794 11702802 11366639 12719580 13317209 12604583 12050046
5317 12050046 12575317 11828158 13250999 13404762 12283268 12847835 12936223 13079088 13450638
5308 13450638 13937921 13971568 12776457 13664987 14593712 15255844 14921387 12911780 14380507
5299 14380507 16108052 16676304 16371678 14815042 14301810 14343919 16563726 16347276 15841610
5290 15841610 15362873 15222492 15999549 16664240 16341099 15975977 15436876 14844513 14143499
5281 14143499 16001916 15741548 15850160 16639277 15318408 15103559 15778717 16502430 13973094
5272 13973094 13779000 16032712 15915351 16557456 16118706 14984632 14568769 14789751 15656871
5263 15656871 15891032 16130716 14968258 14527844 16181952 16313209 16499405 16400256 17078346
5254 17078346 17492110 18015431 19464713 18492387 18891808 20378031 21608599 21291025 20434033
5245 20434033 20092641 21479553 21809694 23836435 23973723 25300895 24366112 25047976 26682107
5236 26682107 26953420 27428628 28166544 29885510 29758672 30557908 32058456 32583663 31661579
5227 31661579 33152981 35323997 37203873 37930356 38921672 39540567 39745710 42417224 45104939
5218 45104939 46114418 46263795 48197673 49501300 51267750 54070140 55132810 56546035
5210 56546035 58707670 61760121 64592941 66948052 69176365 70695835 74903927 77965251
5202 77965251 78976352 82811509 87601141 90556066 93630506 98706772 102483465 104899795
5194 104899795 108243193 111884163 115488973 119587364 124222983 126544559 129518215 132758850
5186 132758850 135516408 136356136 138775536 139651474 139646475 140042711 140332791 138615999 136938830
5177 136938830 136217728 133009816 131023938 127885801 124082220 120412895 117231352 114155148
5169 114155148 111715035 108848661 104407858 99725608 95953917 92636551 91588066 89131778
5161 89131778 85749392 81883066 79926898 77319439 74747762 72031901 69851513 68523676
5153 68523676 66945036 65321966 64241487 63555388 61318565 59669145 57603303 56565184
5145 56565184 55696727 55728826 54656936 54104014 53439684 51859467 51248270 50358854 48590730
5136 48590730 47704294 47632921 47865912 46615593 45825753 44590229 44416480 43569645 41957582
5127 41957582 42776198 42325528 39975255 39240233 40101599 39334484 36965817 35598774 36241133
5118 36241133 36157066 36215523 34878845 34776542 33441157 32326549 33197531 32814160 30394459
5109 30394459 30123092 31088748 29773798 29301409 30732798 29759972 27429285 26764266 27068908
5100 27068908 27172511 27051477 27020534 25707809 25683288 24499078 25415718 25924767 23754424
5091 23754424 24214180 24124031 24260965 23068602 22921845 22221407 20974767 21442317 21464264
5082 21464264 21092281 20584247 18853485 18341595 19593827 19530390 20048523 18879466 17531178
5073 17531178 17287274 18219752 17648147 17183837 17250851 16257455 16386756 17131140 16780257 15737192
5063 15737192 16751541 16485267 16117121 17548362 17072863 15394769 15048807 15230246 15181413
5054 15181413 15511873 17561296 15441884 15862268 16598627 17020678 16439019 16613836 16083660
5045 16083660 15701165 15890846 15593561 15894756 15489581 15881856 15588549 17190271 16652141
5036 16652141 15555181 14828719 15147878 14690704 15062458 13720258 13438209 13653577 13191316
5027 13191316 14014084 14271753 13739401 12288450 12578833 13267749 12387440 12636606 12561294
5018 12561294 11456349 11598220 11364799 10731072 11369098 12144407 11734051 11441897 11925803
5009 11925803 12170587 11119885 10309596 10590616 10905141 11324675 10928695 11754714 11814410
5000 11814410 10644485 10908763 11512477 12462482 13197562 13729267 14153303 13125426 12325858
4991 12325858 12635716 13830121 14080913 12313714 12022365 11548163 11423679 11542416 11050963
4982 11050963 11504617 10715743 10356354 9843736 10294306 10142647 9705779 8590703 8502802
4973 8502802 9233094 10165533 9146568 8113299 8926434 9131877 9265818 8844847 7834997
4964 7834997 6530789 6417012 7438988 8704870 8015244 8718371 8649324 7039324 5990499
4955 5990499 6304272 6403286 5745978 7433190 6753528 5355336 6363550 6549158 4928178
4946 4928178 5384529 7706822 7072679 6644240 6029506 5583631 5237471 5607488 4924292
4937 4924292 4873583 6612912 5690365 5652419 6347375 5935828 5467120 4709283 4056402 4407645
4927 4407645 5347495 5196000 4706517 5092918 4525032 3226767 4253602 4422218 4791458
4918 4791458 5014842 4532687 5031459 4067236 3924688 4313831 4821470 2945008 1500217
4909 1500217 4024932 4416208 3247479 3055312 4338737 2868820 1698605 2499679 1800180
4900 1800180 2515455 2679140 2478971 2363107 2344076 2284849 2152617 2045131 1606135 1875861
4890 1875861 3708722 2557998 2311190 2494864 1664247 2024700 2789033 1552571 1082399
4881 1082399 2667487 3238010 1927303 2832468 2272812 1626355 3865493 2770356 2131312
4872 2131312 2010828 1874002 619321 3473688 4789128 3645190 3382031 2218025 2602372
4863 2602372 3699392 4369940 3550575 2349901 2723005 3932277 5705160 5675839 4528935
4854 4528935 4302353 4597702 6148824 8057191 7583015 7226765 6701517 6474433 5742700
4845 5742700 5989931 7376990 5693159 5814492 5110698 6145348 8877754 7971406 7306936
4836 7306936 8260111 9662900 9368505 11557810 15002116 18085026 26828239 42962591
4828 42962591 62100151 71415602 69671107 60159585 47635652 35688359 25978491 19136667
4820 19136667 15230860 12661721 9983165 9116766 7234471 5301602 4183200 5898779
4812 5898779 6324542 6188457 4475565 3626314 3943846 3769399 4402870 3896291 2092649
4803 2092649 2082916 3380231 3699419 2724263 3053539 3440416 3086745 3173767 2760761 1116258
4793 1116258 122775 923904 839871 1889365 3355662 4161925 2163639 1307882 1188281
4784 1188281 2904276 2936187 2305773 2392467 2077604 2087988 2913046 3055398 2181020 1862807
4774 1862807 1300744 2682816 3904367 2574115 1594892 2022863 861529 21003 700929
4765 700929 2351924 1568342 1004154 991145 1798178 1405062 1030071 1096895 562356 129521
4755 129521 -740886 499245 891888 1648025 1015384 -214696 -200911 -56867 492817 27728
4745 27728 791027 108317 -656492 792055 -2081 412765 1186629 300046 1068926 2298008
4735 2298008 681743 484434 1661952 1635688 161499 421801 920025 1390272 1779044
4726 1779044 854908 -22898 198357 46373 130230 1081206 1209995 -21685 645551 416284
4716 416284 584580 940288 741414 336137 86238 1820935 1567954 3248393 3181605 1735664
4706 1735664 688227 -69497 -211554 1373968 2303220 2250179 1773962 1259039 652301
4697 652301 564628 1931753 1156218 341332 397668 2035591 2096262 1780642 2004082 1319877
4687 1319877 991028 1931979 1769817 1094328 1251557 2642262 2474567 1927193 1134743
4678 1134743 -299440 519130 1721616 1991251 1393697 1544980 1879061 1815200 2049195
4669 2049195 1503402 1183348 2497923 1874501 1577358 2356928 2955137 3144999 3361795
4660 3361795 3846906 2371451 1127661 1518407 2368882 1922004 1778857 3758886 2247025
4651 2247025 2101054 2258173 2782893 1682549 2704839 3517964 1608666 2400671 4008462
4642 4008462 2242156 2300245 3192047 2394084 3972112 5450031 6148817 4590335 5076462
4633 5076462 3978394 5953493 9283285 9736757 12693498 19329122 23455789 24586718
4625 24586718 25055763 21466127 16799146 14693470 12953310 11667476 11876563 10073415
4617 10073415 9339782 10359764 11569577 10957366 13058945 15731574 15281911 17619448 20883717
4608 20883717 22810860 23554101 23726587 24575415 24424049 27816884 31881919 36333953 39651559
4599 39651559 39188985 36645151 36694046 40053215 41598470 43625566 47464628 49744995 47214065
4590 47214065 45280621 42307773 39357199 37812867 38536340 38342522 37795600 36986943 33761109
4581 33761109 31050385 26912296 24650088 22836373 22352575 21634700 18948930 17289720
4573 17289720 14601229 13009958 11024012 10017566 9443849 7806289 5710586 4488317
4565 4488317 3548006 3131704 2103044 2017224 3233674 3882845 4469043 3149614 2813058
4556 2813058 2331982 3159416 3452383 2855354 2640192 2937815 4265734 2029373 916304
4547 916304 1768603 3374682 4455183 1576551 1594571 666350 283066 999729 1757312
4538 1757312 1760065 444104 1213207 1465477 926192 586244 1816762 1981044 1747477 1735198
4528 1735198 3155963 3015294 1853576 -50961 219178 2042863 3013312 2849858 2399013
4519 2399013 2560389 1683322 1771555 2098165 1799247 1496484 1638902 2197525 1430649 1638800
4509 1638800 2079489 1020620 842171 898304 1845578 2345854 2600514 1158658 85499
4500 85499 1288585 1744609 1469311 715493 712585 -723947 -684044 774190 945271 1280207
4490 1280207 1900114 2022606 766537 785340 530653 -366942 1014654 1654610 1229875
4481 1229875 1557356 1262287 595384 1231341 1795011 718691 181688 663965 537686
4472 537686 816509 141419 -477334 -759590 -356702 47888 129883 453741 74921 626780
4462 626780 1797795 804021 1687549 2048343 961215 355342 377017 1765008 699078
4453 699078 1052321 1324418 2069993 1353354 1062233 1167699 835393 -1197909 -256911 1220523
4443 1220523 1473236 1051263 -1097659 -384667 -198565 1427786 1790245 2346808 1807053
4434 1807053 563867 1070117 2234931 2322645 1027399 1287323 1049347 944337 1668274
4425 1668274 2018019 1833172 2035758 2015812 1459486 1867395 2813130 2219018 1010791 566132
4415 566132 854787 1372663 1552313 2664877 3866140 2318839 1561609 1018074 1763816
4406 1763816 914399 608533 1086826 -336715 -1046728 369195 1188886 -648405 135752
4397 135752 1028816 125978 71002 327675 -785227 -1440316 606746 776581 -347790
4388 -347790 680458 58624 -116319 257179 -181128 927960 2391192 2591207 226723
4379 226723 684254 1146398 -257943 975100 2635627 2449861 1645864 2121131 2558667
4370 2558667 2494612 2879252 3621577 2970646 2561358 2177617 2553696 1543780 3289213
4361 3289213 4011713 3502029 2550404 2133532 3240458 3104987 3798785 2969787 2721833
4352 2721833 2311314 788250 2020909 3038712 1816838 1464231 1811467 2932587 1243072
4343 1243072 1721725 3198590 2927486 2213714 1535221 2321124 1845084 1022133 1555352
4334 1555352 2335971 2410866 1857017 1925196 2392013 1912411 2130694 1841248 2097165 2096379
4324 2096379 2704110 3155309 1950437 1872449 1726053 2165959 2749906 4412656 4795143
4315 4795143 3316828 3485293 3830528 3449082 3093157 4788440 5744587 4107738 3756294
4306 3756294 5773528 5949858 5738506 5015130 5306790 5087498 6341466 6451000 6857698
4297 6857698 6742959 4868029 5270750 6170852 5873279 5673077 6921343 6251913 5952414
4288 5952414 6773914 7911057 7741722 8834825 6966629 6273108 8284251 9210718 8161079
4279 8161079 8826377 9029479 8212924 9197638 9202280 10202001 11936211 11258605 9652728 10918954
4269 10918954 11869203 10863825 11510361 13543087 12051753 12538457 13040615 14019128 14651753
4260 14651753 14580525 13793411 13600883 13537750 13556903 14631383 15860434 15137840 14369933 15896173
4250 15896173 16328077 17842178 18772220 18291294 19416446 20331605 19905388 21051530 24099289
4241 24099289 25544286 25776016 27935748 30893909 33805993 37237748 41030513 45852468
4233 45852468 56920979 75690639 113691552 167823452 227324004 251671425 234219061
4226 234219061 197916795 154613011 118444728 92303262 73631476 59616228 50393230
4219 50393230 43078473 37921902 32535717 29845917 27320002 26988547 26358488 24553158
4211 24553158 21143879 21678379 22395512 21179472 19301567 19385065 19211987 17961438 18227879
4202 18227879 17135464 17431621 17692049 17730206 16827714 17157263 16626776 14642405 14632304
4193 14632304 15642487 15447408 15655752 14999229 12711580 11116167 11647464 12149443 13185151
4184 13185151 12864730 13268827 14099024 13749912 11564683 10457517 11563436 10668427 11435771
4175 11435771 11369929 10475648 10912484 11660023 12070496 10733225 10650711 11186134 10866650 9643405
4165 9643405 10363335 11513201 11533181 10035872 9875183 9933360 9762202 10586047 9989463 10237950
4155 10237950 9288937 9550056 8917663 9455928 8157343 7370492 8168261 7935844 6861907
4146 6861907 6279253 7288153 6572778 6455141 6698286 7464410 6910179 4659986 4066508
4137 4066508 6841595 5708640 5081344 4775048 4433200 4316890 4172245 4351144 3526110
4128 3526110 4562824 4669430 4725277 4686536 3600611 3425979 4344546 4048767 4262036 4034288
4118 4034288 2905582 3178909 4857991 3794496 2996437 4763415 4158352 2688134 2729480
4109 2729480 2831154 2280843 2401703 3078190 2972809 3349474 2368356 1898836 2824071 2385413
4099 2385413 2098754 3557578 3312652 2396517 2589067 3277870 2460924 2313271 2656940
4090 2656940 2167358 2187199 2314082 2464209 2967333 2954104 3178193 2867693 1785385 1743781
4080 1743781 1315776 749579 644318 2228541 3303275 3321616 1610355 82100 1702220
4071 1702220 3028850 2403374 2387391 2845445 2563805 2703039 3392209 3146749 2367038 3119735
4061 3119735 2778100 4956947 6465329 7452889 10791783 14009854 14949261 13390151 14032727
4052 14032727 11414031 8418721 8051868 7992390 7815070 6971245 5211208 4952784 5170130
4043 5170130 4960071 4830409 5255018 3966865 3165329 4549903 3620431 4637639 5240107
4034 5240107 5179489 3934137 4260327 3876359 2160162 2576367 2291641 2540473 3815593
4025 3815593 3269766 3026974 1762737 1450488 2749149 3087729 3010569 1735907 4142382
4016 4142382 3306108 2146603 2937171 2125439 1397907 2148548 3676239 5493331 5161126
4007 5161126 5119771 3226055 2942210 1694878 2359080 4897277 4287840 3385282 4176931
3998 4176931 5631506 4006582 4212896 4980537 4581312 4303361 4962902 5185305 5576338
3989 5576338 4516056 4776632 4296603 4917939 4424829 4138332 4656043 4174175 5660293
3980 5660293 5364564 4888462 5085328 4637076 5723934 6643702 7057911 7384995 6771114
3971 6771114 7599244 8807320 10208273 11291255 11726998 12080112 12432610 14045994 14616343
3962 14616343 15623480 16531605 16307034 17265829 17820373 19028152 19307148 20987227 22471100
3953 22471100 24106267 27486825 32156697 35948583 38013500 37290605 35966911 35711666
3945 35711666 35810344 34947595 33864739 34433829 34308398 33432236 32384085 33079220 33694811
3936 33694811 32684920 31749987 33471086 32658898 33948675 35531397 35784765 36462929 37630675
3927 37630675 37439843 37324823 38561953 39452264 37779565 38954087 41178247 42233366 44363997
3918 44363997 43892743 42061776 37751993 37262507 36654258 36517365 34479359 33178453 33162820
3909 33162820 32276709 31437103 30490329 29606447 28408860 25447080 23986638 23947117 24284581
3900 24284581 24045392 23146369 23171388 21484802 21825301 21862675 22084545 23047333 23175822 23639677
3890 23639677 23011349 23626109 24036148 23642138 24899803 24442577 26200342 25557931 24430612
3881 24430612 23807314 22815470 24066422 23839530 26455831 26833879 25663080 26474619 25632341
3872 25632341 27304053 27780792 27553874 28352945 27013021 26004581 24913627 25870652 26294340
3863 26294340 24382317 25159553 24533372 24647129 23778871 23763365 24915315 25053080 25233165
3854 25233165 25109584 27901643 27831559 27617014 27334681 27478726 27543603 27731486 27071814 26097262
3844 26097262 25606150 25409730 23392726 23471260 23508031 21544317 22145308 20461844 21288834
3835 21288834 20916747 22984797 23375249 21279796 20638266 21794641 23482184 22974336 23024139
3826 23024139 23901856 22762570 22096234 22125670 21882240 21992498 21744888 20760096 20949897
3817 20949897 21477122 21291554 20707816 20582635 19977327 20292161 21698632 21111504 19697563
3808 19697563 19866335 20192855 18707745 18479065 18621785 18025949 16892601 16826752 16386218
3799 16386218 16135839 16386958 15613289 14102775 15339453 14692961 14744223 15267518 15992197
3790 15992197 15367939 15993767 17870910 16389834 15773950 16616637 17592207 16633625 17135543
3781 17135543 16133035 15382455 16336488 17691026 17313103 17557252 17197338 15316636 15766941
3772 15766941 16748090 16136930 15117994 15788151 15399615 14633239 13562168 14596429 15100781
3763 15100781 14609438 13533846 14585198 15133245 13294262 11593629 11226223 10927260 11518558
3754 11518558 11928905 9714264 9478586 9110731 9328547 9166580 10106440 8476261 7175946
3745 7175946 7864827 8098389 8339802 8371349 8236902 6603914 8324870 9126317 11117820
3736 11117820 11589065 11091298 9835414 11053473 12291753 12239082 11917208 13483481 13932855
3727 13932855 15140661 16268019 15913541 16484341 16976978 16273377 16471941 18022391 17645176
3718 17645176 17490849 16809911 17855906 17594999 18376249 17500048 17705731 17359420 17843353
3709 17843353 17837651 17555833 16688712 15154306 14475646 13696552 14060399 12926541 12301377
3700 12301377 11968699 10983389 10363374 9532727 8945976 7981021 8428202 9121601 8630856
3691 8630856 8459631 7765922 6971683 7907052 8637388 8314984 8322577 8670143 9560583 8875766
3681 8875766 7710289 7711643 8404582 8586983 8640681 9623058 8859736 8240165 7930256 7425325
3671 7425325 8577745 9278838 8855372 7869375 7584569 6125266 5151755 5814596 4951407
3662 4951407 5160028 6076862 5960523 4662785 5331226 4192946 3337633 4073420 4997365
3653 4997365 4589077 4339406 4065908 3408105 3198353 4099910 4283644 4335715 4616873 4988395
3643 4988395 5478748 4272476 4175997 4087905 3476472 4563382 5331054 4976436 4772492 3987233
3633 3987233 4790505 5081497 5095578 3636559 2948886 3098843 3505190 3321568 4110611 3114066
3623 3114066 3223260 3950158 3887780 3190058 2326175 3042217 2982173 2602977 2902456 3899435
3613 3899435 3358218 2299612 926938 2070164 2345927 2657752 3615425 2406556 1897471
3604 1897471 2252173 2294421 2364486 1921787 1643888 2370709 1477380 1822993 1347288 1656818
3594 1656818 1426898 918590 2189456 2095177 1907359 920193 861666 2011380 1935159 1281635
3584 1281635 1289281 2942452 3357184 2413339 1909363 271225 -261551 833694 2474485
3575 2474485 1987498 1059317 1525284 1137777 1432520 771160 1920486 3324369 3019960
3566 3019960 3227762 1665026 2448845 4504782 3487760 3310818 2764827 3024399 3400653
3557 3400653 2583465 4082485 2667513 2823305 2626821 1877274 2658209 2033452 1867740
3548 1867740 1788247 2991531 3649180 3035455 4140717 3963063 2423034 2447697 2124148
3539 2124148 1574256 2292148 3904553 3277892 1530255 1674407 1272733 2392621 3168657
3530 3168657 2923416 1358727 1067564 2171530 1533500 1610181 955223 1300253 2026073
3521 2026073 1549884 1896353 2813197 2935031 2086843 822354 2550101 2231209 2141865
3512 2141865 3119679 3060095 3336356 286563 1002308 2462130 2289799 2063874 1314115
3503 1314115 2849377 2138208 1408719 2678303 2424699 2445567 3022896 3767923 3625039
3494 3625039 2894675 6354480 5864413 5185204 3826170 3497797 4574949 5136185 6063408
3485 6063408 4958499 5112767 5099028 4975760 5464628 5192193 5177231 5018624 5392605 6492875
3475 6492875 6349045 7004157 5803103 6529826 5916253 6180357 7462788 6623895 7325693
3466 7325693 8081618 8383720 8142651 7974871 8023048 8179047 9303443 9059148 8612712 11654658
3456 11654658 10593649 10034674 10510337 12017883 12054609 10881742 11506318 11094171 11664974
3447 11664974 11649166 12071951 12521534 11515977 11915985 13421764 13123142 12015206 11944169
3438 11944169 12830491 12067786 12723410 12812983 13016838 14319416 13720313 12470254 13124418
3429 13124418 14497626 14898746 15089735 18056890 18318928 18391336 18405174 19139404 20181375
3420 20181375 20600492 21141858 20941724 21552852 23263734 22625125 22227182 21980045 21680012
3411 21680012 21599274 21950665 24387335 23997289 23434336 22820132 22376317 21971107 21994401 22131374
3401 22131374 21428676 20473518 20697120 19907655 20461519 20056225 18999020 18909887 19400330
3392 19400330 20417120 19672154 20503445 19878207 20669838 21843235 22898767 24297901 25714352
3383 25714352 27004068 26732904 28682729 29730995 30347101 33322707 36195443 37489697
3375 37489697 38895705 40276094 41688061 42510558 43550816 44190961 42606828 43373825 41246804
3366 41246804 40362847 40925214 39709108 36812411 32640423 31787718 30235698 29161176 29255518
3357 29255518 28040980 26175121 25300357 24129361 24000352 23909420 23545104 22599297 22882221
3348 22882221 23832730 23571658 24329500 23832301 22502802 23117875 24438998 24972270 24882453
3339 24882453 25077329 25268026 26816504 26958383 25754265 26137365 27356151 27139998 27841730
3330 27841730 28233202 27144888 26553988 27092875 26833662 26778157 27253050 27409398 28180524
3321 28180524 27781323 27172174 28106966 29381291 30468176 30547660 31338507 32607910 34173663
3312 34173663 35411871 36717904 39562403 42735916 46254860 50891714 54070393 58739189
3304 58739189 66605795 74389633 84765535 97197169 109756275 120236456 130346469
3297 130346469 137232902 137951108 136848122 131483090 124678977 119299159 113760298 111879794
3289 111879794 113207044 114840829 118928402 124482911 129349137 127529388 124795547 119241769
3281 119241769 110560309 101953859 90690124 82192349 73447756 64650381 57478574 51779279
3273 51779279 47210196 42891228 39922408 35849683 32940516 31403715 28921588 28010442
3265 28010442 26298774 24463498 23507716 23135774 21761613 20308360 20249324 19749942 18135966
3256 18135966 17822774 15970735 16386813 16305099 16613289 15524481 15455837 16289591 14939843
3247 14939843 13665132 13787015 14831929 14296591 13918895 15611785 15603644 15237237 16505515
3238 16505515 15629999 15923294 16714579 18206416 18266976 20228881 19051680 18066816 20343070
3229 20343070 20570826 20240411 23133792 25716160 25822233 27555989 28544105 29993216 31172419
3220 31172419 33111250 34417078 38808235 42597691 46014586 51662960 57373394 64851206
3212 64851206 74351275 84316964 93912223 109095082 125149342 137034367 147814376 156853681
3204 156853681 161244102 163489107 164993546 165041511 164320229 162135957 156797653 150250307
3196 150250307 141697400 127870022 115149706 102561416 88835402 76969055 69812342
3189 69812342 62593098 53617607 47996470 43543249 38043450 35109440 31250137 27179356
3181 27179356 25403999 24022016 21487290 19002913 19522889 17827647 16049672 16526334
3173 16526334 16863975 15298420 14837434 13382831 13549436 14553317 13966689 11951059 11714700
3164 11714700 13007366 12193614 12209929 13316304 13265427 11020860 10793423 11281623 10959164
3155 10959164 10398925 10565099 9836490 9228194 9086580 9531027 9166134 8493011 7852772
3146 7852772 8357169 9512989 8944161 8242037 8037561 7778454 7897834 7752188 9171885
3137 9171885 9088067 9210624 9188352 9940587 11281086 10737269 9929214 8707076 8171807 7439464
3127 7439464 8790765 10293600 11181525 11499717 12365593 10741238 10142790 11309141 13509438
3118 13509438 13593342 14597433 15434011 15428836 15137922 15169404 15876057 15756153 17200753 18891151
3108 18891151 19139477 20031897 20357884 21708641 22321771 23338995 25439076 27072285 29387729
3099 29387729 31705553 35045442 38395491 42401646 47205990 52493837 59104989 65819066
3091 65819066 74581390 84836750 97439899 111550470 128128289 146039769 162502343
3084 162502343 177834707 188443450 194040594 194258886 187369028 174804548 159829916 143955277
3076 143955277 126928766 111084037 98410000 84518453 72539067 63899712 56143698
3069 56143698 50179839 44915402 38855969 34286640 32226526 30178726 26412333 23644019
3061 23644019 21382948 19308675 19245645 18360493 16920503 15167454 14440564 13365644 13109938
3052 13109938 12577742 11215807 10881976 10745523 10689994 9838966 9817345 9566927 8534362
3043 8534362 7009265 7704017 9480041 8917854 6842359 5221717 4332444 4520250 5225605
3034 5225605 5964257 5421270 5402885 3474400 3688129 4163464 4584397 2673596 3222381
3025 3222381 4936137 4772109 4606619 4057219 3753835 2990980 4277478 4351468 3835481
3016 3835481 3773222 3417693 3041316 4399784 4092986 3091443 4303365 3670275 3635014
3007 3635014 3778501 4974798 3100071 3010536 3705472 2646337 3574425 3521421 2324139
2998 2324139 1031043 3405045 2903963 1747494 2353008 2945607 2242622 2450109 1543370
2989 1543370 1158583 931179 1149614 977763 990239 1988040 1312775 1328821 -576897 1033203
2979 1033203 1484514 915691 1067825 1144559 1277032 1261160 2001146 1035538 171284 105279
2969 105279 -616877 183159 1488431 965306 285018 -297351 -29124 222075 322170 -1019224
2959 -1019224 -2009748 -148005 929439 2052236 1820092 405369 134786 345700 1018926
2950 1018926 239440 1220663 1557869 1453111 820549 437995 432039 268670 1514995 1112240
2940 1112240 848216 772872 996125 246566 -782819 1190173 1653970 623900 293915
2931 293915 685931 765158 55686 73054 508557 533361 333857 149692 1439984 844456
2921 844456 -1667230 -1090240 183321 166198 1620751 2035247 3674 -1315878 -188965
2912 -188965 442208 1273170 129069 -1007085 -311026 1370816 1934877 482298 1132443
2903 1132443 -861844 -63407 1798173 1672391 1184705 1354013 28393 -2059938 -467337
2894 -467337 -543156 -938295 -759857 -123750 -1463263 -1271859 -1392447 -1017378 -515125 178381
2884 178381 87639 136532 736762 -156018 -440457 -379080 447623 530893 150414 187760 -1108502
2873 -1108502 -677558 -539775 -445061 -1049439 -1175337 -518368 -596360 -178539 -675757 -873460
2863 -873460 -494217 1449158 339788 -1081168 -986718 -775682 -562394 -847744 -73956
2854 -73956 -492380 -1427199 -670966 377344 -359557 -1234910 -862743 -1250873 -1196905 -358253
2844 -358253 -469706 -505983 -312 -434404 -593167 282544 -516524 -666369 1709280 1371584
2834 1371584 380963 1230212 2217518 1388628 878612 1019951 348040 1012146 1115099 -196994
2824 -196994 21050 370139 -487878 -1220262 -1501656 -2820284 -1965652 -294990 -148604
2815 -148604 -388825 -54651 -1207166 -1134897 -389576 -32489 219901 1941764 1501338 389727
2805 389727 -79426 -164531 205846 284505 893382 1033540 344636 106239 48230 903876
2795 903876 968954 1211413 1314877 1397564 849576 1401489 1344832 461188 1229080 1764279
2785 1764279 1856168 734715 766585 1220281 1239039 1155843 1030439 545989 369753 52999
2775 52999 151335 -248715 -1001008 -305747 858912 -315657 -2009895 -1296926 -371297 -454836
2765 -454836 -219082 296781 -525880 -1314716 -1271406 -285538 1351782 1099542 49389 215081
2755 215081 -1024124 -1500631 -560925 632247 -213216 -1681110 -465390 -1882366 -1002003
2746 -1002003 -480685 -171620 159056 245042 843950 933201 1805455 893515 831653 1302211
2736 1302211 1789708 2016901 1468336 -62352 -273034 927079 209968 476298 40152
2727 40152 -180646 -1162594 -131705 -284287 -1281744 -1664892 -848181 -757961 -783666 -816071
2717 -816071 -2424362 -2227336 -1103146 714289 -284027 -435404 -646151 -2348121 -2291563
2708 -2291563 -837746 -444442 -1190206 -1020557 -907304 -805047 -722252 -482061 -893694 -272844
2698 -272844 -668529 -667333 -188088 173129 -75060 -72026 -351808 87363 743414 651169 109418
2687 109418 1136280 2071420 925655 598212 1011624 -147859 -1046020 156873 732783
2678 732783 651830 -839560 -420827 -161662 -261784 -406600 -330751 -192837 -88178 649680
2668 649680 387473 597172 171794 -874228 -1240606 449926 318886 -329896 -509564
2659 -509564 -419185 -1016930 -1158263 -908189 -2038978 -968727 -1335132 -1104404 -1571352 -611563
2649 -611563 -414573 -817358 24021 318623 170429 188654 832853 793179 -837752 18465
2639 18465 2316999 1192390 1101482 1347988 647632 765163 2610670 1705991 339425
2630 339425 1750379 630066 -254830 1129173 1764830 7176 -640491 272103 94765
2621 94765 1071185 1024183 -1079204 -501881 -143969 41858 -978029 -1026090 -105427 -102339
2611 -102339 1055650 54544 -189160 -548498 -1977668 -1864830 -1615759 89273 -106496
2602 -106496 -328312 -421272 -385371 -973814 -675007 424156 167425 308675 1607768 2925898
2592 2925898 2472926 2111509 2261171 2825788 3612404 3177671 1780777 2188023 1472142
2583 1472142 1890761 3175982 2601796 1019943 188340 571161 876416 1545220 503438
2574 503438 -481863 -388317 -68941 -592414 -301271 -1421948 -1298737 -1587590 -1396626 -711596
2564 -711596 -68092 -1021096 -2338466 -960564 -840948 -1012923 -592440 -720311 -904948
2555 -904948 301289 -176228 -1478590 -147577 -490446 -2015019 -421579 974755 -31329
2546 -31329 -1328069 178448 -12956 59496 1233619 1069324 1174425 800634 439189 1484445
2536 1484445 1410607 1106156 1078808 1367348 1448979 1418536 866081 -591081 354596 2507581
2526 2507581 857669 -215306 314246 1204966 644654 1502104 786231 -777952 121640
2517 121640 158630 806992 1429264 928712 -349482 925649 1693897 763335 564119 1753447
2507 1753447 577289 898410 2358623 1476296 64676 -1352380 -407609 -732161 1254791
2498 1254791 1048511 752156 -1009289 -1735489 -1812205 -1241671 5677 353859 325687 -550058
2488 -550058 482711 727777 748274 271861 -265591 338723 2044520 2171381 891412
2479 891412 -293441 -1038441 -800188 227058 199159 378710 260925 232883 853592 1859948
2469 1859948 -560795 -758939 1146295 1068562 475098 2669655 2643227 966101 2088294
2460 2088294 1386274 -44802 734908 2322779 811991 2161651 3382753 1977182 790000
2451 790000 350255 93645 988703 1127066 1232080 1618847 1809111 67988 583200 712898
2441 712898 38147 313655 486418 1109929 1677290 2132193 1822205 1633839 24939 -98193
2431 -98193 1417400 3481141 1334391 341346 -167550 1821902 1434619 1695080 1439712
2422 1439712 776814 609333 1312628 3722010 2472786 1832358 2696250 1472876 1387883
2413 1387883 2167145 3207508 2389597 2299728 1677472 2288044 4929039 3481986 2312888
2404 2312888 2883789 2713334 913330 2543615 2920368 813838 2128348 4462602 1696843
2395 1696843 2252772 4382329 3177161 706860 1350508 3110847 2507653 3034675 2694177
2386 2694177 3145448 5277885 4556249 4257666 3529615 4012930 4930672 5357985 4929197
2377 4929197 2357401 3908786 4074655 3793372 2682553 3594868 4246066 5019251 5294373
2368 5294373 4694252 4349800 4859769 5240884 5207955 6719717 7789893 9783103 9272916
2359 9272916 10239087 9777274 11205598 11402825 10659405 10210199 11233286 12083201 12093911
2350 12093911 12412448 12586946 12861387 14997513 16433183 16466413 18819573 20980547 21424561
2341 21424561 22379686 24536431 28483898 31977910 36155088 37824843 40223819 43299005
2333 43299005 43106314 45329313 49212920 55078437 63891912 76007170 91390057 118222169
2325 118222169 175875422 273749530 393217359 479502294 476294527 416607988 333020975
2318 333020975 253184918 191909776 146770816 113369066 87170064 70667771 57158751
2311 57158751 47316248 42088601 38583934 36773636 36514374 34756955 29776928 25927150
2303 25927150 23481272 19420616 17758259 15679539 13156939 12161974 12541659 11565780 10049156
2294 10049156 11495692 12422391 11214625 10822624 9594194 8361041 6709003 6356585 6929743
2285 6929743 6358220 5762717 5944881 6239997 4464895 3893720 5640546 5326151 4451753
2276 4451753 2583245 3180802 2917999 3131361 2042032 1786934 1752876 1830590 2352236 2097943
2266 2097943 1979616 1891018 1979887 2157349 2630340 2686237 2837901 2531940 2967616 2603461
2256 2603461 2846615 3038483 3609754 4786431 3894493 4637526 4251801 2859343 1881079
2247 1881079 2420306 3148440 1986891 2002369 2466498 2653366 2840264 1869979 2085995 2219663
2237 2219663 3005944 2803144 2694016 2841357 2863344 3036936 1538680 642365 1816988
2228 1816988 2024497 2041893 1231679 550026 321733 321615 481727 -636901 -838966 -158470
2218 -158470 -560835 -749422 -555318 -70408 -19621 324244 556025 -477088 -217820 -365160
2208 -365160 -1115934 -1082570 -684257 -1360987 -866719 -629870 -906323 -1203011 -31460 -1421975
2198 -1421975 -969568 -73862 398187 -1311618 -1197264 -1363562 -986632 77955 -494878
2189 -494878 107164 1350512 1461181 1285741 72434 -184287 2357943 3671086 2108879
2180 2108879 1284628 2485800 1590104 770330 1518509 2055676 1570031 2114710 1552750
2171 1552750 603625 173836 1029843 1142106 409015 222559 259271 279380 -631012 455419
2161 455419 -589020 519466 584756 419566 -374868 45065 -234072 -1568706 -1299653
2152 -1299653 -632433 -865649 -374862 -1998301 -2304916 -13923 363098 73669 -504334
2143 -504334 -160423 -703168 -113900 -765261 -1240915 -192692 -51014 190906 244879 -64638
2133 -64638 112818 34095 -254746 -426034 1110667 -388960 -1427315 -314398 -1558879
2124 -1558879 -2026746 -439953 82072 -41757 -1412889 -1226014 -1238771 -1266763 -1567782 -1341327
2114 -1341327 -1155140 -1968585 -2251695 61156 -447156 -1529535 -956912 -746628 543031
2105 543031 778713 36993 -1343375 -1740288 -661817 -1105850 -853618 -81532 -1128582
2096 -1128582 -2341364 -1285376 -1097159 -979717 -1184356 -697149 -1675088 -1504130 -11547
2087 -11547 -384920 -402520 -1029881 -2724698 -1150035 899193 285006 -277734 629330 -476920
2077 -476920 -976623 -330011 -659688 -2379843 -407237 885265 1010731 1172081 -295635
2068 -295635 -1076213 54128 539821 1145569 818603 -415172 -85723 -163906 308727 602764
2058 602764 2010576 85753 -548394 1752045 2307696 2726501 3492998 2084779 869068
2049 869068 2231981 2058387 -38927 291270 435732 -103983 1042395 885204 396876
2040 396876 303016 -651293 -1003932 -343288 1743305 -40535 -1077325 -777307 -868061 -416857
2030 -416857 -163495 -186 -1146985 -1445683 213240 -591078 -2662868 -2515641 -443786
2021 -443786 -1455772 -2878989 -2220759 -706060 -1474632 -2049246 -2140103 -2130890 -1458210 -993385
2011 -993385 -1579205 -976497 -450614 44560 -1250006 -984176 -229826 68749 801923 -188635
2001 -188635 -1025844 -120721 470326 1121142 470217 1139422 411899 -307375 529786 -318471
1991 -318471 -96806 -313169 -174919 -406164 -333273 571312 -18296 -1053070 -970685 25782
1981 25782 56878 437652 304330 701579 -199967 -480160 -439676 -297483 591721 349521
1971 349521 118360 -560796 -139311 226185 173446 -1486174 -300360 -1198285 -1574887 -726697
1961 -726697 8714 -63020 -815368 744676 -737122 -262068 589144 -580193 -952708
1952 -952708 -325082 507888 142484 -250021 -1154894 -1104353 -1511936 -440095 -346678 29190
1942 29190 -321261 -9769 -229015 -1005929 -1177696 -502351 -626132 -174446 7776 -717739
1932 -717739 6376 487964 -936032 -495817 -431674 -293218 -1410636 -395604 -935026
1923 -935026 -1351123 -87098 -1764862 -1985585 -1696787 -479986 -1164124 -1111820 -855822
1914 -855822 -1480133 -2141723 -763155 -43605 -549798 -356814 -33873 -25698 394775 1616738
1904 1616738 380685 -141156 -228915 -591560 -78286 815892 -550069 -2079631 -1006854
1895 -1006854 332744 118303 -960680 -1379594 -1339778 -1430773 -163031 578395 79612
1886 79612 -1656719 -2197919 -1419588 -1115013 661676 1882228 99118 -1017996 -108417
1877 -108417 -838656 -1644376 -307245 42194 -1193360 -386646 927769 533636 248229
1868 248229 -94846 -139644 1122925 1327383 1613033 1694470 981399 -105574 -2310 763250
1858 763250 599969 53418 92728 -333314 -248492 -1241448 -1531152 -869714 -1249266 -1456820
1848 -1456820 -1293381 -1782153 -2750931 -2747915 -2340088 -2205088 -1209407 -1478137 -2770050 -1580733
1838 -1580733 109292 -1076065 -1758366 -1737436 -1276232 -1654083 -1260631 -1189373 244706
1829 244706 514548 -1398535 -861853 596303 112318 -1081488 672252 -34280 84669
1820 84669 1625238 1991784 -81909 240637 958318 652386 1907133 1946687 408466
1811 408466 751898 2317508 -421079 -321680 -89973 -379631 -2540017 -915048 -172517
1802 -172517 -479012 -388797 -1525715 -1816037 -1426398 -1855319 -1481116 -1293742 -440765 -1015451
1792 -1015451 -565062 -1144105 -1270561 -355929 -577630 -914876 -1081983 -429854 -860391 -757211
1782 -757211 -1807169 -1663343 -945172 -258416 -731694 294356 -1415699 -1582703 -893338
1773 -893338 -252720 -686837 -291541 136721 -1902907 -1066392 -1400257 -44649 1162571
1764 1162571 -794330 -1398702 -1514808 -265801 -1095900 -483125 -82505 -1560542 -620681
1755 -620681 -887540 -1299332 -1078685 -1617540 -1953089 -1137472 1452254 1170694 -43311
1746 -43311 -759455 -1721434 -813336 -338677 -50246 515598 -1340848 -1428593 61543 -318852
1736 -318852 -1734464 -858161 -453541 -1777499 -866789 -980853 -1421696 -728761 -1324916
1727 -1324916 -1347888 -1984029 292381 -2190555 -1568540 727642 845959 10627 -437540
1718 -437540 -428346 -687025 -125537 -352949 -1032067 -931323 236466 -117336 504158 570881
1708 570881 405533 -1029407 -1101270 204045 -1168771 -42419 -6905 -1849628 -2190665
1699 -2190665 -148648 592009 -396327 459759 -878651 -761939 779034 549308 -662077
1690 -662077 -865847 -561260 -449307 1083338 241952 -1088821 583205 -117297 -1170489
1681 -1170489 1081177 218251 -2080802 -953878 233450 -1316334 -1946489 15787 -1690563
1672 -1690563 -1677385 -852355 -1060906 -1171349 -704641 -4858 -914655 -1462901 -1440525 -1460040
1662 -1460040 -1970630 -2023914 -876546 -931372 -914878 -799062 -1114528 -1666579 -163861 33625
1652 33625 -171847 634807 354465 -480505 1643149 543416 -520739 1397323 2942165
1643 2942165 1076550 686229 2157020 782929 262857 2256561 1073079 -155979 -503345
1634 -503345 -510954 417383 852617 947199 -432529 -1305514 -340006 -609708 -135466 -1239869
1624 -1239869 -1944894 -3153117 -2699038 -1056768 -359020 -389464 -1222523 -1445175 -1264212
1615 -1264212 -480803 -1634507 -1558314 -782887 -1065122 -1653628 634106 137675 -2267359
1606 -2267359 -2342578 -1403675 -1064032 1049682 1796823 314213 173278 -1057889 -1913166
1597 -1913166 -336813 1566205 445056 281659 882245 729112 -320613 474680 90456
1588 90456 248800 1324356 -137894 -829460 -313043 -387727 -2293995 -166078 241793
1579 241793 -1261716 -763925 628877 94320 -215689 -38680 -1075698 -722548 -38175
1570 -38175 -1707776 -1733619 -782034 -1586134 -2407515 401520 532892 -215771 -965374 -1527474
1560 -1527474 -1356426 504925 182660 -805860 -1099709 -1410115 -1873145 -61618 1209740
1551 1209740 74860 -767732 -1021574 223643 474420 -980038 243406 -289068 -766733
1542 -766733 -1187608 516359 1018284 320477 899347 835882 1430019 249357 -657342 -1049729
1532 -1049729 71039 -181073 -490624 -271129 -1000684 -983957 -370195 -59749 574701 106842
1522 106842 -895892 -1178028 -898445 -108189 -405063 -400404 -1616729 -1620192 -222332 621286
1512 621286 1131063 -769119 -1081960 -87412 1397484 873038 -792630 -1185600 -1153770
1503 -1153770 -107640 698410 453734 675772 -387062 -1289993 -785708 1048823 1287054
1494 1287054 -816978 -1684881 -770822 -14041 727951 -86743 356976 -520988 1345211
1485 1345211 1912642 1574918 718745 -781231 -918371 129923 882617 -770249 -1393514
1476 -1393514 -378902 -1957561 -1467164 821421 747537 -272347 -1005782 -439831 309349
1467 309349 936139 -134852 -1779271 -920135 473643 603612 800131 519448 -573646
1458 -573646 -2056188 -595315 352052 44085 -706459 -1281004 -704855 -1250815 -464503
1449 -464503 -369276 -761978 -952383 -863066 439694 530526 -120703 -1175923 -1958864 -704201
1439 -704201 760115 396913 -1351835 -963088 234075 604539 832220 851393 -840945
1430 -840945 -345734 349735 381613 -47113 -75042 -1080991 -1660503 358759 572603 180083
1420 180083 -1768734 -265567 540723 925349 1156054 1603615 2147817 -595303 -863422
1411 -863422 1635747 1678068 631333 113268 -89639 -277470 474001 697590 908550 -89215
1401 -89215 -1497945 -1818235 679692 621385 -43474 -713763 -664476 118643 -468410 -741231
1391 -741231 -1588231 -637885 -808076 136612 -1035219 -2056749 -1798389 -2040879 -1619081
1382 -1619081 -683061 477906 -1009961 -1181424 -495476 -1054462 -1165377 223664 496376
1373 496376 -248617 7360 -536582 440450 743606 -91904 28947 773097 683934 -268554
1363 -268554 791233 455554 133102 344047 48635 -1096622 -1794307 -1256830 -902915
1354 -902915 -1552288 -534397 -1105846 -2592049 -3384418 -1893735 -1796116 -3297224 -2450230
1345 -2450230 -2286823 -1223004 -1023172 -1567639 -1271776 -689532 -587595 -633098 593224
1336 593224 819917 -1587743 280704 1278266 -49010 -544444 1076538 1314073 17725
1327 17725 968180 1523477 2062788 1712752 716970 106545 -383386 272508 365962 -480453
1317 -480453 -347328 -235430 -534722 -1643225 -1003580 -728139 -761109 -1243264 -1381372 -1067695
1307 -1067695 -596813 -1470068 -1987003 -1640652 -2203759 -1719411 -1134099 -298643 -2210847
1298 -2210847 -1583703 -437284 -549735 -1727219 -1135302 172641 -227782 -483187 -257469
1289 -257469 844670 488769 612013 -39965 -135413 345309 -129246 142678 1324633 922160
1279 922160 -1829794 -1027161 -1568121 -1999645 -292319 1368897 -541066 -1309808 700135
1270 700135 -535986 -396766 473230 1308895 795973 954403 -430822 -1364130 154123
1261 154123 673375 -110308 -82915 -769700 -85573 1327657 1046599 -512635 -927741 -871906
1251 -871906 -613054 469685 295206 -790938 -826072 -319101 -384270 -294593 -280487 -99723
1241 -99723 -686185 -978046 -1253664 -267051 42296 510862 -230958 -1082966 -736963 313050
1231 313050 450999 -311488 -235703 -903773 666549 1859981 690465 -480887 -365836
1222 -365836 -58336 -578439 852814 2224909 511342 1154204 1311868 970682 -509885
1213 -509885 -1592850 -1314297 -1038795 105650 -186669 -585588 -1032763 -2363889 -2925178
1204 -2925178 -1902882 -2111392 -2082406 -1036490 195296 524454 -764037 -1303357 -421994
1195 -421994 10539 -531184 382687 1600009 456767 -520681 742045 32766 -1493099
1186 -1493099 709310 557031 -1062592 -191295 1442743 890226 -283313 715315 780573
1177 780573 -554186 695305 493640 932231 521408 -423804 -368058 -221234 406473 91747
1167 91747 -673314 432665 -355954 -128382 358154 -1049342 -1288465 -1623606 753770
1158 753770 135093 -739035 -126277 -1099939 -1226463 -845765 -458216 -586244 391313 413431
1148 413431 -890285 -687076 315436 1478376 1016886 187035 -805478 -953929 -881173
1139 -881173 -414650 317371 -378501 -2669976 -1720469 -439226 -1119697 633941 -42783
1130 -42783 -653688 -1971321 -137338 -370898 -140771 980384 -67200 -40971 301809
1121 301809 -300053 -1118062 -6248 839658 209081 -1456223 -678640 -1620517 -1424057
1112 -1424057 -672048 -271973 -39865 276327 885412 -90947 391549 928107 778327 86701
1102 86701 -568624 87100 -172309 1324298 864298 -764425 -815218 136844 2071285 1959515
1092 1959515 -179807 -166709 -427329 -128875 303649 1771538 1033711 -538764 343984
1083 343984 -215846 1380050 1843419 -161849 -573134 -762324 437700 424785 1722985
1074 1722985 713691 -1729790 -1535896 -833862 -185809 -855175 -1104611 -34109 -928273
1065 -928273 -2015367 -2470526 -845761 -2371639 -2860208 -550466 -480949 -520993 373917
1056 373917 -618701 -923168 -219053 986551 -970628 -547572 934123 748051 2145111
1047 2145111 673464 -116038 -1314847 163117 852813 793160 2239713 1370060 687914
1038 687914 709681 1784610 1139539 -940907 -317857 15732 442949 692162 976568 69990
1028 69990 -2330460 -2932018 -2054997 -1093562 -851813 -1745484 -267446 -546922 -2370036
1019 -2370036 -1084693 -49147 173988 -719463 590533 1071741 272869 1158802 -393075
1010 -393075 161292 -23971 941634 182982 242835 1026191 1551240 467282 349009 57010
1000 57010 -249098 -874502 371685 1235027 1367167 189396 -1001719 -1527743 -1205872
991 -1205872 425332 1026704 517033 608242 431707 1241687 750067 -375989 -597264 -797455
981 -797455 -126725 370780 1457391 1729789 556433 1522067 663585 -1061862 -664761
972 -664761 615570 1007190 394011 1561555 1718347 -28239 -853229 -765522 185989 938367
962 938367 1532076 1464684 1161761 900672 -669998 -2288888 -2439354 -1604214 -1462482 -1573291
952 -1573291 -158244 335719 -914387 -1212200 -822246 642365 173297 470153 -1208
943 -1208 -650070 -63727 145333 758522 857436 -207965 -550266 204806 800431 498960
933 498960 1231 -29704 -423440 -794572 -721473 51927 1023064 207236 -440556 -896693
923 -896693 719630 791360 318040 253360 1326774 245528 -1401043 -1294525 -11711
914 -11711 -1202634 -543349 -1035683 457506 694434 -204620 -1666956 -887558 -692193 -3276340
904 -3276340 -2391256 -204945 -990747 -1169999 648290 -778676 -1271411 -2091744 -821492
895 -821492 232149 861234 87049 144354 1235237 -1099513 -826257 88959 546264 -718706
885 -718706 360611 768438 1273193 1013372 -406736 -2042994 -234045 -535480 -748707
876 -748707 236787 807287 -628389 41373 845336 -162432 932032 -659808 -1204912
867 -1204912 -414762 834920 -1196141 -1462525 -1343672 -981906 -851605 793150 98543
858 98543 -1583659 -1335579 -209037 742872 673187 622967 3374 647450 -439606 -878293
848 -878293 151485 -727089 295438 918195 1437284 -177301 965124 445232 -559978
839 -559978 -630391 -333429 -471034 -1366004 -289175 326017 703606 12536 -77099 -61539
829 -61539 -154608 -1293335 -476000 667971 -916446 -777970 572620 635384 -894453 143246
819 143246 -918876 -1530742 571962 2062974 2598425 1425569 -393422 -1517094 -1254918
810 -1254918 163556 -634155 924098 198032 27163 1192085 1924461 -247653 -1476987
801 -1476987 -682425 -1081816 -589518 1216816 -140688 -1851279 -1304175 -2153410 -1952417
792 -1952417 -774938 788493 -628179 -764701 -445023 -1901871 -31494 850773 1460351
783 1460351 -51343 -497539 -988198 111390 2295519 872037 332320 348918 -626320
774 -626320 -1306504 777331 1823267 -157764 -460907 172547 -452792 125833 118046 1449302
764 1449302 863543 -28107 142055 1076879 2043301 -78660 -237568 -326396 -1542635 44932
754 44932 639246 546692 -774153 -35119 -522757 -1322409 -140663 -163443 -73364 601685
744 601685 -340393 -513477 -922663 -342395 -660647 618806 1172473 861228 3168655 1604051
734 1604051 74530 -187088 1116487 304383 -600342 1047410 418169 760531 346939
725 346939 -908134 -184588 655092 963610 637901 -259673 -332565 -709113 191072 121229
715 121229 1032864 1446475 617278 1357714 1090792 317534 487402 977708 807102 -488862
705 -488862 930033 -831953 -1610083 -1618963 -2133051 -1219809 -965634 -843444 -993294 1586904
695 1586904 1333809 -1683334 -1523090 -871835 -572958 416452 594987 21828 1066690
686 1066690 1511172 1071663 -347113 435736 401261 833659 617288 -461205 260847 233063
676 233063 218934 -521528 -457996 -1075116 239981 1320958 476067 1236684 1972327 2126266
666 2126266 383481 18531 143991 1109274 1094532 568278 495530 1213017 812264 823251
656 823251 1400176 1704777 1265576 -921988 492578 1061086 1048378 428934 692996 681442
646 681442 665595 2357386 2518488 746858 871554 1904445 1555613 876431 1009067 1189971
636 1189971 1034707 -46208 -854328 -824782 -583484 -73923 -349081 -453970 -1092888 -1599185
626 -1599185 378593 -720480 -1472998 -855333 -430996 -842636 -872473 225768 -194252
617 -194252 -743977 200846 -862320 -845364 -454652 -415374 -1042105 -375691 -704353 -1981471
607 -1981471 -1387827 -233779 -1104292 -1807109 -1272110 -1146138 -673856 727928 -46429
598 -46429 -423466 -747140 -1315846 -1265417 -1045922 -1063058 -576471 -226044 867789 -555836
588 -555836 539065 1046217 735826 -522103 -382542 134367 -112450 1418295 2095365
579 2095365 983252 -342217 650175 172970 704002 1613116 665825 14291 1345804
570 1345804 1628234 232040 443430 376131 -399600 -382708 913149 -257331 -146114 1009893
560 1009893 1227125 8388 -1593922 -1052866 -913225 -122547 -431201 -688247 344065
551 344065 1512199 387543 -188659 165426 323339 -244795 -38089 749065 226664 188222
541 188222 714642 -303643 -1103446 -1023994 -198582 -75529 938993 526509 621795 350197
531 350197 1110058 211615 -487161 -2050201 -833942 -225960 555277 -54135 770883 -501101
521 -501101 -465179 669968 -445201 -1754982 -901998 -100988 -1049565 -814856 -723873 -1110129
511 -1110129 433103 703716 -1354664 -386485 852497 83541 432824 1403963 212453
502 212453 -298417 -37256 -809439 -70708 930244 -294079 -621652 -201100 699217 1106857
492 1106857 320230 -462654 -999433 -160370 -1582488 -1885518 -945315 305275 552532
483 552532 133730 79709 1027907 29275 -749477 -292604 222210 498081 1159811 1820239
473 1820239 -1219726 -1863634 178873 331567 -1018388 -1120441 -334730 784111 789964
464 789964 404918 -758711 67210 -171945 19314 -872960 324047 712035 456413 1137850
454 1137850 1433675 1792705 793672 -391157 45234 -369478 182024 -818435 -229362
445 -229362 -137814 71679 63303 -406807 -237321 657274 142657 739830 315070 743442
435 743442 276713 130452 881296 -42247 550456 -176476 1108308 567479 320055 1273717
425 1273717 839876 159534 -1721244 -667996 -765846 -583122 -1614779 -2386009 -1244114
416 -1244114 -308027 -1150827 -212010 -444651 -1369292 -1052164 -654881 445896 434006 662930
406 662930 -230156 1396550 1936832 552173 1171702 988376 525049 -200848 161995 805818
396 805818 153140 262092 -395478 72743 -1102600 -1176965 969310 380647 -269646 925346
386 925346 1445195 1619215 634464 759085 -664053 528789 447554 -823364 515527
377 515527 824000 66326 196702 -1481219 -1689966 -801806 -824076 -1628861 -1664117 -1986514
367 -1986514 -2979867 -1204707 -1905707 -1920856 -525296 -1243578 -1741119 -526840 1686879
358 1686879 99756 352566 -46022 -1298633 -122657 91721 -827653 -337350 -23880
349 -23880 -650196 -475503 -104089 -785152 -1636714 -579297 -1009848 -476973 370286 -697469
339 -697469 -861111 -1579224 375048 1903314 2458096 2174090 1125509 1216370 841768 949235
329 949235 1329129 1376750 -230282 -512827 -534439 -456826 -930528 -944045 -672005 -1134512
319 -1134512 -757523 -1387040 -639576 -348024 -816720 -343725 662897 -69170 -1548162
310 -1548162 399789 298384 147116 1847768 2719434 1566009 675317 417266 -748927
301 -748927 1103868 1101166 -1588178 -872588 1029682 606043 54667 475007 -291257 -64787
291 -64787 799579 1525397 1176218 1010479 -499187 537793 1893873 242474 -478413
282 -478413 -126575 -578687 -132070 523935 -185500 -1488567 -1639692 -2871756 -2000193 -1750396
272 -1750396 -3113552 -2770673 -417470 -651806 -2567029 -750889 -797949 -1700520 -1866747
263 -1866747 398172 896865 1295111 1371247 -80500 -1136871 278857 1286257 743540
254 743540 556393 28331 -409608 258209 618738 -402284 -1447311 -1241359 -1133052 136571
244 136571 1070730 318258 -931412 -391659 360096 484707 847688 -400135 -384909 -147434
234 -147434 416598 110681 226395 -531310 -1178936 -210963 -436665 -1295937 -699953 71213
224 71213 -483764 -79446 -708032 -1122888 -749328 -511936 -322016 -55474 934416 -55373
214 -55373 -1054812 560182 161465 -137290 24999 778012 -450369 -978577 461208 606185
204 606185 -268998 -424596 -371687 -717125 1050966 1865945 540985 145274 1780464 464662
194 464662 -94391 839626 881541 -741433 466073 1540055 417918 784778 593943
185 593943 -274464 -764383 -941645 -316777 -171831 -11593 -1395978 -1580564 -1247364 -2191559
175 -2191559 -1014509 -1342743 -1331844 -501040 -639775 -421366 -790822 -197101 -1589251 -1499773
165 -1499773 -799370 -1325863 -625856 -681549 -1075980 -317484 -247108 -653050 -326792 907679
155 907679 803336 -543104 -48419 58536 1053254 907096 303185 -339632 -18942 782024
145 782024 702966 1536377 705236 475211 203693 -700719 -1269909 -1994548 -812507 -100745
135 -100745 -221267 -800713 -1108523 205534 38295 -650352 -476258 -831335 -2241 -108474
125 -108474 -291180 -721151 -490340 535315 -259239 -754204 -50334 -674736 -703876 -782376
115 -782376 188658 -643413 -850391 69883 42041 -794768 -797972 137395 388859 1187206
105 1187206 163846 -602527 -897611 154664 -67610 204081 124954 -438140 -464501 -30807
95 -30807 -398837 -922628 -630379 -1161117 -611024 -241028 194324 -1456163 -1016106 -954618
85 -954618 -900075 -320333 815136 870672 792261 278855 -150379 324164 354880 535925 330463
74 330463 152670 -1313204 -452598 722927 235026 -947583 -1602686 -3006671 -1913729
65 -1913729 -944476 -864320 -1119067 -482761 -1136290 -2798860 -2138911 -1757639 -1294612 193385
55 193385 -628104 -490255 279661 -192409 -1416382 -980358 -398423 -1431349 -151427 1097533
45 1097533 3682 -1148828 -382891 -320585 311067 887079 643200 -557130 -758473 -194948
35 -194948 888473 1249679 1278539 844914 -175985 -42877 657815 975436 386854 770823
25 770823 1466766 -296072 -154157 -48087 -821707 -1140068 -745414 -72225 -977367 -692180
15 -692180 -1463367 -971700 -1058672 -478083 -700858 -789558 -1666376 -1490888 -243196 -291449
5 -291449 -548965 -256094 366841 -180144 -58264
0 -58264
$$ Imaginary data points
##PAGE= N=2
##DATA TABLE= (X++(I..I)), XYDATA
16383 -1346316 -1383182 -907103 -845029 -1608262 -2002952 -2389128 -1134419 -460258 -973294 -842248
16373 -842248 -1720970 -1892605 -1555081 -1130094 -1138145 -1859238 -2018147 -1719294 -1083798 -1303249
16363 -1303249 -679361 -589026 -667994 -833666 -213884 -979090 -1976689 -1833429 -1563566 -671203
16353 -671203 643115 505453 -795851 -909983 -8053 358260 944985 924189 -115150
16344 -115150 -964195 -501511 47106 925540 883005 -336954 -703035 -414114 585525 876339
16334 876339 964871 -99597 -725353 329457 789122 -520079 -708960 -407458 -258526
16325 -258526 -826107 943256 1256950 267726 63380 14823 201060 284708 697196 277748
16315 277748 -348578 -11521 475402 873768 1298821 625368 1139099 163862 230146 -527109
16305 -527109 211619 446359 239697 618206 270116 184134 -98053 -530690 348177 1164949
16295 1164949 1225057 962388 1339989 936138 779100 2135061 533359 -55525 -179428
16286 -179428 639977 67608 307347 919987 295391 -549845 41537 346725 299961 -775753
16276 -775753 -346002 21997 -494891 1593987 2187837 1983522 -161992 -330143 1212949
16267 1212949 1540279 1643927 915547 1583358 1216815 959762 1963200 2252095 1571188
16258 1571188 1541762 1817894 1336342 1350889 2210602 1351524 803824 1579799 1001369 2061089
16248 2061089 1537382 1628533 1507409 2746632 3259279 2310559 2423126 1440326 2240469
16239 2240469 2376438 1632471 1709953 1187748 1485157 1402863 2823344 3782945 1580640
16230 1580640 557649 -40116 1428220 2732217 2024916 1650004 1161854 1110359 1056334
16221 1056334 1497062 2786408 1661872 1158367 1165993 2292796 1858428 453257 1172030
16212 1172030 1255633 608538 -509097 517775 1135711 -82079 527769 1250639 2297844
16203 2297844 1117956 1277795 1950968 929483 1365899 1373685 2412919 1603103 944619
16194 944619 1691684 2788867 2215406 2134421 1702957 1886697 2391390 3080696 1849502
16185 1849502 637496 1013484 1991606 2219676 2519039 1209153 -113247 626294 1892606
16176 1892606 3185311 2805788 1121638 1358553 2913366 3667902 3568134 3108553 2500647
16167 2500647 868396 1872929 2505630 3682510 4124185 3401862 2910380 2744549 1665493
16158 1665493 1914072 3928543 3796493 2921108 2507650 2963155 2846317 2754714 2845841 1802968
16148 1802968 2226105 2723127 2839985 2613814 2275404 2273986 2416797 -525231 -305487 1087237
16138 1087237 763704 530630 2269939 2641007 1541024 2147708 2737060 2482077 1638586
16129 1638586 1424833 1494043 3773818 4172102 3198663 3442571 2759985 1226010 2515624
16120 2515624 3572355 3455589 2237380 3558301 4642838 3276915 2964107 2261698 2756903
16111 2756903 2901463 3499566 3656359 2752960 1667923 2528472 1745288 2812151 3178727
16102 3178727 2507942 1337843 2071087 1791864 1249934 1758319 1586119 1535748 1795815
16093 1795815 2343603 335522 1246583 1661641 1433495 1216247 1836261 1366017 2232436
16084 2232436 1795304 2126026 1212365 1995588 1900412 859633 1703827 1648373 2219944 2714496
16074 2714496 1636211 -328588 482275 1668651 2540214 1341547 1668173 2200076 3170678
16065 3170678 3407592 2391474 2490704 2317106 3159401 3210327 4515929 4367421 4082959
16056 4082959 2516074 2666888 4372147 3947275 2473573 1449552 2812018 2439501 2319394
16047 2319394 3230524 2114610 766516 1821438 3732681 3819796 3174357 3059175 2799360
16038 2799360 2663062 1461621 1345770 3242515 4003602 2273459 1242425 3128892 2781137
16029 2781137 1352039 1387399 2344470 2641211 3166476 2631512 3082010 2234118 2562980
16020 2562980 2388946 3235993 2662263 1970067 3464138 3915161 4604364 3352493 2623293
16011 2623293 2364878 3032307 3645452 4031600 3880804 2165871 661773 1689114 1683416
16002 1683416 1791926 1375243 1967859 1674568 2603519 2620728 1317307 1724770 1749249 1293740
15992 1293740 693636 1380676 2883229 3422053 2768926 1713766 2047849 2897913 1855897
15983 1855897 2147385 2335149 2274446 2927127 2124120 2828416 1849142 1989337 1991872 3389723
15973 3389723 3802122 2878753 4001736 4508425 3768379 3280584 2970456 2829103 3011493
15964 3011493 3831522 2575588 2261520 2358666 2519280 2652336 2102312 1706844 1506341
15955 1506341 1313450 1630545 2564665 1144214 -303456 564336 2126374 1174175 838241
15946 838241 963325 1930823 2919095 2618822 2106854 1554060 2558711 2029934 3607862
15937 3607862 3512704 2500712 2592200 2517898 2484207 3391330 3900081 3640235 3547866 3251161
15927 3251161 3617806 3729028 4790510 3201757 3252964 2688659 3008992 5226956 5656753
15918 5656753 3639063 2863896 2995318 2651981 1920970 2919749 2704495 1903890 2916512
15909 2916512 3342993 2669786 793412 1189597 1515951 1898263 2257271 2242214 1660933
15900 1660933 1703994 3014367 1568186 2167757 2514110 1739568 2408399 3606466 2943122
15891 2943122 2012295 1933817 936247 -140942 2810611 3216984 1714512 1967897 2719701
15882 2719701 2962487 2504720 3186397 3768478 2271771 2052836 2658477 3623898 2238307
15873 2238307 2937647 3703742 2934778 3959997 3879803 3375892 1623277 2393143 2407358
15864 2407358 3882699 4967675 2873478 2262935 2395639 2304483 1846840 2110464 2242178
15855 2242178 2186879 3179584 3665881 2418674 2500400 2168357 1682534 1179717 1819856 2062157
15845 2062157 2346006 2656526 1549918 1596721 1584079 820121 640694 1887953 1839796 1659879
15835 1659879 2392726 2346451 1229661 1772290 1334271 908203 1767967 2414056 1901879
15826 1901879 3252610 4639548 2756883 1875770 2357729 1911487 1914874 3600618 3620851
15817 3620851 3087072 2547647 2289082 2732032 2162856 2553370 2908898 3674486 3429179
15808 3429179 3319149 2529612 2072793 2761626 2658411 2560326 4068924 2836560 1767371
15799 1767371 1857880 1936478 1850220 3096248 4473495 2948538 2619159 2762247 2725654 3469943
15789 3469943 2383010 1972475 1127561 2051635 2612952 4052062 3120462 2198751 2779347
15780 2779347 1580916 783843 2117638 2653458 2996580 4167440 3332522 1603795 989415
15771 989415 1940824 1341760 3315449 3032346 2405145 3598884 3321035 2024734 1276033
15762 1276033 2086027 2563091 2652525 3364400 2683683 2494405 3140668 3038650 2710999 1512717
15752 1512717 1948503 2518931 3229608 2707158 2330698 3183491 2935159 2647447 1665877
15743 1665877 852641 1775811 1613214 2640456 3266844 2972010 2605994 1828396 2915615
15734 2915615 660545 1408410 1183237 1816644 2547390 2976614 2985348 1442363 1889693
15725 1889693 3072399 2742464 3523250 3258963 2961295 2987965 3568990 3442774 3356647 3866361
15715 3866361 2728250 2342293 3302382 3106092 3860212 3571994 3485399 2623248 2571578 3230384
15705 3230384 2081551 2765611 1775401 3360847 3570746 2912022 2165288 1709710 996071
15696 996071 997629 2125047 2599088 2031229 2710178 1676743 2461684 2588799 2134970 2411813
15686 2411813 1492424 1161322 1583551 2913327 2003811 2197011 2484519 1072459 1099184
15677 1099184 2480042 2117327 2190621 2381794 3026180 2360251 2395803 2315667 1728011 1794795
15667 1794795 2639503 3239207 2302924 2291687 3964671 2961407 1768570 1810662 2012774
15658 2012774 2656076 1757840 2314059 1802739 2946535 2161410 958582 1811769 1933839
15649 1933839 2246012 3874486 4025855 2360487 1939069 2263398 1523096 990546 2187169
15640 2187169 2093785 2619165 2371160 2027201 1960330 2890426 3014566 2664102 3018928 2797943
15630 2797943 2340683 2342489 2244969 1661854 1358110 2527816 2738120 2088546 3897070 3501529
15620 3501529 3869805 3674459 3207509 2432833 1640283 2839633 2685371 3624835 4487182
15611 4487182 3755272 1690820 1134435 1427312 2614582 2772801 3097410 1652952 1675450
15602 1675450 2556373 1564860 1489469 1468780 1384777 748636 2080593 2915530 2967350 2610407
15592 2610407 2166242 1265380 554178 2303988 3058928 1901950 1507530 1732080 2386967
15583 2386967 3291676 3394607 2281189 2212478 3057099 3200376 3451156 5559345 3762293
15574 3762293 2100585 2812395 3972565 3524006 3792629 4715279 4204642 3884752 4704843
15565 4704843 4285558 2539184 2608887 2664210 2633695 3216615 3340056 2926782 2100202 1151904
15555 1151904 2036404 2147632 2598819 1958080 1861756 1146227 232828 1602105 2487686
15546 2487686 2348321 2375789 3485380 3762945 2193633 1732230 2489764 2113306 2134396
15537 2134396 2388357 2068352 109994 1030165 3590683 4840603 3286932 2434807 2044383
15528 2044383 1362921 1914833 3904664 4368312 3937147 2131021 2824387 1904944 1954365
15519 1954365 4039686 4333431 4220764 2188148 2439329 2439663 2832956 2179765 1560569 2942855
15509 2942855 3766939 2133031 2326882 3202865 4048872 3373349 3353403 3384851 2031982
15500 2031982 2384804 2715188 2410366 2308360 2851795 3113760 2122457 2578030 2058976
15491 2058976 2445439 2239680 1952716 3177357 3121220 2320167 1019175 827518 1390125
15482 1390125 2177587 2924985 745297 674394 2366620 2990132 3457982 2603969 2362883
15473 2362883 1970038 2888160 2273338 2369006 3944472 3599700 3035439 3360859 2803477
15464 2803477 3281039 3667878 3389060 2608596 3090792 3287827 3402819 4295104 3354624
15455 3354624 3156509 2997520 2549661 2516986 3750824 2448605 1115858 1357041 1666410
15446 1666410 301931 837295 1070361 2028151 1452062 1290009 525513 555206 1972057
15437 1972057 2089840 2558447 131527 93545 2123320 4200454 3041080 1516784 1345431
15428 1345431 1230626 1383375 2285946 4601860 2798348 1444833 1122459 1862632 1722729
15419 1722729 3264915 4941567 3808264 2663089 3442315 4031922 2460910 3022035 2751564
15410 2751564 3496700 1866379 1585549 3663675 3954788 2009397 805952 1615044 2001962
15401 2001962 1612682 1999898 1706893 1403790 2014123 1572211 1730736 1744970 1021582 2392398
15391 2392398 2442431 1909112 2488698 2994161 3395377 1773515 2067968 2121233 2170927 3009307
15381 3009307 2752363 2154361 998768 1295031 1783380 1563350 1454671 2895482 1965884
15372 1965884 -149195 2254873 4396077 3058325 1436658 2485358 2826292 2068993
15364 2068993 3530254 4070220 4329442 3905862 2218107 2152038 3991285 3653654 3328857
15355 3328857 1812197 2693035 2581924 3364263 3053786 2662509 3324630 2797319 3493621
15346 3493621 3304820 2882108 2101359 2840388 3879978 4221476 3006911 2646012 1839960
15337 1839960 2621501 1849503 1431021 2631105 2607311 1666445 442941 1626374 2472962
15328 2472962 1189532 1155885 2653315 2802542 1888844 2034472 3589608 2491297 1929377
15319 1929377 2919532 4073520 3592114 2614714 3108391 4519836 5063547 4369949 4431965
15310 4431965 3076305 3144908 3479925 3025130 2893156 2005165 2583171 3665381 3043394
15301 3043394 2124767 1513965 2219933 1531835 2210546 4400098 2988398 1961792 2248739
15292 2248739 1857433 700765 1810437 2399684 1809934 1555973 1888749 1244259 1395556
15283 1395556 1997671 1512715 2504327 2795929 2224477 1858722 2383095 1634371 1765899
15274 1765899 2018346 3508202 3447631 3498033 2827079 3208974 4707317 3965291 2755852
15265 2755852 2300871 3455905 2572358 2069259 2860123 2964056 3406386 2404611 2477116
15256 2477116 2790305 2313102 3011705 3067045 2905266 1173005 1587227 2745941 2327622
15247 2327622 2708562 3261924 3673053 2753644 2788697 2721357 2728490 3499502 3539177 3667663
15237 3667663 4200111 3557223 2956975 3432148 3944015 3336722 3533954 3378574 3193652
15228 3193652 4129451 3862104 3313317 2075693 2226376 2494160 2041453 2799928 2060504
15219 2060504 1729321 2453218 1944798 1797406 1778591 1988559 1313355 708088 802572 1724364
15209 1724364 2533988 2628137 2592774 1642861 954081 1405743 3401285 3166990 2535995 3755855
15199 3755855 3242290 1624071 2396989 3141130 2836951 3116133 3577205 3295320 2137693
15190 2137693 2586168 3518661 3683991 3900833 2613158 1992989 2463961 2628382 3225811
15181 3225811 3294377 3634593 2825026 1186135 2608220 3134576 1230834 480420 1772905
15172 1772905 2629904 1828112 2023934 1930480 1570093 1435650 1912822 3181928 4012013
15163 4012013 2410473 1596700 2442374 1000814 1265615 3555441 2713296 1332462 2300046
15154 2300046 2141938 2123131 2878627 2267970 1262929 2685396 2541750 413585 2507734
15145 2507734 2991531 2409333 2784927 2933541 2096107 2702981 4516842 4494164 3805622
15136 3805622 3852539 3896285 3301642 5290824 4915929 4670221 2625222 1587015 2800979
15127 2800979 3843397 5129768 3996789 3456491 1214064 2034451 3189067 3943526 3346789
15118 3346789 1760456 1265116 1889617 2796721 2628495 2606823 2374405 1581745 3629697
15109 3629697 4107330 2270228 1524853 1009309 1258688 1607132 1560131 1113341 194501
15100 194501 1843484 2343109 3140106 2781774 1331891 1661925 1162082 1841529 3698533
15091 3698533 4167612 2925606 1656441 2660017 2332045 2621485 2911224 3468112 2973243
15082 2973243 3391266 3640694 2398113 1373714 1191284 2520277 2810145 2959528 2164280
15073 2164280 1682223 2305575 2498790 2757909 2737967 2102483 1247373 1994436 2976776 2759006
15063 2759006 2673869 2569710 2284576 3106164 3823894 3152370 2373413 1565776 2548186 3752692
15053 3752692 4531687 2489053 2336187 1678931 2113650 3472095 4813513 3713043 2964362
15044 2964362 2196566 2491995 3792837 4933665 3527391 2297296 1662338 2398777 3906802
15035 3906802 3838625 2190616 2251498 3445456 3262921 2728500 2306774 1691448 806152
15026 806152 1353480 1770775 1977689 2755939 2587717 2302223 2096293 2709449 4128170
15017 4128170 3615351 2849383 2701005 2153507 1930028 2262827 3297930 3154402 4052809
15008 4052809 2839832 1984540 1513032 2701992 4296493 3932172 1877710 1649463 1495317
14999 1495317 1153257 1042788 3219233 3320677 2355191 2024046 1887588 3730845 3122562
14990 3122562 3104993 2703537 2116324 2044851 2883533 3815322 3138387 1765167 2912023
14981 2912023 2863972 3813176 3040305 2600439 2889568 3249742 3074963 3110997 3739508 2904135
14971 2904135 757335 966678 2732422 4165737 3951972 2337869 2366391 2176155 2735285
14962 2735285 2405404 1863332 2034782 1556807 1696583 1373892 2718707 1562171 1404535
14953 1404535 2200261 2298380 2510193 3058524 3369429 3092595 1814950 2896188 2579933
14944 2579933 2185381 3064015 3721286 3982398 3253310 3578995 3820997 3151190 3047958
14935 3047958 3047523 3304886 3054636 3515069 4049124 2353172 1840772 4061503 4559660 2683732
14925 2683732 1906522 4309389 2575811 2263485 2736828 3865599 2782428 4020199 3698049
14916 3698049 2261889 2804541 2982343 3726260 4831772 4823832 2209610 3060822 2731196
14907 2731196 2959539 2814740 3672427 2659765 2135053 4689131 4409174 3273449 2112890
14898 2112890 1830114 1539895 2954895 3860079 2641332 1739276 1500004 1869591 1072275
14889 1072275 2171455 1449217 2010217 1353412 1694575 1278582 1583658 2347503 1506473
14880 1506473 1453333 1067893 2658084 1793250 2544797 2513344 1812908 2839609 2699684
14871 2699684 3075821 2094195 2212824 2317211 1973577 1681878 2187176 2480158 2737782
14862 2737782 2024137 2690190 2005688 1504377 2139902 3127194 3818800 3087200 2610333
14853 2610333 1646099 1208966 3062607 3177582 2492542 2657217 3928113 2716926 2682320
14844 2682320 2276926 1997317 2706443 3295219 3545031 2684118 1705834 1720213 1224015 2760827
14834 2760827 2785959 3398585 3404364 1563049 2148133 2430550 2561125 3322003 2713856 1705075
14824 1705075 1374269 2757685 3091853 2523332 3416279 3174091 2638196 2978437 2912700
14815 2912700 2655155 2710904 2401308 3367953 3839364 4499398 3645842 3306553 2462434 2657217
14805 2657217 3583831 4093829 4346503 4575455 5022760 3654507 2486666 1399109 1125922
14796 1125922 1742719 2159004 3658929 2899056 2570745 2454785 1494926 979413 545069
14787 545069 1620796 2092262 1889836 1635168 2469404 2491830 1802313 1304175 2185412 1616103
14777 1616103 1605369 3178076 2225085 1925387 1168147 2240344 788994 1759247 1215256
14768 1215256 1140185 1977944 1783148 2997524 1949266 1678091 770576 2066025 2430301
14759 2430301 841724 2154179 2948386 3110701 3107839 3162389 2506426 2450105 1886053 2475087
14749 2475087 2597933 3763057 3899062 3832095 2967771 1605406 2946678 3424474 3913923
14740 3913923 3392921 3838020 3769937 3637193 4023772 3415862 3899689 3046924 3661121 5159324
14730 5159324 5280877 4811364 3190193 2502044 2724958 3925795 4751035 3264701 2458404
14721 2458404 2490664 1533364 1598522 1611889 2814840 3833636 2708557 2330766 1435374
14712 1435374 2669839 1994038 2002656 2362815 1631765 2604458 3022714 2122065 1173194 1798821
14702 1798821 2688912 2504759 1972847 1724963 2650243 2757777 1996486 2259492 3256945
14693 3256945 3341787 2184081 2686434 2068859 1696730 3904353 4133172 4013838 3482313
14684 3482313 3260034 2228277 2137543 2778333 3631427 4428262 3390349 1885528 2801027
14675 2801027 3773733 3482689 3799693 2417053 2333635 2966755 4100832 2728424 2498322
14666 2498322 2760248 3193999 2216025 2321988 3061579 2371741 2923169 2258086 2295312 2886353
14656 2886353 2621466 2822966 585638 1276444 1223716 1834044 2409905 2153300 2358061
14647 2358061 1263090 2647261 2472919 2558895 2057197 1749433 1510881 1455406 1826631
14638 1826631 3253753 3818117 2907196 2441871 2441625 2536139 2359234 3968656 3464819 3126746
14628 3126746 2683293 3517853 3122175 3616850 5199179 4123109 3938506 4403682 3573113
14619 3573113 4062460 3505386 4520185 3048714 3644347 2962995 3459787 3766571 2699129
14610 2699129 2330110 2514512 2787599 2560437 2615040 2552891 1712843 1784158 1457233 2049843
14600 2049843 3655215 3571038 2165758 2510711 2684554 2293630 1796827 3577766 3692606
14591 3692606 1906668 2739236 2592366 2652089 2182839 3817147 3041658 2252880 2544246
14582 2544246 3373685 2864204 2997892 2299583 1663894 3209691 3366450 2878857 2651465
14573 2651465 2930176 2075482 2920133 3707555 2446525 3342080 3699997 2040515 87197
14564 87197 2228853 2026707 1724291 2873602 4148763 2313383 1390342 2230079 1901788
14555 1901788 1977867 3466041 3660145 4233482 3859615 3649255 3581488 3865456 3372015 2754131
14545 2754131 2810722 4678487 4672211 3495091 2809868 2628003 2388091 1569760 2209241 3597855
14535 3597855 2534229 1309899 1342130 3391237 3131690 2297382 1194190 1618741 2739052
14526 2739052 2632804 1092937 1628909 2308269 1558125 1155568 2757932 2712609 1222066
14517 1222066 1921518 2514040 1660030 1741133 2553752 2936433 2658945 3052341 3188579 4257384
14507 4257384 3721677 2526976 3347170 4459187 4732233 4580372 5355548 5632898 5110397
14498 5110397 5014493 4442733 3505407 4489475 5236131 4680657 4002979 4392683 3777921 3178374
14488 3178374 2580919 3395235 2903753 3384845 2746197 2352864 2729842 2428144 2483869 3162343
14478 3162343 2809336 1637418 1834688 3952182 2789200 1858136 1841343 2038100 639713
14469 639713 1376683 1282011 2153630 2244388 1675516 1193113 1447414 1893346 2696044 1986961
14459 1986961 1880815 2694889 3080031 2817553 2748484 3832855 2467489 2617431 5659764
14450 5659764 4460783 4100913 3470043 2716914 1887758 3367447 4988061 3677493 3691396
14441 3691396 3309517 2797700 3484486 4262242 3300172 2884015 3367691 3486830 3599201
14432 3599201 1917569 2266823 2004834 3178666 3724273 3558574 2786421 3077690 2477239
14423 2477239 1458473 2766662 3479497 1515360 236909 3228199 3021433 2327049 2558250
14414 2558250 2282764 1482080 1602512 3416869 3345949 3156092 1733227 1714705 3571328
14405 3571328 4185635 2870500 2584678 2560617 2076268 4218656 4499754 4789475 3076911
14396 3076911 2823113 2523646 4278472 4812784 4068212 2600818 3128937 3563943 3623368
14387 3623368 4273198 4818569 3590481 2535423 2822922 3071867 3265750 3814495 3333745
14378 3333745 3109997 3846208 3469189 2909550 3649597 4352848 3306294 3339183 3338418 1521434
14368 1521434 2598097 3564739 2235789 1329150 2105723 2012263 2008822 3122574 3634086
14359 3634086 1561612 1393180 518496 1458159 2855007 2613470 1964270 1831363 1754493
14350 1754493 2831587 4422479 4083756 1371520 1320589 3354004 3044617 2210400 2655796
14341 2655796 3052170 3308094 2876232 2791077 3757335 3328715 2203151 2760885 3229861
14332 3229861 4401895 3708221 3373675 2772894 3481410 3062483 2593397 3970184 4016368
14323 4016368 4508160 4389906 4129322 2005907 2897549 2781972 3008633 3073373 3368566
14314 3368566 1812800 2585370 2838534 1821789 2293530 3552229 2018037 874019 2665483
14305 2665483 3243544 3265908 4068316 3232479 2775773 3321134 3282713 3728056 2992428 3802556
14295 3802556 3675031 3553449 3364373 2134107 2175334 3279314 4322520 3418800 3161403
14286 3161403 2801681 2442102 2031143 3938373 3820188 3336867 2607851 3371403 3705851
14277 3705851 3186790 2846865 1958302 2715292 1945567 3342169 3888599 3203486 1639836
14268 1639836 1912161 2851578 557819 1758085 3199865 3024198 2515047 2937821 2848376
14259 2848376 2326273 2067864 1415611 683531 2458949 3425711 3691866 3554624 2973482
14250 2973482 2076952 2159102 2929502 2799216 4407685 4712924 4066860 3032700 2229347
14241 2229347 2094754 3355164 4653054 4554509 3702896 4374889 3663337 4131474 5055784
14232 5055784 4515129 3243138 2832612 4695555 4849013 5012271 4609796 3769165 3112584
14223 3112584 3672001 4484150 3701168 3829755 3058545 2321600 1499299 2729383 2727355 882132
14213 882132 2284068 2788682 2424536 2488179 2791741 2055517 1354366 1097413 673781 1289059
14203 1289059 3513790 2294289 1991456 2244935 1668485 2149460 2967209 2563969 1254787
14194 1254787 2843828 4186457 3149277 2843248 4404882 3204318 2565099 2372109 2183915
14185 2183915 2802584 4365906 3898333 3214874 2499431 2443238 2033032 2356163 2722110
14176 2722110 2842675 4022282 2921502 2209269 2860579 2933441 2436445 2740706 3829639
14167 3829639 3631724 2857084 2951589 1505642 1731421 3249356 4029843 4163573 3524511
14158 3524511 3226852 3669009 3261687 2584418 2943999 4095165 3807673 3377439 3452210
14149 3452210 2829022 2496726 2865156 4216821 3484770 3347330 3469857 2856892 2968008
14140 2968008 2727058 2852843 2851080 2589389 3638890 3405400 3953123 2461742 3021136
14131 3021136 2736254 1846285 2360154 3093966 2714327 2465054 3257304 2995935 2856963
14122 2856963 3447395 4067286 3391458 4148567 3281259 2988729 3053151 3825029 2120058
14113 2120058 2438082 3598507 2968629 2992598 1844792 2597236 2572378 2527751 1656510 1791577
14103 1791577 2620166 1500962 2361862 3907563 3095622 2269173 2676808 3121114 2435080
14094 2435080 711247 2176370 2645454 3644707 4214867 3691702 2087512 1558124 1719201
14085 1719201 2149698 2884770 3664314 3171058 1984140 1944479 2663825 3070453 3243272
14076 3243272 2972410 2598057 3488714 3661318 3818377 3586358 3542128 1741877 1742394 4188853
14066 4188853 4859178 3455497 3153883 2862314 3219980 3853787 3839854 2900872 1421907
14057 1421907 2758649 2615015 2490503 2808741 2012460 2258370 2971747 3317105 2933724
14048 2933724 2038113 2935401 3219125 2875385 2515080 3395184 3407961 1174491 499570
14039 499570 2104127 3198313 2371473 1326492 1874278 3079074 2936367 2832990 1571276
14030 1571276 2093122 983995 2406826 2765526 2830431 1579913 2003650 3010531 2844612
14021 2844612 3559084 3477328 3008539 1290391 1408312 2110247 2449454 1922640 2076131
14012 2076131 2280810 3426547 3514838 2377148 1529039 2159176 3118159 2660653 3554591
14003 3554591 2353359 2201450 3457668 3576765 2751367 3062314 4421461 4243375 4057306
13994 4057306 4563099 4394556 3940786 2673642 1757093 2158123 3185498 3972470 2696168
13985 2696168 2454425 1835928 2454481 3625782 3966415 1775383 1477501 2256249 2068708
13976 2068708 2170077 2852285 2648611 2672161 4044323 3581557 2485545 2580847 2603413 2170547
13966 2170547 3409407 3449775 2668705 3145501 3075464 2983907 2884107 2837379 1972580 4154058
13956 4154058 4780194 4568227 4904311 3424057 2480532 4294754 4321364 3221697 3373895
13947 3373895 4089679 3460126 4279294 4389101 3847928 3600178 3209366 2953541 3663711
13938 3663711 3575756 2520954 2984028 3214559 1836949 2417152 2566996 2418008 3190571
13929 3190571 2333887 2227386 4043621 3679179 2266395 2055968 2602791 1158580 2775402
13920 2775402 3775261 2368686 4551227 3708010 3300994 3496427 4007898 2423277 2652384
13911 2652384 3268479 2966486 2777547 3149229 3143072 3371069 3267586 3425036 3806355 3359898
13901 3359898 2725848 4213056 4405919 2236805 2753297 3347369 2776914 2792041 4035699
13892 4035699 4497783 3756699 4597878 3955061 1701121 2751333 3034454 4177787 4448188
13883 4448188 4130843 2687341 521063 2133919 2093179 3246934 4040442 3473060 1957704
13874 1957704 3139628 3067389 2167554 2564043 2846549 2650357 3644246 3748326 3344111
13865 3344111 2571286 3907880 3804091 3441189 4133885 4550412 3890668 2514747 2296121
13856 2296121 3105562 2888706 3821821 3491706 3480711 3915831 3902614 5064016 4825729 4826330
13846 4826330 3534328 2996520 4007421 4521938 3846664 3690116 4727320 4726956 4262409
13837 4262409 3099207 4180226 4150791 3399459 3729444 4272860 2001163 1512400 2292236
13828 2292236 2233279 1293984 1622874 2307548 1587807 2901779 2803907 2228641 1671930 1937802
13818 1937802 1998618 1865119 2320015 2813993 1790540 2188110 3395863 3413169 1731953
13809 1731953 2206266 2414959 2238130 2168277 2177375 2482516 3258432 1899266 1535241 3633602
13799 3633602 4872641 3689223 4005316 4229879 3491308 5390545 6055205 4254147 4537297
13790 4537297 4254744 3961876 3602932 4046562 2283411 3137828 4363703 3273250 3655627
13781 3655627 4300423 3182963 3072698 3418577 3570308 2872415 3648350 2815861 2312513
13772 2312513 4211796 5334241 4320829 4270812 4639089 3680089 3195964 3092054 2170808
13763 2170808 1737282 2463042 2543793 2195115 3837449 3181636 1659521 2313358 3061629
13754 3061629 2574111 3676051 3648437 2253136 2541645 4513509 3079717 3232027 4566790
13745 4566790 3593398 4958925 6859599 4599182 2359906 3413378 3051796 1967158
13737 1967158 3571431 3871952 2837421 3278050 3981301 2388406 2703405 3743286 2591380
13728 2591380 3685957 4200216 4273090 3112531 4020389 3790732 3354419 4182655 4066814
13719 4066814 2453578 3095026 2659088 2585932 2628997 3518021 2227063 1694426 2028886
$$ [...]
##END NTUPLES=NMR SPECTRUM
##END=
