##TITLE=1H_DE-80H_X3
 200.13MHz, d2o
 8 sc
 
 19ns.26.2.2025
##JCAMPDX= 6.0         $$ Bruker NMR JCAMP-DX V2.0
##DATA TYPE= NMR SPECTRUM
##DATA CLASS= NTUPLES
##ORIGIN= UXNMR, Bruker Analytische Messtechnik GmbH
##OWNER= pz
$$ XWIN-NMR		Version 3.5
$$ Tue Apr 21 13:22:27 2026 Russian Standard Time (UT+4h)  Yarkov@DPX200
##.OBSERVE FREQUENCY= 200.1313
##.OBSERVE NUCLEUS= ^1H
##.ACQUISITION MODE= SIMULTANEOUS
##.ACQUISITION SCHEME= undefined
##.AVERAGES= 8
##.DIGITISER RES= 18
##SPECTROMETER/DATA SYSTEM= spect
##.PULSE SEQUENCE= zg30
##.SOLVENT NAME= DMSO
##.SHIFT REFERENCE= (INTERNAL, DMSO, 0, 15.4659)
##AUDIT TRAIL= $$ (NUMBER, WHEN, WHO, WHERE, WHAT)
$$ ##TITLE= Audit trail, XWIN-NMR		Version 3.5
$$ ##JCAMPDX= 5.01
$$ ##ORIGIN= Bruker BioSpin GmbH
$$ ##OWNER= Yarkov
$$ C:/Bruker/XWIN-NMR/data/yarkov2/nmr/H-C/1/pdata/1/auditp.txt
$$ ##AUDIT TRAIL=  $$ (NUMBER, WHEN, WHO, WHERE, WHAT)
(   1,<2026-04-21 13:21:30.17 +0400>,<Yarkov>,<DPX200>,
      <created by zg, POWCHK disabled, PULCHK disabled
       configuration hash MD5:
       00 E9 B6 7A A2 85 ED C7 34 08 36 98 17 FE 4E 26
       data hash MD5: 16K
       DD 1D F0 DD 34 B0 20 3B C2 0C 37 8D 34 97 23 07>)
(   2,<2026-04-21 13:21:43.06 +0400>,<Yarkov>,<DPX200>,
      <Start of raw data processing
       efp BC_mod = 2 LB = 0.25 FT_mod = 6 PKNL = 1 PHC0 = -5302.316 PHC1 = 11.42193 SI = 16K 
       data hash MD5: 16K
       C0 8E 9F 27 E6 1B 30 37 19 F7 86 B9 76 F6 14 51>)
$$ ##END=
$$ 
$$ hash MD5
$$ E6 BD D6 5F AB 75 6A 1E 2A F0 48 41 9F 9B D0 3A
##$RELAX= 
##$RELAX= 
##$RELAX= 
##$RELAX= 
##$RELAX= 
##$RELAX= 
$$ Bruker specific parameters
$$ --------------------------
##$DU= <C:/Bruker/XWIN-NMR>
##$EXPNO= 1
##$NAME= <H-C>
##$PROCNO= 1
##$TYPE= <nmr>
##$USER= <yarkov2>
##$AMP= (0..31)
100 100 100 100 100 100 100 100 100 100 100 100 100 100 100 100 100 100 
100 100 100 100 100 100 100 100 100 100 100 100 100 100 
##$AQSEQ= 0
##$AQ_mod= 1
##$AUNM= <au_zg>
##$AUTOPOS= <>
##$BF1= 200.13
##$BF2= 200.13
##$BF3= 200.13
##$BF4= 200.13
##$BF5= 200.13
##$BF6= 200.13
##$BF7= 200.13
##$BF8= 200.13
##$BYTORDA= 1
##$CFDGTYP= 0
##$CFRGTYP= 5
##$CHEMSTR= <none>
##$CNST= (0..31)
1 1 145 1 1 1 1 1 1 1 1 1 1 1 1 1 1 1 1 1 1 1 1 1 1 1 1 1 1 1 1 1 
##$CPDPRG= <>
##$CPDPRG1= <>
##$CPDPRG2= <>
##$CPDPRG3= <>
##$CPDPRG4= <mlev>
##$CPDPRG5= <mlev>
##$CPDPRG6= <mlev>
##$CPDPRG7= <mlev>
##$CPDPRG8= <mlev>
##$CPDPRGB= <>
##$CPDPRGT= <>
##$D= (0..31)
0 0.7 0 0 0 0 0 0 0 0 0 0.03 0 0 0 0 0 0 0 0 0 0 0 0 0 0 0 0 0 0 0 0 
##$DATE= 1776763289
##$DBL= (0..7)
120 120 120 120 120 120 120 120 
##$DBP= (0..7)
150 150 150 150 150 150 150 150 
##$DBP07= 0
##$DBPNAM0= <>
##$DBPNAM1= <>
##$DBPNAM2= <>
##$DBPNAM3= <>
##$DBPNAM4= <>
##$DBPNAM5= <>
##$DBPNAM6= <>
##$DBPNAM7= <>
##$DBPOAL= (0..7)
0.5 0.5 0.5 0.5 0.5 0.5 0.5 0.5 
##$DBPOFFS= (0..7)
0 0 0 0 0 0 0 0 
##$DE= 6
##$DECBNUC= <off>
##$DECIM= 32
##$DECNUC= <off>
##$DECSTAT= 4
##$DIGMOD= 1
##$DIGTYP= 9
##$DL= (0..7)
0 120 120 120 120 120 120 120 
##$DP= (0..7)
$$ [...]
##$SUBNAM2= <"">
##$SUBNAM3= <"">
##$SUBNAM4= <"">
##$SUBNAM5= <"">
##$SUBNAM6= <"">
##$SUBNAM7= <"">
##$SUBNAM8= <"">
##$SUBNAM9= <"">
##$SW= 18.0517328524113
##$SWIBOX= (0..15)
0 0 2 0 0 0 0 0 0 0 0 0 0 0 0 0 
##$SW_h= 3612.71676300578
##$TD= 16384
##$TD0= 1
##$TE= 0
##$TE2= 300
##$TE3= 300
##$TEG= 300
##$TL= (0..7)
0 120 120 120 120 120 120 120 
##$TP= (0..7)
150 150 150 150 150 150 150 150 
##$TP07= 0
##$TPNAME0= <>
##$TPNAME1= <>
##$TPNAME2= <>
##$TPNAME3= <>
##$TPNAME4= <>
##$TPNAME5= <>
##$TPNAME6= <>
##$TPNAME7= <>
##$TPOAL= (0..7)
0.5 0.5 0.5 0.5 0.5 0.5 0.5 0.5 
##$TPOFFS= (0..7)
0 0 0 0 0 0 0 0 
##$TUNHIN= 0
##$TUNHOUT= 0
##$TUNXOUT= 0
##$USERA1= <user>
##$USERA2= <user>
##$USERA3= <user>
##$USERA4= <user>
##$USERA5= <user>
##$V9= 5
##$VALIST= <valist>
##$VCLIST= <CCCCCCCCCCCCCCC>
##$VD= 0
##$VDLIST= <DDDDDDDDDDDDDDD>
##$VPLIST= <PPPPPPPPPPPPPPP>
##$VTLIST= <TTTTTTTTTTTTTTT>
##$WBST= 1024
##$WBSW= 4
##$XGAIN= (0..3)
0 0 0 0 
##$XL= 0
##$YL= 0
##$YMAX_a= 236401
##$YMIN_a= -275705
##$ZGOPTNS= <>
##$ZL1= 120
##$ZL2= 120
##$ZL3= 120
##$ZL4= 120
##$ABSF1= 0
##$ABSF2= 0
##$ABSG= 0
##$ABSL= 0
##$ALPHA= 0
##$AQORDER= 0
##$ASSFAC= 0
##$ASSFACI= 0
##$ASSFACX= 0
##$ASSWID= 0
##$AUNMP= <proc_1d>
##$AZFE= 0.1
##$AZFW= 0.1
##$BCFW= 0
##$BC_mod= 2
##$BYTORDP= 0
##$COROFFS= 0
##$CY= -3
##$DATMOD= 1
##$DC= 0
##$DFILT= <>
##$DTYPP= 0
##$F1P= 0
##$F2P= 0
##$FCOR= 1
##$FTSIZE= 16384
##$FT_mod= 6
##$GAMMA= 0
##$GB= 0
##$INTBC= 1
##$INTSCL= 3.241238e-09
##$ISEN= 128
##$LB= 0.25
##$LEV0= 0
##$LPBIN= 0
##$MAXI= 10000
##$MC2= 0
##$MEAN= 0
##$ME_mod= 0
##$MI= 1.114404
##$NCOEF= 0
##$NC_proc= -7
##$NLEV= 6
##$NOISF1= 3.799351
##$NOISF2= 2.8
##$NSP= 0
##$NTH_PI= 0
##$NZP= 0
##$OFFSET= 15.46593
##$PC= 1
##$PHC0= -5302.316
##$PHC1= 11.42193
##$PH_mod= 1
##$PKNL= yes
##$PPARMOD= 0
##$PSCAL= 0
##$PSIGN= 0
##$REVERSE= no
##$SF= 200.130011162252
##$SI= 16384
##$SIGF1= 3
##$SIGF2= 2
##$SINO= 0.751879
##$SIOLD= 32768
##$SREGLST= <19F.Aceton>
##$SSB= 0
##$STSI= 16384
##$STSR= 0
##$SW_p= 3612.71676300578
##$SYMM= 0
##$S_DEV= 0
##$TDeff= 16384
##$TDoff= 0
##$TI= <>
##$TILT= no
##$TM1= 0
##$TM2= 0
##$TOPLEV= 0
##$USERP1= <user>
##$USERP2= <user>
##$USERP3= <user>
##$USERP4= <user>
##$USERP5= <user>
##$WDW= 1
##$XDIM= 16384
##$YMAX_p= 517208976
##$YMIN_p= -9348659
$$ End of Bruker specific parameters
$$ ---------------------------------
##NTUPLES= NMR SPECTRUM
##VAR_NAME=  FREQUENCY,     SPECTRUM/REAL,   SPECTRUM/IMAG
##SYMBOL=    X,             R,               I
##VAR_TYPE=  INDEPENDENT,   DEPENDENT,       DEPENDENT
##VAR_FORM=  AFFN,          ASDF,            ASDF
##VAR_DIM=   16384,         16384,           16384
##UNITS=     HZ,            ARBITRARY UNITS, ARBITRARY UNITS
##FACTOR=    0.220516191357247, 1,           1
##FIRST=     3095.19674054194, 0,            0
##LAST=      -517.520022463839, 0,           0
##MIN=       -517.520022463839, -9348659,    0
##MAX=       3095.19674054194, 517208976,    0
$$ Real data points
##PAGE= N=1
##DATA TABLE= (X++(R..R)), XYDATA
$$ [...]
$$ plain form
5801 1966382 2333198 2708366 1673859 1902991 1922829 1969879 1898306 1834562 2462757 2636593
5791 2636593 1857989 1791643 2923802 3299959 2074953 1396557 1938173 1720655 1115422
5782 1115422 1326962 1897459 2970616 2720316 1029354 1820148 2593142 2345828 2549368
5773 2549368 2500169 2040083 1910685 928101 928849 2038304 1471229 1504246 2307341 2357271
5763 2357271 1934111 1440079 2213765 2769691 2832687 2094905 1929438 1430159 1716182 1751931
5753 1751931 1677701 2019893 1987713 1672373 2130873 2622883 2529576 2633796 2489258 2964524
5743 2964524 3452516 2868349 2448509 2422664 2431664 2201281 3099107 2709876 2269212 2204404
5733 2204404 2532021 2826803 1593811 1694336 1964461 2257302 1827783 658449 634125
$$ packed form
5801A966382L66816L75168j034507K29132J9838M7050p1573o3744O28195J73836
5791B636593p78604o6346J132159L76157j225006o78396N41616k17518o05233
5782A115422K11540N70497J073157k50300j690962P90794P72994k47314K03540
5773B549368m9199m60086j29398r82584P48J109455n67075L3017Q03095M9930
5763B357271m23160m94032P73686N55926O2996p37782j65467m99279K86023L5749
5753A751931p4230L42192l2180l15340M58500M92010r3307J04220j44538M75266
5743B964524M87992n84167m19840k5845R000k30383Q97826l89231m40664o4808
5733B204404L27617K94782j232992J00525K70125K92841m29519j169334k4324
$$ plain form
5724 634125 997937 1905047 2154008 1621610 1183668 1106226 1743482 1883859 2287919 3087107
5714 3087107 2548190 1482180 2273726 2945863 1971018 1794859 1759094 2208440 2590388 2810832
5704 2810832 3532690 4198216 4374094 4163678 3975352 3619123 3776083 2790343 2408343 2071408
5694 2071408 2098392 2663101 1842109 1499897 3081761 3286129 2441638 2012020 1898152 3055500
5684 3055500 3040238 2028842 2158112 1958121 1663922 1719101 2696929 3503318 2688077 2537608
5674 2537608 2887150 2951463 3886079 4074936 3917776 3977809 3957181 2840786 2169132 1638144
5664 1638144 1919455 2632941 2514522 2708774 2560451 1895978 2334154 2036949 2864640 3307230
5654 3307230 2701512 3223169 2853096 2488991 2981653 2229459 1984738 2310632 1939576 2034222
$$ packed form
5724F34125L63812R07110K48961n32398m37942p7442O37256J40377M04060P99188
5714C087107n38917j066010P91546O72137r74845j76159l5765M49346L81948K20444
5704B810832P21858O65526J75878k10416j88326l56229J56960r85740l82000l36935
5694B071408K6984N64709q20992l42212J581864K04368q44491m29618j13868J157348
5684C055500j5262j011396J29270j99991k94199N5179R77828Q06389q15241j50469
5674B537608L49542O4313R34616J88857j57160O0033k0628j116395o71654n30988
5664A638144K81311P13486j18419J94252j48323o64473M38176k97205Q27691M42590
5654C307230o05718N21657l70073l64105M92662p52194k44721L25894l71056R4646
$$ plain form
5644 2034222 2390999 2045845 2314509 2345268 2034864 2911454 1697513 2092772 1986929 1966821
5634 1966821 2234539 2708567 1801357 1742532 2082463 2803101 2668901 1439600 937156 1528136
5624 1528136 1002399 1034474 1243978 1846126 1585716 1271157 2904264 2847663 2619605 1814546
5614 1814546 1669678 1944600 2432275 2311567 1554642 1823612 2259332 1209483 1455074
5605 1455074 1639691 2340480 2564895 2215154 2395983 3306530 2711497 1694168 2263056
5596 2263056 3389766 3086691 2714757 2180350 1920248 1572097 2142992 2588463 2834384
5587 2834384 2857551 2126665 2470501 2843452 2139334 2137658 2319823 1664565 2051141 2669013
5577 2669013 2641944 1690710 1621344 2471135 2413316 2001671 2527839 2334430 1724378 1426136
$$ packed form
5644B034222L56777l45154K68664L0759l10404Q76590j213941L95259j05843k0108
5634A966821K67718M74028r07210n8825L39931P20638j34200j229301n02444N90980
5624A528136n25737L2075K09504O02148k60410l14559J633107n6601k28058q05059
5614A814546j44868K74922M87675j20708p56925K68970M35720j049849K45591
5605A455074J84617P00789K24415l49741J80829R10547n95033j017329N68888
5596B263056J126710l03075l71934n34407k60102l48151N70895M45471K45921
5587B834384K3167p30886L43836L72951p04118j676J82165o55258L86576O17872
5577B669013k7069r51234o9366Q49791n7819m11645N26168j93409o10052k98242
$$ plain form
5567 1426136 2072711 2451866 1681492 1936010 2646452 2309738 1713776 1636976 2562196 2381949
5557 2381949 1508429 2063270 2802885 2061980 2305950 2248363 1866779 2177865 2003525 1151424
5547 1151424 1428463 1485751 1736441 2643248 2350871 2096371 2355544 2096643 1994555 2433021
5537 2433021 2283696 2155534 2206857 1386161 1290419 1720952 2081625 2110955 2188350 2622472
5527 2622472 2895849 2420490 2034788 1899512 2300289 2490971 2657278 3464115 2701663 2570441
5517 2570441 3373409 3012214 2420255 2734759 2384447 3005231 2504292 1511961 1359025 1807706
5507 1807706 1423659 2226027 3246605 2740576 2185065 1946065 1821548 1983050 2103421
5498 2103421 2432506 1823755 1112986 1145277 1992117 1411026 698856 1043536 2216216 2841299
$$ packed form
5567A426136O46575L79155p70374K54518P10442l36714n95962p6800R25220j80247
5557B381949q73520N54841P39615p40905K43970n7587l81584L11086j74340q52101
5547A151424K77039N7288K50690R06807k92377k54500K59173k58901j02088M38466
5537B433021j49325j28162N1323q20696r5742M30533L60673K9330P7395M34122
5527B622472K73377m75359l85702j35276M00777J90682J66307Q06837p62452j31222
5517B570441Q02968l61195n91959L14504l50312O20784n00939r92331j52936M48681
5507A807706l84047Q02368J020578n06029n55511k39000j24517J61502J20371
5498B103421L29085o08751p10769L2291Q46840n81091p12170L44680J172680O25083
$$ plain form
5488 2841299 1234858 1934974 3251160 3302667 1978307 1831864 2092180 1905325 1593739
5479 1593739 994153 1437716 1913520 1449410 1566670 1560928 1990560 1957534 2355742 2512157
5469 2512157 2207590 1863013 1963791 596775 175769 1561910 2020016 2155329 1476836
5460 1476836 962494 2102914 1946317 1562383 2312583 3068996 1739115 1245464 1068599
5451 1068599 557515 728911 637099 1320204 782098 696737 1138420 2731120 2390397 2374514
5441 2374514 2311705 3017720 2157755 1023748 1644786 1463239 847918 776405 591544 2391749
5431 2391749 2045213 1007016 1888522 1755788 1726058 2039278 2203100 1563032 1080414 768101
5421 768101 890945 1450557 1161829 1238036 1914975 1536704 1768294 1284870 1556648 1114950
$$ packed form
5488B841299j606441P00116J316186N1507j324360j46443K60316j86855l11586
5479A593739n99586M43563M75804m64110J17260n742M29632l3026L98208J56415
5469B512157l04567l44577J00778j367016m21006J386141M58106J35313o78493
5460A476836n14342J140420j56597l83934P50200P56413j329881m93651j76865
5451A068599n11084J71396r1812O83105n38106q5361M41683J592700l40723j5883
5441B374514o2809P06015q59965j134007O21038j81547o15321p1513j84861J800205
5431B391749l46536j038197Q81506j32734k9730L13220J63822o40068m82618l12313
5421G68101J22844N59612k88728P6207O76939l78271K31590m83424K71778m41698
$$ plain form
5411 1114950 1296838 2294463 1900156 1842108 2053445 1724913 1976495 2244540 1914746 1578379
5401 1578379 1796615 1685396 2517789 2917219 2425871 2168292 1575421 1959383 2683209 2865378
5391 2865378 1984915 1754291 1971881 2779820 2376341 1657611 2155472 1876130 2896006
5382 2896006 3030065 3260722 2057910 1208420 1558483 2192016 2752919 1942256 1843509 2186547
5372 2186547 2569283 2787406 1965853 1715169 1734413 2676968 2333762 1451023 1907599 2200827
5362 2200827 1437205 1098093 2307304 3017873 2527728 1143593 2298538 2650371 2035292
5353 2035292 1814307 1809222 2457374 2218878 2034093 2579076 1913031 2075406 1858255 2354529
5343 2354529 2071672 1704203 2029824 2189081 2435202 2369595 2072436 2055198 2549806 2475899
$$ packed form
5411A114950J81888R97625l94307n8048K11337l28532K51582K68045l29794l36367
5401A578379K18236j11219Q32393L99430m91348k57579n92871L83962P23826J82169
5391B865378q80463k30624K17590Q07939m03479p18730M97861k79342J019876
5382B896006J34059K30657j202812q49490L50063O33533N60903q10663r8747L43038
5372B186547L82736K18123q21553k50684J9244R42555l43206q82739M56576K93228
5362B200827p63622l39112J209211P10569m90145j384135J154945L51833o15079
5353B035292k20985n085O48152k38496j84785N44983o66045J62375k17151M96274
5343B354529k82857l67469L25621J59257K46121o5607k97159j7238M94608p3907
$$ plain form
5333 2475899 1749685 1917962 2500114 2198672 1754109 1910746 2648108 1873568 1890532 2624726
5323 2624726 2478026 1689236 512238 1219638 3436288 1934166 1313674 2163180 2872634
5314 2872634 3785557 3172894 2641194 2900129 1968486 1524277 1665549 1827697 1535086 1791951
5304 1791951 1680973 1559738 1595035 1361044 2407431 2706078 2854618 2540441 1873676 1628512
5294 1628512 1873901 2021189 2162345 2028040 1930324 1935725 1587259 1539256 1234766 1531294
5284 1531294 1959475 1957006 2475445 1733214 1851405 2557900 1994986 2094541 2158150 2178911
5274 2178911 2777180 1732961 2017774 2533674 2024769 2050645 2115689 1857250 2485465 1313151
5264 1313151 1046756 1626350 1822285 1582705 1710633 2342911 3506203 2482881 2336632
$$ packed form
5333B475899p26214J68277N82152l01442m44563J56637P37362p74540J6964P34194
5323B624726j46700p88790j176998P07400K216650j502122o20492Q49506P09454
5314B872634R12923o12663n31700K58935r31643m44209J41272J62148k92611K56865
5304A791951j10978j21235L5297k33991J046387K98647J48540l14177o66765k45164
5294A628512K45389J47288J41156j34305r7716N401l48466m8003l04490K96528
5284A531294M28181k469N18439p42231J18191P06495n62914R9555O3609K0761
5274B178911N98269j044219K84813N15900n08905K5876O5044k58439O28215j172314
5264A313151k66395N79594J95935k39580J27928O32278J163292j023322j46249
$$ plain form
5255 2336632 2757879 2808918 3062935 2506627 1999575 1000800 510948 1325185 2006563 1589288
5245 1589288 2057073 2760941 2583586 2132055 2959191 4080438 3269978 2359034 3014264
5236 3014264 2307828 2981366 2418105 2728238 2721736 2755298 2478364 2199576 1902062 2086390
5226 2086390 2902008 2553727 2044974 1548968 1367894 1495161 1298912 1947545 1927792 1886758
5216 1886758 1959424 1222960 1958762 2455151 2329043 1801333 2202989 1999232 2676829 1657379
5206 1657379 1451460 1192172 1314070 2745396 2422131 1943906 2247706 2355482 2851607
5197 2851607 3139572 3815975 3791215 2530783 1637927 1806308 2560221 2669424 3084981 1741014
5187 1741014 2062877 2632035 2526029 3246106 3271033 2656307 3664557 2419154 2478478 2554395
$$ packed form
5255B336632M21247N1039K54017n56308n07052r98775m89852Q14237O81378m17275
5245A589288M67785P03868j77355m51531Q27136J121247q10460r10944O55230
5236C014264p06436O73538n63261L10133o502L3562k76934k78788k97514J84328
5226B086390Q15618l48281n08753m96006j81074J27267j96249O48633j9753m1034
5216A886758P2666p36464P35802M96389j26108n27710M01656k03757O77597j019450
5206A657379k05919k59288J21898J431326l23265m78225L03800J07776M96125
5197B851607K87965O76403k4760j260432q92856J68381P53913J09203M15557j343967
5187A741014L21863N69158j06006P20077K4927o14726J008250j245403N9324P5917
$$ plain form
5177 2554395 1454697 1869669 3097555 3205067 2970331 2617310 3239610 3568264 3098656
5168 3098656 2733930 3103661 2843587 2061165 2043034 3193304 2760003 2283122 2675750 3207174
5158 3207174 3794966 2302390 2023571 2944768 3272195 3212313 3107295 1905647 2329337
5149 2329337 2959123 2522344 2422351 2385866 3195433 3962729 2584680 1888371 2813941 3275421
5139 3275421 3549342 3706564 3863160 3479312 2368297 2435034 3198666 3247332 3081674 3302433
5129 3302433 3437685 3696852 4073324 3967661 3698515 3036079 3419447 4001180 3361707 2519391
5119 2519391 2042483 3019631 3445474 2926785 3544887 3521784 3866114 4836698 4216099 4452530
5109 4452530 4295750 3808596 3939086 3695175 3246890 3696629 2806809 3215062 3577405 2995577
$$ packed form
5177B554395j099698M14972J227886J07512k34736l53021O22300L28654m69608
5168C098656l64726L69731k60074p82422j8131J150270m33301m76881L92628N31424
5158C207174N87792j492576k78819R21197L27427n9882j05018j201648M23690
5149B329337O29786m36779r9993l6485Q09567P67296j378049o96309R25570M61480
5139C275421K73921J57222J56596l83848j111015O6737P63632M8666j65658K20759
5129C302433J35252K59167L76472j05663k69146o62436L83368N81733o39473q42316
5119B519391m76908R77148M25843n18689O18102k3103L44330R70584o20599K36431
5109D452530j56780m87154J30490k43911m48285M49739q89820M08253L62343n81828
$$ plain form
5099 2995577 2457098 3049024 3266860 3784121 3209087 3103108 2858662 2767000 2309821 2962419
5089 2962419 2306203 1969079 3220034 3726692 3128298 2836792 3024743 3347594 3058297
5080 3058297 3375954 3415949 3037044 2739961 2589280 2951981 2830197 3268558 3463538 4580118
5070 4580118 4685649 4317719 4003158 3695431 3884056 4277969 3441141 3860303 3707833 3136837
5060 3136837 3412363 3665873 3322694 3413879 3254399 3286294 3263935 3556112 3405818 3498017
5050 3498017 2693457 2713546 3276933 3364857 3483055 3328401 3514631 3426967 2903600 2916285
5040 2916285 2377680 2897360 2963724 3341081 3053431 3521577 3547024 3606778 4160675 3905793
5030 3905793 3237975 3600569 4464237 3668561 2968993 3107636 2286282 3324843 3459950
$$ packed form
5099B995577n38479N91926K17836N17261n75034j05979k44446r1662m57179O52598
5089B962419o56216l37124J250955N06658n98394k91506J87951L22851k89297
5080C058297L17657L9995l78905k97083j50681L62701j21784M38361J94980J116580
5070D580118J05531l67930l14561l07727J88625L93913q36828M19162j52470n70996
5060C136837K75526K53510l43179R1185j59480L1895k2359K92177j50294R2199
5050C498017q04560K0089N63387Q7924J18198j54654J86230q7664n23367J2685
5040B916285n38605N19680O6364L77357k87650M68146K5447N9754N53897k54882
5030C905793o67818L62594Q63668p95676o99568J38643q21354J038561J35107
$$ plain form
5021 3459950 3386068 4302098 3260609 3115314 3511777 4171813 3304678 2974672 3071385 2645615
5011 2645615 3360468 3572316 3431157 3819393 3637218 4919346 5034280 5306394 4407852
5002 4407852 4222710 4972408 4610315 3846455 4350555 4348990 4409225 4533332 4888824 5520511
4992 5520511 5130320 4668617 4465379 4774317 5069887 4994966 4905743 5607189 6381815 7330775
4982 7330775 8165158 8267242 8368474 8226241 6625959 5479670 4771361 4881704 5375293
4973 5375293 4759529 5130004 4938467 4789199 4523960 3980196 4385127 4965412 5086509 5487969
4963 5487969 5267754 4802727 4756969 4364894 5048320 4980271 4544615 4747375 4416010 4102541
4953 4102541 4636306 4635884 5023243 5133029 4863450 4445305 5663906 5552515 4895670 5942685
$$ packed form
5021C459950p3882R16030j041489j45295L96463O60036q67135l30006R6713m25770
5011B645615P14853K11848j41159L88236j82175J282128J14934K72114q98542
5002D407852j85142P49698l62093p63860N04100j565O0235J24107L55492O31687
4992E520511l90191m61703k03238L08938K95570p4921q9223P01446P74626R48960
4982G330775Q34383J02084J01232j42233j600282j146289p08309J10343M93589
4973E375293o15764L70475j91537j49268k65239n43764M04931N80285J21097M01460
4963E487969k20215m65027m5758l92075O83426o8049m35656K02760l31365l13469
4953D102541N33765m22L87359J09786k69579m18145J218601j11391o56845J047015
$$ plain form
4943 5942685 5636386 5603604 5864039 6082396 6520506 7030228 7599524 7155115 7291774 7883527
4933 7883527 8521619 8966183 8271188 8997190 10538445 12374260 13073522 14145134 16811091
4924 16811091 18351785 19465426 19001859 17848400 17044427 16467976 15457884 13895005 13391522
4915 13391522 13692203 13090914 12775044 13137536 14533190 15540000 16250176 17528290 19938996
4906 19938996 21268289 22119738 21527111 21340072 20771024 18614024 18057970 17237598 14713019
4897 14713019 13575722 12964266 11586445 11568629 10716914 10123218 10201289 9380286 8729792
4888 8729792 9732151 9547545 9714119 9837293 10063976 9555060 9551070 10809888 11038688 10793584
4878 10793584 11535894 12251872 13314606 14366183 15172537 17827853 20719964 22304386 24089236
$$ packed form
4943E942685l06299l2782K60435K18357M38110N09722N69296m44409J36659N91753
4933G883527O38092M44564o94995P26002J541255J835815O99262J071612K665957
4924A6811091J540694J113641m63567j153459q03973n76451j010092j562879n03483
4915A3391522L00681o01289l15870L62492J395654J006810P10176J278114K410706
4906A9938996J329293Q51449n92627j87039n69048k157000n56054q20372k524579
4897A4713019j137297o11456j377821j7816q51715n93696P8071q21003o50494
4888H729792J002359j84606J66574J23174K26683n08916l990J258818K28800k45104
4878A0793584P42310P15978J062734J051577Q06354K655316K892111J584422J784850
$$ plain form
4869 24089236 24649720 24892619 24879670 23329978 21901287 20630976 20477379 19977616 18576278
4860 18576278 18146597 18598975 19721183 19383683 20554750 22213212 24544519 26318063 27855704
4851 27855704 30416695 31234510 30963065 29967183 28941218 28743041 27194795 25754915 25343700
4842 25343700 25518910 25939873 26545003 26413178 25852410 24394702 23023378 23180364 22778607
4833 22778607 21948879 21546023 21979694 22705968 23779121 24729277 26036017 27097436 28941434
4824 28941434 31522767 32357671 32058645 31744106 31407547 29912881 28865547 29080729 28360244
4815 28360244 27260914 26463601 26987033 27154408 27510748 27290107 28171776 30142409 30486222
4806 30486222 30516548 30802064 31778329 32835625 32759485 32864184 33656864 34098787 33648768 34595445
$$ packed form
4869B4089236N60484K42899j2949j549692j428691j270311j53597m99763j401338
4860A8576278m29681M52378J122208l37500J171067J658462K331307J773544J537641
4851B7855704K560991Q17815k71445r95882j025965j98177j548246j439880m11215
4842B5343700J75210M20963O05130j31825n60768j457708j371324J56986m01757
4833B2778607q29728m02856M33671P26274J073153R50156J306740J061419J843998
4824B8941434K581333Q34904k99026l14539l36559j494666j047334K15182p20485
4815B8360244j099330p97313N23432J67375L56340k20641Q81669J970633L43813
4806C0486222L0326K85516R76265J057296p6140J04699P92680M41923m50019R46677
$$ plain form
4796 34595445 36146559 37430135 38082051 39188075 40822761 41960148 41951782 42698965 43440055
4787 43440055 45070676 46890710 47280944 47315669 47479099 46878229 46957145 46712876 46430649
4778 46430649 45354025 46102917 47628229 49104398 50508288 52382033 54166594 54447400
4770 54447400 54712062 54046572 54770491 54042407 51835946 50238796 49397221 47976995 46381050
4761 46381050 44920649 45105438 45539055 45135132 44925321 45154831 44814318 44058609 40918658
4752 40918658 39369763 37302804 33976107 32904145 32437329 30635967 29792252 28580752
4744 28580752 27013877 27084354 26335435 25388931 24726820 24746298 24659736 23427144 22287922
4735 22287922 21783011 21150025 20445992 19086931 18445840 18587919 17137713 16499868 18168757
$$ packed form
4796C4595445J551114J283576O51916J106024J634686J137387q366P47183P41090
4787D3440055J630621J820034L90234L4725J63430o00870P8916k44269k82227
4778D6430649j076624P48892J525312J476169J403890J873745J784561K80806
4770E4447400K64662o65490P23919p28084k206461j597150q41575j420226j595945
4761D6381050j460401J84789M33617m03923k09811K29510l40513p55709l139951
4752D0918658j548895k066959l326697j071962m66816j801362q43715j211500
4744B8580752j566875P0477p48919r46504o62111J9478q6562j232592j139222
4735B2287922n04911o32986p04033j359061o41091J42079j450206o37845J668889
$$ plain form
4726 18168757 17662798 17452376 18553331 19582684 20711730 22062196 24509761 25716869
4718 25716869 25465872 24951470 24534513 23048740 20293128 17883290 17742308 17841302 16381019
4709 16381019 15981718 16872597 16536984 17457809 19674577 21607737 22919554 23171292 22438448
4700 22438448 21608076 19824902 18257108 17786233 15690435 13323668 13203103 12939884 11875643
4691 11875643 10989188 10069037 10716635 10491886 10063582 9877616 9259341 8564009 9384463
4682 9384463 10099283 9822253 8844187 7950417 7861210 7741402 7776748 8525418 7748048 7588874
4672 7588874 7408794 8558313 9087429 7653865 7381288 7853450 8810235 8582330 8140864
4663 8140864 8230673 7395561 7619378 8142192 8376188 7871499 7885797 8427636 8688343 8999747
$$ packed form
4726A8168757n05959k10422J100955J029353J129046J350466K447565J207108
4718B5716869k50997n14402m16957j485773k755612k409838j40982R8994j460283
4709A6381019l99301Q90879l35613R20825K216768J933160J311817K51738p32844
4700B2438448q30372j783174j567794m70875k095798k366767j20565k63219j064241
4691A1875643q86455r20151O47598k24749m28304j85966o18275o95332Q20454
4682I384463P14820k77030r78066q93770q9207j19808L5346P48670p77370j59174
4672G588874j80080J149519N29116j433564k72577M72162R56785k27905m41466
4663H140864Q9809q35112K23817N22814K33996n04689J4298N41839K60707L11404
$$ plain form
4653 8999747 8716688 9385616 9596750 9269842 9966841 10772585 11514860 11667241 11258378 11953657
4643 11953657 13147292 13894288 15727206 17084695 18199518 20434470 22200219 23484600
4635 23484600 24029054 23334178 22646198 21686256 18423514 17432953 17533126 16462571 14623953
4626 14623953 14333853 14663387 14741983 13739078 13351854 13080338 13011114 12649165 13477437 13566105
4616 13566105 14037004 13250221 13602576 14276033 14972376 15917250 15900621 16524620 17852124
4607 17852124 19355801 20687367 22386376 24591792 27693675 30833103 35819810 41037425
4599 41037425 46849248 52254810 56335600 57977765 58063621 56456698 53840439 51059060
4591 51059060 48042863 44461669 42202498 39898348 38685893 37301934 37307429 38157714 38386321
$$ packed form
4653H999747k83059O68928K11134l26908O96999Q05744P42275J52381m08863O95279
4643A1953657J193635P46996J832918J357489J114823K234952J765749J284381
4635B3484600N44454o94876o87980r59942l262742r90561J00173j070555j838618
4626A4623953k90100L29534P8596j002905l87224k71516o9224l61949Q28272Q8668
4616A3566105M70899p86783L52355O73457O96343R44874j6629O23999J327504
4607A7852124J503677J331566J699009K205416L101883L139428M986707N217615
4599D1037425N811823N405562M080790J642165Q5856j606923k616259k781379
4591E1059060l016197l581194k259171k304150j212455j383959N495Q50285K28607
$$ plain form
4582 38386321 38937078 38670857 37736825 35965077 33707036 31384531 28921066 28272052 27347228
4573 27347228 25805336 25372745 24500967 24893705 25623494 25578264 26466511 29964087 31275458
4564 31275458 34278449 37753435 41922612 47293518 52861849 56680703 58217969 59008667
4556 59008667 58100361 56585561 55089434 52638060 50757112 49995478 48313572 47611029 48419431
4547 48419431 49356843 49535734 52186833 53924118 55950365 56745408 55631295 54292847 52411015
4538 52411015 49975426 47650141 44137826 40190092 36587441 33750268 31973278 30128343
4530 30128343 29127023 28831225 27321385 27822198 28915032 28926502 29334231 28804288 28700335
4521 28700335 27791462 27008057 25970627 25541233 24459670 24991854 26480851 25995641 26072900
$$ packed form
4582C8386321N50757k66221r34032j771748k258041k322505k463465o49014r24824
4573B7347228j541892m32591q71778L92738P29789m5230Q88247L497576J311371
4564C1275458L002991L474986M169177N370906N568331L818854J537266P90698
4556E9008667r08306j514800j496127k451374j880948p61634j681906p02543Q08402
4547D8419431R37412J78891K651099J737285K026247P95043j114113j338448j881832
4538E2411015k435589k325285l512315l947734l602651k837173j776990j844935
4530C0128343j001320k95798j509840N00813J092834J1470M07729n29943j03953
4521B8700335r08873p83405j037430m29394j081563N32184J488997m85210P7259
$$ plain form
4512 26072900 26807021 27772306 28089515 29294736 31379693 34293979 35932536 36856303 38374359
4503 38374359 38717154 37657281 36236315 33574045 31864493 28762067 25946515 23881468
4495 23881468 22147448 20129043 18371307 17517163 16677129 15422503 14691467 14902583 14560920
4486 14560920 14178947 13897562 14177434 14193984 14465817 14703714 16097020 16046183 15472243 15862856
4476 15862856 14854039 14508093 14177860 13654013 13663822 12611752 11929170 11089310 10113203
4467 10113203 9095532 9759032 10764963 9674701 8559701 8615016 9086448 7622113 7411060
4458 7411060 7593090 8032572 8305202 7089979 7376559 7417159 6574484 6295246 6706642 6288324
4448 6288324 6678238 6594428 5881005 6039244 6585099 6296500 6106253 5273919 5815013 6163669
$$ packed form
4512B6072900P34121R65285L17209J205221K084957K914286J638557R23767J518056
4503C8374359L42795j059873j420966k662270j709552l102426k815552k065047
4495B3881468j734020k018405j757736q54144q40034j254626p31036K11116l41663
4486A4560920l81973k81385K79872J6550K71833K37897J393306n0837n73940L90613
4476A5862856j008817l45946l30233n23847R809j052070o82582q39860r76107
4467A0113203j017671O63500J005931j090262j115000N5315M71432j464335k11053
4458G411060J82030M39482K72630j215223K86580M0600q42675k79238M11396m18318
4448F288324L89914q3810p13423J58239N45855k88599j90247q32334N41094L48656
$$ plain form
4438 6163669 6456930 6941303 5980231 4539950 4723639 5605599 6373735 6532228 6475407 6772754
4428 6772754 7013857 6113674 5468658 5787853 5632737 6327682 6526818 5665370 5909181 5445670
4418 5445670 5492685 5413819 5618631 5581625 5875913 6134206 5954092 5179631 4808645 5115043
4408 5115043 5764724 6267834 5634041 5665603 6354624 5691235 4549734 5702471 6627685
4399 6627685 7042108 5945463 5810823 6837310 6087731 4509802 5464035 6528401 6615040
4390 6615040 6980079 7339806 6791725 6246049 5589254 6200153 6708100 5987895 5263276 5628015
4380 5628015 5748895 5369749 4612618 4384603 5170437 5827692 5364049 4840550 5749390 6029486
4370 6029486 4649842 4313675 5545623 5391569 5488568 5957326 5393553 5859681 5387271
$$ packed form
4438F163669K93261M84373r61072j440281J83689Q81960P68136J58493n6821K97347
4428F772754K41103r00183o45016L19195j55116O94945J99136q61448K43811m63511
4418E445670M7015p8866K04812l7006K94288K58293j80114p74461l70986L06398
4408E115043O49681N03110o33793L1562O89021o63389j141501J152737R25214
4399F627685M14423j096645j34640J026487p49579j577929R54233J064366Q6639
4390F615040L65039L59727n48081n45676o56795O10899N07947p20205p24619L64739
4380E628015J20880l79146p57131k28015P85834O57255m63643n23499R08840K80096
4370F029486j379644l36167J231948j54054R6999M68758n63773M66128m72410
$$ plain form
4361 5387271 4906169 6091789 6207298 5688732 5830566 5671426 5409988 5701910 5499288
4352 5499288 5457552 5801062 5211223 4420820 4861223 4863065 4690044 4661415 4783071 5111207
4342 5111207 5379584 4917840 4603660 4896401 5512044 5086147 5108171 4520853 4241794 5036321
4332 5036321 5065284 5602027 5044731 5404810 5944739 6436555 6296503 6116408 5577504 6017428
4322 6017428 5678364 7007936 7667099 7121287 7574462 8031673 8709566 9665717 9534410
4313 9534410 10069664 9742763 9789685 10086168 10145894 11460724 11338169 12868227 13355033 13328977
4303 13328977 13426214 14283031 14845985 15909730 17707468 17720976 17100016 16582218 16236781
4294 16236781 17311764 17185095 17544471 17451010 17433923 17494477 16983816 17305491 16485184 16500354
$$ packed form
4361E387271m81102J185620J15509n18566J41834j59140k61438K91922k02622
4352E499288m1736L43510n89839p90403M40403J842j73021k8629J21656L28136
4342E111207K68377m61744l14180K92741O15643m25897K2024n87318k79059P94527
4332E036321K8963N36743n57296L60079N39929M91816j40052j80095n38904M39924
4322F017428l39064J329572O59163n45812M53175M57211O77893R56151j31307
4313I534410N35254l26901M6922K96483N9726J314830j22555J530058M86806k6056
4303A3328977R7237Q56817N62954J063745J797738J3508o20960n17798l45437
4294A6236781J074983j26669L59376r3461j7087O0554n10661L21675q20307J5170
$$ plain form
4284 16500354 17352047 17389018 16515441 16896740 16731363 16371297 16837729 16414063 16078319 16208636
4274 16208636 16396719 16521821 16305098 16390667 16939071 17080390 17213251 16849893 17041859 16883764
4264 16883764 16489634 16225164 16689471 16213226 16873624 17451054 18228082 19043859 19337239
4255 19337239 19374823 19858320 19308395 19585218 20020840 20944357 22013337 21730824 23118699
4246 23118699 24455724 23344609 22890527 23289411 23221732 23766708 23505346 22762697 23313909
4237 23313909 23885603 23646047 24024505 24175120 24479491 24823306 24347941 23196697 22936912
4228 22936912 22790465 22583840 21641653 21071422 21483558 21508319 21389381 20185655 19581073
4219 19581073 19771482 18298917 17444266 17251349 18302607 18286551 18044048 18036043 17895641 17421143
$$ packed form
4284A6500354Q51693L6971q73577L81299j65377l60066M66432m23666l35744J30317
4274A6208636J88083J25102k16723Q5569N48404J41319J32861l63358J91966j58095
4264A6883764l94130k64470M64307m76245O60398N77430P77028Q15777K93380
4255A9337239L7584M83497n49925K76823M35622R23517J068980k82513J387875
4246B3118699J337025j111115m54082L98884o7679N44976k61362p42649N51212
4237B3313909N71694k39556L78458J50615L04371L43815m75365j151244k59785
4228B2936912j46447k06625r42187n70231M12136K4761j18938j203726o04582
4219A9581073J90409j472565q54651j92917J051258j6056k42503q005j40402m74498
$$ plain form
4209 17421143 17229094 16773384 16246035 15681506 15359095 14913250 15042106 15268006 15867101
4200 15867101 15764340 15690332 15358784 15585904 15493398 14741116 14482034 14914769 15249245 15683233
4190 15683233 16074154 16799032 17130995 17042496 16798036 16333186 16316012 15117784 14723885 14430006
4180 14430006 13542619 13637293 13968940 13572218 13318366 13803729 14614154 13926665 13150018 12197118
4170 12197118 12521921 12963682 11921770 10993001 10507692 10841381 10455419 10145422 9796498
4161 9796498 9829705 9210079 8713679 8237951 8288873 8263483 8442681 8651710 7309172 7175326
4151 7175326 7309137 6340705 5843105 6162846 7162013 7574542 6648760 6653153 6653575 6481524
4141 6481524 5758087 6678087 6306763 6495010 6015080 5700808 5663139 6020211 6416637 6345823
$$ packed form
4209A7421143j92049m55710n27349n64529l22411m45845J28856K25900N99095
4200A5867101j02761p4008l31548K27120r2506p52282k59082M32735L34476M33988
4190A5683233L90921P24878L31963q8499k44460m64850j7174j198228l93899k93879
4180A4430006q87387R4674L31647l96722k53852M85363Q10425o87489p76647r52900
4170A2197118L24803M41761j041912r28769m85309L33689l85962l09997l48924
4161I796498L3207o19626m96400m75728N0922k5390J79198K09029j342538j33846
4151G175326J33811r68432m97600L19741R99167M12529r25782M393M22j72051
4141F481524p23437R20000l71324J88247m79930l14272l7669L57072L96426p0814
$$ plain form
4131 6345823 6718314 6239027 6325544 6445489 5762884 5447523 5177806 5253432 4999557 5288245
4121 5288245 4804573 5370259 5780099 4627770 5217496 4641923 5320590 5318797 4770985 5364205
4111 5364205 5873237 5913402 5691084 5969651 5700283 6692595 6351050 5839725 5893033 5554622
4101 5554622 5908846 6113082 4726504 4925866 5573215 5844046 5434419 5224570 5581334
4092 5581334 6067222 5096057 5183591 5007255 5334461 5788709 5478219 5861650 5368194 5763120
4082 5763120 6119646 5454444 5580271 5957183 5755100 5534462 5389565 6468590 6398045 6228654
4072 6228654 5853839 6110103 6564347 6591286 5670105 6075393 6058627 5887435 5620474 5455082
4062 5455082 5353124 6330420 6116062 5354855 5309154 5615341 5869768 6153161 5372422 5913355
$$ packed form
4131F345823L72491m79287Q6517J19945o82605l15361k69717P5626k53875K88688
4121E288245m83672N65686M09840j152329N89726n75573O78667j793n47812N93220
4111E364205N09032M0165k22318K78567k69368R92312l41545n11325N3308l38411
4101E554622L54224K04236j386578J99362O47349K70831m09627k09849L56764
4092E581334M85888r71165Q7534j76336L27206M54248l10490L83431m93456L94926
4082E763120L56526o65202J25827L76912k02083k20638j44897J079025p0545j69391
4072F228654l74815K56264M54244K6939r21181M05288j6766j71192k66961j65392
4062E455082j01958R77296k14358p61207m5701L06187K54427K83393p80739N40933
$$ plain form
4052 5913355 6474029 5954189 5742552 5964270 6195056 6406177 6844984 7407743 6649597 5959303
4042 5959303 5677243 6207297 6473776 5735325 5962886 6484756 6121905 5487830 5435417 5467635
4032 5467635 5195868 5442806 6219873 6889482 6702210 6053333 5659833 6161656 6748465 6555961
4022 6555961 6561196 7140482 6729284 6608877 6370176 6433262 7168869 7521840 7399358 7265378
4012 7265378 8078337 8025477 7657104 7545723 6723633 7091326 7500392 6707734 7445081 7083769
4002 7083769 6697602 6018460 6367106 6804027 6417913 6458284 6732672 7159420 7236900 6477224
3992 6477224 7202274 7744866 7348844 6792015 7233533 7610946 7001117 6484420 6551563 7389155
3982 7389155 7572869 7728465 7906420 7268537 6589642 6846674 7681417 7635756 7379920 6945013
$$ packed form
4052E913355N60674n19840k11637K21718K30786K11121M38807N62759p58146o90294
4042E959303k82060N30054K66479p38451K27561N21870l62851o34075n2413L2218
4032E467635k71767K46938P77067O69609j87272o48877l93500N01823N86809j92504
4022F555961N235N79286m11198j20407k38701O3086P35607L52971j22482j33980
4012G265378Q12959n2860l68373j11381q22090L67693M09066p92658P37347l61312
4002G083769l86167o79142L48646M36921l86114M0371K74388M26748P7480p59676
3992F477224P25050N42592l96022n56829M41518L77413o09829n16697O7143Q37592
3982G389155J83714J55596J77955o37883o78895K57032Q34743m5661k55836m34907
$$ plain form
3972 6945013 6904287 6879544 7484030 7868201 7966770 7678444 7662882 8265933 8254495 7887274
3962 7887274 7864317 7527249 7523313 7814444 9127597 8440775 7904271 7747111 8293020 9460177
3952 9460177 9262188 9829806 9774513 10205887 10355158 10447390 11282818 11263934 10999067 11841578
3942 11841578 11930915 11627271 11476570 11648778 11823338 13148620 13682241 15091994 15225127
3933 15225127 15308711 15730711 16645273 17970980 17857378 18410363 18421092 17977843 17154221 16867355
3923 16867355 17100347 17548541 17913846 17367589 17212831 18652352 18431108 18794466 19424527
3914 19424527 20255866 20569177 21100171 21672174 22164861 21863270 20996798 21313481 21314245 21161687
3904 21161687 20403416 20879926 21657214 21712866 22799814 23929421 24643398 25400521 25454096
$$ packed form
3972F945013m0726k4743O04486L84171R8569k88326j5562O03051j1438l67221
3962G887274k2957l37068l936K91131J313153o86822n36504j57160N45909J167157
3952I460177j97989N67618n5293M31374J49271R2232Q35428j8884k64867Q42511
3942A1841578Q9337l03644j50701J72208J74560J325282N33621J409753J33133
3933A5225127Q3584M22000R14562J325707j13602N52985J0729m43249q23622k86866
3923A6867355K32992M48194L65305n46257j54758J439521k21244L63358O30061
3914A9424527Q31339L13311N30994N72003M92687l01591q66472L16683P64j52558
3904B1161687p58271M76510P77288N5652J086948J129607P13977P57123N3575
$$ plain form
3895 25454096 27540924 28784453 28399998 27944520 28322297 29769012 30088652 30690830 32242091
3886 32242091 33013310 33918558 34193552 35359675 37378257 38208425 39663617 40977644 42127469
3877 42127469 43546477 45577073 47068496 48730179 49488621 49558966 49773731 50482447 51289861
3868 51289861 51554329 52310036 54392000 55759724 56773691 58269543 60056647 62259276
3860 62259276 63121986 64287596 66031327 65417777 63123175 62733545 62106727 62041669 61521287
3851 61521287 59987488 59801375 59632499 59335787 60152163 60616229 59834488 59507862 59122273
3842 59122273 58362896 57350453 55386045 53169711 51782458 51792375 50472699 48693925 46988014
3833 46988014 46024958 45712351 45679134 44838862 44614568 44881683 44120862 44442905 44948720 44186558
$$ packed form
3895B5454096K086828J243529l84455m55478L77777J446715L19640O02178J551261
3886C2242091P71219R05248K74994J166123K018582Q30168J455192J314027J149825
3877D2127469J419008K030596J491423J661683P58442P0345K14765P08716Q07414
3868E1289861K64468P55707K081964J367724J013967J495852J787104K202629
3860F2259276Q62710J165610J743731o13550k294602l89630o26818o5058n20382
3851F1521287j533799j86113j68876k96712Q16376M64066p81741l26626l85589
3842E9122273p59377j012443j964408k216334j387253R917j319676j778774j705911
3833D6988014r63056l12607l3217q40272k24294K67115p60821L22043N05815p62162
$$ plain form
3823 44186558 43744900 44213040 43937057 44250963 44840806 44531668 45733518 47151467 48515168
3814 48515168 51558303 54793109 58021932 61439577 64920931 68866748 72494827 76273945
3806 76273945 79091151 82831887 85596052 86992700 87370126 86490672 85889456 83444935 80954413
3797 80954413 78226237 75427393 73150598 70430415 67751744 66297215 64651372 64419510
3789 64419510 65210568 67329179 69807651 71793514 73884473 75863191 78722223 79522169
3781 79522169 79102767 77230144 73831595 71356956 67919498 64935434 62489750 60349567
3773 60349567 59421007 58570829 57688240 57032897 57161913 56681272 56337528 56854730 57779732
3764 57779732 58007379 58314077 58732860 59337571 60185429 60860537 61632794 62056503 61750984
$$ packed form
3823D4186558m41658M68140k75983L13906N89843l09138J201850J417949J363701
3814D8515168L043135L234806L228823L417645L481354L945817L628079L779118
3806G6273945K817206L740736K764165J396648L77426q79454o01216k444521k490522
3797H0954413k728176k798844k276795k720183k678671j454529j645843k31862
3789F4419510P91058K118611K478472J985863K090959J978718K859032P99946
3781G9522169m19402j872623l398549k474639l437458k984064k445684k140183
3773F0349567r28560q50178q82589o55343J29016m80641l43744N17202R25002
3764E7779732K27647L06698M18783O04711Q47858O75108P72257M23709l05519
$$ plain form
3755 61750984 62743826 63072415 62278912 61808897 61850982 62054432 61545322 60886017 60700363 60355372
3745 60355372 58428713 57028753 57462105 58361985 58049849 57647886 57999072 59460416 59477050
3736 59477050 59809101 59263770 58890930 58201548 55236010 53948531 54114544 53110134 52474726
3727 52474726 51933539 52336585 54651142 55307477 55636741 57049185 58823244 60015994 60931572
3718 60931572 61695987 62840044 63833138 64666471 66909172 68457678 70027329 70128798 69541231
3709 69541231 68915242 67716021 66010013 65268284 64032520 62434116 60930943 60861839 61874450
3700 61874450 62124217 61223874 61824485 62659305 62448026 61804761 60407372 59614915 57263630
3691 57263630 53762113 53168849 51997973 48952506 46328462 44931506 43570670 42109107
$$ packed form
3755F1750984R92842L28589p93503m70015M2085K03450n09110o59305j85654l44991
3745F0355372j926659j399960M33352Q99880l12136m01963L51186J461344J6634
3736E9477050L32051n45331l72840o89382k965538j287479J66013j004410o35408
3727E2474726n41187M03046K314557O56335L29264J412444J774059J192750R15578
3718F0931572P64415J144057R93094Q33333K242701J548506J569651J01469n87567
3709F9541231o25989j199221j706008p41729j235764j598404j503173o9104J012611
3700F1874450K49767r00343O00611Q34820k11279o43265j397389p92457k351285
3691E7263630l501517n93264j170876l045467k624044j396956j360836j461563
$$ plain form
3683 42109107 40043500 39760194 38803600 37335789 36857943 36649032 35161988 32625070 31597487
3674 31597487 31105617 30140029 28614647 28406313 26258369 24942972 23949494 22533488 22048021
3665 22048021 22011084 21512768 22273535 21256324 21756987 23611310 23433396 22183604 23098315
3656 23098315 23042990 23253647 21816182 20934126 20417811 20287798 19437909 19606959 20408254
3647 20408254 19961018 19761609 20307401 20397219 20125563 18917143 19034691 19981137 20541297
3638 20541297 20337092 19313554 20109122 19105743 18470394 18030781 18050067 17338093 15995935
3629 15995935 14442184 14292841 13236041 12768663 13037194 13218877 12945282 11812300 11571730
3620 11571730 11593067 10995454 9962671 10086457 10478767 10887486 10617303 10324904 10855735
$$ packed form
3683D2109107k065607k83306r56594j467811m77846k08911j487044k536918j027583
3674C1597487m91870r65588j525382k08334k147944j315397r93478j416006m85467
3665B2048021l6937m98316P60767j017211N00663J854323j77914j249792R14711
3656B3098315n5325K10657j437465q82056n16315j30013q49889J69050Q01295
3647B0408254m47236j99409N45792Q9818k71656j208420J17548R46446N60160
3638B0541297k04205j023538P95568j003379o35349m39613J9286p11974j342158
3629A5995935j553751j49343j056800m67378K68531J81683k73595j132982k40570
3620A1571730K1337n97613j032783J23786L92310M08719k70183k92399N30831
$$ plain form
3611 10855735 11292130 10796023 9952469 9319939 9446483 9422468 8233696 8102026 7983444
3602 7983444 8639333 9161250 9268089 8965738 9163463 8324164 8550508 9128695 9116103 8687772
3592 8687772 8400139 8920008 8774403 7964560 8499694 7938545 8791740 9012860 8683193 9292056
3582 9292056 8314133 7735261 8445481 7981754 8465988 9126569 8432292 7597392 7331441 7828218
3572 7828218 7260174 7376017 7847087 9236558 9394600 8962674 8103480 7893211 7862243 8122045
3562 8122045 8268694 8895855 8488856 8428146 8233459 8379393 9234573 9838100 9671192 9000376
3552 9000376 9297775 9091036 8900449 9855538 10155763 11537729 11546098 11631921 12074086 12400382
3542 12400382 13094309 12593441 13089616 14036241 14033549 14510953 15147754 15829340 16235439 16659885
$$ packed form
3611A0855735M36395m96107q43554o32530J26544k4015j188772j31670j18582
3602G983444O55889N21917J06839l02351J97725q39299K26344N78187j2592m28331
3592H687772k87633N19869j45605q09843N35134n61149Q53195K21120l29667O08863
3582I292056r77923n78872P10220m63727M84234O60581o94277q34900k65951M96777
3572G828218n68044J15843M71070J389471J58042m31926q59194k10269l0968K59802
3562H122045J46649O27161m06999o0710j94687J45934Q55180O03527j66908o70816
3552I000376K97399k06739j90587R55089L00225J381966Q369Q5823M42165L26296
3542A2400382O93927n00868M96175R46625k692M77404O36801O81586M06099M24446
$$ plain form
3532 16659885 17154789 17042525 18384613 17898702 17924671 18733339 19439402 20771319 21673996
3523 21673996 20858360 20452572 21817989 21672146 20686702 20699499 20591413 20398630 20629532
3514 20629532 20654199 21022533 21126019 20638805 19508794 19422650 19685058 18801112 19010547 18963822
3504 18963822 18137834 18675663 18173643 17415065 18051191 17542254 16829932 17253533 17103777
3495 17103777 16993940 16837916 16383032 17191781 18871707 19666051 20114084 19722866 20910225
3486 20910225 21909414 22128296 23228305 24733466 26673994 27092033 28264513 30037395 30134310
3477 30134310 28827133 28896007 29363354 29279080 28097428 27740475 27624911 27011134 26847424
3468 26847424 28874105 28761413 28589856 28228667 28636388 28881402 28543146 27624875 27660275
$$ packed form
3532A6659885M94904j12264J342088m85911K5969Q08668P06063J331917R02677
3523B1673996q15636m05788J365417j45843r85444J2797j08086j92783K30902
3514B0629532K4667L68334J03486m87214j130011q6144K62408q83946K09435m6725
3504A8963822q25988N37829n02020p58578O36126n08937p12322M23601j49756
3495A7103777j09837j56024m54884Q08749J679926P94344M48033l91218J187359
3486B0910225R99189K18882J100009J505161J940528M18039J172480J772882R6915
3477C0134310j307177O8874M67347q4274j181652l56953j15564o13777j63710
3468B6847424K026681j12692j71557l61189M07721K45014l38256r18271L5400
$$ plain form
3459 27660275 27551371 26644909 27737230 27256152 25746047 25966102 24900122 24949946 25802094
3450 25802094 25189875 25642717 26979454 27436824 26400546 25455073 23819201 22296485 20795154
3441 20795154 20071462 19209090 18263928 17104531 15960775 15715527 15965614 14423486 14437443
3432 14437443 14479465 13725022 13823366 13019908 12163649 11805306 12084542 11865276 12703972 13163065
3422 13163065 12592685 13138775 13767735 13650212 14224351 15396371 16599600 17443689 17394118
3413 17394118 16571953 16711707 16591663 15829637 16198711 16513053 16787801 16321026 15719627
3404 15719627 15951382 17389288 16180734 16580149 16770145 16862211 16031015 14773787 14325120
3395 14325120 14541178 15196897 15147193 14256637 14514150 14442550 15149426 14433691 13484807 14363307
$$ packed form
3459B7660275j08904r06462J092321m81078j510105K20055j065980M9824Q52148
3450B5802094o12219M52842J336737M57370j036278r45473j635872j522716j501331
3441B0795154p23692q62372r45162j159397j143756k45248K50087j542128J3957
3432A4437443M2022p54443R8344q03458q56259l58343K79236k19266Q38696M59093
3422A3163065n70380N46090O28960j17523N74139J172020J203229Q44089m9571
3413A7394118q22165J39754j20044p62026L69074L14342K74748m66775o01399
3404A5719627K31755J437906j208554L99415J89996R2066q31196j257228m48667
3395A4325120K16058O55719m9704q90556K57513p1600P06876p15735r48884Q78500
$$ plain form
3385 14363307 14591141 14447494 14140333 13680997 13144559 13362831 14898359 16431683 15946542
3376 15946542 16603420 17599062 18528220 18459113 19484525 20130549 20223013 20264502 19726242 19958602
3366 19958602 19879604 18910652 18910471 18311178 17584809 18543631 18876370 18061789 17561431 17936733
3356 17936733 18593367 18314228 19356461 20180062 21848370 22774784 22859735 25056895 25476882
3347 25476882 25453189 25614247 25936724 26051874 25280683 24914086 24469981 24092608 23875068 23747197
3337 23747197 23762018 23568350 24000067 24894013 25619380 25588130 26719151 28443982 29117197
3328 29117197 29469886 30040413 30914035 30529830 30294261 30432539 31061580 31205711 31052429
3319 31052429 31616636 30930369 30915367 30659587 30984520 31232611 30592621 31006903 31576394 31327160
$$ packed form
3385A4363307K27834j43647l07161m59336n36438K18272J535528J533324m85141
3376A5946542O56878R95642R29158o9107J025412O46024R2464M1489n38260K32360
3366A9958602p8998r68952j81n99293p26369R58822L32739q14581n00358L75302
3356A7936733O56634k79139J042233Q23601J668308R26414Q4951K197160M19987
3347B5476882k3693J61058L22477J15150p71191l66597m44105l77373k17540j27871
3337B3747197J4821j93668M31717Q93946P25367l1250J131021J724831O73215
3328B9117197L52689N70527Q73622l84205k35569J38278O29041J44131j53282
3319C1052429N64207o86267j5002k55780L24933K48091o39990M14282N69491k49234
$$ plain form
3309 31327160 31658104 31927177 33480043 33983497 34032992 34584242 34321644 35078588 34545454
3300 34545454 34635181 35650454 35876607 35817272 36301978 36270540 35634880 35524245 36504871 36520947
3290 36520947 36486518 36500570 37000486 38868878 39920587 41534124 44649851 47180733 51047594
3281 51047594 55829566 59815299 64008069 68577751 72402072 74061596 73880174 73897917 71682902
3272 71682902 68225540 64800480 60085771 55284727 50530034 46328443 43298905 39823319
3264 39823319 36690943 35641801 34740438 33884305 33218796 32398278 33385455 33953554 33725873
3255 33725873 33989883 34261459 35894684 35837982 35028501 37748227 39347139 40830491 42060860
3246 42060860 44554653 47025044 49855632 51933866 54069317 55524814 56155142 56286578
$$ packed form
3309C1327160L30944K69073J552866N03454M9495N51250k62598P56944n33134
3300C4545454Q9727J015273K26153n9335M84706l1438o35660j10635R80626J6076
3290C6520947l4429J4052M99916J868392J051709J613537L115727K530882L866861
3281E1047594M781972L985733M192770M569682L824321J659524j81422J7743k215015
3272G1682902l457362l425060m714709m801044m754693m201591l029538l475586
3264C9823319l132376j049142r01363q56133o65509q20518R87177N68099k27681
3255C3725873K64010K71576J633225n6702q09481K719726J598912J483352J230369
3246D2060860K493793K470391K830588K078234K135451J455497O30328J31436
$$ plain form
3238 56286578 55648089 54739530 53730635 52618199 51076767 49383407 47141779 44003009
3230 44003009 40273820 37852029 36220810 33968065 30976759 29177146 27591751 26234986
3222 26234986 25838399 24646527 23505182 22750406 21861027 22332207 22004304 21360205 21054911
3213 21054911 21503347 20688147 20998348 21862976 21914644 22237105 21406985 21097950 22864858
3204 22864858 22792526 23164975 23501167 23368459 23697632 23678423 22880352 23452337 24196730 25349266
3194 25349266 26311063 26540180 26382632 27917376 29691246 30621846 31104282 31520025 31673514
3185 31673514 32483691 33280446 33815365 34410129 35650100 37451485 40145924 41413319 43285112
3176 43285112 47085207 51718811 56689094 63880993 74809558 88938442 107692853 129302675
$$ packed form
3238E6286578o38489r08559j008895j112436j541432j693360k241628l138770
3230D4003009l729189k421791j631219k252745k991306j799613j585395j356765
3222B6234986l96587j191872j141345p54776q89379M71180l27903o44099l05294
3213B1054911M48436q15200L10201Q64628N1668L22461q30120l09035J766908
3204B2864858p2332L72449L36192j32708L29173j9209p98071N71985P44393J152536
3194B5349266R61797K29117j57548J534744J773870R30600M82436M15743J53489
3185C1673514Q10177P96755N34919N94764J239971J801385K694439J267395J871793
3176D3285112L800095M633604M970283P191899J0928565J4128884J8754411K1609822
$$ plain form
3168 129302675 152788552 173103992 184864763 187196042 181520483 170659516 157741409
3161 157741409 147469687 141846464 141394145 143425301 144524904 143932980 138632199 128821164
3153 128821164 116326205 103371180 91506420 80928163 72872199 66257624 60687855
3146 60687855 56609148 53615139 50718196 47775244 45445390 43515703 42423495 41181061
3138 41181061 40341862 39649951 39124126 39282782 39394248 39029645 38717049 39004675 40592196
3129 40592196 40266083 40217889 41022660 41882220 42474066 43034555 43262839 44266548 44868433
3120 44868433 46263872 47705572 49445455 51134717 53322696 55606606 59380059 62868109
3112 62868109 66044995 69426864 74250171 79380726 84822412 90517753 98704372 109667133
$$ packed form
3168A29302675K3485877K0315440J1760771K331279n675559j0860967j2918107
3161A57741409j0271722n623223m52319K031156J099603n91924n300781r811035
3153A28821164j2494959j2955025j1864760j0578257q055964o614575n569769
3146F0687855m078707k994009k896943k942952k329854j929687j092208j242434
3138D1181061q39199o91911n25825J58656J11466l64603l12596K87626J587521
3129D0592196l26113m8194Q04771Q59560N91846N60489K28284J003709O01885
3120D4868433J395439J441700J739883J689262K187979K283910L773453L488050
3112F2868109L176886L381869M823307N130555N441686N695341Q186619J0962761
$$ plain form
3104 109667133 120074532 134205703 151660546 172774744 199372193 228855438 259174268
3097 259174268 286932322 307377012 320108170 326997657 332416903 338151869 342282030 342067015
3089 342067015 336817428 326042896 311914053 297903496 290808302 292748044 303127451
3082 303127451 319235969 334890274 343289362 342278943 333912570 321344746 310286785
3075 310286785 306729572 313683392 333259904 363181315 400275878 437285054 464396072
3068 464396072 476069052 470535772 455336429 440071225 433293525 437832425 453602102
3061 453602102 476001912 500749698 517208976 516251966 497739850 466168704 428799853
3054 428799853 392605214 358956170 329182549 305174533 284862510 265976451 247765873
$$ packed form
3104A09667133J0407399J4131171J7454843K1114198K6597449K9483245L0318830
3097B59174268K7758054K0444690J2731158O889487N419246N734966M130161k15015
3089C42067015n249587j0774532j4128843j4010557p095194J939742J0379407
3082C03127451J6108518J5654305Q399088j010419q366373j2567824j1057961
3075C10286785l557213O953820J9576512K9921411L7094563L7009176K7111018
3068D64396072J1672980n533280j5199343j5265204o777700M538900J5769677
3061D53602102K2399810K4747786J6459278r57010j8512116l1571146l7368851
3054D28799853l6194639l3649044k9773621k4008016k0312023j8886059j8210578
$$ plain form
3047 247765873 227376315 207122206 188659776 173143165 162397767 153688100 147740482
3040 147740482 142388784 139600264 140895308 147612607 161648211 184101189 213915141 242236893
3032 242236893 257799253 254569542 235344158 209130575 181373048 160176147 143046126
3025 143046126 129943352 121034151 114265434 108342793 101688431 93071549 85036256 77965602
3017 77965602 70042186 64586169 61369779 57086329 54077739 52231253 50292530 48744343
3009 48744343 47703710 47620424 48176316 49260561 49189325 49478633 49666719 46891605 45021310
3000 45021310 43396186 41365060 39366758 37462949 35288676 33976978 33899989 33615832 33369621
2991 33369621 34358401 35738380 37387302 37635471 37564264 37880583 37163082 37493689 36491206
$$ packed form
3047B47765873k0389558k0254109j8462430j5516611j0745398q709667n947618
3040A47740482n351698k788520J295044O717299J4035604K2452978K9813952K8321752
3032B42236893J5562360l229711j9225384k6213583k7757527k1196901j7130021
3025A43046126j3102774q909201o768717n922641o654362q616882q035293p070654
3017G7965602p923416n456017l216390m283450l008590j846486j938723j548187
3009D8744343j040633q3286N55892J084245p1236K89308J88086k775114j870295
3000D5021310j625124k031126j998302j903809k174273j311698p6989k84157k46211
2991C3369621R88780J379979J648922K48169p1207L16319p17501L30607j002483
$$ plain form
2982 36491206 35570101 33782435 33278251 32826411 31833996 30764275 30439034 30213799 30199089
2973 30199089 30937156 32247835 34131009 35822123 37130946 39091490 39792927 40671448 40588256
2964 40588256 39483904 37293239 36223883 34084276 30806025 28738761 27174187 25429617
2956 25429617 24262121 23133489 22773101 22712657 22351724 22790063 23643016 25016922 26326686
2947 26326686 27585170 28053720 27648109 26330235 25538105 22989744 21349460 20432284 19852091
2938 19852091 18679460 17972183 17559499 17515069 17934487 18858228 21118729 22792212 22785639
2929 22785639 22555926 22494394 22256714 20827311 20160261 18779006 17171228 16487109 15420560
2920 15420560 14597434 13849797 13361683 13942189 14603299 15241148 15621347 16906391 17663790
$$ packed form
2982C6491206r21105j787666n04184m51840r92415j069721l25241k25235j4710
2973C0199089P38067J310679J883174J691114J308823J960544P01437Q78521q3192
2964D0588256j104352k190665j069356k139607l278251k067264j564574j744570
2956B5429617j167496j128632l60388o0444l60933M38339Q52953J373906J309764
2947B6326686J258484M68550m05611j317874p92130k548361j640284r17176n80193
2938A9852091j172631p07277m12684m4430M19418R23741K260501J673483o573
2929B2785639k29713o1532k37680j429403o67050j381255j607778o84119j066549
2920A5420560q23126p47637m88114N80506O61110O37849L80199J285044P57399
$$ plain form
2911 17663790 18905634 19849450 18219588 17688782 16587789 14305612 13326940 12448828 11499538
2902 11499538 10550568 8605022 7927449 7965010 7808372 6677595 6590378 6425929 6072612
2893 6072612 5502948 5097690 4493697 4383994 5514771 6065644 5338131 5721439 5187801
2884 5187801 5371430 5845530 5471551 5053975 4793420 3927023 5303478 5150213 4336300
2875 4336300 4410184 4786437 5330911 4576393 4546075 4640146 3951139 3235656 3483992 3394181
2865 3394181 3052702 2952780 3988976 3410722 3462621 4157390 4223279 3280399 3107149 2383024
2855 2383024 2824175 2348718 2068224 2953407 3432107 1685984 1755283 2710082 2122665 2293825
2845 2293825 2192691 2182346 2543738 2231155 1740142 1526447 1791581 1850533 2718431 3270477
$$ packed form
2911A7663790J241844R43816j629862n30806j100993k282177r78672q78112r49290
2902A1499538r48970j945546o77573L7561j56638j130777q7217j64449l53317
2893F072612n69664m05258o03993j09703J130777N50873p27513L83308n33638
2884E187801J83629M74100l73979m17576k60555q66397J376455j53265q13913
2875D336300P3884L76253N44474p54518l0318R4071o89007p15483K48336q9811
2865C394181l41479r9922J036196n78254N1899O94769O5889r42880j73250p24125
2855B383024M41151m75457k80494Q85183M78700j746123O9299R54799n87417J71160
2845B293825j01134j0345L61392l12583m91013k13695K65134N8952Q67898N52046
$$ plain form
2835 3270477 1957623 2358760 2912393 2756486 2694158 2729677 2860402 2963743 2408774 2736705
2825 2736705 2867941 1641540 1234685 2033502 2248315 2173196 2150893 2656048 2995701 2253054
2815 2253054 1689900 3179559 3696517 3054800 2274351 2901295 3330598 2848509 2256641
2806 2256641 2389485 2755629 3739944 2908297 2764107 3010084 2190863 3428037 2775460
2797 2775460 2295225 2680215 2494061 2404604 2534547 1918730 2303260 2100329 1858024 2868133
2787 2868133 3306484 3625937 4111492 3490030 3738879 3630969 3555940 3738582 3819541 3994857
2777 3994857 3999655 4157859 3767684 3789323 3360684 3408380 3322815 3261643 2237718 1831842
2767 1831842 1817542 1659785 1454447 1842885 1609154 1728777 2487206 2101905 2187106 2581422
$$ packed form
2835C270477j312854M01137N53633j55907o2328L5519J30725J03341n54969L27931
2825B736705J31236j226401m06855P98817K14813p5119k2303N05155L39653p42647
2815B253054n63154J489659N16958o41717p80449O26944M29303m82089n91868
2806B256641J32844L66144R84315q31647j44190K45977q19221J237174o52577
2797B775460m80235L84990j86154q9457J29943o15817L84530k02931k42305J010109
2787B868133M38351L19453M85555o21462K48849j07910p5029J82642Q0959J75316
2777C994857M798J58204l90175K1639m28639M7696q5565o1172j023925m05876
2767A831842j4300j57757k05338L88438k33731J19623P58429l85301Q5201L94316
$$ plain form
2757 2581422 2176151 2628335 2477794 1130735 1258633 1042507 1605385 1596235 2341266 1384103
2747 1384103 1031278 943465 1041980 958115 1216503 -77336 545931 1043491 1135597 1263298
2737 1263298 509001 924598 1141765 1554288 1453155 970107 943337 917372 359142 1663630
2727 1663630 1745661 1350203 766676 1138752 757983 987487 -115094 188772 559486 191281
2717 191281 -166730 -34107 553283 1095337 804622 1125012 590947 135296 283314 99726
2707 99726 855224 1010907 956592 1246733 1308056 2118742 1757924 1319931 1630921 1260686
2697 1260686 1453627 1267671 527104 1767 488964 1028209 1516914 1503779 511664 419674
2687 419674 641568 -365290 406418 970352 215218 157293 -613993 44038 897793 18367
$$ packed form
2757B581422m05271M52184j50541j347059J27898k16126N62878r150P45031r57163
2747A384103l52825q7813R8515q3865K58388j293839O23267M97560R2106J27701
2737A263298p54297M15597K17167M12523j01133m83048k6770k5965n58230J304488
2727A663630Q2031l95458n83527L72076l80769K29504j102581L03866L70714l68205
2717A91281l58011J32623N87390N42054k90715L20390n34065m55651J48018j83588
2707I9726P55498J55683n4315K90141O1323Q10686l60818m37993L10990l70235
2697A260686J92941j85956p40567n25337M87197N39245M88705j3135r92115r1990
2687D19674K21894j006858P71708N63934p55134n7925p71286O58031Q53755q79426
$$ plain form
2677 18367 621384 583427 1227110 1186606 500903 600556 499944 606538 1356826 1033406
2667 1033406 1193315 644633 216083 272357 143894 407403 459985 425770 877685 959613
2657 959613 1211971 700596 683349 712078 422625 778478 873031 1109608 744466 563075
2647 563075 462703 287507 1029312 1313083 794956 662294 9333 375978 258733 -52638
2637 -52638 138848 205818 376619 1804371 2332649 1572414 3586 232464 911756 736828
2627 736828 383494 485899 597534 -330506 -278557 158117 865575 777298 742629 1975092
2617 1975092 1763241 344255 838292 1514140 1599619 1671186 1666612 1404995 2303087 1538819
2607 1538819 713474 770758 153645 238177 795866 542325 625009 -338700 -271092 782256
$$ packed form
2677A8367O03017l7957O43683m0504o85703R9653j00612J06594P50288l23420
2667A033406J59909n48682m28550N6274j28463K63509N2582l4215M51915Q1928
2657I59613K52358n11375j7247K8729k89453L55853R4553K36577l65142j81391
2647E63075j00372j75196P41805K83771n18127j32662o52961L66645j17245l11371
2637e2638J91486O6970J70801J427752N28278p60235j568828K28878O79292j74928
2627G36828l53334J02405J11635r28040N1949M36674P07458q8277l4669J232463
2617A975092k11851j418986M94037O75848Q5479P1567m574k61617Q98092p64268
2607A538819q25345N7284o17113Q4532N57689k53541Q2684r63709O7608J053348
$$ plain form
2597 782256 1238172 905697 683778 964972 1141362 -112706 -672342 389744 -141379
2588 -141379 25192 838022 1268571 960400 802505 58829 1100896 288388 -126214 440792
2578 440792 985462 289856 -441654 610569 920692 1224918 1657397 798421 1629404 1036346
2568 1036346 344284 672537 -151509 475317 798027 816738 -116409 424638 709289 -20651
2558 -20651 607801 840909 1411172 699346 -622132 335247 801947 722559 919388 1121560
2548 1121560 985710 323984 547151 675054 79350 655275 731231 83153 -2561 426406
2538 426406 1245103 507832 -902183 -559646 255224 -203381 -137041 -116290 -3286 -649046
2528 -649046 -547252 168751 -249493 -105300 426011 1014127 723997 663793 683081 763685
$$ packed form
2597G82256M55916l32475k21919K81194J76390j254068n59636J062086n31123
2588a41379J66571Q12830M30549l08171j57895p43676J042067q12508m14602N67006
2578D40792N44670o95606p31510J052223L10123L04226M32479q58976Q30983n93058
2568A036346o92062L28253q24046O26826L22710J8711r33147N41047K84651p29940
2558b0651O28452K33108N70263p11826j321478R57379M66700p9388J96829K02172
2548A121560j35850o61726K23167J27903n95704N75925P5956o48078q5714M28967
2538D26406Q18697p37271j410015L42537Q14870m58605O6340K0751J13004o45760
2528f49046J01794P16003m18244J44193N31311N88116k90130o0204J9288Q0604
$$ plain form
2518 763685 -171887 -141510 1000572 1135043 -120959 -362384 -672681 625799 659300 316022
2508 316022 358090 500388 834363 825343 398460 539745 362407 368904 607333 -64865 848617
2497 848617 802829 458754 821429 1011385 1236494 1243658 1212150 1010616 1097704 921850 861611
2486 861611 1706473 929525 414327 721943 1327593 954747 527842 369754 770 319026
2476 319026 1051664 362766 -88128 -74390 -192713 865093 558546 392389 1311238 1282590
2466 1282590 1697292 1026133 855814 1720649 1675779 1810963 604305 874146 1232439 286222
2456 286222 526892 782239 2241707 731832 -139349 828889 874751 536143 610353 576862
2446 576862 1611905 702949 875224 1440732 1900770 1840180 1538139 1586063 1657276 870541
$$ packed form
2518G63685r35572L0377J142082J34471j256002k41425l10297J298480L3501l43278
2508C16022M2068J42298L33975r020m26883J41285j77338O497K38429o72198R13482
2497H48617m5788l44075L62675J89956K25109P164l1508k01534Q7088j75854o0239
2486H61611Q44862p76948n15198L07616O05650l72846m26905j58088l68984L18256
2476C19026P32638o88898m50894J3738j18323J057806l06547j66157R18849k8648
2466A282590M14702o71159j70319Q64835m4870J35184j206658K69841L58293r46217
2456B86222K40670K55347J459468j509875q71181R68238M5862l38608P4210l3491
2446E76862J035043r08956J72275N65508M60038o0590l02041M7924P1213p86735
$$ plain form
2436 870541 571942 670231 536832 539668 -61728 -78719 939800 1532552 520579 1606189
2426 1606189 1852865 1620731 1385729 1437907 1557934 1630293 1628428 1864048 1813176 1395856
2416 1395856 1328783 2147764 1964700 2450751 2474374 1888027 2254823 2180722 1627261 1408163
2406 1408163 892992 1066474 1574761 1522999 2240718 2140407 1434847 1824103 2002225 2139360
2396 2139360 1647405 1638994 1703560 1414586 1073208 1552420 1214367 1085653 1862921 2932797
2386 2932797 3115903 3064445 2915829 3342272 2661764 2373805 2774883 3548740 3835430 3314575
2376 3314575 2660179 3988046 3325049 2964996 3574421 3672907 4865324 4963823 4550189 6269906
2366 6269906 7350164 8436505 10839351 12292118 12781578 13084299 13542301 13238545 13237895
$$ packed form
2436H70541k98599R8289j33399K836o01396j6991J018519N92752j011973J085610
2426A606189K46676k32134k35002N2178J20027P2359j865K35620n0872m17320
2416A395856o7073Q18981j83064M86051K3623n86347L66796p4101n53461k19098
2406A408163n15171J73482N08287n1762P17719j00311p05560L89256J78122J37135
2396B139360m91955q411O4566k88974l41378M79212l38053j28714P77268J069876
2386B932797J83106n1458j48616M26443o80508k87959M01078P73857K86690n20855
2376C314575o54396J327867o62997l60053O09425R8486J192417R8499m13634J719717
2366F269906J080258J086341K402846J452767M89460L02721M58002l03756o50
$$ plain form
2357 13237895 14645396 16279849 18853172 23074438 27661510 36943828 56093827 91712247
2349 91712247 142964977 183003605 177978827 148396868 114029197 86301174 67627680
2342 67627680 52533011 39602611 30992640 24505019 20624200 18198501 15681744 14628832
2334 14628832 13236452 13448705 13580862 11567282 10076445 9207477 8340495 8254554 6392876
2325 6392876 5961100 6060958 5319570 5011120 5918451 5561404 4290279 3733294 3518939 4357050
2315 4357050 4424520 3180100 3198986 3133670 3734894 3844601 2635671 2357105 2306378 2662085
2305 2662085 2979667 2419883 2368766 2996690 2542760 2678815 2424077 2337467 2385383 2215465
2295 2215465 2494964 2652845 2417684 1673864 1357078 1444713 1694864 1641839 1372399 1775088
$$ packed form
2357A3237895J407501J634453K573323M221266M587072R282318J9149999L5618420
2349I1712247N1252730M0038628n024778k9581959l4367671k7728023j8673494
2342F7627680j5094669j2930400q609971o487621l880819k425699k516757j052912
2334A4628832j392380K12253J32157k013580j490837q68968q66982q5941j861678
2325F392876m31776R9858p41388l08450R07331l57047j271125n56985k14355Q38111
2315D357050O7470j244420J8886o5316O01224J09707j208930k78566n0727L55707
2305B662085L17582n59784n1117O27924m53930J36055k54738q6610M7916j69918
2295B215465K79499J57881k35161p43820l16786Q7635K50151n3025k69440M02689
$$ plain form
2285 1775088 2204788 2146309 1855605 989427 1413527 1594981 1531848 1952442 1784259 520192
2275 520192 818173 1930793 1967480 1793692 726885 867608 2288101 2338685 1335893
2266 1335893 1445156 952430 731421 1344040 1166824 891197 924041 1682121 1657835 1612302
2256 1612302 1621874 2244299 2079466 1030233 767692 1543233 1677803 1281393 -37512 185479
2246 185479 754139 509230 774124 499214 -65766 141637 455114 361775 690408 677540
2236 677540 151873 157014 1227763 761941 1004803 393154 -114553 -274022 -439988 -35848
2226 -35848 408498 932611 -245611 -892113 -129700 130178 205876 505669 -585802 -294794
2216 -294794 546783 -65784 406700 723048 95047 415151 955000 1085448 -270455 -1070396
$$ packed form
2285A775088M29700n8479k90704q66178M24100J81454o3133M20594j68183j264067
2275E20192K97981J112620L6687j73788j066807J40723J420493N0584j002792
2266A335893J09263m92726k21009O12619j77216k75627L2844P58080k4286m5533
2256A612302R572O22425j64833j049233k62541P75541J34570l96410j318905K22991
2246A85479N68660k44909K64894k74910n64980K07403L13477r3339L28633j2868
2236F77540n25667N141J070749m65822K42862o11649n07707j59469j65966M04140
2226c5848M44346N24113j178222o46502P62413K59878P5698K99793j091471K91008
2216b94794Q41577o12567M72484L16348o28001L20104N39849J30448j355903p99941
$$ plain form
2206 -1070396 -548460 -146045 -625047 -363702 -555770 -71186 -678150 -793832 481386
2197 481386 203499 -720037 -764687 5644 -493272 31214 -9843 -777763 -515302 180385
2187 180385 954648 509582 -865846 -210196 834825 973132 -192666 186348 1179612
2178 1179612 926488 614299 1297061 1310675 194455 -257219 -224864 336931 -106410 -363357
2168 -363357 -495455 -225796 24277 210321 485455 -770823 -1864357 -648608 -58718
2159 -58718 -1367488 -1486152 -1188801 37806 233132 -236758 739346 777280 450089 -388272
2149 -388272 255481 747581 -496720 -668581 -308189 -523232 -433623 -254623 -125900 221584
2139 221584 -238033 -347085 191078 -208086 -900183 -965850 -438032 -213890 37019 -304314
$$ packed form
2206a070396N21936M02415m79002K61345j92068M84584o06964j15682J275218
2197D81386k77887r23536m4650P70331m98916N24486m1057p67920K62461O95687
2187A80385P74263m45066j375428O55650J045021J38307j165798L79014R93264
2178A179612k53124l12189O82762J3614j116220m51674L2355N61795m43341k56947
2168c63357j32098K69659K50073J86044K75134j256278j093534J215749N89890
2159e8718j308770j18664K97351J226607J95326m69890R76104L7934l27191q38361
2149c88272O43753M92100j244301j71861L60392k15043Q9609J79000J28723L47484
2139B21584m59617j09052N38163l99164o92097o5667N27818K24142K50909l41333
$$ plain form
2129 -304314 -463108 441647 816083 416436 -50307 -293048 407969 152978 -195509 -13539
2119 -13539 -133315 -284972 -479859 -299606 71433 892557 949361 891687 369120 769407
2109 769407 246091 463348 47208 24375 620678 1448811 357135 53389 656313 -106565
2099 -106565 298096 973160 87015 234906 -1083717 -1020603 -494636 -1207497 -839261 245973
2089 245973 971831 30247 41655 985473 543205 -658846 -62147 -272429 -257540 484620
2079 484620 -175059 -645933 333880 -151506 812208 428026 48235 714403 330829 -539255
2069 -539255 -328994 -124264 390016 192011 66823 471982 637165 1763582 1820958 541015
2059 541015 975863 895198 1427593 2025079 888535 87854 568287 839524 1133421 686166
$$ packed form
2129c04314j58794R04755L74436l99647m66743k42741P01017k54991l48487J81970
2119a3539j19776j51657j94887J80253L71039Q21124N6804n7674n22567M00287
2109G69407n23316K17257m16140k2833N96303Q28133j091676l03746O02924p62878
2099a06565M04661O75064q86145J47891j318623O3114N25967p12861L68236J085234
2089B45973P25858r41584J1408R43818m42268j202051N96699k10282J4889P42160
2079D84620o59679m70874R79813m85386R63714l84182l79791O66168l83574q70084
2069e39255K10261K04730N14280j98005j25188M05159J65183J126417N7376j279943
2059E41015M34848q0665N32395N97486j136544q00681M80433K71237K93897m47255
$$ plain form
2049 686166 579304 1584646 1103223 296285 541379 838004 506956 -248415 110709 1305241
2039 1305241 446815 396720 488440 126802 487610 260764 -542142 -219508 -401367 -570760
2029 -570760 789690 -131668 -83672 1084268 819742 748717 1022951 787171 867916 305334
2019 305334 -134111 -285448 49123 -112567 -459504 221974 569851 716483 1067396 877451
2009 877451 1078549 1331402 784986 389066 989705 1246295 1343015 1312845 714050 275460
1999 275460 626031 1109286 570891 980753 208269 -330916 -387067 -412769 -283339 -337329
1989 -337329 -1101466 -630698 -42508 98619 -545771 -211551 -234296 -153948 651775 947999
1979 947999 61235 -421473 -393648 403968 479240 -376994 -700352 -664281 -523468 -790326
$$ packed form
2049F86166j06862J005342m81423q06938K45094K96625l31048p55371L59124J194532
2039A305241q58426n0095R1720l61638L60808k26846q02906L22634j81859j69393
2029e70760J360450r21358M7996J167940k64526p1025K74234k35780Q0745n62582
2019C05334m39445j51337L34571j61690l46937O81478L47877J46632L50913j89945
2009H77451K01098K52853n46416l95920O00639K56590R6720l0170n98795m38590
1999B75460L50571M83255n38395M09862p72484n39185n6151k5702J29430n3990
1989c37329p64137M70768N88190J41127o44390L34220k2745Q0348Q05723K96224
1979I47999q86764m82708K7825P97616P5272q56234l23358L6071J40813k66858
$$ plain form
1969 -790326 -357407 50528 -884787 -648447 -521063 -537074 -157218 -46484 -312449 462692
1959 462692 481182 222288 569870 -581935 -590433 -655184 -311609 -96399 -492448 -317238
1949 -317238 -319311 -129607 -185655 -324934 -440331 -472456 -457471 -913326 -271842 -998773 -1504999
1938 -1504999 -682426 -643493 -448833 68575 165259 -127802 -184856 316804 580245 103322
1928 103322 -511510 -181109 771509 1009777 -319998 -298847 856425 276750 -128840 185332
1918 185332 667511 1421278 1243188 1110181 460890 382885 473300 689400 388931 -383492
1908 -383492 -312887 -206352 -544695 -34788 11432 557907 -76933 563671 590564 -32970
1898 -32970 -614317 81819 166182 177200 518007 297269 414933 439613 453018 787307 543492
$$ packed form
1969g90326M32919M07935r35315K36340J27384j6011L79856J10734k65965P75141
1959D62692J8490k58894L47582j151805q498o4751L43575K15210l96049J75210
1949c17238k073J89704n6048j39279j15397l2125J4985m55855O41484p26931n06226
1938a504999Q22573L8933J94660N17408R6684k93061n7054N01660K63441m76923
1928A03322o14832L30401R52618K38268j329775K1151J155272n79675m05590L14172
1918A85332M82179P53767j78090j33007o49291p8005R0415K16100l00469p72423
1908c83492P0605J06535l38343N09907M6220N46475o34840O40604K6893o23534
1898c2970n81347O96136Q4363J1018L40807k20738J17664K4680J3405L34289k43815
$$ plain form
1887 543492 -564277 -606079 -295575 302217 -101511 -160926 -407564 -178084 432132 -176194
1877 -176194 -504621 433746 970937 709538 -857264 -737369 -279128 528505 480971 -490153
1867 -490153 -527288 -806491 -1096200 -415551 -696569 -1269714 -775804 -583675 -235743 -384479
1857 -384479 277578 90089 -1008389 -85551 -1271 -59658 222019 93865 774850 668360
1847 668360 222294 318134 720604 802347 76097 652216 36236 314732 705149 454475
1837 454475 142731 1125971 640406 254250 838764 863010 165291 435432 374234 -139080
1827 -139080 514241 -310778 -290600 -237438 -32579 122351 71661 -141107 -285861 -187216
1817 -187216 -26828 -553840 79262 729967 57245 -29089 165742 -331527 -671880 -722540
$$ packed form
1887E43492j107769m1802L10504N97792m03728n9415k46638K29480O10216o08326
1877a76194l28427R38367N37191k61399j566802J19895M58241Q07633m7534r71124
1867d90153l7135k79203k89709O80649k81018n73145M93910J92129L47932j48736
1857c84479O62057j87489j098478R22838Q4280n8387K81677j28154O80985j06490
1847F68360m46066R5840M02470Q1743p26250N76119o15980K78496L90417k50674
1837D54475l11744R83240m85565l86156N84514K4246o97719K70141o1198n13314
1827a39080O53321q25019K0178N3162K04859J54930n0690k12768j44754R8645
1817a87216J60388n27012O33102O50705o72722q6334J94831m97269l40353n0660
$$ plain form
1807 -722540 -1146486 -632255 184447 105338 -332017 -374897 -97231 771574 511489 -348786
1797 -348786 -357237 939243 861726 -265986 -46983 -47257 99996 589829 346007 836120
1787 836120 1263941 278886 -375746 -254566 3872 358318 97107 -622338 -749862 -250371
1777 -250371 -17693 -1370422 -1079579 -1036918 -245602 -185666 -1311315 -762556 -557864 -58947
1767 -58947 442621 -296894 -197107 -124631 -330133 -634203 -193282 -478967 -1177035 -903694
1757 -903694 -1220698 -387812 -1096252 -1578449 -762398 -1047756 -840205 -779395 -617055 -1170758
1747 -1170758 -1484468 -424444 779302 284839 -553695 -563921 98097 1063340 513313
1738 513313 -206461 -145951 -57618 -173717 -205197 -615056 -419519 571768 -68307 -190541
$$ packed form
1807g22540m23946N14231Q16702p9109m37355m2880K77666Q68805k60085q60275
1797c48786q451J296480p7517j127712K19003k74J47253M89833k43822M90113
1787H36120M27821r85055o54632J21180K58438L54446k61211p19445j27524M99491
1777b50371K32678j352729K90843M2661P91316N9936j125649N48759K04692M98917
1767e8947N01568p39515R9787P2476k05502l04070M40921k85685o98068K73341
1757i03694l17004Q32886p08440m82197Q16051k85358K07551O0810J62340n53703
1747a170758l13710J060024J203746m94463q38534j0226O62018R65243n50027
1738E13313p19774O0510Q8333j16099l1480m09859J95537R91287o40075j22234
$$ plain form
1728 -190541 328081 682119 675133 298085 841925 1122172 950296 1018585 585220 392981
1718 392981 508119 244785 792879 281093 -848202 -287561 -322305 -459798 -292127 238839
1708 238839 43833 -165158 336885 185354 278173 336030 407456 367635 -26603 -82326 -432031
1697 -432031 -147024 223361 200117 388919 -86062 -269065 727811 331136 -193710 777078
1687 777078 952528 1101345 703660 604984 125626 702454 846246 359450 894727 -684168
1677 -684168 -719707 225525 -322967 -139225 280674 163802 -408469 27186 134368 209907
1667 209907 405968 424059 634041 970779 319076 -229050 -131650 -1048699 266544 1242760
1657 1242760 -278424 -125802 5447 491826 629258 1077749 1043098 508094 418618 370387
$$ packed form
1728a90541N18622L54038o986l77048N43840K80247j71876O8289m33365j92239
1718C92981J15138k63334N48094n11786j129295N60641l4744j37493J67671N30966
1708B38839j95006k08991N02043j51531R2819N7857P1426l9821l94238n5723l49705
1697d32031K85007L70385k3244J88802m74981j83003R96876l96675n24846R70788
1687G77078J75450J48817l97685r8676m79358N76828J43792m86796N35277j578895
1677f84168l5539R45232n48492J83742M19899j16872n72271M35655J07182P5539
1667B09907J96061J8091K09982L36738o51703n48126R7400r17049J315243R76216
1657A242760j521184J52622J31249M86379J37432M48491l4651n35004q9476m8231
$$ plain form
1647 370387 467111 538091 131691 835884 1291676 521863 718389 1594957 950832 -11131
1637 -11131 218290 496310 489213 -414683 -1239009 -337538 1157146 528500 85546 -225288
1627 -225288 406065 -227809 -981509 -721504 -616699 -167740 -71600 -259284 643119 1276323
1617 1276323 883637 710919 300194 982847 921437 13711 188042 605379 45435 -136122
1607 -136122 -676425 974431 1593864 514095 470292 312906 -877083 -1138731 -784894
1598 -784894 -120529 732643 119941 60765 576586 379343 367925 758961 359818 339940
1588 339940 -108057 540868 289957 -503098 -355354 239394 414101 291746 -405786 -30147
1578 -30147 -32778 199084 501838 351924 164952 714143 629559 6359 293830 62218
$$ packed form
1647C70387R6724P0980m06400P04193M55792p69813J96526Q76568o44125r61963
1637a1131K29421K78020p097r03896q24326R01471J494684o28646m42954l10834
1627b25288O31353o33874p53700K60005J04805M48959R6140j87684R02403O33204
1617A276323l92686j72718m10725O82653o1410r07726J74331M17337n59944j81557
1607a36122n40303J650856O19433j079769m3803j57386j189989k61648L53837
1598g84894O64365Q53172o12702n9176N15821j97243j1418L91036l99143j9878
1588C39940m47997O48925k50911p93055J47744N94748J74707j22355o97532L75639
1578c0147k631K31862L02754j49914j86972N49191q4584o23200K87471k31612
$$ plain form
1568 62218 -446257 -501621 -1250691 -661648 164338 -50832 947734 844498 177305 37026
1558 37026 467388 38180 -310329 -346763 -173003 264737 75628 -661160 119945 553767
1548 553767 60922 -83597 -585612 -1045575 -1278790 -1470529 -1190020 -732871 -284853 -574369
1538 -574369 -231247 147812 -115776 388456 -385906 -620771 -203521 -1183185 -1272285 149315
1528 149315 49524 141061 -129373 157019 766926 40389 -1224357 -1095493 -592410 -366415
1518 -366415 -198235 -215321 114030 -154431 -29969 641709 1071472 829445 285785 -207746
1508 -207746 -118867 -621295 -490506 429256 955865 718627 222384 -555324 99 68763
1498 68763 88358 -2605 -1063688 -293365 376736 -474300 315150 1054908 954054 746528
$$ packed form
1568F2218n08475n5364p49070N89043Q25986k15170R98566j03236o67193j40279
1558C7026M30362m29208l48509l6434J73760M37740j89109p36788P81105M33822
1548E53767m92845j44519n02015m59963k33215j91739K80509M57149M48018k89516
1538e74369L43122L79059k63588N04232p74362k34865M17250r79664q9100J421600
1528A49315r9791R1537k70434K86392O09907p26537j264746J28864N03083K25995
1518c66415J68180j7086L29351k68461J24462O71678M29763k42027n43660m93531
1508b07746Q8879n02428J30789R19762N26609k37238m96243p77708N55423O8664
1498F8763J9595r0963j061083P70323O70101q51036P89450P39758j00854k07526
$$ plain form
1488 746528 594188 497378 535730 208432 -50265 12161 991539 835952 396543 754618
1478 754618 569115 613275 840344 224336 499439 964611 155618 -339129 411027 168069
1468 168069 313296 782708 258326 1068116 1142680 490934 -328250 -110935 -65427 341673
1458 341673 396009 533961 20742 327497 -165953 290231 -92106 -111863 428725 134121
1448 134121 536996 -155304 -352955 -78662 -744678 -449931 198394 381488 381586 -567790
1438 -567790 -27004 356594 552881 397461 41686 399232 931242 588267 1253965 828256
1428 828256 -294493 72753 661864 770768 259445 614113 874917 855539 135430 -218713
1418 -218713 751271 259296 -773743 -181419 279823 225849 -378465 -379166 198936 654484
$$ packed form
1488G46528j52340r6810L8352l27298k58697O2426R79378j55587m39409L58075
1478G54618j85503M4160K27069o16008K75103M65172q08993m94747P50156k42958
1468A68069J45227M69412n24382Q09790P4564o51746q19184K17315M5508M07100
1458C41673N4336J37952n13219L06755m93450M56184l82337j9757N40588k94604
1448A34121M02875o92300j97651K74293o66016K94747O48325J83094R8r49376
1438e67790N40786L83598J96287j55420l55775L57546N32010l42975O65698m25709
1428H28256j122749L67246N89111J08904n11323L54668K60804j9378p20109l54143
1418b18713R69984m91975j033039N92324M61242n3974o04314p01N78102M55548
$$ plain form
1408 654484 23900 -385887 863294 575389 456389 720344 34909 139721 521964 757065
1398 757065 1029110 261738 43483 185958 613661 103018 802063 1073347 614706 1543077
1388 1543077 1230850 1416043 1098426 1017534 579252 211281 -22415 -7344 568617 1677
1378 1677 149929 1109063 -99478 -77734 -529113 -870426 -14871 -164191 -1705737 -2000307
1368 -2000307 -1356357 -1495950 -166416 -270283 -158013 648268 681434 -628380 -185806
1359 -185806 -229052 -338209 -72656 -122729 -600127 -347537 26624 -568160 -6120 341528
1349 341528 -511957 -179 -383688 -762522 162972 -476144 -814573 79187 489436 338266
1339 338266 -12489 -307326 392411 354392 422267 302645 12238 248444 146154 355948
$$ packed form
1408F54484o30584m09787J249181k87905j19000K63955o85435J04812L82243K35101
1398G57065K72045p67372k18255J42475M27703n10643O99045K71284m58641R28371
1388A543077l12227J85193l17617q0892m38282l67971k33696J5071N75961n66940
1378A677J48252R59134j208541K1744m51379l41313Q55555j49320j541546k94570
1368b000307O43950j39593J329534j03867J12270Q06281L3166j309814M42574
1359a85806m3246j09157K65553n0073m77398K52590L74161n94784N62040L47648
1349C41528q53485N11778l83509l78834R25494o39116l38429Q93760M10249j51170
1339C38266l50755k94837O99737l8019O7875j19622k90407K36206j02290K09794
$$ plain form
1329 355948 459698 333829 58849 80335 391733 12262 499438 295715 -70662 346688
1319 346688 650352 959090 118730 -321669 -1128806 -1222473 163720 487566 548118 358908
1309 358908 518173 1251614 461637 -26859 138167 588932 652157 -831801 -132063 -120991
1299 -120991 -516176 -374792 -70740 39327 211818 430789 -808895 -782857 -322687 -783762
1289 -783762 -1020467 -1160352 -64786 449018 11408 -617115 -712934 309773 116802 -163501
1279 -163501 892833 537812 611611 965392 740411 906636 501500 -222672 571638 690836
1269 690836 254665 -115755 -268195 615840 264833 166394 1009052 521780 -250012 320729
1259 320729 -5901 46362 -605167 -1258861 -120492 292139 -509283 -119737 -487025 -584232
$$ packed form
1329C55948J03750j25869k74980K1486L11398l79471M87176k03723l66377M17350
1319C46688L03664L08738q40360m40399q07137r3667J386193L23846O0552j89210
1309C58908J59265P33441p89977m88496J65026M50765O3225j483958O99738J1072
1299a20991l95185J41384L04052J10067J72491K18971j239684K6038M60170m61075
1289g83762k36705j39885J095566N13804m37610o28523r5819J022707j92971k80303
1279a63501J056334l55021P3799L53781k24981J66225m05136p24172P94310J19198
1269F90836m36171l70420j52440Q84035l51007r8439Q42658m87272p71792N70741
1259C20729l26630N2263o51529o53694J138369M12631q01422L89546l67288r7207
$$ plain form
1249 -584232 171406 422622 321282 -432860 -771742 -166579 -440619 -74836 357119 -451390
1239 -451390 -570037 157117 272967 662613 -147497 -470547 1187366 1314958 1178810 1009783
1229 1009783 454565 530278 515170 174042 456968 867106 712700 264465 -88171 -323717
1219 -323717 468384 281920 141409 -448512 -507347 98162 -515242 -408676 -72234 90422
1209 90422 219326 162622 57518 199158 -229957 -748120 -491788 -791085 -500017 600388
1199 600388 856736 283865 -311836 -391336 320339 807150 643687 4875 -404858 -551722
1189 -551722 -391441 -669979 -512575 -78296 207647 1031029 538130 -315897 -578985 -1346902
1179 -1346902 -772439 -272969 -511690 74345 -449840 -1151932 -731369 -395442 -30 339244
$$ packed form
1249e84232P55638K51216j01340p54142l38882O05163k74040L65783M31955q08509
1239d51390j18647P27154J15850L89646q10110l23050J657913J27592j36148j69027
1229A009783n55218P5713j5108l41128K82926M10138j54406m48235l52636k35546
1219c23717P92101j86464j40511n89921n8835O05509o13404J06566L36442J62656
1209I0422J28904n6704j05104J41640m29115n18163K56332k99297K91068J100405
1199F00388K56348n72871n95701p9500P11675M86811j63463o38812m09733j46864
1189e51722J60281k78538J57404M34279K85943Q23382m92899q54027k63088p67917
1179a346902N74463M99470k38721N86035n24185p02092M20563L35927L95412L39274
$$ plain form
1169 339244 123491 172852 930901 126636 -700423 -458132 -526104 -14880 227989 -501981
1159 -501981 -1001542 -1259721 -173334 926731 518304 115278 -596571 609966 1240382
1150 1240382 745367 100589 -801534 -890932 -316198 -63850 -689883 -510455 -37594 -762907
1140 -762907 -830192 28713 5046 -1262512 -1149398 -362273 866298 184213 -1245499 56846
1130 56846 156521 228962 620782 233441 117839 45158 57180 149718 -31815 -496872 507481
1119 507481 656136 77691 695633 -322836 -926660 -387317 365 141017 -365367 -397112
1109 -397112 -322426 -509043 -409758 118585 73341 -807760 -1757727 -702507 27398 -702596
1099 -702596 -904434 -182292 -308131 -400507 -578033 35942 589697 1103795 1014250 -64095
$$ packed form
1169C39244k15753M9361P58049q04265q27059K42291o7972N11224K42869p29970
1159e01981m99561k58179J086387J100065m08427m03026p11849J206537O30416
1150A240382m95015o44778r02123q9398N74734K52348o26033J79428M72861p25313
1140g62907o7285Q58905k3667j267558J13114P87125J228571o82085j429712J302345
1130E6846R9675P2441L91820l87341j15602p2681J2022R2538j81533m65057J004353
1119E07481J48655n78445O17942j018469o03824N39343L87682J40652n06384l1745
1109c97112P4686j86617R9285N28343m5244q81101r49967J055220P29905p29994
1099g02596k01838P22142j25839r2376j77526O13975N53755N14098q9545j078345
$$ plain form
1089 -64095 -525100 -138293 290986 229585 543936 -294208 -915409 -909011 -590466 365073
1079 365073 -479818 -1162708 -439557 417406 714349 259883 511177 -515949 -1057054 -167641
1069 -167641 438590 -552291 -915743 -787343 -657991 326986 70250 -491578 210571 -345477
1059 -345477 -9566 -153225 -1098256 -913926 -285931 -671113 -891575 251286 501934 59244
1049 59244 307469 1609670 1264744 154091 -351516 107665 298958 -211836 88310 1590351
1039 1590351 1420713 825267 799116 834569 208651 -186563 352481 307252 124603 -335779
1029 -335779 -359564 -865792 -254834 -103538 274922 520313 -669299 -919787 -647769 -1247574
1019 -1247574 -924558 -1190695 -974824 -307533 365642 -591408 -763440 -263204 120303 537076
$$ packed form
1089f4095m61005L86807M29279o1401L14351q38144o21201O398L18545R55539
1079C65073q44891o82890P23151Q56963K96943m54466K51294j027126n41105Q89413
1069a67641O06231r90881l63452J28400J29352R84977k56736n61828P02149n56048
1059c45477L35911j43659r45031J84330O27995l85182k20462J142861K50648m42690
1049E9244K48225J302201l44926j110653n05607M59181J91293n10794L00146J502041
1039A590351j69638n95446k6151L5453o25918l95214N39044m5229j82649m60382
1029c35779k3785n06228O10958J51296L78460K45391j189612k50488K72018n99805
1019a247574L23016k66137K15871O67291O73175r57050j72032N00236L83507M16773
$$ plain form
1009 537076 -188861 -471818 -315268 298074 -570135 -1260041 -695836 -651340 -327553 -698191
999 -698191 -707848 -318829 -269057 -656608 -372757 449141 350389 3665 -154486 91063 222836
988 222836 -26704 -87735 -39749 174836 -214158 189364 821937 315929 -298096 811042
978 811042 460314 96373 186049 -117961 1216704 786073 134655 650521 514218 214293
968 214293 594948 94558 503620 155539 22730 -142255 398003 224047 190853 -544307
958 -544307 -152647 7331 -358119 198277 106099 -392654 695179 904326 793833 873192
948 873192 856024 1193547 793543 204526 503203 -291648 -1037926 -1124390 168496 715383
938 715383 105043 483313 1133766 925644 1001901 573657 135189 373622 430927 393293
$$ packed form
1009E37076p25937k82957J56550O13342q68209o89906N64205M4496L23787l70638
999f98191r657L89019M9772l87551K83851Q21898r8752l46724j58151K45549J31773
988B22836k49540o1031M7986K14585l88994M03522O32573n06008o14025J109138
978H11042l50728l63941Q9676l04010J334665m30631o51418N15866j36303k99925
968B14293L80655n00390M09062l48081j32809j64985N40258j73956l3194p35160
958e44307L91660J59978l65450N56396r2178m98753J087833K09147j10493P9359
948H73192j7168L37523m00004n89017K98677p94851p46278q6464J292886N46887
938G15383o10340L78270O50453k08122P6257m28244m38468K38433N7305l7634
$$ plain form
928 393293 -218148 399330 180468 -452657 -226975 192191 641210 716819 -37194 -969291
918 -969291 -669452 -671261 -411874 -307487 -624492 259496 512968 -342612 -990505 -969050
908 -969050 -529258 -789726 -738176 62569 -191071 -18870 -166462 -783287 158541 664825
898 664825 -607881 -249629 -1228209 -841009 -987163 -999757 -27670 182298 275281 125643
888 125643 521523 1012726 554425 -347102 -1177733 -186744 145589 349659 -1389897 -646321
878 -646321 745206 922065 693778 287723 747085 684419 433343 436075 588128 45115
868 45115 -418819 -625759 -426074 119376 131275 90741 981620 133843 429869 -106990
858 -106990 -44018 363149 51490 -7783 -45776 -496528 -661630 -427014 -148895 282275
$$ packed form
928C93293o11441O17478k18862o33125K25682M19166M49019P5609p54013r32097
918i69291K99839j809K59387J04387l17005Q83988K53472q55580o47893K1455
908i69050M39792k60468N1550Q00745k53640J72201j47592o16825R41828N06284
898F64825j272706L58252r78580L87200j46154j2594R72087K09968R2983j49638
888A25643L95880M91203m58301r01527q30631R90989L32333K04070j739556P43576
878f46321J391527J76859k28287m06055M59362o2666k51076K732J52053n43013
868D5115m63934k06940J99685N45450J1899m0534Q90879q47777K96026n36859
858a06990O2972M07167l11659n9273l7993m50752j65102K34616K78119M31170
$$ plain form
848 282275 524741 1014646 771749 -82300 -893292 -322477 -146916 -188277 -1100065 -1078029
838 -1078029 -498130 -1063652 29004 607159 80749 11383 -189459 -557236 -372830 -548140
828 -548140 -311687 251583 -373473 -51777 922172 388926 684163 -28050 153322 23354
818 23354 -408023 -91000 -684901 -1303429 -283113 543579 749882 443288 -57657 266278
808 266278 436012 -449358 -852356 -328689 -336178 -248369 208995 658420 677199 601653 1114318
797 1114318 614555 385103 597920 -267931 -190685 -1500573 -1240278 750270 645042 -334957
787 -334957 -108500 697111 670950 329516 84941 795387 993234 -324591 -443063 -17794
777 -17794 276249 241776 926669 1455684 1098914 443847 -447158 -181368 368865 169659
$$ packed form
848B82275K42466M89905k42897q54049q10992N70815J75561m1361r11788K2036
838a078029N79899n65522J092656N78155n26410o9366k00842l67777J84406j75310
828e48140K36453N63270o25056L21696R73949n33246K95237p12213J81372j29968
818B3354m31377L17023n93901o18528J020316Q26692K06303l06594n00945L23935
808B66278J69734q85370m02998N23667p489Q7809M57364M49425J8779p5546N12665
797A114318m99763k29452K12817q65851P7246j309888K60295J990548j05228r79999
787c34957K26457Q05611k6161l41434k44575P10446J97847j317825j18472M25269
777a7794K94043l4473O84893N29015l56770o55067q91005K65790N50233j99206
$$ plain form
767 169659 -36328 -26062 -785583 -658936 -620749 -1403302 312234 966986 477874 762419
757 762419 169458 1006499 1007534 342207 857405 642335 129056 129039 211333 468979 -414236
746 -414236 -382766 343371 165943 97874 -238226 -682993 -645506 -377165 -72316 22071 37470
735 37470 115121 607979 543469 284095 238299 -142488 -422167 -799999 -181425 182720 -37354
724 -37354 416944 665116 710019 631826 577963 773964 497040 -40325 42586 -58189 -661297
713 -661297 -1461778 -671276 909040 1247247 1304782 673782 735100 -294071 -353544 -101502
703 -101502 236618 510918 341732 357970 291824 404540 562954 159446 956464 870210
693 870210 781933 -455159 -1100155 -944565 -456818 -508698 -558652 406164 386916 366087 -851464
$$ packed form
767A69659k05987J0266p59521J26647L8187p82553J715536O54752m89112K84545
757G62419n92961Q37041J035o65327N15198k15070n13279j7Q2294K57646q83215
746d14236L1470P26137j77428o8069l36100m44767L7487K68341L04849R4387J5399
735C7470P7651M92858o4510k59374m5796l80787k79679l77832O18574L64145k20074
724c7354M54298K48172M4903p8193n3863J96001k76924n37365Q2911j00775o03108
713f61297q00481P90502J580316L38207N7535o31000O1318j029171n9473K52042
703a01502L38120K74300j69186J6238o6146J12716J58414m03508P97018q6254
693H70210q8277j237092o44996J55590M87747n1880m9954R64816j9248k0829j217551
$$ plain form
682 -851464 -474610 272073 649133 739806 143888 662810 1041624 805609 703687 1039781
672 1039781 1108545 -349838 165228 397642 -195989 -1036170 -707498 466976 990215 -46089
662 -46089 -991522 159412 191684 -594336 -7196 -92073 17111 374681 99287 -501974
652 -501974 -260685 255403 385134 587255 -195384 -973807 -473835 -996628 -141360 268994
642 268994 -88750 87235 -196744 -303055 98059 -27853 -534016 -473672 -290142 -283103
632 -283103 334625 162781 730296 307685 -519993 -10682 657296 283151 -335348 127222
622 127222 318711 112288 91466 122241 357472 438297 398682 448527 39018 -903507 -876967
611 -876967 -461923 166977 584107 557083 1252879 307617 35025 -352835 -189759 149564
$$ packed form
682h51464L76854P46683L77060R0673n95918N18922L78814k36015j01922L36094
672A039781O8764j458383N15066K32414n93631q40181L28672J174474N23239j036304
662d6089r45433J150934L2272p86020N87140q4877J09184L57570k75394o01261
652e01974K41289N16088J29731K02121p82639p78423M99972n22793Q55268M10354
642B68994l57744J75985k83979j06311M01114j25912n06163O0344J83530P039
632b83103O17728j71844N67515m22611q27678N09311O67978l74145o18499M62570
622A27222J91489k06423k0822L0775K35231Q0825l9615M9845m09509r42525K6540
611h76967M15044O28900M17130k7024O95796r45262k72592l87860J63076L39323
$$ plain form
601 149564 -204542 -205633 -355146 -373766 -354973 136245 418498 525133 1043886 612893 429993
590 429993 -501986 -663738 -947937 -241141 184207 -34468 -102727 305134 934022 843226
580 843226 -736303 -1075176 -248980 551460 -9966 -26359 -389846 -421487 -648104 -746729
570 -746729 117600 -202110 -306266 -660117 -709007 -440581 -353775 -455329 182952 383953
560 383953 10931 947618 256515 -443210 -399104 -716051 14061 -178017 -749099 -448468
550 -448468 684691 394657 128153 -177278 -58136 -159569 -241368 -145025 -571563 -406367
540 -406367 -745081 -826624 326779 588657 -9091 -290103 -375483 -393873 268274 -432116
530 -432116 -911986 -364053 -867251 -1461404 -466883 -37176 -695913 -1138652 -1014232 1052
$$ packed form
601A49564l54106j091j49513j8620J8793M91218K82253J06635N18753m30993j82900
590D29993r31979j61752k84199P06796M25348k18675o8259M07861O28888r0796
580H43226j579529l38873Q26196Q00440n61426j6393l63487l1641k26617r8625
570g46729Q64329l19710j04156l53851m8890K68426Q6806j01554O38281K01001
560C83953l73022R36687o91103o99725M4106l16947P30112j92078n71082L00631
550d48468J133159k90034k66504l05431J19142j01433q1799R6343m26538J65196
540d06367l38714q1543J153403K61878n97748k81012q5380j8390O62147p00390
530d32116m79870N47933n03198n94153R94521M29707o58737m42739J24420J015284
$$ plain form
520 1052 -99912 -1534811 -593107 220501 -512044 -1107425 -449893 -144761 -679200 -897357
510 -897357 -642123 319869 -773034 -926662 -99374 442962 -53165 120175 529571 685888
500 685888 309419 564927 142294 276089 -278483 -938109 -524632 -224774 119183 48232
490 48232 -488292 -171079 -568139 -416228 170786 -79697 660358 337129 257334 65765
480 65765 377089 51221 -180508 -118638 -131687 285718 146777 -1386113 -579036 -378549
470 -378549 -656904 25225 290969 -333271 -530650 -265047 323982 -18651 -402779 -95424
460 -95424 844543 556977 -225240 262567 715961 75551 -728048 -900029 -737771 -648547
450 -648547 -1154088 -349287 -51135 -542733 35371 -343275 25574 201877 -88159 -183358
$$ packed form
520A052j00964j434899R41704Q13608p32545n95381O57532L05132n34439k18157
510h97357K55234R61992j092903j53628Q27288N42336m96127J73340M09396J56317
500F85888l76469K55508m22633J33795n54572o59626M13477K99858L43957p0951
490D8232n36524L17213l97060J51911N87014k50483P40055l23229p9795j91569
480F5765L11324l25868k31729O1870j3049M17405j38941j532890Q07077K00487
470c78549k78355O82129K65744o24240j97379K65603N89029l42633l84128L07355
460i5424R39967k87566p82217M87807M53394o40410q03599j71981J62258Q9224
450f48547n05541Q04801K98152m91598N78104l78646L68849J76303k90036r5199
$$ plain form
440 -183358 -549934 -1266003 -719868 -578155 -660425 142587 299744 337832 361071 6660
430 6660 733606 -412013 -257946 316600 -155391 151963 -198302 503517 893919 1161094
420 1161094 416882 431139 687094 542440 837159 -363297 -1002569 -496360 -232618 228058
410 228058 268320 288479 -363564 424771 235286 201070 -386180 -315642 544396 -61168 -414233
399 -414233 -790152 -657764 125956 -993625 -606819 -763186 -195580 566977 -196968 -530731
389 -530731 -673984 -99211 116580 -219903 -292531 -21381 -45558 510963 -11355 -474323
379 -474323 568861 473506 185202 -123222 -92344 206812 99101 -330368 -274572 955786
369 955786 17786 -544386 295572 334303 615643 427594 -37169 82956 -618488 -213752
$$ packed form
440a83358l66576p16069N46135J41713q2270Q03012J57157L8088K3239l54411
430F660P26946j145619J54067N74546m71991L07354l50265P01819L90402K67175
420A161094p44212J4257K55955j44654K94719j200456o39272N06209K63742M60676
410B28058M0262K0159o52043P88335j89485l4216n87250P0538Q60038o05564l53065
399d14233l75919J32388P83720j119581L86806j56367N67606P62557p63945l33763
389e30731j43253N74773K15791l36483p2628K71150k4177N56521n22318m62968
379d74323J043184r5355k88304l08424L0878K99156j07711m29469N5796J230358
369I55786r38000n62172Q39958L8731K81340j88049m64763J20125p01444M04736
$$ plain form
359 -213752 1174204 753673 -381894 184144 598406 248221 -224207 -788657 232386
350 232386 -459657 -814753 -175213 383678 -405235 340607 664184 351241 89102 -264921
340 -264921 -514821 -59602 -337068 -42838 -430564 -379834 -719088 326527 973769 60330
330 60330 454692 289414 563902 260861 -439352 -104495 516717 -83371 -33904 -47948
320 -47948 213262 -291842 -551749 190794 1070395 162273 -324756 -698166 -557120 -381646
310 -381646 101931 369660 -306778 -1673826 -1324733 -581444 -395970 -813486 -3545 260734
300 260734 170871 -854738 -792302 -775961 -804056 -645930 -826816 -673231 -860326 -630803
290 -630803 -160643 -876602 -64994 96284 -413009 -768114 -439574 854372 586197 -646659
$$ packed form
359b13752J387956m20531j135567N66038M14262l50185m72428n64450J021043
350B32386o92043l55096O39540N58891p88913P45842L23577l12943k62139l54023
340b64921k49900M55219k77466K94230l87726N0730l39254J045615O47242r13439
330F0330L94362j65278K74488l03041p00213L34857O21212o00088M9467j4044
320d7948K61210n05104k59907P42543Q79601r08122m87029l73410J41046J75474
310c81646M83577K67729o76438j367048L49093P43289J85474m17516Q09941K64279
300B60734q9863j025609O2436J6341k8095J58126j80886J53585j87095K29523
290f30803M70160p15959Q11608J61278n09293l55105L28540J293946k68175j232856
$$ plain form
280 -646659 -777138 60497 710126 68087 -124362 -288936 -222289 -241452 -592672 -408907
270 -408907 -583447 -168719 174966 426649 425423 705520 -178700 -238665 -998085 297871
260 297871 490391 -577696 -1115293 -848005 -296782 -1003423 -1595422 -1070927 -779687 -306309
250 -306309 -185289 -1017138 -1168844 -915891 -251088 -46078 221523 -589292 -1229506 -1478275
240 -1478275 -856290 30807 119906 -1065637 -557407 240267 356712 660013 -394296 -833120
230 -833120 -354638 -334819 -589465 -734711 -960182 -691836 -644378 -672376 -481734 -344547
220 -344547 -302682 65914 -256972 -532962 -1074299 -1009407 -1444382 -1392460 -1321077 -626294 -1281194
209 -1281194 -1080465 -1095993 -699317 -20812 642318 884180 -97084 -300114 -300574 -454028
$$ packed form
280f46659j30479Q37635O49629o42039j92449j64574O6647j9163l51220J83765
270d08907j74540M14728L43685K51683j226K80097q84220n9965p59420J295956
260B97871J92520j068087n37597K67288N51223p06641n91999N24495K91240M73378
250c06309J21020q31849j51706K52953O64803K05010K67601q10815o40214k48769
240a478275O21985Q87097Q9099j185543N08230P97674J16445L03301j054309m38824
230h33120M78482J9819k54646j45246k25471K68346M7458k7998J90642J37187
220c44547M1865L68596l22886k75990n41337O4892m34975N1922P1383O94783o54900
209a281194K00729j5528L96676O78505O63130K41862r81264k03030m60j53454
$$ plain form
199 -454028 -1056147 -756786 -554976 -858722 -1378792 -898421 272263 537580 -835 851778
189 851778 237622 229630 195419 -162159 -95512 -14209 -320426 245072 172608 -709365 -500529
178 -500529 -624648 -508832 -510313 -1047411 -1243382 -1208119 -793375 -631930 -455031 -856524
168 -856524 -626088 -775969 -952648 -14737 -164958 22012 -1085951 -1207092 -390548 -57452
$$ packed form
199d54028o02119K99361K01810l03746n20070M80371J170684K65317n38415Q52613
189H51778o14156p992l4211l57578O6647Q1303l06217N65498p2464q81973K08836
178e00529j24119J15816j481n37098j95971L5263M14744J61445J76899m01493
168h56524K30436j49881j76679R37911j50221J86970j107963j21141Q16544L33096
$$ [...]
##END NTUPLES=NMR SPECTRUM
##END=
