##TITLE=1H_DE-80H_X3
 200.13MHz, d2o
 8 sc
 
 19ns.26.2.2025
##JCAMPDX= 6.0         $$ Bruker NMR JCAMP-DX V2.0
##DATA TYPE= NMR SPECTRUM
##DATA CLASS= NTUPLES
##ORIGIN= UXNMR, Bruker Analytische Messtechnik GmbH
##OWNER= pz
$$ XWIN-NMR		Version 3.5
$$ Fri Apr  3 11:28:39 2026 Russian Standard Time (UT+4h)  Yarkov@DPX200
##.OBSERVE FREQUENCY= 200.1313
##.OBSERVE NUCLEUS= ^1H
##.ACQUISITION MODE= SIMULTANEOUS
##.ACQUISITION SCHEME= undefined
##.AVERAGES= 8
##.DIGITISER RES= 18
##SPECTROMETER/DATA SYSTEM= spect
##.PULSE SEQUENCE= zg30
##.SOLVENT NAME= DMSO
##.SHIFT REFERENCE= (INTERNAL, DMSO, 0, 15.4439)
##AUDIT TRAIL= $$ (NUMBER, WHEN, WHO, WHERE, WHAT)
$$ ##TITLE= Audit trail, XWIN-NMR		Version 3.5
$$ ##JCAMPDX= 5.01
$$ ##ORIGIN= Bruker BioSpin GmbH
$$ ##OWNER= Yarkov
$$ C:/Bruker/XWIN-NMR/data/yarkov2/nmr/H-C/1/pdata/1/auditp.txt
$$ ##AUDIT TRAIL=  $$ (NUMBER, WHEN, WHO, WHERE, WHAT)
(   1,<2026-04-03 11:27:25.95 +0400>,<Yarkov>,<DPX200>,
      <created by zg, POWCHK disabled, PULCHK disabled
       configuration hash MD5:
       00 E9 B6 7A A2 85 ED C7 34 08 36 98 17 FE 4E 26
       data hash MD5: 16K
       59 6A 8E 0F D0 98 8C FA FE F1 B3 55 46 04 90 43>)
(   2,<2026-04-03 11:27:39.10 +0400>,<Yarkov>,<DPX200>,
      <Start of raw data processing
       efp BC_mod = 2 LB = 0.25 FT_mod = 6 PKNL = 1 PHC0 = -5301.948 PHC1 = 6.821927 SI = 16K 
       data hash MD5: 16K
       FD C4 23 17 D8 E3 46 67 46 C3 53 6E E6 5A D8 30>)
$$ ##END=
$$ 
$$ hash MD5
$$ 89 32 F9 8C 3C 78 22 C7 B5 A4 F5 33 5E E4 70 14
##$RELAX= 
##$RELAX= 
##$RELAX= 
##$RELAX= 
##$RELAX= 
##$RELAX= 
$$ Bruker specific parameters
$$ --------------------------
##$DU= <C:/Bruker/XWIN-NMR>
##$EXPNO= 1
##$NAME= <H-C>
##$PROCNO= 1
##$TYPE= <nmr>
##$USER= <yarkov2>
##$AMP= (0..31)
100 100 100 100 100 100 100 100 100 100 100 100 100 100 100 100 100 100 
100 100 100 100 100 100 100 100 100 100 100 100 100 100 
##$AQSEQ= 0
##$AQ_mod= 1
##$AUNM= <au_zg>
##$AUTOPOS= <>
##$BF1= 200.13
##$BF2= 200.13
##$BF3= 200.13
##$BF4= 200.13
##$BF5= 200.13
##$BF6= 200.13
##$BF7= 200.13
##$BF8= 200.13
##$BYTORDA= 1
##$CFDGTYP= 0
##$CFRGTYP= 5
##$CHEMSTR= <none>
##$CNST= (0..31)
1 1 145 1 1 1 1 1 1 1 1 1 1 1 1 1 1 1 1 1 1 1 1 1 1 1 1 1 1 1 1 1 
##$CPDPRG= <>
##$CPDPRG1= <>
##$CPDPRG2= <>
##$CPDPRG3= <>
##$CPDPRG4= <mlev>
##$CPDPRG5= <mlev>
##$CPDPRG6= <mlev>
##$CPDPRG7= <mlev>
##$CPDPRG8= <mlev>
##$CPDPRGB= <>
##$CPDPRGT= <>
##$D= (0..31)
0 0.7 0 0 0 0 0 0 0 0 0 0.03 0 0 0 0 0 0 0 0 0 0 0 0 0 0 0 0 0 0 0 0 
##$DATE= 1775201245
##$DBL= (0..7)
120 120 120 120 120 120 120 120 
##$DBP= (0..7)
150 150 150 150 150 150 150 150 
##$DBP07= 0
##$DBPNAM0= <>
##$DBPNAM1= <>
##$DBPNAM2= <>
##$DBPNAM3= <>
##$DBPNAM4= <>
##$DBPNAM5= <>
##$DBPNAM6= <>
##$DBPNAM7= <>
##$DBPOAL= (0..7)
0.5 0.5 0.5 0.5 0.5 0.5 0.5 0.5 
##$DBPOFFS= (0..7)
0 0 0 0 0 0 0 0 
##$DE= 6
##$DECBNUC= <off>
##$DECIM= 32
##$DECNUC= <off>
##$DECSTAT= 4
##$DIGMOD= 1
##$DIGTYP= 9
##$DL= (0..7)
0 120 120 120 120 120 120 120 
##$DP= (0..7)
$$ [...]
##$SUBNAM2= <"">
##$SUBNAM3= <"">
##$SUBNAM4= <"">
##$SUBNAM5= <"">
##$SUBNAM6= <"">
##$SUBNAM7= <"">
##$SUBNAM8= <"">
##$SUBNAM9= <"">
##$SW= 18.0517328524113
##$SWIBOX= (0..15)
0 0 2 0 0 0 0 0 0 0 0 0 0 0 0 0 
##$SW_h= 3612.71676300578
##$TD= 16384
##$TD0= 1
##$TE= 0
##$TE2= 300
##$TE3= 300
##$TEG= 300
##$TL= (0..7)
0 120 120 120 120 120 120 120 
##$TP= (0..7)
150 150 150 150 150 150 150 150 
##$TP07= 0
##$TPNAME0= <>
##$TPNAME1= <>
##$TPNAME2= <>
##$TPNAME3= <>
##$TPNAME4= <>
##$TPNAME5= <>
##$TPNAME6= <>
##$TPNAME7= <>
##$TPOAL= (0..7)
0.5 0.5 0.5 0.5 0.5 0.5 0.5 0.5 
##$TPOFFS= (0..7)
0 0 0 0 0 0 0 0 
##$TUNHIN= 0
##$TUNHOUT= 0
##$TUNXOUT= 0
##$USERA1= <user>
##$USERA2= <user>
##$USERA3= <user>
##$USERA4= <user>
##$USERA5= <user>
##$V9= 5
##$VALIST= <valist>
##$VCLIST= <CCCCCCCCCCCCCCC>
##$VD= 0
##$VDLIST= <DDDDDDDDDDDDDDD>
##$VPLIST= <PPPPPPPPPPPPPPP>
##$VTLIST= <TTTTTTTTTTTTTTT>
##$WBST= 1024
##$WBSW= 4
##$XGAIN= (0..3)
0 0 0 0 
##$XL= 0
##$YL= 0
##$YMAX_a= 294636
##$YMIN_a= -285855
##$ZGOPTNS= <>
##$ZL1= 120
##$ZL2= 120
##$ZL3= 120
##$ZL4= 120
##$ABSF1= 0
##$ABSF2= 0
##$ABSG= 0
##$ABSL= 0
##$ALPHA= 0
##$AQORDER= 0
##$ASSFAC= 0
##$ASSFACI= 0
##$ASSFACX= 0
##$ASSWID= 0
##$AUNMP= <proc_1d>
##$AZFE= 0.1
##$AZFW= 0.1
##$BCFW= 0
##$BC_mod= 2
##$BYTORDP= 0
##$COROFFS= 0
##$CY= -3
##$DATMOD= 1
##$DC= 0
##$DFILT= <>
##$DTYPP= 0
##$F1P= 0
##$F2P= 0
##$FCOR= 1
##$FTSIZE= 16384
##$FT_mod= 6
##$GAMMA= 0
##$GB= 0
##$INTBC= 1
##$INTSCL= 3.241238e-09
##$ISEN= 128
##$LB= 0.25
##$LEV0= 0
##$LPBIN= 0
##$MAXI= 10000
##$MC2= 0
##$MEAN= 0
##$ME_mod= 0
##$MI= 1.114404
##$NCOEF= 0
##$NC_proc= -7
##$NLEV= 6
##$NOISF1= 3.799351
##$NOISF2= 2.8
##$NSP= 0
##$NTH_PI= 0
##$NZP= 0
##$OFFSET= 15.44389
##$PC= 1
##$PHC0= -5301.948
##$PHC1= 6.821927
##$PH_mod= 1
##$PKNL= yes
##$PPARMOD= 0
##$PSCAL= 0
##$PSIGN= 0
##$REVERSE= no
##$SF= 200.130015571802
##$SI= 16384
##$SIGF1= 3
##$SIGF2= 2
##$SINO= 0.751879
##$SIOLD= 32768
##$SREGLST= <19F.Aceton>
##$SSB= 0
##$STSI= 16384
##$STSR= 0
##$SW_p= 3612.71676300578
##$SYMM= 0
##$S_DEV= 0
##$TDeff= 16384
##$TDoff= 0
##$TI= <>
##$TILT= no
##$TM1= 0
##$TM2= 0
##$TOPLEV= 0
##$USERP1= <user>
##$USERP2= <user>
##$USERP3= <user>
##$USERP4= <user>
##$USERP5= <user>
##$WDW= 1
##$XDIM= 16384
##$YMAX_p= 371277506
##$YMIN_p= -1642503
$$ End of Bruker specific parameters
$$ ---------------------------------
##NTUPLES= NMR SPECTRUM
##VAR_NAME=  FREQUENCY,     SPECTRUM/REAL,   SPECTRUM/IMAG
##SYMBOL=    X,             R,               I
##VAR_TYPE=  INDEPENDENT,   DEPENDENT,       DEPENDENT
##VAR_FORM=  AFFN,          ASDF,            ASDF
##VAR_DIM=   16384,         16384,           16384
##UNITS=     HZ,            ARBITRARY UNITS, ARBITRARY UNITS
##FACTOR=    0.220516191357247, 1,           1
##FIRST=     3090.78586972351, 0,            0
##LAST=      -521.930893282275, 0,           0
##MIN=       -521.930893282275, -1642503,    0
##MAX=       3090.78586972351, 371277506,    0
$$ Real data points
##PAGE= N=1
##DATA TABLE= (X++(R..R)), XYDATA
$$ [...]
7345E91611J4462K34966M11730r9570l62679j94510K61727m9969p8871N2168j78101
7334F02964M98165q1045l52448K64615L01267M50338J72655q205j89608R3172
7324A751870J25863k24242l41842k19969P9875J31922J9065J3626J28571K526
7314A467265n4556j14975P1569N39482R8931j81244N7282K95374J48045k83756
7304B043417l51339J2713K87561L82709l9007M129K78031K25304K32965j72501
7294B903982O6871l1828l79058K06550J68038J38659J93597l08246K25220K96005
7284C479790J3955L3108N706R6351j31868m8528L85069R7485N03005J5515l96132
7273D053456J5677m4407L77783j25805l29592J41679m3571K04852J15230l28791
$$ y = [591611, 606073, 841039, 1252769, 1153199, 790520, 596010, 857737, 807768, 728897, 781065, 602964, 1101129, 1020084, 667636, 932251, 1233518, 1683856, 1856511, 1848306, 1658698, 1751870, 1877733, 1653491, 1311649, 1091680, 1171555, 1303477, 1322542, 1336168, 1464739, 1467265, 1412709, 1297734, 1369303, 1908785, 2007716, 1826472, 1883754, 2179128, 2327173, 2043417, 1692078, 1704791, 1992352, 2375061, 2336054, 2340183, 2618214, 2843518, 3076483, 2903982, 2970853, 2939025, 2559967, 2766517, 2934555, 3073214, 3266811, 2958565, 3183785, 3479790, 3493745, 3526853, 3532559, 3628910, 3497042, 3448514, 3833583, 3931068, 4434073, 4449588, 4053456, 4069133, 4024726, 4402509, 4276704, 3947112, 4088791, 4045220, 4250072, 4365302, 4036511]
7263D036511r586j97037j8794O6051J92156J19737j43701m9151k21943m1423K95017
7252D027837p8778l24383k43160r2931J80543L1198k96297m03196J78637L79387
7242C358857J96299l46492p7967J49834M3202q6016l84603m30841n4307n1002
7232B316964k20427J55546l0547L14203k93137o3496J2322N4908K24114l16164
7222B154286k99495j13973K10709K53008j45096m0741o7056k12685o7235k50864
7212A420858J5043K28218R8135k11356j23213J52635K1410o7067l12934l88000
7202H33729j32448L12321p799j48714j72119K17227L08330Q2160m2006p6208J61300
7191A335773q1581k13934k60049J010L2429M429K38091K55984l02449j11831k49797
$$ y = [4036511, 4026925, 3829888, 3811094, 3877145, 4069301, 4189038, 4045337, 3996186, 3774243, 3732820, 4027837, 3949059, 3624676, 3381516, 3288585, 3469128, 3500326, 3204029, 2800833, 2979470, 3358857, 3555156, 3208664, 3130697, 3280531, 3323733, 3237717, 2853114, 2422273, 2367966, 2316964, 2096537, 2252083, 2221536, 2535739, 2242602, 2179106, 2191428, 2246336, 2470450, 2154286, 1854791, 1740818, 1951527, 2204535, 2059439, 2018698, 1951642, 1738957, 1671722, 1420858, 1435901, 1664119, 1762254, 1550898, 1427685, 1580320, 1601730, 1534663, 1221729, 833729, 701281, 1013602, 1005803, 857089, 684970, 902197, 1210527, 1292687, 1250681, 1174473, 1335773, 1254192, 1040258, 780209, 781219, 813648, 818077, 1056168, 1312152, 1009703, 897872, 648075]
7180F48075Q7795J10804O9472j27833l01927K33724J35300K701K5491Q2946m9316
7169I17232J10626l2138j9966k26435j04843k14294j30616L76113o335J81791
7159H51135o147P9779N4083j30842k15134k34731M10200K38592j45865R3014N1467
7148A045551j24707R9172k13002j90429k31261m1322K81923l19988J05264q9248
7138C21953K26419J02309j29254j825J39251n0398m0223n10303j47435J59847
7128G0341J43206M12420L1252M3628j55131j9931j35128K78368j20696J6956l81590
7117A83695J90266P3369J70170j31632l03894m05544N3790K51828m3766Q0110
7107A18392k72142L66191L2172K73776j29638K03126R5232p2268l73921O6179
$$ y = [648075, 735870, 846674, 916146, 788313, 486386, 720110, 855410, 858111, 883602, 966548, 917232, 1027858, 995720, 975754, 749319, 644476, 430182, 299566, 675679, 669344, 851135, 844988, 924767, 978850, 848008, 632874, 398143, 808343, 1046935, 901070, 994084, 1045551, 920844, 1020016, 807014, 616585, 385324, 344002, 625925, 305937, 411201, 321953, 548372, 650681, 521427, 519602, 658853, 608455, 568232, 57929, -89506, 70341, 213547, 625967, 657219, 700847, 545716, 525785, 390657, 669025, 548329, 565285, 183695, 373961, 447330, 617500, 485868, 181974, -223570, -169780, 82048, 38282, 118392, -153750, 212441, 244613, 518389, 388751, 591877, 687109, 614841, 240920, 307099]
7097C07099p9772l42276J17116J40880L30859J33941J78625m03666N6021j23320
7087C15507K119l2813J3385p7687J65550Q2389O3171n1054j74052Q4946k63519
7076A27942j96321Q1883L25041j02041N15k10931J58784K45135K94704j75927
7066E48784k72889n53289J81596J15718P7449l633o1253L33975j94708J38511
7056C10261j103M9706k35968m41700Q5091K50776K00910N8099k51705L3831O813
7045F5011L8897l06872r0963K17668j4082j6469K5392n0846L23452K43934j94776
7034B40346j13996q9463N7324n2617K0976k7797J18722K95666J83181k11833j58376
7023B62133J410R7152j24439l41567j35382J93451K98588J74534j03798j75633
$$ y = [307099, 227327, -114949, 2167, 143047, 473906, 607847, 786472, 382806, 438827, 315507, 317626, 284813, 298198, 220511, 386061, 468450, 531621, 480567, 306515, 391461, 127942, -68379, 13504, 338545, 236504, 237019, 26088, 184872, 430007, 724711, 548784, 275895, -277394, -95798, 19920, 97369, 93736, 32483, 366458, 171750, 310261, 309158, 358864, 122896, -318804, -233713, 17063, 217973, 276072, 24367, 58198, 65011, 103908, -202964, -293927, -76259, -90341, -106810, -81418, -132264, 191188, 435122, 240346, 126350, 36887, 94211, 41594, 62570, 34773, 153495, 449161, 632342, 420509, 262133, 263543, 360695, 236256, -105311, -240693, -47242, 251346, 425880, 322082, 146449]
7013A46449J12780j25491O3936p9345L00687l5823j29499k32540J27752L38336
7003D87242j10406n03913P0020L10592J40822J01460l33604J94889Q9026Q3519
6993E29647j26038n7770L4160k2643m82573k561p7779K491n0731K40052M49307
6982D35562p9640P7458l30938P3072K44538k948l92288L416J19678L7745k41264
6971e5609J20818j82880Q268j65286M6398L64820J44224J37193m39260K8068m0423
6960c3669Q1028J05205L75171j3818q0252m53365Q8988J65292K53528k8598j44793
6949C14717M78154o2477j08343j66414m7834k63125j76533k0447M61491J61264
6939E70453k30907l78571K12463K38508p662p9846j69614L71154L05572o3199
$$ y = [146449, 259229, 133738, 197674, 118329, 419016, 383193, 253694, 21154, 148906, 487242, 376836, -127077, -57057, 253535, 394357, 495817, 162213, 357102, 446128, 529647, 403609, 345839, 379999, 357356, -125217, -127778, -205557, -203066, -253797, -13745, 435562, 355922, 433380, 102442, 175514, 420052, 417104, 24816, 28232, 147910, 185655, -55609, 65209, -117671, -109403, -274689, -228291, 136529, 280753, 417946, -21314, 6754, -33669, 47359, 152564, 527735, 513917, 433665, -19700, 69288, 234580, 488108, 459510, 314717, 792871, 730394, 622051, 455637, 407803, 144678, -31855, -52302, 409189, 570453, 339546, -39025, 173438, 411946, 404284, 324438, 154824, 525978, 831550, 768351]
6929G68351l67017q6405k04934J52648k13527N2696J43742q0244k61553k30856
6919c27099K35954R833o1622m3146K70956L12811K667q1453J04583q3067l40692
6908b75l19408Q6579M97342P5161l53595k91787J44646P5772J137P7750L9197
6897C2519K46206l82985k19180L03229L01253n4622l19906j40173M20411N11805
6887F98557m34187m71218n0110L08382L63373r5187P9485P0284J51938l110j51252
6876D66955l6702l30854j69043O7288J12811K53855J181l52621K6142M57460K71469
6865G67941n9654l03822j0312J7976K26354j57432j23729J7061j92726k03218
6855b1561l46627J23092p6770J67057J23758Q0326L49715K10969L6682j3099k01190
$$ y = [768351, 401334, 314929, 109995, 262643, 49116, 101812, 245554, 165310, -96243, -327099, -91145, -81312, -142934, -186080, 84876, 397687, 400354, 318901, 423484, 340417, -275, -319683, -233104, 264238, 339399, -14196, -305983, -161337, -85565, -84428, -6678, 32519, 278725, -104260, -323440, -20211, 281042, 226420, -93486, -233659, 186752, 698557, 264370, -206848, -256958, 51424, 414797, 319610, 399095, 469379, 621317, 618207, 466955, 430253, 99399, -69644, -2356, 110455, 364310, 365491, 12870, 39012, 496472, 767941, 708287, 404465, 394153, 412129, 638483, 481051, 357322, 374383, 181657, -21561, -368188, -245096, -321866, -154809, -31051, 49275, 398990, 609959, 646641, 633542, 432352]
6844D32352j2617k22301j3232K77883j36811k3587m98482j25613L98371K77972
6834C53935K55630k77141N2521K75183o7444O7652l78692k81288K24031J48433
6824C72820P2051M9542j61015Q7718j71625l24532J6782j54696J65785J72332
6814A25162K35251J04581P3736k09252l02143K11065M15051J3180k04499r6146
6804C65986j82846M12079k10039l00594o5506J37308J56053m7635o9643r4778
6794A00385m22l6606L40293L11890m2631j63953K40735m9784p0505m18110m09070
6783a97778K90459J20441K1832J18311j90593K92452L62001k15544k35772K57152
6773F22961K16851j03779J10776l95367k9767k9123m72657j27264J96941L33249
$$ y = [432352, 419735, 197434, 184202, 462085, 325274, 301687, -196795, -322408, 75963, 353935, 609565, 332424, 384945, 660128, 592684, 660336, 281644, 356, 224387, 372820, 444871, 494413, 333398, 421116, 249491, -75041, -58259, -212955, -47170, 125162, 360413, 464994, 538730, 329478, 27335, 238400, 653451, 666631, 462132, 365986, 183140, 595219, 385180, 84586, 19080, 156388, 312441, 264806, 195163, 100385, 99963, 63357, 403650, 715540, 672909, 508956, 749691, 699907, 629402, 211292, -197778, 92681, 213122, 234954, 353265, 162672, 455124, 817125, 601581, 365809, 622961, 839812, 736033, 846809, 451442, 421675, 392552, -80105, -207369, -10428, 322821]
6763C22821K01357n3763J99417L79642k06865m15312k64492L59617K38104j80169
6753E80357n77261k80147M96179n659L8429k49887l45829K91059M75277K42814
6743F65332j36089J83888P5026J84633K60761l76077r6006k95859k26008L818
6733B43419k60813l5501Q4362k22704J16272n7893K35519K44339Q996K66607K01383
6722H23986L27367l5692l65293p1906J6455J80322j65234l51977j91016l7100
6712A29912J1238m73856j10920L14256M35834L39037P6454j09598J17803J43924
6702H74084R6725p64633m98488j08549J74730M41109k36204q8851j18763J77727
6692e1113L57872n0133K48515r2563j68443M1147J87220R6090k20047k99055k04447
$$ y = [322821, 524178, 470415, 669832, 1049474, 842609, 427297, 162805, 522422, 760526, 580357, 3096, -277051, 219128, 213469, 251898, 2011, -343818, -52759, 422518, 665332, 529243, 713131, 788157, 972790, 1233551, 857474, 761468, 465609, 239601, 243419, -17394, -52895, 31467, -191237, -74965, -132858, 102661, 347000, 355996, 622603, 823986, 1151353, 1115661, 750368, 678462, 694917, 875239, 710005, 358028, 167012, 129912, 141150, -332706, -443626, -129370, 306464, 645501, 721955, 612357, 730160, 874084, 970809, 206176, -292312, -400861, -226131, 214978, -21226, -110077, -228840, -51113, 306759, 256626, 505141, 412578, 244135, 285282, 472502, 568592, 348545, 49490, -154957]
6681a54957K14207L38300r8775n66919j04206J54272L00885L02457Q6343K21077
6671F92684N604l7089l14462j0757j61260M953L6451K45733L11278j5683J55962
6660I13414K25381K13173j6391p7176o2519J3382J35610o7855m10138q2907O6216
6649H50190J28111k78453k30119L0438J08953j72358p6644l75401j11800L1874
6639i5209J69932J53451J64201M0858j03496K54653j57468K50740p9563l54391
6629B43708j66546L53339O2235k15392k26490n68627J66466l6535K64476o262
6619a29628K41173N2133J98900L65672M9013j24816n5965l74375q7339l35636
6609b00868k98867J31253n07759K05130J75498K19561N5767K46410L00259N26555
$$ y = [-154957, 59250, 397550, 298775, -268144, -372350, -218078, 82807, 385264, 471607, 692684, 698288, 661199, 346737, 335980, 174720, 179673, 216124, 461857, 773135, 757452, 913414, 1138795, 1351968, 1335577, 1258401, 1195882, 1209264, 1344874, 1277019, 866881, 783974, 850190, 978301, 699848, 469729, 500167, 609120, 436762, 360118, -15283, -127083, -95209, 74723, 228174, 392375, 433233, 329737, 584390, 426922, 677662, 598099, 243708, 77162, 430501, 492736, 277344, 50854, -517773, -351307, -387842, -123366, -129628, 111545, 163678, 362578, 728250, 777263, 652447, 596482, 222107, 134768, -200868, -499735, -368482, -876241, -671111, -495613, -276052, -220285, 26125, 326384, 852939]
6599H52939J13645l21676k09074K80344r0705m08059k41411l92786L74297l8139
6589h0625k7729R0550J75302L13511j4002o5304J67586j5382n838l08833j70105
6578E9131R1924l12368L67682j57787K34187K03266J4950j61218J18697K37403
6568F95867K16000N6870j5935j67364n385p5701k62536q335k92899P0902J30022
6557C41506J58014q9496j49611K70581K96202k43382j43818k89687J74903K43912
6547E69124j09141q1303l70533J86864j1727J17824K02580J13406l03360l39535
6537b5801m5263J68355J40686j20184j52898n5779N18706K48911J74182j54976
6527F95939J1913l0688l1839M2409k1292l10628j94976j85976M2409L24780M9976
$$ y = [852939, 966584, 644908, 435834, 716178, 625473, 217414, -23997, -416783, -42486, -80625, -108354, -17804, 157498, 471009, 457007, 391703, 559289, 543907, 538069, 229236, 59131, 151055, -161313, 206369, 48582, 282769, 486035, 500985, 339767, 458464, 695867, 911867, 968737, 952802, 785438, 780053, 704352, 441816, 433481, 140582, 211484, 341506, 499520, 410024, 260413, 530994, 827196, 583814, 439996, 150309, 325212, 569124, 459983, 378680, 8147, 195011, 183284, 301108, 503688, 617094, 313734, -25801, -71064, 97291, 237977, 117793, -35105, -90884, 427822, 676733, 850915, 695939, 707852, 677164, 645325, 687734, 666442, 355814, 160838, -25138, 17271, 342051, 392027]
6516C92027k53912K66530J84469m5870P9823J76810K74697J45346J35722l58735
6506I96907L8075K8535m1300j16418j5126K35990J46962n5901m1395j06741j2102
6495A057486J54876K6096l27727n0803j32944p5255j08255j58277j53147J37185
6485C69235L60987M0259N41245J51907j71145k20648j95662k38076J36524j38218
6475F36408k94465j73277M1903K50878L44007k19418l5146j9288m7514L8998P8753
6464F01839j7091j14270L24020k51839K32681Q6422k89823o4196J15338l00275
6454C22806j12496k4896J03419M33415K11190j46747L3470J03724j69314n229
6444G49342m97896K98434R0272n4846K862J99207J14403j24624p5621j47666K18820
$$ y = [392027, 138115, 404645, 589114, 543244, 623067, 799877, 1074574, 1219920, 1355642, 996907, 1034982, 1063517, 1022217, 905799, 890673, 1126663, 1273625, 1217724, 1176329, 1069588, 1057486, 1212362, 1238458, 910731, 859928, 726984, 651729, 543474, 385197, 232050, 369235, 730222, 770481, 1311726, 1463633, 1292488, 1071840, 876178, 638102, 774626, 636408, 341943, 168666, 210569, 461447, 805454, 586036, 550890, 531602, 484088, 523086, 601839, 584748, 470478, 794498, 542659, 775340, 861762, 571939, 507743, 623081, 322806, 210310, 185414, 288833, 722248, 933438, 786691, 820161, 923885, 754571, 749342, 251446, 549880, 640152, 585306, 588168, 787375, 901778, 777154, 701533, 553867, 772687]
6433G72687R3822n40025k10481N6466n3588K82446j76970R2003K56873M07045
6423I80278k69150l08730j14862L24087O4271J82366r7819K28767J12430N7375
6413A159013K37266m66743J69342k44304k18790q3812r5175J13423L21661q0392
6403H11489n0459j67284K91787j78694k08831p5998p7247M53189j83222l3455
6393E81275J38503L66593K90836l23956l20591j03014K152L08595n3825N05179
6383A391747J54070K54428K97264J77391L7752j70740m08176k72655O0729j67218
6373A354592k52088j29344J69131j77630J16287j13795L14604J01749k47090j87077
6363I49339n8239L25683R7123O4257p0598O0015L73926k53584k01444L7806j86339
$$ y = [772687, 866509, 326484, 116003, 172469, 118881, 401327, 224357, 316360, 573233, 980278, 711128, 402398, 287536, 611623, 675894, 858260, 760441, 989208, 1101638, 1159013, 1396279, 929536, 1098878, 854574, 635784, 551972, 456797, 570220, 891881, 811489, 761030, 593746, 885533, 706839, 498008, 422010, 344763, 797952, 614730, 581275, 719778, 1086371, 1377207, 1053251, 732660, 629646, 631798, 940393, 886568, 1391747, 1545817, 1800245, 2097509, 2274900, 2312652, 2141912, 1733736, 1461081, 1521810, 1354592, 1102504, 973160, 1142291, 964661, 1080948, 967153, 1281757, 1383506, 1136416, 949339, 891100, 1216783, 1313906, 1378163, 1307565, 1367580, 1741506, 1487922, 1286478, 1324284, 1137945]
6352A137945l4598m59774m1895L72071M88376l5994k31288L29159Q1161L9823
6342A644986j15096m62703M28951L16147l52173N4795l27194P8982J98767K03163
6332A668625n0493j46437l24606J3641K82797J37017K67683L71269J52263Q3051
6322B454810K23980j60203n8059l09923j74728J66726N45832L01820R6l0910k08182
6311B751259L70105L32594J43729O42340J47906K91445O67755L43660J061519
6302F752312J239326Q43381P57073R67118O69877M7763j08455n98364m38555p8534
6292A0052942m25607M15669P60582N36666R95665L86584O88466M82080k97911
6283A3595136m59596o24593o2794j75028l5072J65484L26035J047742J07517k74104
$$ y = [1137945, 1103347, 643573, 601678, 973749, 1462125, 1426131, 1194843, 1524002, 1605163, 1644986, 1529890, 1067187, 1496138, 1812285, 1460112, 1514907, 1187713, 1266695, 1465462, 1668625, 1618132, 1471695, 1147089, 1160730, 1443527, 1580544, 1848227, 2219496, 2371759, 2454810, 2678790, 2518587, 2460528, 2150605, 1975877, 2142603, 2688435, 2990255, 2990351, 2959441, 2751259, 3121364, 3453958, 3597687, 4240027, 4387933, 4679378, 5347133, 5690793, 6752312, 7991638, 8835019, 9592092, 10559210, 11229087, 11276850, 11168395, 10570031, 10131476, 10052942, 9627335, 10043004, 10803586, 11340252, 12335917, 12722501, 13410967, 13893047, 13595136, 13135540, 12510947, 12448153, 12273125, 12238053, 12403537, 12729572, 13777314, 13884831, 13610727]
6273A3610727j84112r27890o03792q98717j158337k24893P2074J33092J97100
6264A0015252N81042J086402O80479M19257p18276o72320n30897r90595o16959
6255I253385j281868p83623j33642o59118l49554j45994l75813J46126j64275
6246E505624n71690j14675L12530J50094o0255q5180K32479O56692N09578j1415
6236F523782M04031J040093J116976J418002J563210K077455K216442J729978
6228A8089969P98843L50141k8121n13753j109215r57148q74996m5661J86978O90617
6218A6587654R80177J417865J738843R19139K38715l79160l05429o44199k23164
6209B0330441k55637P43063P67049J108089N41794K6525o1106j065626j550861
$$ y = [13610727, 13426615, 12498725, 11894933, 10996216, 9837879, 9612986, 9685060, 9818152, 10015252, 10596294, 11682696, 12363175, 12782432, 12064156, 11391836, 10860939, 9870344, 9253385, 7971517, 7187894, 7054252, 6395134, 6045580, 5899586, 5523773, 5669899, 5505624, 4933934, 4819259, 5131789, 5281883, 5221628, 5136448, 5368927, 6025619, 6535197, 6523782, 6927813, 7967906, 9084882, 10502884, 12066094, 14143549, 16359991, 18089969, 18888812, 19238953, 19210832, 18697079, 17587864, 16630716, 15755720, 15710059, 15897037, 16587654, 17567831, 18985696, 20724539, 21643678, 21882393, 21503233, 21197804, 20553605, 20330441, 20074804, 20817867, 21584916, 22693005, 23234799, 23261324, 23200218, 22134592, 20583731]
6200B0583731j546310j338288j012927o47808m68592Q2515M98412J189731R30840
6191A8271304J184177M99740m03581r56736j584410j610285j267714j746197j559392
6182A0826906j186453j252508q13681j125745p43219p80166l50249l64022R654
6173D220517J46029L7550O4385k12920l18529j25639j54809k43311J5154l05533
6163C122894l26832k61216k61907j32086L72682j39631r3004J14189j00957Q1014
6153B375146K9274j64912K74392m9346K434M12820k10196j4811j84196k05062
6143B265543k17022l1725o2102k28582J08877j9124k3469K6000l11227J37404
6133A644573M79094k278J97059J9810k30436J48215M1423k12876J03499L5454
$$ y = [20583731, 19037421, 17699133, 16686206, 16038398, 15569806, 15652321, 16150733, 17340464, 18271304, 19455481, 19955221, 19551640, 18594904, 17010494, 15400209, 14132495, 12386298, 10826906, 9640453, 8387945, 7574264, 6448519, 5705300, 4925134, 4574885, 4210863, 4220517, 4366546, 4404096, 4468481, 4255561, 3937032, 3811393, 3656584, 3413273, 3428427, 3122894, 2796062, 2534846, 2272939, 2140853, 2513535, 2373904, 2280900, 2395089, 2294132, 2375146, 2404420, 2239508, 2513900, 2464554, 2466988, 2879808, 2669612, 2654801, 2470605, 2265543, 2048521, 2016796, 1954694, 1726112, 1834989, 1815865, 1792396, 1818396, 1507169, 1644573, 2123667, 2121389, 2318448, 2338258, 2107822, 2256037, 2297460, 2084584, 2188083, 2223537]
6123B223537j43654J0881K1616m33843o3065j39081k74407P9918J99449L50449
6113A831800M54929K12070k84218L0914k78676r2743J03438Q6251r2117m4208
6103A927440J75729J23463J66120m09491k74656K43669j39843j02200Q7516J90411
6093A988158N83273L9070l92341K17386P6126j44542j17233o02577M80168K55601
6083B383089j60755j41183J43066N74879K82093j73835m82301k19983L40592M501
6073B550163k50683k3467j10834L27511L511O0021L30262L16521J0192r6859L1974
6062C148312J12435J77501L68889j6989M5033K56970L4553O16255P9116j09469
6052D712606J87101M34179M59248P97693R23072J272092J659673J632740J991015
$$ y = [2223537, 2079883, 2090764, 2112380, 1678537, 1615472, 1476391, 1201984, 1281902, 1481351, 1831800, 2286729, 2498799, 2214581, 2245495, 1966819, 1874076, 1977514, 2063765, 1971648, 1927440, 2103169, 2226632, 2392752, 1983261, 1708605, 1952274, 1812431, 1710231, 1797747, 1988158, 2571431, 2610501, 2218160, 2435546, 2511672, 2367130, 2249897, 1647320, 2127488, 2383089, 2222334, 2081151, 2224217, 2799096, 3081189, 2907354, 2425053, 2205070, 2545662, 2550163, 2299480, 2276013, 2165179, 2492690, 2496201, 2556222, 2886484, 3203005, 3213197, 3116338, 3148312, 3260747, 3438248, 3807137, 3790148, 3835181, 4092151, 4126704, 4742959, 4822075, 4712606, 4899707, 5333886, 5793134, 6590827, 7513899, 8785991, 10445664, 12078404, 14069419]
6043A4069419J961607J790580P23591p6344q43499r38526j173192j156103j167581
6034A3189952p14928o04333n02268n7340m35503K361K20708O74013J337172J880458
6024A4990292K426423L109643L633777L717567L101419J883282K34845q22085
6016C2275163j488899k528236k534062k679992k657815k204626k316036j673565
6008A4191932j218643q03614p62812n39533K34907L13484P94927J013664J450188
5999A4674500J744633J359702J287159O79545m16367j198562j285408j549610
5991A5295592j299081j198458j155315r63803q27146j019029p09526j75585p16627
5982G231022j42699m75996m5167L11376J61746K05087K09261P06287R28310J144747
$$ y = [14069419, 16031026, 17821606, 18545197, 18468853, 17625354, 16686828, 15513636, 14357533, 13189952, 12475024, 11870691, 11368423, 11311083, 10875580, 10877941, 11098649, 11772662, 13109834, 14990292, 17416715, 20526358, 24160135, 27877702, 30979121, 32862403, 33097248, 32275163, 30786264, 28258028, 25723966, 23043974, 20386159, 18181533, 15865497, 14191932, 12973289, 12169675, 11406863, 10867330, 11102237, 11415721, 12210648, 13224312, 14674500, 16419133, 17778835, 19065994, 19745539, 19329172, 18130610, 16845202, 15295592, 13996511, 12798053, 11642738, 10678935, 9851789, 8832760, 8123234, 7947649, 7231022, 7088323, 6612327, 6567160, 6878536, 7040282, 7245369, 7454630, 8160917, 9089227, 10233974]
5972A0233974R48352Q95724Q71253Q5639l42354n89295j016053q69653o58184
5963I559403p37782o67250m20515m32141j10584m494J94315N05248O95489J137293
5953I718982J503727K038991K055181K400697K035940J112717J93590p96825j193698
5944A9069302j336854j693383j871659j587261j700060j341418p63508o63903
5936H111256p44642j59438l99133J52424L61305K27031O43027P65812R44749P99503
5926A0701894P27553M63631K19594m97354q59746p81271q46697o23624p81404
5917G722576q88944n68015n26136q28469k21302k10565m55386k22000q6502n43529
5907C171728k91328j30153o3707k76373k16551j37662P0535N52441j46102j37558
$$ y = [10233974, 11182326, 12078050, 12949303, 13034942, 12692588, 12103293, 11087240, 10217587, 9559403, 8821621, 8154371, 7733856, 7301715, 7191131, 7186637, 7380952, 7886200, 8581689, 9718982, 11222709, 13261700, 15316881, 17717578, 19753518, 20866235, 21059825, 20263000, 19069302, 17732448, 16039065, 14167406, 12580145, 10880085, 9538667, 8775159, 8111256, 7366614, 7207176, 6808043, 6960467, 7321772, 7548803, 8191830, 8957642, 9902391, 10701894, 11429447, 11893078, 12112672, 11615318, 10755572, 9974301, 9127604, 8503980, 7722576, 6833632, 6265617, 5739481, 4911012, 4689710, 4479145, 4023759, 3801759, 3715257, 3171728, 2880400, 2750247, 2686540, 2410167, 2193616, 2055954, 2126489, 2678930, 2532828, 2395270]
5897B395270n2105K80330j66928p7556k74993K11735M84294L50919l86955l27114
5887B436897K05844j42823j98995l38353P5170J531j73651l33076K93278O6625
5877A892447M95786m62327m93167J79142K53086J45694l75625j28091j59413J34694
5867A482226k29985k97244Q6064M04421k13580K09728j08502K20650K15618j1675
5857A757721l33377k27346Q0349K99872K93663l12947j97296k71508P094n7014
5847A039211K52944k58869K64785j00512q651J58099R9234k16640m32498j53770
5837F43333m1671L30711q9774l17040J66350N56497J02502J73805n10758K35045
5827A249000J54859q0648J01776J07234j9714k24959q9557K20041J73418k35908
$$ y = [2395270, 2343165, 2623495, 2456567, 2379011, 2104018, 2315753, 2800047, 3150966, 2764011, 2436897, 2642741, 2499918, 2300923, 1962570, 2037740, 2039271, 1865620, 1532544, 1825822, 1892447, 2388233, 1925906, 1432739, 1611881, 1864967, 2010661, 1635036, 1506945, 1347532, 1482226, 1252241, 954997, 1041061, 1445482, 1231902, 1441630, 1333128, 1553778, 1769396, 1757721, 1424344, 1196998, 1277347, 1577219, 1870882, 1557935, 1360639, 1089131, 1096225, 1039211, 1292155, 1033286, 1298071, 1197559, 1188908, 1347007, 1446241, 1229601, 797103, 643333, 601662, 932373, 842599, 525559, 691909, 1248406, 1350908, 1524713, 1013955, 1249000, 1403859, 1323211, 1424987, 1532221, 1512507, 1287548, 1197991, 1418032, 1591450, 1355542]
5817A355542o37869l9211L36890j15694K25982k03297K09789K94406k87813m51857
5807F86868J67787K19776J57028k04045J65195L33698L33337J64153p3333r1079
5797A859385l94148r1600K52946K42945R3924m3211l88115K08606j64399j95474
5787A380859j15631j78288o739M59784K40993n1498J6036j46928n3639J88386
5777A733335M74850O8507L57578M75695O25096N29531K87076R0595O03063Q27115
5767F072441J847893K581169M160732P114912P414736O113087L160750K79399
5759C8745119l357195n989187n460680m469636l442769k935434k368955j579613
5751I141650j531354j346475j370013o02353m95880l85583k27303m68005n1680
$$ y = [1355542, 717673, 678462, 1015352, 899658, 1125640, 922343, 1132132, 1426538, 1138725, 686868, 854655, 1074431, 1231459, 1027414, 1192609, 1526307, 1859644, 2023797, 1950464, 1859385, 1465237, 1373637, 1626583, 1869528, 1963452, 1920241, 1532126, 1740732, 1576333, 1380859, 1265228, 1086940, 1080201, 1539985, 1780978, 1729480, 1745516, 1598588, 1544949, 1733335, 2208185, 2276692, 2634270, 3109965, 3735061, 4264592, 4551668, 4642263, 5245326, 6072441, 7920334, 10501503, 14662235, 21777147, 29191883, 35304970, 38465720, 38745119, 35387924, 29398737, 23938057, 19468421, 16025652, 13090218, 10721263, 9141650, 7610296, 6263821, 4893808, 4291455, 3795575, 3409992, 3182689, 2714684, 2663004]
5742B663004n8849p4438j93819k48393m08664O4339K69890M66457L2502j5357
5732B496672j47459K08540l5731m87613j17395l01365J77354R0348l21551k3212
5722A538588J96821j57321j23388k20489o0228k50550M4802M204L80776L83087
5712A736302l24128p9014K05148J98795K36029k50156m29868J59438K2944J46086
5702A621576j84241O2389j89916L5561O2924l0306j26191m03994q915K76305j92034
5691I23158k60159K10249j15601M59797Q1502j50933l6438L19424j80643j16605
5681A133751J37991J54932J6690o8337J50311J04592K1398k51165k31410l66448
5671H02305j0418J07916M4385R1275M54897m3230j1417Q0315l36470j7491K05715
$$ y = [2663004, 2604155, 2529717, 2335898, 2087505, 1678841, 1743180, 2013070, 2479527, 2512029, 2496672, 2349213, 2557753, 2522022, 2034409, 1917014, 1615649, 1793003, 1883351, 1561800, 1538588, 1735409, 1578088, 1454700, 1234211, 1173983, 923433, 968235, 972439, 1353215, 1736302, 1412174, 1333160, 1538308, 1737103, 1973132, 1722976, 1293108, 1452546, 1475490, 1621576, 1437335, 1499724, 1309808, 1345369, 1408293, 1377987, 1251796, 847802, 838887, 1115192, 923158, 662999, 873248, 757647, 1217444, 1298946, 1148013, 1111575, 1430999, 1250356, 1133751, 1271742, 1426674, 1443364, 1375027, 1525338, 1629930, 1651328, 1400163, 1168753, 802305, 791887, 899803, 944188, 1035463, 1490360, 1447130, 1435713, 1516028, 1179558, 1162067, 1367782]
5660A367782j98773n7569J04023K10230L79605N9727k63514k98737l7962J58035
5650A422847K29496k70282j99646J83634J89780J85184K3938k42672J44235j47576
5640A518938l89975o0136J62976j77675K2207J23876K9205J01922p840j05425
5630A218073k61850L15514J33506J97717j31921k4491k2107K63784p4236l09989
5620A304000k15062p9112L55294o875j10187j73127J8787l681L40768j55096J13616
5609A389325K08816j50041k20551n0144l99757L03042J08874l64349j37748L40679
5599A028146M03262k71026J82466l0461Q9061l08036L6964j17214K81303M5234
5589A339699Q421k24925K42771P7742k26631r1829j68232P4942K042K62407j47913
$$ y = [1367782, 1169009, 1111440, 1215463, 1425693, 1805298, 1865025, 1601511, 1302774, 1264812, 1422847, 1652343, 1382061, 1182415, 1366049, 1555829, 1741013, 1764951, 1522279, 1666514, 1518938, 1128963, 1068827, 1231803, 1054128, 1076335, 1200211, 1229416, 1331338, 1323498, 1218073, 956223, 1271737, 1405243, 1602960, 1471039, 1446548, 1424441, 1688225, 1613989, 1304000, 1088938, 1009826, 1365120, 1358245, 1248058, 1074931, 1093718, 1090037, 1430805, 1275709, 1389325, 1598141, 1448100, 1227549, 1177405, 777648, 1080690, 1189564, 825215, 687467, 1028146, 1431408, 1160382, 1342848, 1312387, 1401448, 1093412, 1130376, 1013162, 1294465, 1339699, 1348120, 1123195, 1365966, 1443708, 1217077, 1125248, 957016, 1031958, 1034000, 1296407, 1148494]
5578A148494J98541Q8701J39921l60452r9975k69546m5865R7711j33780K23249
5568I86999K12398J50864q6922L10016k7021j77768l86207j24545L38407K39702
5558A435923J04078k63987k15350o9169J04206j51435j21999n6284J13494r5178
5548G84299J39853k1386P5113J75762k99658j60989O8712K23021k2824r1072K48846
5537A119677J21793J39239J88262o8002J35054l3523j75346l36453l27393O9330
5527H32638o2225J28067O2098K32835J38626N4752L2459R4707r533J8302K34563
5516A757289J71324J2524n67947J70893m1566K54362k83376k76610l76659J19611
5506I39845L73109l28977j66092k1953L22093M7544L03008K0280L10997l13245
$$ y = [1148494, 1347035, 1435736, 1575657, 1215205, 1115230, 845684, 799819, 897530, 763750, 986999, 1199397, 1350261, 1263339, 1573355, 1546334, 1368566, 982359, 857814, 1196221, 1435923, 1540001, 1276014, 1060664, 991495, 1095701, 944266, 822267, 765983, 879477, 784299, 924152, 902766, 977879, 1153641, 853983, 692994, 761706, 984727, 961903, 870831, 1119677, 1241470, 1380709, 1568971, 1500969, 1636023, 1602500, 1427154, 1090701, 763308, 832638, 770413, 898480, 960578, 1193413, 1332039, 1386791, 1419250, 1513957, 1504424, 1522726, 1757289, 1928613, 1941137, 1373190, 1544083, 1502517, 1756879, 1473503, 1196893, 820234, 939845, 1312954, 983977, 817885, 795932, 1118025, 1165569, 1468577, 1488857, 1799854, 1486609]
5496A486609m97240j94803L08939M25067N8368j89698o8382K54719k13637R7669
5486A467611l72313k35185P3742M45861j20482J43423J378P5351O5174L6182m38721
5475A142021j05226K86990j70063L18187k62978J93660m5866j61132j03470K34382
5465A326505k45399J85882l03310k27556K63284M47022K72963J1109J99964l54009
5455A576455M25364m7212R378p4088m2195j67326Q0497l363N9471K01978l2192
5444A986767j22369Q7671J38589j55259L39266l42824n4541J7532J89809L53077
5434B437718J5822n25153N6019Q1857K78746m8946j47436M2064L90520M35369
5424C016580l83948j72722R383L7458j71904k09520q5089M17793J17806K02286
$$ y = [1486609, 989369, 794566, 1103505, 1528572, 1586940, 1397242, 1328860, 1583579, 1369942, 1467611, 1095298, 860113, 933855, 1379716, 1259234, 1402657, 1404035, 1479386, 1544560, 1580742, 1142021, 1036795, 1323785, 1153722, 1471909, 1208931, 1402591, 1356725, 1195593, 1092123, 1326505, 1081106, 1266988, 963678, 736122, 999406, 1446428, 1719391, 1730500, 1930464, 1576455, 2001819, 1954607, 1963985, 1889897, 1847702, 1680376, 1760873, 1757510, 1816981, 2018959, 1986767, 1864398, 1952069, 2090658, 1935399, 2274665, 1931841, 1877300, 1894832, 2084641, 2437718, 2453540, 1928387, 1984406, 2066263, 2345009, 2296063, 2148627, 2190691, 2581211, 3016580, 2632632, 2459910, 2469293, 2506751, 2334847, 2125327, 2040238, 2458031, 2575837, 2778123]
5414B778123l9969K10225L06622j78273m88587j14206K27324J3489k06061l79623
5404B129064O0350L09935K4269j79499j9833K39477L90902R1745M6653M598J38699
5393C236360j000L6125j29883P5595r4520j15378p3623l65684o8256q612L37316
5382B828440k9185L65545R5175j42383l7203L3982j90147R8706P6610j12523K20174
5371C207191L627K06073m1782o5258K68794J1212r1949J38767n6740J57404j40983
5360C596356q2051j6665J39489J49266P6260L09629J6649L048k56321k56720K85135
5349C964075O11289o3383k36214k07268K58119L17894l57492m05529j50720M84533
5339D215304K91904L25878J30353M27880N44265J49023o7655K02891O692j3845
$$ y = [2778123, 2738154, 2948379, 3255001, 3076728, 2588141, 2473935, 2701259, 2714748, 2508687, 2129064, 2189414, 2499349, 2523618, 2344119, 2324286, 2563763, 2954665, 3046410, 3093063, 3097661, 3236360, 3235360, 3271485, 3141602, 3217197, 3122677, 3007299, 2933676, 2567992, 2499736, 2491124, 2828440, 2799255, 3164800, 3259975, 3117592, 3080389, 3114371, 2924224, 3022930, 3099540, 2987017, 3207191, 3210818, 3416891, 3375109, 3309851, 3578645, 3589857, 3497908, 3636675, 3579935, 3737339, 3596356, 3514305, 3497640, 3637129, 3786395, 3862655, 4172284, 4188933, 4191981, 3935660, 3678940, 3964075, 4575364, 4511981, 4275767, 4068499, 4326618, 4644512, 4287020, 3881491, 3730771, 4215304, 4507208, 4833086, 4963439, 5391319, 5935584, 6084607, 6016952, 6219843, 6226535, 6212690]
5329F212690k35481l1625N15470l3729M5166l55055N40408L52971N7054m001J8988
5318G082856n7570M91301K82993K72127K05022N0450N11151j09699M79618K33124
5308I441373K48501q7630K92288K32238N20124N98720L23973N0698K58705K65450
5298A2144440L11905M04245j87762K1444Q3145N43021N16812Q34107M68783L58060
5288A5498200J60464K39699O60744O65928K06226J76656N73778N40692Q93100
5279A9615487K23839J84614M76001P88119N14247N88740O10874O45804P48662
5270B4396387M63916O34083Q54096Q26352K98955O26685O74362P56207O19496
5261C0150539L85969M65526J121786R70489J016991P01282P05184Q39163L89933
$$ y = [6212690, 5977209, 5945584, 6461054, 6427325, 6472491, 6117436, 6657844, 7010815, 7067869, 7063868, 7082856, 7025286, 7516587, 7799580, 8071707, 8276729, 8327179, 8838330, 8728631, 9208249, 9441373, 9689874, 9602244, 9894532, 10126770, 10646894, 11245614, 11569587, 11620285, 11878990, 12144440, 12456345, 12860590, 12672828, 12694272, 12777417, 13320438, 13837250, 14671357, 15140140, 15498200, 15658664, 15898363, 16559107, 17225035, 17431261, 17607917, 18181695, 18722387, 19615487, 19839326, 20023940, 20499941, 21288060, 21802307, 22391047, 23001921, 23647725, 24396387, 24860303, 25494386, 26348482, 27174834, 27473789, 28100474, 28774836, 29531043, 30150539, 30536508, 31002034, 32123820, 33094309, 34111300, 34812582, 35517766, 36356929, 36746862]
5252C6746862N91054O53235R54001N13775M71976O05348P09495O34955J71185
5243D2051886K31017J71048J03438J47735N86920O8885j10142n33981m06337k14554
5233D2095915k08297l85816o60950m29021o44976m26270o16767o70864n15714
5224C7537240n93973o10566l47066o21237o74099p28022p16623o92745o04482
5215C1948427n23437p44297l61465m17986m40314k14880n55765k74557j13122
5206B8302604O9302M25112M05369M56483J47469P0648M56066j61990o60226q66348
5196B8644489l68385l7767J10201L84562J035140J528127J707683J104046R57696
5187C5065792J049006P09548J00870m24376R5862K29145L97063N73615K79797
$$ y = [36746862, 37337916, 37991151, 38945152, 39458927, 39930903, 40536251, 41245746, 41880701, 42051886, 42282903, 42453951, 42557389, 42705124, 43292044, 43360929, 43250787, 42716806, 42310469, 42095915, 41887618, 41501802, 40840852, 40411831, 39766855, 39340585, 38723818, 38052954, 37537240, 36943267, 36332701, 35985635, 35364398, 34690299, 33962277, 33245654, 32552909, 31948427, 31424990, 30680693, 30319228, 29901242, 29460928, 29246048, 28690283, 28415726, 28302604, 28371906, 28797018, 29202387, 29658870, 29806339, 29876987, 30333053, 30171063, 29510837, 28644489, 28276104, 28238337, 28348538, 28733100, 29768240, 31296367, 33004050, 34108096, 35065792, 36114798, 36824346, 36925216, 36500840, 36596702, 36825847, 37222910, 37796525, 38076322]
5178C8076322O83320P71388L69868L47793K72941M73727L90270L28163P33172
5169D2446964O91708N02695n7295p28901o59253o58749p35081p53289l99140k77116
5159C9372543l57347q00422j061748j393787j358002j016178p85690l19003j79444
5150C2100922r4596p668j90992p32360j357005j829938j854749j874309j513735
5141B2645570j519735q39845o15580m32693j05415L108j51607m00215n82231q91977
5131A7109380p05823q93510r24792n70414m58342q90251o35459m68609k49472
5122A1312708k11882m49366k10329j19908l16171k99583j66711R6144J37907o1563
5112I711246m31010j16539P8244l52380k15509j46746m8926L77344m84983k96783
$$ y = [38076322, 38759642, 39531030, 39900898, 40248691, 40521632, 40995359, 41385629, 41713792, 42446964, 43138672, 43641367, 43584072, 42855171, 42195918, 41537169, 40802088, 40048799, 39649659, 39372543, 39015196, 38214774, 37153026, 35759239, 34401237, 33385059, 32599369, 32280366, 32100922, 32006326, 31998658, 31807666, 31075306, 29718301, 27888363, 26033614, 24159305, 22645570, 21125835, 20285990, 19670410, 19237717, 19132302, 19135410, 18983803, 18583588, 18001357, 17109380, 16403557, 15510047, 14585255, 14014841, 13556499, 12666248, 12030789, 11562180, 11312708, 11100826, 10651460, 10441131, 10321223, 10005052, 9705469, 9538758, 9634902, 9772809, 9711246, 9280236, 9163697, 9241941, 8889561, 8674052, 8527306, 8478380, 8855724, 8370741, 8073958]
5102H073958L03303K51069O1065m47681k75635n4465j8870p0581m54511J67012
5092G534664j48533j39919k78079j86572L90818l57136k48611j843O931N0885
5082F622605n6434j69905k07059o7J02769o4244j50110K3574j21840j233J51808
5071F129864j20483J16707K4508J4070J1011n1925l58486J74874R0595j60322
5061E870413J66840j82419J07275l48528k6175Q3179J26994p1889l44665j83397
5051E197628J37603L55047J68020j98086O3707P8387m06814m1174O6253K08484
5041E629055j08803l06130j09507J81775J36371j08545m88659L25690O5551J88219
5031E405017J80340r6577L50945k73999p7462J50539r4200KJ80218M711L72291
$$ y = [8073958, 8377261, 8628330, 8689395, 8241714, 7966079, 7911614, 7892744, 7822163, 7367652, 7534664, 7386131, 7246212, 6968133, 6781561, 7172379, 6815243, 6566632, 6564789, 6571720, 6622605, 6566171, 6396266, 6189207, 6189140, 6291909, 6227665, 6077555, 6101129, 5979289, 5978056, 6129864, 6009381, 6126088, 6150596, 6164666, 6175677, 6123752, 5765266, 5940140, 6030735, 5870413, 6037253, 5854834, 5962109, 5613581, 5587406, 5670585, 5797579, 5725690, 5381025, 5197628, 5335231, 5690278, 5858298, 5660212, 5723919, 5802306, 5395492, 5354318, 5420571, 5629055, 5520252, 5214122, 5104615, 5286390, 5422761, 5314216, 4825557, 5151247, 5216798, 5405017, 5585357, 5488780, 5839725, 5565726, 5488264, 5638803, 5544603, 5544605, 5724823, 5729534, 6101825]
5020F101825P0845j24696l64924K92292L83024o133J54829l11648K06107k616
5010F398905o4556j2721K36683j75843J08419k91430K90817M48359K15361J61780
5000G315774J82407K32514O15075M83921K10512M37293J41881L24321O30063R95677
4990A1569438N71525Q58644Q30368J205322K072225L574735N101183P231704Q862981
4981D1878125R400505Q972359O181337K075274k476555n369144o808134p200545
4973D6653222o965436n977292n352540m172124l345418k562638j908832j515457
4965A4853485r12797j021874m01965m04358o27777n13322l91859k18783R1843
4956A0452593j59889Q6605q7261k6482J80022K07023K02339K83402j60836m6206
$$ y = [6101825, 6172670, 6047974, 5683050, 5975342, 6358366, 6352233, 6507062, 6195414, 6401521, 6398905, 6334349, 6321628, 6558311, 6382468, 6490887, 6199457, 6490274, 6938633, 7153994, 7315774, 7498181, 7730695, 8345770, 8829691, 9040203, 9477496, 9619377, 9943698, 10573761, 11569438, 12140963, 12999607, 13829975, 15035297, 17107522, 20682257, 25783440, 33015144, 41878125, 51278630, 60250989, 66432326, 68507600, 66031045, 60661901, 53853767, 46653222, 39687786, 33710494, 28357954, 24185830, 20840412, 18277774, 16368942, 14853485, 13940688, 12918814, 12516849, 12112491, 11484714, 10971392, 10579533, 10360750, 10452593, 10292704, 10379309, 10292048, 10265566, 10445588, 10652611, 10854950, 11138352, 10977516, 10931310]
4946A0931310K2711M6702L15082K55309O1834k09722M24623K41818L20833J18857
4936A2529357J83001K36937K48631M59371M19010N72297L10722K49579J06570
4927A5315475N82234O68295M63634N03709N92411L77410P38316O76161M87878
4918B0405523L65606N59394P58625Q91789Q93400J061405R93885J274175J529459
4909B8733261J753240J790622J830015K289378J728633K065840J803086J642272
4901D3636347J578399J247089Q51145R72463P46859K9929j32531K51096K49614
4892D9430410j0507R7885m5901M56881N94577N34377Q34481J167271J536375J182734
4882E5778583R59872J550658J555152J599599J616844J311460J372059J944306
$$ y = [10931310, 10954021, 11000723, 11315805, 11571114, 11632948, 11423226, 11847849, 12089667, 12410500, 12529357, 12712358, 12949295, 13197926, 13657297, 14076307, 14648604, 14959326, 15208905, 15315475, 15897709, 16566004, 17029638, 17533347, 18125758, 18503168, 19241484, 19917645, 20405523, 20771129, 21330523, 22089148, 22980937, 23874337, 24935742, 25929627, 27203802, 28733261, 30486501, 32277123, 34107138, 36396516, 38125149, 40190989, 41994075, 43636347, 45214746, 46461835, 47312980, 48285443, 49032302, 49062231, 48929700, 49180796, 49430410, 49419903, 49517788, 49471887, 49928768, 50523345, 51057722, 51892203, 53059474, 54595849, 55778583, 56738455, 58289113, 59844265, 61443864, 63060708, 64372168, 65744227, 67688533]
4874F7688533K523019L081692N108703P371329R210970J0829002J0653334Q190403
4866A24656985L789809j013641m690003o904029o857365n919510m881027l410064
4858I4771155k352983j546560j257753n80762K47998K27242P99238R83406J490549
4849I2781530K275948K407330K940553L994174N206642O915563Q195049Q798333
4841A33515122P886375M812248J027853j642382j774071j859578r65690k80050
4833A40719827L82785P03223J088289J098233Q43366L76278l7780j25880q35322
4824A44213019p35567j202364j187570j558965j246174j695771j438082j539513
4816A33609013j069369m55883k89997L10422L05953N72647O28514O72661O20335
$$ y = [67688533, 70211552, 73293244, 78401947, 85773276, 94984246, 105813248, 116466582, 124656985, 128446794, 127433153, 122743150, 115839121, 108981756, 103062246, 98181219, 94771155, 92418172, 90871612, 89613859, 89033097, 89281095, 89508337, 90307575, 91290981, 92781530, 95057478, 97464808, 100405361, 104399535, 109606177, 116521740, 124716789, 133515122, 141401497, 146213745, 147241598, 145599216, 143825145, 141965567, 140999877, 140719827, 141102612, 141805835, 142894124, 143992357, 144835723, 145212001, 145174221, 145048341, 144213019, 143477452, 142275088, 141087518, 139528553, 138282379, 136586608, 135148526, 133609013, 132539644, 132083761, 131793764, 132104186, 132410139, 132982786, 133611300, 134283961, 134904296]
4807A34904296L23254j098756j682877k530010k739152l951367m509512n102151
4799A13613725n161449n241226n214577m740939m686762m504408m772155m157237
4791G5134972m029298k992905l087299k668889k659829k086827j845219j242241
4783E4522465q52012l40726L46772R48542K134984K790094K915964K560740K065714
4774F7092537J475421Q57004m68459j030571k374756l111751l934566l134815
4766E5370044k768368k321881j873355j372349M61234J317738J763344J761974
4758E2338381K145011K874901L560711L303150K724338J624927O81489j005873
4750F8247035k070022k870616l332866m097509m953882m781190l795019k929089
$$ y = [134904296, 135227550, 134128794, 132445917, 129915907, 127176755, 123225388, 118715876, 113613725, 108452276, 103211050, 97996473, 93255534, 88568772, 84064364, 79292209, 75134972, 71105674, 68112769, 65025470, 62356581, 59696752, 57609925, 55764706, 54522465, 53670453, 53329727, 53676499, 54625041, 56760025, 59550119, 62466083, 65026823, 67092537, 68567958, 69424962, 68956503, 67925932, 65551176, 62439425, 58504859, 55370044, 52601676, 50279795, 48406440, 47034091, 47495325, 48813063, 50576407, 52338381, 54483392, 57358293, 60919004, 64222154, 66946492, 68571419, 69252908, 68247035, 66177013, 63306397, 59973531, 55876022, 50922140, 46140950, 42345931, 39416842]
4742C9416842k246837j642987p05372Q10997J793682K472262K586935K738632
4734D5224154K226411J826555P01305j29073j127136k177180k938986l396964
4726D0209086l188023k648494k241890j822686j243569r60251n18298n98777k74432
4717B6712666p65715o49130l73166m09123j48312p71979m84952j7374p8130M0358
4707B3055143m59584j3696J9138n82227Q4186k03608J68751k12079m20712L9002
4697B1474314J80155m2133l64976q12386m35320n48786l46561j87436n96657k68586
4687A8051628o49997k13885p8556j99622k26934j99685n6427r2436k24750j30100
4677A5979236k03855j20405j44440J22601O76679K60388M22053K97266J90157
$$ y = [39416842, 37170005, 35527018, 34821646, 35632643, 37426325, 39898587, 42485522, 45224154, 47450565, 49277120, 49978425, 49849352, 48722216, 46545036, 43606050, 40209086, 37021063, 34372569, 32130679, 30307993, 29064424, 28104173, 27585875, 26987098, 26712666, 25946951, 25297821, 24924655, 24515532, 24367220, 23595241, 23110289, 23092915, 23014785, 23055143, 22595559, 22581863, 22601001, 22018774, 22102960, 21899352, 22068103, 21856024, 21435312, 21474314, 21654469, 21612336, 21247360, 20434974, 19999654, 19450868, 19104307, 18916871, 18320214, 18051628, 17401631, 17187746, 17109190, 16909568, 16682634, 16482949, 16426522, 16334086, 16109336, 15979236, 15775381, 15654976, 15510536, 15633137, 16309816, 16570204, 16992257, 17289523, 17479680]
4668A7479680L67616L38429J90499L5038L04566N72534N88825K73691J09505O31304
4658B0891687R11019M81895M30446L38631N58915n4575k71493l16972n22867o72932
4648B1773754q13800m54553o00032r4410l10066l81618k92333Q2284k60786K10686
4638A8859126J02428J39348M84468J43695N94465J156891J519454J485361K155309
4629B6640545K782891L374795K536836J412638J08233q54746j580686k293881
4621C2126625k219753j892525j504064j163514j074817l87667q4457K476N27195
4612B4329499K92128Q36725J018067M46080m0779j08505M62523O32768P78362
4603B8646868J336192J197531J010062J173751O27931Q12134K06236Q24430J120721
$$ y = [17479680, 17847296, 18185725, 18376224, 18411262, 18715828, 19288362, 19877187, 20150878, 20260383, 20891687, 21802706, 22284601, 22715047, 23053678, 23612593, 23558018, 23286525, 22969553, 22446686, 21773754, 20959954, 20505401, 19905369, 19810959, 19500893, 19119275, 18826942, 18909226, 18648440, 18859126, 18961554, 19100902, 19585370, 19729065, 20323530, 21480421, 22999875, 24485236, 26640545, 29423436, 32798231, 35335067, 36747705, 36855938, 36001192, 34420506, 32126625, 29906872, 28014347, 26510283, 25346769, 24271952, 23884285, 23799828, 23802304, 24329499, 24621627, 25458352, 26476419, 26922499, 26881720, 26773215, 27235738, 27868506, 28646868, 29983060, 31180591, 32190653, 33364404, 33992335, 34804469, 35010705, 35835135, 36955856]
4594C6955856J242964J349820N46349J95491m51254p38741k98675M887L06834
4585C9113531L1422j04236k67844n29702o46219q91699q88021j85225k89707K07078
4575C5549378R9624j90437j3587m89231l3384j65212J58342N5249J81126L54987
4565C5506855P17538J193756R86368P45296J351919J155956J080349Q23269R90491
4556D4551797R72980M56140N47809M83253J212307J142708O23481R20808J444552
4547E2355835K485405K982876K953776L910614M302478M843335N331558N309517
4539H4475394O656439P492055R698305J3216431J7995795K2967029K7748057L1904740
4531B22154245L3248891L0628403K4795215J6092146N758545l911494j1961417
$$ y = [36955856, 38198820, 39548640, 40094989, 40290480, 39839226, 39100485, 38801810, 38806697, 39113531, 39144953, 39040717, 38772873, 38243171, 37596952, 36705253, 35817232, 35632007, 35342300, 35549378, 35649002, 35458565, 35444978, 34955747, 34922363, 34757151, 34915493, 34970742, 35151868, 35506855, 36224393, 37418149, 38404517, 39149813, 40501732, 41657688, 42738037, 43561306, 44551797, 45524777, 45980917, 46528726, 47011979, 48224286, 49366994, 49990475, 50911283, 52355835, 54841240, 57824116, 60777892, 64688506, 68990984, 73834319, 79165877, 84475394, 91131833, 98623888, 108322193, 121538624, 139534419, 162501448, 190249505, 222154245, 255403136, 286031539, 310826754, 326918900, 332677445, 328765951, 316804534]
4524C16804534j6875648j8561470j6406407j1604920m122317M508625J2993728
4517B66736125J9299589K3949279K4754213K0693758J3399510K445032q413284
4510C62864222j5743416k0581645k3861526k4673288k2998813j9652498j6498278
4503B18854758j3536912j1794438r543049p652457o452238n268031l714294j439050
4495A59454289M39012K603890L941742M289753L212866K574382P96229j622002
4487A75690161n117466p164151r182339r805640r892412j0167265r026591q177949
4479A07156348o601086n275181l639888k651167j708369j718623k154832k398604
4471H1008598k111708k577655l175218l395127k032265n78464l02306j59141k6656
$$ y = [316804534, 299928886, 281367416, 264961009, 253356089, 249233772, 253742397, 266736125, 286035714, 309984993, 334739206, 355432964, 368832474, 371277506, 362864222, 347120806, 326539161, 302677635, 278004347, 255005534, 235353036, 218854758, 205317846, 193523408, 183980359, 176327902, 169875664, 164607633, 160893339, 159454289, 159893301, 162497191, 166438933, 170728686, 173941552, 176515934, 177312163, 175690161, 170572695, 163408544, 154226205, 144420565, 134528153, 124360888, 115334297, 107156348, 100555262, 95280081, 91640193, 88989026, 87280657, 85562034, 83407202, 81008598, 78896890, 76319235, 73144017, 69748890, 67716625, 67138161, 66835855, 66676714, 66650058]
4462F6650058m33791j88790j410520k179440k443629l093197l249505l350605
4454E0300581j858541j741193j509090j432044q93655k23406n56743r27551o37890
4445D0520468n16929l88655l88067m01174L66031J76910J52523M53182O59856
4436D0634145R40217R56951N67856O27944J041559J262447P30166R96447P65553
4427D8523285N53463K72588J27781q0395P0684K53075j7654M01086N40642J082155
4417E1726710O80863Q90506R08890P95634O67359J211506O55025M30609N71883
4408E8538985N60758R47751M77908M89255J98110P44722Q12103P31235M34784
4399F3935611N43352R20568J170575J284566J662278J385877J180327P34559k86404
$$ y = [66650058, 66216267, 66027477, 64616957, 62437517, 59993888, 56900691, 53651186, 50300581, 48442040, 46700847, 45191757, 43759713, 42866058, 42642652, 42085909, 41158358, 40520468, 40003539, 39614884, 39226817, 38825643, 39191674, 39368584, 39521107, 39974289, 40634145, 41574362, 42531313, 43099169, 43727113, 44768672, 46031119, 46761285, 47757732, 48523285, 49076748, 49349336, 49477117, 49396722, 49467406, 49720481, 49702827, 50103913, 50644555, 51726710, 52407573, 53298079, 54206969, 55002603, 55669962, 56881468, 57536493, 57967102, 58538985, 59099743, 60047494, 60525402, 61014657, 61212767, 61957489, 62769592, 63500827, 63935611, 64478963, 65399531, 66570106, 67854672, 69516950, 70902827, 72083154, 72817713, 72531309]
4390G2531309r82447j678306k501104l014183k765716l169422k507742k088063
4382E3824326k320270k213519j637429j289067p75935n60740m80799k51446J57925
4373D4453046M13430M71499O05391J119340J444658J146828J376576J403323J016314
4364E3450405J066724P85297N01213Q57159R61053M64249L91869M7651k39796
4355E8285824m74827p97027j314313j215177r49052j082165n41311j022222j056175
4346D9833555j165530r81385o74337o97688q56162o05530l72295l26488j58146
4337D3995994r3962o0547J41117k14181l91860k20314k54046m38376q81744r55344
4327D0626737r79188q85834r28744j200694j255070r74966r22854p09516j037278
$$ y = [72531309, 71548862, 69870556, 67369452, 64355269, 61589553, 58420131, 55912389, 53824326, 51504056, 49290537, 47653108, 46364041, 45588106, 45027366, 44546567, 44295121, 44453046, 44866476, 45337975, 45943366, 47062706, 48507364, 49654192, 51030768, 52434091, 53450405, 54517129, 55302426, 55803639, 56660798, 57621851, 58086100, 58477969, 58525620, 58285824, 57810997, 57013970, 55699657, 54484480, 53535428, 52453263, 51911952, 50889730, 49833555, 48668025, 47686640, 47012303, 46314615, 45458453, 44852923, 44480628, 44154140, 43995994, 43902032, 43841485, 43982602, 43768421, 43376561, 43156247, 42902201, 42463825, 41582081, 40626737, 39647549, 38761715, 37832971, 36632277, 35377207, 34402241, 33479387, 32769871, 31732593]
4318C1732593r40596p49440o71998l08279p01026m42740J27153R2637M19600N04115
4308B9062019P21125O19644R20669R81863P28360R23809J200192R12711J095202
4299C7165594Q33487Q13452J167329R76453Q74889M04462P43779R59610N99267
4290D4538322M99418L02049p2975m43733o56763j032092j482218j472448j577873
4281C8601687j408867j050875j040804j086866r99726r37331j023037r94982r59338
4272B9099861r73406p72004o93486m36081l11634l88661r12137r20865m63522
4263B3228065k86394l18311n59800j70012K57583J8407l10891o26995l01913q1756
4253B0847983l16480l37018l4473J52638O8293m3301L25979K44925O55598P03886
$$ y = [31732593, 30791997, 30042557, 29370559, 29062280, 28361254, 27918514, 28045667, 28138304, 28557904, 29062019, 29783144, 30402788, 31323457, 32305320, 33033680, 33957489, 35157681, 36070392, 37165594, 37999081, 38812533, 39979862, 40956315, 41831204, 42235666, 42979445, 43939055, 44538322, 45037740, 45339789, 45266814, 44823081, 44166318, 43134226, 41652008, 40179560, 38601687, 37192820, 36141945, 35101141, 34014275, 33014549, 32077218, 31054181, 30059199, 29099861, 28126455, 27354451, 26660965, 26224884, 25913250, 25524589, 24612452, 23691587, 23228065, 22941671, 22623360, 22063560, 21893548, 22151131, 22169538, 21858647, 21231652, 20929739, 20847983, 20531503, 20194485, 20160012, 20312650, 20380943, 20337642, 20663621, 20908546, 21564144, 22268030]
4243B2268030K53276L98884M51892M04928M2449j93449L1416k24213J99693Q0054
4233B3712960r1961j01056l90382M31753j39594j6710j20105k24835K27503k04148
4223B3083425m53465l26609J74844K44423j04530J28748N17279K27752L40969
4214B3832836n85015M5804N50545K51438K20587m25524L05100L44390J1124J13802
4204B4665087J82739O43644O75393K76936N25008O35543O49748n633j61435K33428
4194B8320458L19729L79779J08925L36196N97194N35654N46665M79532O48468
4185C2272600R38486N38906P82411L95605P11840N06197J66711L82913j84622
4176C6511047N76065k3305k50145J20419j18350L61372J37692Q7059N42874R3684
$$ y = [22268030, 22521306, 22920190, 23372082, 23777010, 23819459, 23626010, 23657426, 23433213, 23632906, 23712960, 23620999, 23519943, 23129561, 23561314, 23421720, 23405010, 23284905, 23060070, 23287573, 23083425, 22629960, 22303351, 22478195, 22722618, 22618088, 22746836, 23264115, 23491867, 23832836, 23247821, 23293625, 23844170, 24095608, 24316195, 23890671, 24195771, 24540161, 24551285, 24665087, 24847826, 25491470, 26166863, 26443799, 26968807, 27604350, 28254098, 28248465, 28087030, 28320458, 28640187, 29019966, 29128891, 29465087, 30062281, 30597935, 31144600, 31624132, 32272600, 33211086, 33749992, 34532403, 34928008, 35639848, 36146045, 36312756, 36695669, 36511047, 37087112, 37063807, 36813662, 36934081, 36815731, 37177103, 37314795, 37401854, 37944728, 38038412]
4166C8038412M62083K62216K33452O90971L83124O04180L42645N02321N69556
4157D2088960J6353m5944l68921J5403P06839N05028Q84849N67927N05007Q41766
4147D5717267L34586N56236K38762P64229P76148P60829P80640P83255P49948
4138E1461900N20216L81871Q44581P92891Q39802R61687N44368R46278R68743
4129E8262337O38192N44272P10473M50897O64827N33797O73848O04535O62258
4120F3745436O86264K28450Q0709R8593p9552j76537n39j76000K7735K8160J31075
4109F4593794j92853Q5896J20679l33624L00743J7322J0686K66778L79328M51459
4099F5700208K03536j18521J21548O8278J85591J8129M12618N33138m55168r24983
$$ y = [38038412, 38500495, 38762711, 38996163, 39687134, 40070258, 40674438, 41017083, 41519404, 42088960, 42105313, 42059369, 41690448, 41705851, 42412690, 42917718, 43802567, 44370494, 44875501, 45717267, 46051853, 46608089, 46846851, 47611080, 48387228, 49148057, 49928697, 50711952, 51461900, 51982116, 52363987, 53208568, 54001459, 54841261, 55802948, 56347316, 57293594, 58262337, 58900529, 59444801, 60155274, 60606171, 61270998, 61804795, 62478643, 63083178, 63745436, 64431700, 64660150, 64740859, 64839452, 64759900, 64583363, 64582824, 64406824, 64434559, 64462719, 64593794, 64400941, 64486837, 64607516, 64273892, 64574635, 64591957, 64602643, 64869421, 65248749, 65700208, 65903744, 65785223, 65906771, 65975049, 66160640, 66178769, 66591387, 67124525, 66669357, 65744374]
4089F5744374j166344o90814l82459m19957l96390N9733N07303J001541L18185
4080F4575172j8135L42269J04507j67165m50830m15793k68258k88687p50218o58715
4070F2004147n71313l80029o79661r26181o41149p65818n44423p95897k26129
4061E6473547p9110j94079l15243o31462q31659r25898j325743j489807j096186
4052D9584360j077269j014266r27070q34184r04360q17181q29579q15865p30891
4043D1633695n30461r94169o73288p58554l97380r68475j024152n18692p89744
4034C4978780o13372r46951p43923n13363l18702o78074p82818l46280r4888p04012
4024B9236397o62985m49169o93664m98616n77786n10982o57151l56692l67379
$$ y = [65744374, 64578030, 63887216, 63504757, 63084800, 62688410, 62748143, 63255446, 64256987, 64575172, 64557037, 64899306, 65003813, 64836648, 64385818, 63970025, 63701767, 63413080, 62662862, 62004147, 61432834, 61052805, 60373144, 59446963, 58805814, 58039996, 57495573, 56699676, 56473547, 56394437, 56200358, 55885115, 55253653, 54421994, 53496096, 52170353, 50680546, 49584360, 48507091, 47492825, 46565755, 45731571, 44827211, 44010030, 43180451, 42364586, 41633695, 41103234, 40109065, 39435777, 38677223, 38279843, 37311368, 36287216, 35768524, 34978780, 34365408, 33418457, 32674534, 32161171, 31842469, 31164395, 30381577, 30035297, 29940409, 29236397, 28573412, 28124243, 27430579, 26931963, 26354177, 25843195, 25186044, 24829352, 24461973]
4015B4461973k69648J63073j66385n09737o4717R1181j55066l39775o61703p13587
4005B1835609l20069l80952o99358l51116l32073k91551p14976n16272l36622
3996A7892620p01120j27060l39459m34411K9720O4100k69262m78879l13597j20919
3986A5201733n48471n13526j45768j70999K95821j51067k42018k03653K07502
3977A3729554J9526k07619K8646k67621o7270N2455n59056n06697j00352O29807
3967A2751373N76730L42473R33848K96114n1265q75088r34143r33969k32610m12045
3957A1461418p46072m80622J27975K9128l91199l39025n72013M48144j60052k76961
3947I100721j96084J03390K93106p7493n9388N4626l5768K42574j94170J51431
$$ y = [24461973, 24192325, 24355398, 24189013, 23679276, 23614559, 23705740, 23550674, 23210899, 22549196, 21835609, 21515540, 21134588, 20435230, 20084114, 19752041, 19460490, 18745514, 18229242, 17892620, 17191500, 17064440, 16724981, 16290570, 16320290, 16384390, 16115128, 15636249, 15322652, 15201733, 14653262, 14139736, 13993968, 13822969, 14118790, 13967723, 13725705, 13522052, 13729554, 13749080, 13541461, 13570107, 13302486, 13235216, 13287671, 12728615, 12221918, 12121566, 12751373, 13328103, 13670576, 14604424, 14900538, 14849273, 13974185, 13040042, 12106073, 11873463, 11461418, 10715346, 10234724, 10362699, 10391827, 10000628, 9661603, 9089590, 9537734, 9377682, 9100721, 8904637, 9008027, 9301133, 9223640, 9164252, 9218878, 9183110, 9425684, 9231514, 9382945]
3937I382945M31717Q97081J088685M47565O71042K4384l98710n30709o37922p91787
3927A0584291k64206m13768l15374j62318K49232j93093l16178o7356o2868J26860
3917I165222j56263L6066j66095j29417j40844q7388M8070P5596o8063o1486J94844
3906H710242M19653N9636M04720m0513k3064K08299j35100m93982j06000J49940
3896I153831k3481j61193k26270Q7635K3332k0830n11437J16949J66669K08627
3886H813832q8946Q2576M64139J33356j98764k85708k99143n5907j17686k01281
3876H246468j4333J05184P6792k36350J57571j18795K65733j34577j54989j95757
3866G996947J25414K87978O4237n2693k34447r2082j9235K66872L07525k00761
$$ y = [9382945, 9814662, 10711743, 11800428, 12247993, 12919035, 12943419, 12544709, 12014000, 11376078, 10584291, 10320085, 9906317, 9590943, 9428625, 9677857, 9484764, 9168586, 9101230, 9038362, 9165222, 9008959, 9045025, 8878930, 8749513, 8608669, 8521281, 8569351, 8644947, 8576884, 8515398, 8710242, 9129895, 9189531, 9594251, 9553738, 9530674, 9738973, 9603873, 9109891, 9003891, 9153831, 9130350, 8969157, 8742887, 8830522, 8853854, 8833024, 8321587, 8438536, 8605205, 8813832, 8724886, 8807462, 9271601, 9404957, 9206193, 8920485, 8621342, 8565435, 8447749, 8246468, 8232135, 8337319, 8414111, 8177761, 8335332, 8216537, 8482270, 8347693, 8192704, 7996947, 8122361, 8410339, 8474576, 8421883, 8187436, 8095354, 8076119, 8342991, 8650516, 8449755]
3856H449755k09938M92701k6397K84670n3172Q0786K63314R3686m36052j0814
3846H928539L52951J01660k84243R698L56676K11055M68732j36446O45647K96880
3836A0951149N57795J11162K68330O49165N28407Q064K63741N27759L82703P44972
3826A4993247M31832N34328L49855O33423L45366P18115J71111K10659K32046
3817A8619982J34307j88046j94365m66740l64101k81363l48969m30529m01809
3808A6078367m256J13200J75831l46504N14272K31640J46742J69003K04424L52485
3798A7635204M74853L379J35344N87664O70190N19711O00328Q43291O86748R68788
3788B3125500P58775J400345J174220J300191J164260R90627P65785R75849K22303
$$ y = [8449755, 8239817, 8732518, 8706121, 8990791, 8937619, 9018405, 9281719, 9375405, 8939353, 8928539, 9281490, 9383150, 9098907, 9108605, 9465281, 9676336, 10145068, 10008622, 10654269, 10951149, 11508944, 11620106, 11888436, 12537601, 13066008, 13074072, 13337813, 13865572, 14248275, 14993247, 15425079, 15959407, 16309262, 16942685, 17288051, 18006166, 18177277, 18387936, 18619982, 18754289, 18566243, 18371878, 17905138, 17541037, 17259674, 16910705, 16480176, 16078367, 16074111, 16187311, 16363142, 16016638, 16530910, 16762550, 16909292, 17078295, 17282719, 17635204, 18110057, 18113436, 18248780, 18836444, 19506634, 20026345, 20626673, 21469964, 22156712, 23125500, 23884275, 25284620, 26458840, 27759031, 28923291, 29913918, 30679703, 31655552, 31877855]
3779C1877855L05784R1049m39412l97820j31844K2261n06523N4296o65721N6874
3769C0266799K44950j0214N5565K9404q1629o570o3952j15356l5053P9033m6196
3758C0316781j38236m47185k96641m7075l91008K3718L32815p0695l5820L21519
3748B9568173J73149O65164L38724K72873K01565K05392q6716j83360L82176m2208
3738C1494932J01074K46659O38888R48275O24004J075306J457677Q15860P96986
3729C8199661L11472K00974L59431j15578n63587n42478k39137p12811r28612
3720C5969335r68805j417668j245169r58321j145871p97098p35732o14907n05751
3711B7580013n46243k42913j43111k36323k35040m39151l0724J7064K2307n5187
$$ y = [31877855, 32183639, 32274688, 31835276, 31437456, 31305612, 31327873, 30821350, 30875646, 30209925, 30266799, 30511749, 30501535, 30557100, 30586504, 30504875, 30498305, 30434353, 30318997, 30283944, 30362977, 30316781, 30178545, 29731360, 29434719, 29387644, 28996636, 29020354, 29353169, 29282474, 29246654, 29568173, 29741322, 30406486, 30745210, 31018083, 31219648, 31425040, 31338324, 31154964, 31537140, 31494932, 31596006, 31842665, 32481553, 33429828, 34053832, 35129138, 36586815, 37402675, 38199661, 38511133, 38712107, 39071538, 38955960, 38392373, 37849895, 37610758, 36897947, 35969335, 35000530, 33582862, 32337693, 31379372, 30233501, 29436403, 28700671, 28085764, 27580013, 27033770, 26790857, 26647746, 26411423, 26176383, 25737232, 25706508, 25723572, 25745879, 25690692]
3701B5690692K81043O32923K10798M35481M81299J95436K15002p4070l67947o5117
3691B7635540k38959n01567m65912l84440j08217m08248o19679m09324m03865
3682B4095329j71353l07190n29210o46180q0324j912l49616j37036J46009J00658
3672B2119175J48346l01362p61116O2953m67755j101705j032175o93909n56373
3663A7416079p58314n49571m40668l41363m02874l71271l57689j72342K29349
3654A4251336k26491m43973L22242K8372K42537J47129l00698j48662J9847j70970
3644A3720669l0665k47338N6671l8183M6170O5680P3112L77144n0484J73788l71413
3633A3775151m07779m60067o68362m82481j65404l68139l45906j14696O299l6930
$$ y = [25690692, 25971735, 26604658, 26815456, 27250937, 27732236, 27927672, 28142674, 28068604, 27700657, 27635540, 27396581, 26895014, 26429102, 26044662, 25936445, 25528197, 24908518, 24499194, 24095329, 23923976, 23616786, 23087576, 22441396, 22361072, 22359160, 22009544, 21872508, 22018517, 22119175, 22267521, 21966159, 21205043, 21267996, 20800241, 19698536, 18666361, 17972452, 17416079, 16657765, 16108194, 15667526, 15326163, 14923289, 14552018, 14194329, 14021987, 14251336, 14024845, 13580872, 13903114, 13931486, 14174023, 14321152, 14020454, 13871792, 13891639, 13720669, 13690004, 13442666, 13499337, 13461154, 13507324, 13573004, 13646116, 14023260, 13972776, 14146564, 13775151, 13367372, 12907305, 12238943, 11756462, 11591058, 11222919, 10877013, 10762317, 10768616, 10731686]
3623A0731686K04000l18017m94973j72225k46511q9576J40293L506j95594L3185
3613I595774j96032Q9748J49541M50466J90666R646P5857L02989j3187l13903
3603A0341565J56252k59989p3178j44918l46222o7616J89321J71787L42592N64794
3593A0874388P38118N74637L92619L08687l3159k54889m26283n11009n04560j15077
3583A1043472K7982p52715m18153J25416K8146K42038J10950J74472N68672K08361
3573A1358641l9482K86636N06175L14131k35282P7433N1764L78468L37218N1605
3563A3087307N28670M29152L69630L81513M27313P23743K26406n98148r1828M5229
3553A5528987J15412p989m21350k32763J93277L24161o2701l50525K42319j51212
$$ y = [10731686, 10935686, 10617669, 10122696, 9950471, 9703960, 9614384, 9754677, 9758183, 9562589, 9595774, 9399742, 9489490, 9639031, 10089497, 10280163, 10289809, 10365666, 10668655, 10655468, 10341565, 10497817, 10237828, 10164650, 10019732, 9673510, 9605894, 9795215, 9967002, 10309594, 10874388, 11612506, 12187143, 12579762, 12888449, 12855290, 12600401, 12174118, 11663109, 11158549, 11043472, 11071454, 10318739, 9900586, 10026002, 10054148, 10296186, 10407136, 10581608, 11150280, 11358641, 11319159, 11605795, 12111970, 12426101, 12190819, 12268252, 12320016, 12698484, 13035702, 13087307, 13615977, 14045129, 14414759, 14796272, 15223585, 15947328, 16173734, 15575586, 15483758, 15528987, 15644399, 15636410, 15215060, 14982297, 15175574, 15499735, 15437034, 15086509, 15328828, 15177616]
3543A5177616k02284k62674k41054L05312J00640J54111L75704O46804O67340
3534A6721515L14739J7010N58850N64253K59087J76671K77224L17159O18981Q54132
3524B0679621L38230O75052J175690J321520J548803J456124J743541J943602
3516C0882183K323654J776833J249804J505950J568326Q98596m01610n44609o21622
3507C8637505o43578o86872j360146j442362o81151q38361p42519n75366n89303
3498C1077847l00947o85579q66728o61547k47437j35970p37088j071462p70652
3489B5600437l90719m74194j019570p22607o05056n25823n08445p85335p79751
3480A9788937j53146k67122n28760j80671l87860j23050j58285j03053p96J74213
$$ y = [15177616, 14975332, 14712658, 14471604, 14776916, 14877556, 15031667, 15407371, 16054175, 16721515, 17036254, 17053264, 17612114, 18176367, 18435454, 18612125, 18889349, 19206508, 19825489, 20679621, 21017851, 21692903, 22868593, 24190113, 25738916, 27195040, 28938581, 30882183, 33205837, 34982670, 36232474, 37738424, 39306750, 40205346, 39803736, 39259127, 38637505, 37993927, 37307055, 35946909, 34504547, 33823396, 32985035, 32242516, 31667150, 31077847, 30776900, 30091321, 29224593, 28563046, 28315609, 28179639, 27442551, 26371089, 25600437, 25209718, 24735524, 23715954, 22993347, 22388291, 21862468, 21354023, 20568688, 19788937, 19635791, 19368669, 18839909, 18659238, 18271378, 18148328, 17990043, 17886990, 17886194, 18060407]
3470A8060407l3095J39947J25174J66560N89205j6064J19995J59072J2992N0548
3460A9374741L37434J0717L56365M33062L66208J66106M48245L35169N66791N41763
3450B2936601K29845M55574N18334O68589P32735N31684L22065L17279L17406
3441B7030112O14312O06903L66004N5249O64539K52689O49546O23056K13259J70196
3431C1245865N98577M09167N97455Q40542P90300J171631N02792R47387J095206
3422C8198922J589560J459249J329501J599253K063204K108395K027557K225089
3414E2600730L054019L094231L378322L724331M127508N650020N762745O487640
3406H7879546Q094067J0469372J3565112J7657660K2135909K6571649K9042158
$$ y = [18060407, 18027312, 18167259, 18292433, 18458993, 19048198, 19032134, 19152129, 19311201, 19324193, 19374741, 19712175, 19722892, 20079257, 20512319, 20878527, 21044633, 21492878, 21828047, 22394838, 22936601, 23166446, 23622020, 24140354, 24808943, 25541678, 26073362, 26395427, 26712706, 27030112, 27644424, 28251327, 28617331, 28672580, 29337119, 29589808, 30239354, 30862410, 31075669, 31245865, 31844442, 32253609, 32851064, 33691606, 34481906, 35653537, 36156329, 37103716, 38198922, 39788482, 41247731, 42577232, 44176485, 46239689, 48348084, 50375641, 52600730, 55654749, 58748980, 62127302, 65851633, 69979141, 75629161, 81391906, 87879546, 95973613, 106442985, 120008097, 137665757, 159801666, 186373315, 215415473]
3399B15415473K9989370K6659048J9444663Q555349l024608j2743703j8530559
3392B65765033k0517026k0912149j9578545j7879186j5306324j3313099j1029758
3385A47228946r196726p027085m886111l094692j676119K5994J395347K756278
3377A25525832N329606P727023J0374300J3453515J7419741K1650400K4368060
3370B25848477K4765355K2076806J5901028O982879m633191j4733195k1371133
3363B54837026k3197142k3271328k2183225j9766415j7797375j5471732j3771320
3356A19378489j2097504j0349289q656659p450130o033237m910486l626577l207646
3348F3046961k910164k136371j238321p34693q03109n09053o78857q47271j192500
$$ y = [215415473, 245404843, 272063891, 291508554, 300063903, 297039295, 284295592, 265765033, 245248007, 224335858, 204757313, 186878127, 171571803, 158258704, 147228946, 138032220, 131005135, 126119024, 123024332, 121348213, 121374207, 122769554, 125525832, 130855438, 138582461, 148956761, 162410276, 179830017, 201480417, 225848477, 250613832, 272690638, 288591666, 295574545, 290941354, 276208159, 254837026, 231639884, 208368556, 186185331, 166418916, 148621541, 133149809, 119378489, 107280985, 96931696, 88275037, 80824907, 74791670, 69881184, 66254607, 63046961, 60136797, 58000426, 56762105, 56027412, 55224303, 54715250, 54036393, 53189122, 51996622]
3339E1996622k140010k351479k191249k141334j720960j433704j171700j389004
3331C7457182j326707j251590p25943o59126q05385r20451n99662j25044j98247
3322C0845027l77161n11367k58788p34059k53102l96465l58512p16489p71040
3313B6468044m86529j67857Q8925l51149m45410r6803m574j5636k61811j32610
3303B4594590L9463k92399k83652m29746k76977j07629l34376n11839l91687l57652
3293B1648096m88277m28050n2576j97855j72399k73836k9072L44128L80184j5373
3283B0714970k80102j41179k13766l69187l89203k31876N6203n6948j89250Q2110
3273A8981772J3191k18051k15041j72306K49175q2283n0120R7461j0114J24326
$$ y = [51996622, 49856612, 47505133, 45313884, 43172550, 41451590, 40017886, 38846186, 37457182, 36130475, 34878885, 34152942, 33493816, 32688431, 31767980, 31168318, 31043274, 30845027, 30467866, 29956499, 29697711, 28963652, 28710550, 28314085, 27955573, 27239084, 26468044, 25981515, 25813658, 25902583, 25551434, 25106024, 25009221, 25004647, 24989011, 24727200, 24594590, 24634053, 24341654, 24058002, 23628256, 23351279, 23243650, 22909274, 22397435, 22005748, 21648096, 21159819, 20731769, 20679193, 20481338, 20308939, 20035103, 20006031, 20350159, 20730343, 20714970, 20434868, 20293689, 20079923, 19710736, 19321533, 19089657, 19145860, 19088912, 18899662, 18981772, 18994963, 18776912, 18561871, 18389565, 18638740, 18556457, 18506337, 18603798, 18593684, 18718010]
3263A8718010l66067j00618K670K13196K20691P6498K79590M97977q1436K78200
3253A9738711L86219N26593Q4845l4770L52956p4750J79749k18153j02234N494
3243B0844660k24085j7329J26894m0827J96756P4535J41688j14148j94593M50793
3233B1244344N71209P67967Q03877O32650N14758O04361Q78611J013244J168467
3224B8199488J769685K151479K815107L499854M196035M872045M455234L706763
3216E5665690K478114J039421m22219j858691k583872j897842j432570j021719
3208D9966312q77622k89167k24996n53583r57708j375617q04905l39392k53457
3199D4289865k23236J66909K46734N86177O81621J252594J501838K642636K877158
$$ y = [18718010, 18351943, 18251325, 18253995, 18467191, 18687882, 18764380, 19043970, 19541947, 19460511, 19738711, 20124930, 20651523, 20736368, 20701598, 21054554, 20979804, 21159553, 20941400, 20839166, 20844660, 20620575, 20603246, 20730140, 20689313, 20886069, 20960604, 21102292, 20988144, 20793551, 21244344, 21815553, 22583520, 23387397, 24020047, 24534805, 25139166, 26017777, 27031021, 28199488, 29969173, 32120652, 34935759, 38435613, 42631648, 47503693, 51958927, 55665690, 58143804, 59183225, 58761006, 56902315, 54318443, 52420601, 50988031, 49966312, 49088690, 48799523, 48574527, 48020944, 47063236, 45687619, 44882714, 44543322, 44289865, 44066629, 44233538, 44480272, 45066449, 45748070, 47000664, 48502502, 51145138, 54022296]
3190E4022296L628125L955604L253817K708918R86198m89730j931286k664944
3182F3468998k967527k620562j991872j652520j612185j475619j645429j274206
3174D8229078j158120p15717k44157l9278j55827M32554K91913p86561j988654
3165D3865231k820466k732856k519772j864877k238748j762969j580648j458317
3157B6886578j169532r78293q21011p37065m58822n19374n3246k65735q021J52013
3147B2027492K17688J0024q4121J33274O76732O95067Q48851P25079O35563M35605
3137B6321254j2006K4732n52705n97891q06021r60839o55490q64258j204050p31610
3127A9961116j235604n68149o52469l93155m73860p16100m34487n78256k16658
$$ y = [54022296, 57650421, 61606025, 64859842, 67568760, 68554958, 68065228, 66133942, 63468998, 60501471, 57880909, 55889037, 54236517, 52624332, 51148713, 49503284, 48229078, 47070958, 46355241, 46111084, 46071806, 45915979, 46348533, 46640446, 45853885, 43865231, 41044765, 38311909, 35792137, 33927260, 31688512, 29925543, 28344895, 26886578, 25717046, 24738753, 23917742, 23180677, 22721855, 22202481, 22149235, 21883500, 21875479, 22027492, 22245180, 22255204, 22171083, 22304357, 22981089, 23676156, 24525007, 25250086, 25885649, 26321254, 26309248, 26333980, 25781275, 25183384, 24377363, 23416524, 22761034, 21896776, 20692726, 19961116, 18725512, 18157363, 17504894, 17111739, 16637879, 15921779, 15487292, 14909036, 14692378]
3118A4692378m27329k53716m8676m100l9712j80568p11567m04162n25525l59982
3108A1737041P6107l24945o3734j04211p1099k82259l63235j70894j18644L2005
3098A0346132j10590j41036J9982j34034j8226j30663n2558K72661K68745M97727
3088A0818140P12462P81501N97987Q59661Q79376Q44995R20773Q61384J64141
3079A7440420L3905k87919J43638J89316m30666p87534j133603q17413q66647
3070A3483497j033433j075772j034615q38542l81550p65195m38090k46628j64677
3061G504995l93178n21938o2732r5178N4361j40395k52456j1317R2077j26482
3051F047757j62691k00443r792Q338j21597M4297M8437q975p8453l88550J94689
$$ y = [14692378, 14265049, 14011333, 13962657, 13958557, 13918845, 13738277, 13026710, 12622548, 12097023, 11737041, 11813148, 11488203, 11424469, 11320258, 11249159, 10966900, 10603665, 10432771, 10314127, 10346132, 10235542, 10094506, 10114488, 9980454, 9962228, 9831565, 9779007, 10051668, 10320413, 10818140, 11530602, 12312103, 12910090, 13769751, 14649127, 15494122, 16414895, 17276279, 17440420, 17474325, 17186406, 17330044, 17519360, 17088694, 16301160, 15167557, 14350144, 13483497, 12450064, 11374292, 10339677, 9501135, 9119585, 8354390, 7916300, 7669672, 7504995, 7111817, 6589879, 6527147, 6431969, 6486330, 6345935, 6093479, 6082162, 6174239, 6047757, 5885066, 5684623, 5674831, 5683169, 5561572, 5605869, 5654306, 5645331, 5566878, 5178328, 5373017]
3040E373017K48489m8028j97697k68218J20516k4574J95977l1671j70957J60093
3030E356947M32399J26009L84440K05739K28246J37290K78563P88281Q3629j2332
3020H009211l84759k77462N10956J86896j96204m59742l48399J6123m65298l36808
3010F254514m83579l06948O9763j86503l05998J58437k57155l37593o14009m34513
3000C556416J52606n1017L31290j97277K28591j31217O9285k07011k30781J58646
2990C679531O2136O7027J89106J78723K54580j21424o14380j68569J79485K61809
2980C968024k14388k09827j83882O9427K30733j85756n12934l42381k39282M95731
2970B875465J56235J17919k80534k51273J74764J65361L20765k52319j61805l19616
$$ y = [5373017, 5621506, 5573478, 5375781, 5107563, 5228079, 5203505, 5399482, 5367811, 5196854, 5356947, 5789346, 5915355, 6299795, 6505534, 6733780, 6871070, 7149633, 7937914, 8021543, 8009211, 7624452, 7346990, 7857946, 8044842, 7848638, 7388896, 7040497, 7056620, 6591322, 6254514, 5770935, 5463987, 5533750, 5347247, 5041249, 5199686, 4942531, 4604938, 3990929, 3556416, 3709022, 3658005, 3989295, 3792018, 4020609, 3889392, 3958677, 3751666, 3520885, 3679531, 3741667, 3808694, 3997800, 4176523, 4431103, 4309679, 3695299, 3526730, 3706215, 3968024, 3753636, 3543809, 3359927, 3429354, 3660087, 3474331, 2961397, 2619016, 2379734, 2875465, 3031700, 3149619, 2869085, 2617812, 2792576, 2957937, 3278702, 3026383, 2864578, 2544962]
2960B544962o5174K42193N6095R4009J75630l13223P0226N05162l8480J6641n90533
2949B697508n7190l3327O7466r7596l11784J42962Q4167l27571j1532K11586K58752
2938B623441J42306k87114N0855M37247L58463o4610j81031j47519R0765j70470
2928B852333n2944m2629k60651k10090R1219O9639L21306P2939j75342j23717
2918B542063J50290L21016R1854N7069n71976l2495J18259o2345O6703l25101
2908B355337n0653L88346K71098J313l96956l19847j78282K0683M28291k5647
2898B493683k6711j24047K01707K2497l84225j09538o5034P649K85950O3033k4789
2887B340175N5155J28680j55117j33364p8117n3549K18619l8835l29988k0626
$$ y = [2544962, 2479788, 2721981, 2778076, 2872085, 3047715, 2734492, 2804718, 3309880, 3271400, 3288041, 2697508, 2640318, 2606991, 2674457, 2576861, 2265077, 2408039, 2492206, 2164635, 2153103, 2364689, 2623441, 2765747, 2478633, 2529488, 2966735, 3325198, 3260588, 3079557, 2932038, 3022803, 2852333, 2799389, 2756760, 2496109, 2286019, 2377238, 2446877, 2768183, 2841122, 2665780, 2542063, 2692353, 3013369, 3105223, 3162292, 2590316, 2557821, 2676080, 2613735, 2680438, 2355337, 2304684, 2693030, 2964128, 2965441, 2568485, 2248638, 2070356, 2091039, 2519330, 2493683, 2466972, 2342925, 2544632, 2567129, 2182904, 2073366, 2008332, 2015981, 2301931, 2364964, 2340175, 2395330, 2524010, 2368893, 2235529, 2157412, 2103863, 2322482, 2283647, 1953659, 1933033]
2877A933033K61119k7870k59677L4148L84993J68286r9077m41424m8299J30688
2867B035920m4948j82026k80584M52160M05993l31441n81809k99757O76272P4589
2857A924369m36161l64157n9769Q23205M7714k73762l38367j58763L04426j09307
2847A359428j17502J21048J54318L49636k56073r6331L45262j02308j12066n09706
2837A135706P3719K23442J44960k49566l91572K50814J13083L19161j71270n29209
2827I19268K68815J11255J73122k48789n55725M14156K9781M5579k95799n427
2817H56236L04710J21458q921j60090j1599L11430k06965K61979J72192j93251
2807A447179M7464n04035K86113k78942l78253J84854O4035J09832J18634J69589
$$ y = [1933033, 2194152, 2166282, 1906605, 1940753, 2325746, 2494032, 2394955, 1953531, 1905232, 2035920, 1990972, 1808946, 1528362, 1980522, 2386515, 2055074, 1473265, 1173508, 1849780, 1924369, 1488208, 1124051, 1064282, 1887487, 1935201, 1661439, 1323072, 1164309, 1468735, 1359428, 1241926, 1362974, 1517292, 1866928, 1610855, 1514524, 1859786, 1757478, 1645412, 1135706, 1209425, 1432867, 1577827, 1328261, 936689, 1187503, 1300586, 1619747, 1448477, 919268, 1188083, 1299338, 1472460, 1223671, 667946, 1082102, 1111883, 1157462, 861663, 856236, 1160946, 1282404, 1273483, 1113393, 1101794, 1413224, 1206259, 1468238, 1640430, 1447179, 1494643, 990608, 1276721, 997779, 619526, 804380, 868415, 978247, 1096881, 1266470]
2797A266470k30685j75209L39494j70588P6958J85366p5118K28376m7700j09610
2787A287754j34274l02729Q9433J28298K07624Q2947l20940j71841J4647J04731
2777I85650j47223N9940J74521m5423K77018Q3458l17013q2024m3125j85168K36481
2766I97092m3930m3373J8764K57274j09183Q1308m28563q7543P8631q8810K05042
2755H36709n5927J0744m3590Q3181m990J22321J18629q9785Q9957L38460l49647
2744A056062O2529k93568L745K39945m3642J630k5431P5866p0301j33194r7762
2733G75879j93418j38347J81245K55780L25361k09828Q5231l04351J53417L38080
2723A269049j66974J3872k8359K52217m1381j89789q5627j76122j287O3313m61636
$$ y = [1266470, 1035785, 860576, 1200070, 1029482, 1106440, 1291806, 1216688, 1445064, 1397364, 1287754, 1153480, 850751, 940184, 1068482, 1276106, 1359053, 1038113, 866272, 880919, 985650, 838427, 898367, 1072888, 1027465, 1304483, 1387941, 1070928, 988904, 945779, 760611, 997092, 953162, 909789, 928553, 1185827, 1076644, 1157952, 729389, 641846, 720477, 631667, 836709, 780782, 791526, 747936, 831117, 826127, 948448, 1067077, 977292, 1067249, 1405709, 1056062, 1118591, 825023, 828768, 1068713, 1025071, 1026701, 1001270, 1077136, 1006835, 873641, 775879, 582461, 444114, 625359, 881139, 1206500, 996672, 1081903, 777552, 930969, 1269049, 1102075, 1115947, 1087588, 1339805, 1298424, 1108635, 1023008, 846886, 845599, 908912, 447276]
2712D47276N96850l29850J9678Q0871j10685M20021j70188J07700N2478p0393
2702A043758J90789j76730k35006M3878J43383L51479o12477o3440n7486L04270
2692I32418L38046m82080M0191p7749L33477L43322l85764j28060o826n062P662
2681I09575k89719K49498K53387k44533k05052K1990M87642m5525k18080j13424
2671H05759l6904N53686k17265k38561j78550J92370N44260k87529k46832j62660
2661G27774L32279J36134l08086m6868O5344L71870M4626k96469L02934l1049
2651A298489L1102j4590k4991J5293q5660j96736J30982j58690O286p458J20707
2640A114734J14106p505L03208l06127K9701o4712L20303Q1023n3178k76722j08574
$$ y = [447276, 1044126, 714276, 733954, 814825, 704140, 1124161, 953973, 1061673, 1114151, 1043758, 1234547, 1057817, 822811, 866689, 1010072, 1361551, 749074, 685634, 628148, 932418, 1270464, 788384, 828575, 750826, 1084303, 1427625, 1041861, 913801, 906975, 901913, 909575, 619856, 869354, 1122741, 878208, 673156, 695146, 1182788, 1137263, 919183, 805759, 768855, 1322541, 1105276, 866715, 688165, 880535, 1424795, 1137266, 890434, 727774, 1060053, 1196187, 888101, 841233, 906577, 1278447, 1323073, 1026604, 1329538, 1298489, 1329591, 1315001, 1290010, 1305303, 1219643, 1022907, 1153889, 995199, 1001485, 994027, 1114734, 1228840, 1221335, 1524543, 1218416, 1248117, 1183405, 1503708, 1584731, 1531553, 1254831, 1146257]
2629A146257J64922K22993N9070l53641l09931O7956L07492K24188j48137k70825
2619A110344L1532j85909J33106j91518j5831j62718l13710P2803J92406K0524
2609F91029p1697j53251Q2348L53857l8105k7404j37579N61808q2033l9058L876
2598A143791J04001n5836l50681k52652m9732j714j48925J20632J49749L33358
2588I91991l17780L0831J33415K61118k13852k81055j9705L50165L44636k91168
2578I88596l88593k3713K97878J59279n7470j37419K57534l17405j70489j33622
2568D74576K57226P9249l11798j24039K04561M00203k44267m25919l7247J63277
2558D35822J92196k0468J3692K30889L3797L42824k18925j15451k67994k14510
$$ y = [1146257, 1311179, 1534172, 1593242, 1239601, 929670, 997626, 1305118, 1529306, 1381169, 1110344, 1141876, 955967, 1089073, 897555, 881724, 719006, 405296, 478099, 670505, 691029, 619332, 466081, 548429, 902286, 864181, 836777, 699198, 1261006, 1178973, 1139915, 1143791, 1247792, 1191956, 841275, 588623, 538891, 537177, 388252, 508884, 658633, 991991, 674211, 705042, 838457, 1099575, 885723, 604668, 584963, 935128, 1279764, 988596, 600003, 576290, 874168, 1033447, 975977, 838558, 1096092, 778687, 608198, 474576, 731802, 811051, 499253, 375214, 579775, 979978, 735711, 309792, 272545, 435822, 628018, 607550, 621242, 852131, 885928, 1228752, 1009827, 894376, 626382, 411872]
2548D11872k2606M8704M03192j98242L4322N452j0613q0160p2230n7136K17252
2537F79807K50001o8966K0130J71419J08091j32121j0077j59069k70288j29948
2527D58979J3531J09266q9121l28580J21808J76894K58176j45305j43740j80018
2517B51890L29810P7549m0725K0409J1301K99625k6672j56011J74770j15833j28374
2506F97739M49J34423L15547k2358m25782k23598M17708J69913l97025k71242
2496C95774J06563K62266L8993j75469m6997M8920K47861o706j14075j1030K38005
2485I84105J98497J2719K9832l37740j73768r3205j79738J11769K85037K35140
2475A072648L997k513l285k5672l88737m75875p2463K67718M39549M24646j09696
$$ y = [411872, 389266, 437970, 841162, 642920, 677242, 682694, 672081, 591921, 519691, 462555, 679807, 929808, 860842, 880972, 1052391, 1160482, 1028361, 1018284, 859215, 588927, 458979, 472510, 581776, 492655, 164075, 285883, 462777, 720953, 575648, 431908, 251890, 581700, 659249, 618524, 638933, 650234, 949859, 923187, 767176, 941946, 826113, 697739, 698188, 832611, 1148158, 1125800, 700018, 476420, 894128, 1064041, 667016, 395774, 502337, 764603, 803596, 628127, 581130, 630050, 877911, 871205, 757130, 746100, 984105, 1182602, 1195321, 1225153, 887413, 713645, 620440, 440702, 552471, 837508, 1072648, 1076645, 1074132, 1070847, 1045175, 656438, 180563, 108100, 375818, 815367, 1240013, 1130317]
2464A130317j25397P4710K1742k35755k46246n7129L99610J96329n2302j24603
2454I81276l8794Q1771L4811n0991j8471J84778q8226j93630N8378L11975l859
2443A259018j48014k39278K23059K94446j32282k52851M2009K60352J07454J2082
2433A425995k78618L63263J91743n2913q8979J6824j08690K06815q700J06548
2423A773288l69460K08244O3154M0801k0561J39761L56916J13608J74103j4035
2413B465819O8769J09144Q8071n07874M58673K63272K27499k57752m21219J0312
2403B504714J24091K6272m83929q1036L27610P55805p690J87883L06105P58304
2393D418129p169j13193k33669M24848O15334L68715J99430J012170J245852R92051
$$ y = [1130317, 1004920, 1079630, 1101372, 865617, 619371, 562242, 961852, 1158181, 1105879, 981276, 942482, 1024253, 1059064, 1008073, 989602, 1174380, 1086154, 892524, 950902, 1262877, 1259018, 1111004, 871726, 1094785, 1389231, 1256949, 1004098, 1046107, 1306459, 1413913, 1425995, 1147377, 1510640, 1702383, 1649470, 1560491, 1577315, 1468625, 1675440, 1666740, 1773288, 1403828, 1612072, 1675226, 1716027, 1695466, 1835227, 2192143, 2305751, 2479854, 2465819, 2534588, 2643732, 2731803, 2223929, 2682602, 2945874, 3173373, 2915621, 2494402, 2504714, 2628805, 2655077, 2171148, 2090112, 2417722, 3173527, 3165837, 3353720, 3659825, 4418129, 4410960, 4297767, 4064098, 4488946, 5104280, 5472995, 5672425, 6684595, 7930447, 8922498]
2383H922498R74819P35978J039385N03089K67404K89229J223686J783410K679019
2374A8418517L403096P003088J2247712J6849328J7663413J5759889J7951767
2367A09296810J7061500l29429j0678777j7356513j6482698j0841859p689363
2360F2979671p889976j0500854q103632o618561n027845m165965l065091j876921
2352A5730826j088214r51502r58031r75874n20277p96398n70059p95997o04952
2343H469522l27284p46313o2954k48180n43034m25665m99290k35909n4337j72551
2333E154005l92166j53637K78511R8791k05959l47909k26846m9458m75486m81062
2323C198784l68047J83197K5479k62640m71590M97996L43129J03819j29811l7000
$$ y = [8922498, 9897317, 10633295, 11672680, 12175769, 12443173, 12732402, 13956088, 15739498, 18418517, 21821613, 28824701, 41072413, 57921741, 75585154, 91345043, 109296810, 126358310, 126028881, 115350104, 97993591, 81510893, 70669034, 62979671, 55089695, 44588841, 36485209, 29866648, 24838803, 20672838, 17607747, 15730826, 14642612, 13691110, 12733079, 11757205, 11236928, 10440530, 9870471, 9074474, 8469522, 8142238, 7395925, 7332971, 7084791, 6541757, 6116092, 5616802, 5380893, 5326556, 5154005, 4761839, 4608202, 4886713, 4985504, 4779545, 4431636, 4204790, 4155332, 3679846, 3198784, 2830737, 3013934, 3039413, 2776773, 2305183, 2803179, 3146308, 3250127, 3120316, 3083316]
2313C083316j5111K6417n51361l35234K25072m4563r6393j99829J07705K85670
2303B485689K13906l82393k28653k168J89493n5548K4501l37077J56968K04197
2293B268915k75211n3801m23548J50389q568K5417k53706j32804j19495J74987
2283A352575m4508K18368j19188L73378j18874k05148j6617j41459L84534n9069
2273A623992k03724Q2227K87823P5099k8172m15442J96411m02752j04811K1349
2263A132000j0997J67184j86227p451j09824J17223M15431J25938j47648k50896
2253A244733r6001J57176r2352j23087l09964j17284k5114L41834r9084j04597
2243G76260M5575J6665L04152L52681l09706j63034J05519k89108N629k36282
$$ y = [3083316, 3068205, 3094622, 2543261, 2208027, 2433099, 2388536, 2292143, 2092314, 2200019, 2485689, 2699595, 2317202, 2088549, 2086381, 2275874, 2220326, 2244827, 1907750, 2064718, 2268915, 1993704, 1939903, 1516355, 1666744, 1658176, 1683593, 1429887, 1297083, 1177588, 1352575, 1308067, 1526435, 1407247, 1780625, 1661751, 1456603, 1439986, 1298527, 1683061, 1623992, 1420268, 1502495, 1790318, 1865417, 1837245, 1421803, 1618214, 1215462, 1110651, 1132000, 1121003, 1288187, 1101960, 1094509, 984685, 1101908, 1517339, 1643277, 1495629, 1244733, 1148732, 1305908, 1213556, 1090469, 780505, 663221, 638107, 979941, 880857, 776260, 821835, 838500, 1142652, 1495333, 1185627, 1022593, 1128112, 839004, 844633, 608351]
2233F08351L8180j72043J32446k01792J77481j4388J11192J72669k2627K42984
2223A072453L66598N2437k70834k36491l08026J82310j63848k12160j99557J15411
2213C98293J40246J14284j57996J41852K07257J77304j25502J16998K17035J88043
2203A417814l5961p71947l17196l9869M16189k8938k74429k30481M89105K11156
2193H35443j74926k75400R2676J63447J35271q7780j17322L38295j85824l29313
2183C94567m03693J65336K07091k161k91858m7650L56741L24418p3086j31096
2173D98609K0893K60517J96224l72167k38932k82109m781j5349J01257R9481L97119
2162F60762j85778k21236O1205K72974j7507k62510k73598J72177M46840q1427
$$ y = [608351, 646531, 474488, 606934, 405142, 582623, 568235, 679427, 852096, 829469, 1072453, 1439051, 1491488, 1220654, 984163, 676137, 858447, 694599, 482439, 282882, 398293, 538539, 652823, 494827, 636679, 843936, 1021240, 895738, 1012736, 1229771, 1417814, 1381853, 609906, 292710, 252841, 669030, 640092, 365663, 135182, 624287, 835443, 660517, 385117, 477793, 641240, 776511, 688731, 571409, 909704, 723880, 394567, -9126, 156210, 363301, 361140, 69282, 21632, 378373, 702791, 629705, 498609, 519502, 780019, 976243, 604076, 365144, 83035, 78254, 62905, 164162, 263643, 660762, 474984, 253748, 314953, 587927, 570420, 307910, 34312, 206489, 653329, 571902]
2152E71902l2924L5744R5092k86997m41629j96678M11247K29005k57999j20966
2142E797L42447M19889J56012l50362m09350M15190J91608k16953q4799j69903
2132B99576K33100K50529j35442L844N5332p1082k99141k74356l2497K98988q1027
2121B47824j54731K0665L75923J37179J11557l45522j95366K39671k0305l9563
2111C77332j05859k44834l7192M55338K3547M5901j57701K39136j9876J42376
2101G18168q8095J28572L56400J3446k05836l5411j0234K26091l31056m90306
2091B81739j28237l13078M11137N6639J81163j62833J28518K45370m1811j03718
2081E54889j62852J13595J38172j41246k65191O8729j33765K77373n26469K02810
$$ y = [571902, 538978, 574722, 669814, 382817, -58812, -255490, 155757, 384762, 126763, 5797, 348244, 768133, 924145, 573783, 164433, 579623, 771231, 554278, 469479, 299576, 532676, 783205, 647763, 651607, 706939, 635857, 336716, 62360, 29863, 328851, 247824, 93093, 113758, 489681, 626860, 738417, 392895, 197529, 437200, 416895, 377332, 271473, 26639, -10553, 444785, 468332, 514233, 356532, 595668, 575792, 718168, 630073, 758645, 1115045, 1128491, 922655, 887244, 877010, 1103101, 772045, 281739, 153502, -159576, 251561, 308200, 489363, 326530, 455048, 700418, 658607, 554889, 392037, 505632, 643804, 502558, 237367, 306096, 172331, 449704, -76765, 126045]
2071A26045K21167J93564N6015l10304l0134M34869J75577m10373l85230K81103
2061C52299L41174J54187k02505o02566J14773j2179j21492q3141L43890O9843
2051C54283j8298k43753J41441J99789J24172p8619m3953p4579J84115K61170
2041H05768k49429k0003j82038O6226L9187L47600j68811k42357j03360j41946
2031A50837k3916L5802q2809q9855k7887R134J84863Q9783K09719k85009j04122
2020F6540K36302J47891j51344M0127l47993J50219L66422K5858j52621J25510
2010E06911R3045k029O0602N6711j47297k99153k95412j52717L02611O7872R588
1999B00732k10817k3456K54143J7735n9386K53772j50705J69489O8483q3824k060
$$ y = [126045, 347212, 540776, 596791, 286487, 256353, 691222, 866799, 456426, 71196, 352299, 693473, 847660, 645155, 42589, 157362, 145183, 23691, -59450, 284440, 354283, 335985, 92232, 233673, 433462, 557634, 479015, 435062, 360483, 544598, 805768, 556339, 536336, 354298, 420524, 459711, 807311, 638500, 396143, 292783, 150837, 126921, 162723, 79914, -9941, -37828, -28694, 156169, 245952, 455671, 170662, 66540, 302842, 450733, 299389, 339516, -8477, 141742, 508164, 534022, 381401, 506911, 599956, 597927, 658529, 715240, 567943, 268790, -26622, -179339, 123272, 191144, 200732, -10085, -33541, 220602, 238337, 178951, 432723, 282018, 451507, 519990, 436166, 434106]
1988D34106j473J58497k69310j00597n3718J10704L47769k07381m35027K58710
1978B42280K18439N01069l95478n6177J92930J05812j86147l92869N2866L3461
1968C16186m8413m23587L1162L78882R3901m51452P9407l3834N26646L4466m42255
1957F1109l03882K44537N57622p3688l62116j13594K96412M8990j56865q1083
1947A17442j52069q3428M43972j60213L35526q5503M513L8746l4656j15187l14555
1936e412J18736J3079k52841j71820J4951K32209R9652k71329K55062k4958K34178
1925B41507J73668P6452K76401J92479k63228p5404J49542R8162k12504k43666
1915D13409j78250m6181K51135r3660j66345k48885J68317k26485K64223K35237
$$ y = [434106, 432633, 591130, 321820, 221223, 167505, 278209, 625978, 418597, -16430, 242280, 460719, 961788, 566310, 510133, 703063, 808875, 622728, 229859, 282725, 316186, 267773, -155814, -124652, 254230, 348131, -103321, -23914, -57748, 468898, 503364, 61109, -242773, 1764, 559386, 485698, 123582, 9988, 306400, 355390, 198525, 117442, -34627, -118055, 325917, 165704, 501230, 415727, 420240, 458986, 424330, 309143, -5412, 113324, 126403, -126438, -298258, -283307, -51098, 48554, -222775, 32287, 7329, 241507, 415175, 491627, 768028, 960507, 697279, 621875, 771417, 869579, 657075, 413409, 235159, 188978, 440113, 346453, 180108, -68777, 99540, -126945, 137278, 372515]
1905C72515k03890j24720l4942L51896K4894j60066l21242K9148M63599L16151
1895G13343n79325J34466m5596L24286k03369k51653J45902n4449K22545j95833
1885B10317k6689K94426q5036l66714k0983K20411J75169o15038Q3769j41752
1875b72120M67576j31433j65110L58145o476l2278j21620J34468m1976k89300
1865a00124M717M49187r6603J56789m44826K52295J96696P3111j83086k40029
1855F8127M52131K03494k89066k46873l8854J26541M2896j69103Q6664p0413M05708
1844E71252n94380p7831J58878Q2227N9180k79010K12659L51343k0371j61646
1834C02301r6874L12121M0297l73804J12919j99524L31146k12169J08777K27378
$$ y = [372515, 168625, 43905, 8963, 360859, 385753, 225687, -95555, -66407, 397192, 713343, 134018, 268484, 222888, 547174, 343805, 92152, 238054, 183605, 406150, 210317, 183628, 478054, 393018, 26304, 5321, 225732, 400901, -214137, -130368, -272120, 195456, 64023, -101087, 257058, 250582, 218304, 96684, 231152, 189176, -100124, -95407, 353780, 257177, 413966, -30860, 221435, 418131, 491242, 308156, 68127, 520258, 723752, 434686, 187813, 148959, 275500, 318396, 149293, 235957, 165544, 571252, -23128, -100959, 57919, 140146, 199326, -79684, 132975, 484318, 463947, 302301, 205427, 517548, 557845, 184041, 296960, 97436, 428582, 216413, 325190, 552568]
1824E52568j12704M5210N2716K7346Q7894n34052k17996J28250J23652L542l96548
1813b40122L45263J07751n1435k06826k90672J35878L10128m6105L84592m0207
1803D08245J62529j26999l56219J76892K94394k13979k07775K7747R7457Q8210
1793C50502j34736o4078j43372M2696j16262J33417K07036J03043l64361l0761
1783a6876j57497K83677N3429M7911L70166o2143j07309l46524J16286J00992
1773B82112n058k62551n7380M73820K24113l92488J83704k12533J74933J35613
1763E44285q2208Q6736l8337k59034m69229J08492J14934l3325N7181N14744Q2037
1752F26276K83189k77437l91437l53319k20850L85325O0297J73435L2024m25762
$$ y = [552568, 439864, 485074, 537790, 565136, 653030, 118978, -99018, 29232, 152884, 156426, -240122, 105141, 212892, 161457, -45369, -336041, -200163, 109965, 63860, 448452, 408245, 570774, 443775, 87556, 264448, 558842, 344863, 137088, 164835, 262292, 350502, 215766, 151688, 8316, 51012, -65250, 68167, 275203, 378246, 13885, -16876, -174373, 109304, 162733, 210644, 580810, 518667, 411358, 64834, 181120, 282112, 277054, 14503, -42877, 430943, 655056, 262568, 446272, 233739, 408672, 544285, 462077, 548813, 510476, 251442, -217787, -109295, 5639, -27686, 29495, 544239, 626276, 909465, 632028, 240591, -112728, -333578, 51747, 112044, 285479, 317503, -108259]
1742a08259M4197p8084K0266R3344j23751M94532K47316J28009L9787k73768N4740
1731E38329j89708j98283j5134n8529p6430m46125k20314J52158K72672K03388
1721c7976n0841L21888M11206j20149l27625j43237J84295j51247j68618K64616
1711A82312N7773R1091J96248j71813n2907j72348R1145K25634O6888j77965l76217
1700d0159K51516L17874p9447k08346p8379R0532K3191j96264j31384J11277O286
1689F6697n05j01756N61047J58523k30676m37592k88925L17527J90245r3842j46122
$$ y = [-108259, -64062, -142146, -121880, -28536, -152287, 342245, 589561, 717570, 757357, 483589, 538329, 348621, 150338, 135204, 76675, 245, -445880, -666194, -514036, -241364, -37976, -88817, 233071, 644277, 524128, 196503, 53266, 237561, 86314, -82304, 182312, 240085, 331176, 527424, 355611, 302704, 130356, 221501, 447135, 514023, 336058, -40159, 211357, 529231, 449784, 241438, 163059, 253591, 276782, 80518, -50866, 60411, 66697, 66192, -35564, 525483, 684006, 453330, 15738, -273187, 44340, 234585, 140743, -5379]
$$ [...]
##END NTUPLES=NMR SPECTRUM
##END=
