##TITLE=1H_DE-80H_X3
 200.13MHz, d2o
 8 sc
 
 19ns.26.2.2025
##JCAMPDX= 6.0         $$ Bruker NMR JCAMP-DX V2.0
##DATA TYPE= NMR SPECTRUM
##DATA CLASS= NTUPLES
##ORIGIN= UXNMR, Bruker Analytische Messtechnik GmbH
##OWNER= pz
$$ XWIN-NMR		Version 3.5
$$ Fri Mar 20 09:35:15 2026 Russian Standard Time (UT+4h)  Yarkov@DPX200
##.OBSERVE FREQUENCY= 200.1313
##.OBSERVE NUCLEUS= ^1H
##.ACQUISITION MODE= SIMULTANEOUS
##.ACQUISITION SCHEME= undefined
##.AVERAGES= 8
##.DIGITISER RES= 18
##SPECTROMETER/DATA SYSTEM= spect
##.PULSE SEQUENCE= zg30
##.SOLVENT NAME= CDCl3
##.SHIFT REFERENCE= (INTERNAL, CDCl3, 0, 15.4637)
##AUDIT TRAIL= $$ (NUMBER, WHEN, WHO, WHERE, WHAT)
$$ ##TITLE= Audit trail, XWIN-NMR		Version 3.5
$$ ##JCAMPDX= 5.01
$$ ##ORIGIN= Bruker BioSpin GmbH
$$ ##OWNER= Yarkov
$$ C:/Bruker/XWIN-NMR/data/yarkov2/nmr/H-C/1/pdata/1/auditp.txt
$$ ##AUDIT TRAIL=  $$ (NUMBER, WHEN, WHO, WHERE, WHAT)
(   1,<2026-03-20 09:34:21.60 +0400>,<Yarkov>,<DPX200>,
      <created by zg, POWCHK disabled, PULCHK disabled
       configuration hash MD5:
       00 E9 B6 7A A2 85 ED C7 34 08 36 98 17 FE 4E 26
       data hash MD5: 16K
       4D 0D 52 A2 E5 64 A9 25 C2 A8 32 71 3A 26 53 04>)
(   2,<2026-03-20 09:34:30.35 +0400>,<Yarkov>,<DPX200>,
      <Start of raw data processing
       efp BC_mod = 2 LB = 0.25 FT_mod = 6 PKNL = 1 PHC0 = -5299.148 PHC1 = 6.821927 SI = 16K 
       data hash MD5: 16K
       9B A9 FB 13 54 DA 49 EE 66 29 7F 53 08 66 D1 22>)
$$ ##END=
$$ 
$$ hash MD5
$$ 76 3C 45 9D A9 A7 4F E8 1D E4 14 4B 09 8F 5C 4F
##$RELAX= 
##$RELAX= 
##$RELAX= 
##$RELAX= 
##$RELAX= 
##$RELAX= 
$$ Bruker specific parameters
$$ --------------------------
##$DU= <C:/Bruker/XWIN-NMR>
##$EXPNO= 1
##$NAME= <H-C>
##$PROCNO= 1
##$TYPE= <nmr>
##$USER= <yarkov2>
##$AMP= (0..31)
100 100 100 100 100 100 100 100 100 100 100 100 100 100 100 100 100 100 
100 100 100 100 100 100 100 100 100 100 100 100 100 100 
##$AQSEQ= 0
##$AQ_mod= 1
##$AUNM= <au_zg>
##$AUTOPOS= <>
##$BF1= 200.13
##$BF2= 200.13
##$BF3= 200.13
##$BF4= 200.13
##$BF5= 200.13
##$BF6= 200.13
##$BF7= 200.13
##$BF8= 200.13
##$BYTORDA= 1
##$CFDGTYP= 0
##$CFRGTYP= 5
##$CHEMSTR= <none>
##$CNST= (0..31)
1 1 145 1 1 1 1 1 1 1 1 1 1 1 1 1 1 1 1 1 1 1 1 1 1 1 1 1 1 1 1 1 
##$CPDPRG= <>
##$CPDPRG1= <>
##$CPDPRG2= <>
##$CPDPRG3= <>
##$CPDPRG4= <mlev>
##$CPDPRG5= <mlev>
##$CPDPRG6= <mlev>
##$CPDPRG7= <mlev>
##$CPDPRG8= <mlev>
##$CPDPRGB= <>
##$CPDPRGT= <>
##$D= (0..31)
0 0.7 0 0 0 0 0 0 0 0 0 0.03 0 0 0 0 0 0 0 0 0 0 0 0 0 0 0 0 0 0 0 0 
##$DATE= 1773984861
##$DBL= (0..7)
120 120 120 120 120 120 120 120 
##$DBP= (0..7)
150 150 150 150 150 150 150 150 
##$DBP07= 0
##$DBPNAM0= <>
##$DBPNAM1= <>
##$DBPNAM2= <>
##$DBPNAM3= <>
##$DBPNAM4= <>
##$DBPNAM5= <>
##$DBPNAM6= <>
##$DBPNAM7= <>
##$DBPOAL= (0..7)
0.5 0.5 0.5 0.5 0.5 0.5 0.5 0.5 
##$DBPOFFS= (0..7)
0 0 0 0 0 0 0 0 
##$DE= 6
##$DECBNUC= <off>
##$DECIM= 32
##$DECNUC= <off>
##$DECSTAT= 4
##$DIGMOD= 1
##$DIGTYP= 9
##$DL= (0..7)
0 120 120 120 120 120 120 120 
##$DP= (0..7)
$$ [...]
##$SUBNAM2= <"">
##$SUBNAM3= <"">
##$SUBNAM4= <"">
##$SUBNAM5= <"">
##$SUBNAM6= <"">
##$SUBNAM7= <"">
##$SUBNAM8= <"">
##$SUBNAM9= <"">
##$SW= 18.0517328524113
##$SWIBOX= (0..15)
0 0 2 0 0 0 0 0 0 0 0 0 0 0 0 0 
##$SW_h= 3612.71676300578
##$TD= 16384
##$TD0= 1
##$TE= 0
##$TE2= 300
##$TE3= 300
##$TEG= 300
##$TL= (0..7)
0 120 120 120 120 120 120 120 
##$TP= (0..7)
150 150 150 150 150 150 150 150 
##$TP07= 0
##$TPNAME0= <>
##$TPNAME1= <>
##$TPNAME2= <>
##$TPNAME3= <>
##$TPNAME4= <>
##$TPNAME5= <>
##$TPNAME6= <>
##$TPNAME7= <>
##$TPOAL= (0..7)
0.5 0.5 0.5 0.5 0.5 0.5 0.5 0.5 
##$TPOFFS= (0..7)
0 0 0 0 0 0 0 0 
##$TUNHIN= 0
##$TUNHOUT= 0
##$TUNXOUT= 0
##$USERA1= <user>
##$USERA2= <user>
##$USERA3= <user>
##$USERA4= <user>
##$USERA5= <user>
##$V9= 5
##$VALIST= <valist>
##$VCLIST= <CCCCCCCCCCCCCCC>
##$VD= 0
##$VDLIST= <DDDDDDDDDDDDDDD>
##$VPLIST= <PPPPPPPPPPPPPPP>
##$VTLIST= <TTTTTTTTTTTTTTT>
##$WBST= 1024
##$WBSW= 4
##$XGAIN= (0..3)
0 0 0 0 
##$XL= 0
##$YL= 0
##$YMAX_a= 325999
##$YMIN_a= -319663
##$ZGOPTNS= <>
##$ZL1= 120
##$ZL2= 120
##$ZL3= 120
##$ZL4= 120
##$ABSF1= 0
##$ABSF2= 0
##$ABSG= 0
##$ABSL= 0
##$ALPHA= 0
##$AQORDER= 0
##$ASSFAC= 0
##$ASSFACI= 0
##$ASSFACX= 0
##$ASSWID= 0
##$AUNMP= <proc_1d>
##$AZFE= 0.1
##$AZFW= 0.1
##$BCFW= 0
##$BC_mod= 2
##$BYTORDP= 0
##$COROFFS= 0
##$CY= -3
##$DATMOD= 1
##$DC= 0
##$DFILT= <>
##$DTYPP= 0
##$F1P= 0
##$F2P= 0
##$FCOR= 1
##$FTSIZE= 16384
##$FT_mod= 6
##$GAMMA= 0
##$GB= 0
##$INTBC= 1
##$INTSCL= 3.241238e-09
##$ISEN= 128
##$LB= 0.25
##$LEV0= 0
##$LPBIN= 0
##$MAXI= 10000
##$MC2= 0
##$MEAN= 0
##$ME_mod= 0
##$MI= 1.114404
##$NCOEF= 0
##$NC_proc= -7
##$NLEV= 6
##$NOISF1= 3.799351
##$NOISF2= 2.8
##$NSP= 0
##$NTH_PI= 0
##$NZP= 0
##$OFFSET= 15.46373
##$PC= 1
##$PHC0= -5299.148
##$PHC1= 6.821927
##$PH_mod= 1
##$PKNL= yes
##$PPARMOD= 0
##$PSCAL= 0
##$PSIGN= 0
##$REVERSE= no
##$SF= 200.130011602124
##$SI= 16384
##$SIGF1= 3
##$SIGF2= 2
##$SINO= 0.751879
##$SIOLD= 32768
##$SREGLST= <19F.Aceton>
##$SSB= 0
##$STSI= 16384
##$STSR= 0
##$SW_p= 3612.71676300578
##$SYMM= 0
##$S_DEV= 0
##$TDeff= 16384
##$TDoff= 0
##$TI= <>
##$TILT= no
##$TM1= 0
##$TM2= 0
##$TOPLEV= 0
##$USERP1= <user>
##$USERP2= <user>
##$USERP3= <user>
##$USERP4= <user>
##$USERP5= <user>
##$WDW= 1
##$XDIM= 16384
##$YMAX_p= 393968575
##$YMIN_p= -1429482
$$ End of Bruker specific parameters
$$ ---------------------------------
##NTUPLES= NMR SPECTRUM
##VAR_NAME=  FREQUENCY,     SPECTRUM/REAL,   SPECTRUM/IMAG
##SYMBOL=    X,             R,               I
##VAR_TYPE=  INDEPENDENT,   DEPENDENT,       DEPENDENT
##VAR_FORM=  AFFN,          ASDF,            ASDF
##VAR_DIM=   16384,         16384,           16384
##UNITS=     HZ,            ARBITRARY UNITS, ARBITRARY UNITS
##FACTOR=    0.220516191357247, 1,           1
##FIRST=     3094.75643597339, 0,            0
##LAST=      -517.96032703239, 0,            0
##MIN=       -517.96032703239, -1429482,     0
##MAX=       3094.75643597339, 393968575,    0
$$ Real data points
##PAGE= N=1
##DATA TABLE= (X++(R..R)), XYDATA
$$ [...]
8163 278437 194876 257420 226667 174942 210216 271345 273777 197855 77227 173572 112676 16077
8151 16077 45750 76637 79140 92040 46677 -28764 136578 146108 21703 149059 149862 93938
8139 93938 33253 -63083 -10499 -42776 21399 41158 35873 116163 166303 190683 113424 -69306
8127 -69306 17243 177624 81113 19907 16189 19266 240 46491 81386 114607 82928 66085
8115 66085 -90606 -112365 48207 94093 78722 -18777 67074 62444 -8754 17722 -40061 12711
8103 12711 -73355 -108220 -76105 -163362 -20886 -97956 -19145 60036 164009 203731 173185
8092 173185 47701 73768 6800 30793 140821 96599 -82733 -45695 37154 21752 155034
8081 155034 82750 1618 104313 63856 -72686 -45461 -60082 5980 208941 125934 116245
8070 116245 202731 -22816 -129825 -84157 73983 -90414 -53018 64841 -49643 -93613
8060 -93613 -34775 -34003 -26738 -18991 -81480 -24703 10467 11861 8326 118831 110258 6444 -8205
8047 -8205 31265 31224 161395 52657 73441 89552 -35285 -182902 -133440 -62348 -13558 -124202
8035 -124202 -38141 -10156 -4501 -178035 -131026 92143 147160 64469 -25367 25296 -111639
8024 -111639 -7293 161362 132825 33959 55757 -40589 -120241 -9919 52650 -18099 87871
8013 87871 125951 64683 66442 183338 -26901 -72818 -5574 38192 -13060 -3257 65568 42033
8001 42033 51964 79790 3928 9558 -20160 19698 -67370 -134198 10124 142011 -58506 -61966
7989 -61966 -49268 122825 125923 -45641 34361 58318 65486 -36600 -22521 90188 49959
7978 49959 37230 36025 31516 121964 -38715 -23008 -74746 -83947 -114593 51242 20084 -112590
7966 -112590 -24548 -25756 -8883 42933 91043 -37492 153229 39548 156669 191566 19152
7955 19152 -33658 -89150 -76037 -83277 -157131 -36139 28215 -10781 25202 66069 -68821 -105720
7943 -105720 -108641 -150352 -250381 -121215 11159 17150 70410 88786 -15970 -207940 -156111
7932 -156111 -29035 111492 52652 33490 -23674 54690 54084 58162 179484 183349 40191 46289
7920 46289 -101967 -85058 67942 59619 78700 122340 24422 26716 48968 -24272 55349 -23109
7908 -23109 -74953 -40480 -19711 -45821 101427 141462 112307 71241 139414 134133 104255 139634
7896 139634 25973 92241 86661 110495 -15306 14201 73452 206977 287509 248117 103362
7885 103362 140497 168847 190405 151557 -47 -109066 -525 35426 -6077 -70526 -47749
7874 -47749 -52616 -44766 -103160 70210 76170 220635 227837 113650 207339 164622 140664 59967
7862 59967 -46816 131032 196046 174538 104183 70851 168058 28990 -39294 -3097 53574
7851 53574 44039 6924 25208 -1926 23037 8685 145184 262087 136220 121058 9020
7840 9020 66659 33200 -25494 17181 71035 145172 188803 173158 133098 52512 72720 133667
7828 133667 80435 75589 207075 221852 220295 101629 57221 931 -64088 28207 107681 57541
7816 57541 72601 -59641 -101662 34944 86933 98289 133874 149918 115000 85588 158769
7805 158769 339934 745313 589203 371880 217517 85810 90545 94333 41202 -42850 -16076
7794 -16076 42381 92900 130010 81522 125393 129470 180398 152251 56398 63079 104989 66523
7782 66523 109967 203436 89078 26402 119184 38977 -28395 87512 163706 358504 397115
7771 397115 354103 264204 191228 -15635 90879 103484 -43061 75383 84334 204704 31020
7760 31020 31789 91809 -31003 -63441 106454 163394 107910 124270 85217 43400 77074 103627
7748 103627 123455 54646 -18484 -18668 33417 116624 237870 178258 261472 166412 47714 36989
7736 36989 63315 157301 122064 120919 144838 202171 172779 140180 110900 55646 -2103 7228
7724 7228 97960 211097 17630 27848 61683 89308 130764 183068 102372 25147 -89675
7713 -89675 26497 -1653 141051 149464 148854 259553 198784 201984 313696 283417 199386 170242
7701 170242 103686 162580 194478 124609 64921 67100 61349 139154 98743 57379 109218 -22831
7689 -22831 -35397 119096 140591 168087 331100 177160 202732 167997 90931 122416 150579
7678 150579 189301 128703 168294 141942 282917 355034 127923 -29148 24274 70738 88430
7667 88430 133922 35337 238064 154489 -2521 100539 251286 237501 158380 203186 322346
7656 322346 362170 276744 310564 257232 175336 184918 59345 41413 226343 222167 232083 317057
7644 317057 342701 242289 124076 203623 237158 165922 111140 143054 302408 360774 215029
7633 215029 87405 97615 37761 67612 318109 263688 172747 340364 283978 266380 143675
7622 143675 136756 289535 376444 315374 346989 186002 189635 170656 164792 84662 117811 163730
7610 163730 -12433 -61679 110579 187380 176179 145725 162226 20081 -25445 26412 29089
7599 29089 65851 25668 38055 -74758 -36499 142269 150600 156324 153242 32735 57857 175802
7587 175802 79989 142272 193542 149344 103932 52188 14424 20814 32847 62871 38273 146259
7575 146259 151286 136920 114661 156327 228108 172354 98473 81522 77768 143474 164201 209276
7563 209276 100349 94084 118740 112778 131896 144621 260135 150193 150513 175371 113557 -4377
7551 -4377 159571 192325 102170 100761 107760 56965 172952 127428 21402 24358 90055 159849
7539 159849 199303 178289 136108 -56683 -19123 -195 78253 130804 100337 39360 92569
7528 92569 135956 21663 97734 215557 137256 134102 183033 275339 331080 177443 184097 196615
7516 196615 96075 96331 156268 259422 248907 143961 206597 98676 -13689 14064 42632
7505 42632 47004 -5626 77674 195971 126706 -20120 59323 -17667 90510 99092 45189 122700
7493 122700 90925 147517 137944 173545 152846 53477 25222 23221 123472 227013 189040 186626
7481 186626 106186 144224 96597 61349 44532 62214 195958 262944 205726 188535 178635 257259
7469 257259 346591 230612 196924 217699 86411 46283 114632 118266 114660 63442 119191 214080
7457 214080 251885 180564 121894 197537 179421 164749 168935 163300 252607 169321 187576 228260
7445 228260 131971 50549 94062 12020 -42647 104975 -26457 88862 154645 263901 344973
7434 344973 244887 202503 217118 209475 233239 260945 272300 303709 259143 197866 170933 100664
7422 100664 57962 152819 191562 299976 240451 152206 167974 117077 12107 48307 174238
7411 174238 287070 289586 164924 99724 91503 76274 177947 100107 183855 259451 179832
7400 179832 188645 251602 261296 400768 481808 374053 339168 225749 222502 201792 186281 173227
7388 173227 150755 109157 17753 175585 169998 115302 125362 37696 156394 169497 200582
7377 200582 192004 83682 93135 173601 156377 195255 304779 237952 329362 342171 148850
7366 148850 138913 47349 70394 131137 132348 134155 123902 147355 228061 180798 159447 265871
7354 265871 227431 227641 176128 78864 173677 32635 67598 218353 215228 218778 231367 158036
7342 158036 158275 153121 160130 214414 167949 167629 124519 151064 170333 192865 249397 154443 64193
7329 64193 20672 47940 179239 107426 -20028 136577 242369 292970 259516 284199 131365
7318 131365 245903 279911 247346 141137 139548 264734 280600 310556 330975 294269 206207
7307 206207 99093 59396 247366 227248 211077 157767 275785 304665 143460 91954 28329
7296 28329 106624 156545 101649 198816 260665 167421 65037 238984 256282 271107 238011
7285 238011 124442 21312 96060 89715 63481 143235 162586 232265 218728 319834 501249
7274 501249 293962 316818 280094 295967 238166 281955 212020 134399 155435 263111 288867
7263 288867 200251 108747 154400 231102 224836 276300 224027 206184 257078 175701 254281 247383
7251 247383 225058 211257 338950 429010 248007 147474 121585 145312 70269 182311 266460
7240 266460 369560 297445 180196 95490 155073 272654 221308 153320 173172 101578 178135
7229 178135 183202 254529 269272 331959 371237 398131 296891 249427 325683 279243 208161 335172
7217 335172 369133 308656 253134 292257 308158 320638 326535 173080 185134 221086 312900 267321
7205 267321 249349 213341 162179 245785 243449 179490 209823 336594 363050 174024 177290 106146
7193 106146 112852 233088 114773 73122 83231 310202 309665 306210 193678 239715 300061 186262
7181 186262 230833 316561 381632 371411 411096 455965 401812 280580 189033 4370 49760
7170 49760 140071 156792 114201 159932 292980 231453 100052 216829 313751 340199 331704
7159 331704 391747 423643 306973 234350 255215 396473 425884 351510 377243 227474 178661
7148 178661 152861 183439 154753 154909 178494 201400 223806 195655 233933 267388 260377 203092
7136 203092 249428 94832 144304 97455 171932 128748 172180 139262 128361 140772 318233
7125 318233 458082 465845 401329 282148 323065 416556 342515 258529 253404 380292 441194
7114 441194 307196 320632 238815 346000 355599 200360 284480 354926 334258 270399 283856
7103 283856 388341 378522 319972 364475 499397 381357 212987 143453 283068 336215 364519
7092 364519 432492 449423 287949 176457 282531 362728 481349 506393 357901 324888 346910
7081 346910 291370 205068 186163 115806 121031 53849 316265 303875 309136 337338 273555 274681
7069 274681 130263 99473 174170 169848 189210 224607 289298 273492 254030 280330 183748 160433
7057 160433 339149 208182 192890 330903 359539 373213 275635 227471 277089 292495 341689
7046 341689 308265 329040 211198 272850 466895 297056 166393 186955 256881 289778 277104
7035 277104 323305 346099 319296 292421 270413 469379 332707 246477 308041 277915 306301
7024 306301 350045 208254 276971 341918 357317 241905 277396 339818 334564 399016 432712
7013 432712 298972 349461 282190 387102 275517 428384 382314 222428 368643 341323
7003 341323 263232 334132 413502 222264 193718 347096 376125 210616 258290 278493 259506
6992 259506 443967 415148 455380 337676 351633 473114 357340 221409 274205 355627 339071
6981 339071 326235 293510 378944 404843 355061 283018 297255 286327 295595 198323 293879 311786
6969 311786 336286 333937 421579 376703 167894 130112 303439 320396 384814 206828 254140
6958 254140 317423 350482 319009 321380 350651 342124 276764 421777 313389 306084 159936 80337
6946 80337 251447 390386 367669 237711 387095 363948 302587 352621 388313 410436 490012
6935 490012 427440 334934 422678 579120 430313 356515 377440 384631 193980 426178 293045
6924 293045 176368 272783 221904 312825 411020 505940 524316 474782 432399 388442 433226
6913 433226 421072 322425 295405 316580 313346 283735 188721 316458 214838 383052 365162
6902 365162 335088 471182 526784 609870 586826 501725 447616 437798 296804 443206 473010
6891 473010 356611 302640 401888 417457 337439 306855 247912 268114 268519 404937 394431 279748
6879 279748 396971 452851 502672 447757 460438 400655 412002 482023 573449 486174 339699
6868 339699 372664 386137 319312 297862 290685 310306 412946 483258 427489 412468 517866
6857 517866 494751 473904 336534 399190 583281 543870 478202 516557 425178 388272 577707
6846 577707 472100 376103 467934 504659 574832 594526 449373 476699 482513 447286 556580
6835 556580 634446 418853 324613 348193 428807 444298 374753 456378 515981 519926 465742 347748
6823 347748 467941 418606 529798 559578 518780 513222 509710 501540 379322 299575 400645
6812 400645 549375 547614 558768 409699 298359 428014 569204 520095 534446 430948 554210
6801 554210 405724 434540 479369 587529 684808 672336 595775 476326 529290 475009 333244
6790 333244 321425 467997 442351 417914 337123 447760 579234 405300 549618 734873
6780 734873 605476 556144 660726 596121 563427 584293 531244 444887 467025 509774 588286
6769 588286 548972 549347 591428 584429 616574 547585 564619 582903 510238 383913 467700 447703
6757 447703 498602 420193 624298 454820 391696 557497 437654 533240 487206 451305 537718
6746 537718 582521 546726 626640 597329 513388 537045 649007 526082 574909 573970 501574 544811
6734 544811 545282 462213 497739 483948 432783 484876 559181 451108 397163 444490 386387 354552
6722 354552 301199 525845 452261 352918 515602 510908 428015 598739 593571 538774 514404
6711 514404 473272 361911 434532 635324 667275 624631 567655 479058 422492 457940 480777
6700 480777 414103 463707 553005 604371 609485 479535 501468 597665 541486 515445 619698
6689 619698 655510 625054 596841 591141 479090 540521 421456 383271 434056 372361 479558
6678 479558 556548 466483 552948 539213 668279 614258 521541 660769 581543 720049 614995
6667 614995 648408 634965 477155 536323 617622 652716 646486 634004 444194 585102 575120
6656 575120 571178 509014 391654 455204 552866 522738 487191 551130 598050 577172 531830 502658
6644 502658 257012 364886 426726 561965 620297 674483 620804 677632 574681 539757 727636
6633 727636 707370 600170 564546 664718 628126 533406 570885 612987 585478 646862 613583
6622 613583 672800 904456 749471 566295 581718 662059 691835 588935 624176 685649 686262
6611 686262 707701 701856 648095 648718 486904 529146 516465 602630 662621 698043 639648 583748
6599 583748 463823 544985 655839 502999 540737 596563 562234 508577 526194 657472 816979
6588 816979 820699 751044 724901 860814 863292 782988 775732 688435 679664 711453 858234 950080
6576 950080 969157 1140494 1141078 1069851 1088011 1140207 1162133 1212965 1169209 1349209 1394493 1238160
6564 1238160 1180757 956789 911674 947668 1037338 1036634 975453 877006 814701 712338 789346
6553 789346 851636 864058 1025356 1035764 960301 857218 743957 767414 789961 634693 608444
6542 608444 696897 771607 809254 864148 836641 813449 927159 885608 856725 829435 840994
6531 840994 890522 876238 933759 930427 794853 769705 837044 879103 950909 868754 674834
6520 674834 758349 970480 747891 717240 654772 651919 763538 713472 696330 665204 623102
6509 623102 741133 678461 712709 712086 630130 685215 668245 718862 635789 707007 832276 802613
6497 802613 804852 864893 716481 698492 780774 659501 735962 781716 708260 635144 775187
6486 775187 813182 886316 795549 723139 638723 792822 770006 622556 690123 708762 790875
6475 790875 880577 791760 816457 902371 766355 856641 892470 895442 771813 771186 741978 713899
6463 713899 866541 868543 690167 699187 808525 961381 894441 795854 882375 776297 856937
6452 856937 857551 878674 849930 863892 902005 815615 664488 722160 727613 722640 740915 660670
6440 660670 794745 822025 850242 840512 900448 808826 818003 875064 1008621 878330 881599 1009914
6428 1009914 995299 865433 834798 898404 994984 868919 907275 764644 894959 931009 944519
6417 944519 881096 773111 720207 891508 940712 987071 1028160 928484 1027157 917833 951606
6406 951606 987577 976505 1012594 950404 845002 1091632 1033290 977639 1087908 1194675 1155653
6395 1155653 1092103 1079077 1014364 1088908 1149319 1079415 1051604 1075980 1105476 1034471 1096166
6384 1096166 1116892 1147514 1077553 1051825 1107727 1215142 1161911 1128074 1217305 1241132 1253201
6373 1253201 1085292 1096383 1263680 1127806 1155432 1152891 1025152 1090387 1178257 1238886 1271327
6362 1271327 1180200 1155470 1169124 1201766 1290568 1312890 1256695 1253660 1320963 1336050 1377786 1456745
6350 1456745 1408282 1501440 1471095 1334718 1361234 1582608 1592706 1496886 1470433 1522032 1515977
6339 1515977 1527799 1557771 1475805 1486676 1466796 1643115 1590795 1761241 1739303 1687263 1786762
6328 1786762 1741823 1804085 1793389 1744609 1698436 1747197 1810111 1884001 1809762 1757319 1749787 1955470
6316 1955470 2012531 2104142 2056247 2146624 2322919 2435724 2513764 2619154 2787200 3040318
6306 3040318 3400224 3858190 4323455 4439383 4411228 4189217 3928156 3768268 3567116 3465913
6296 3465913 3412900 3467232 3591754 3864769 4121590 4408185 4800085 5052701 5069126 4799753
6286 4799753 4492489 4121175 3854669 3599260 3433659 3293174 3209238 3093777 2859257 2943712
6276 2943712 3037985 2990666 2906096 2973936 3223533 3015050 2996797 3076267 3160591 3147574 3055728
6265 3055728 3000643 3045724 3085349 3056904 2919081 2863290 2746782 2826843 2853312 2823696 2888192
6254 2888192 2973474 3020898 3032778 3038194 2996229 2964015 2939171 2860696 2802503 2855425 2910841 3131970
6242 3131970 3088052 3140752 3205191 3282666 3488137 3773667 4340760 5064321 5762903 6417066
6232 6417066 6808369 6806212 6582432 6088925 5538514 5170202 4885279 4627406 4612405 4716989
6222 4716989 4896938 5281667 5940657 6584371 7273399 7338875 7070579 6706364 6054430 5507238
6212 5507238 4879099 4560687 4299587 3927650 3711493 3614262 3369002 3349890 3484675 3416122
6202 3416122 3333098 3336477 3281822 3211863 3318546 3200101 3186141 3301057 3536072 3526463 3588912
6191 3588912 3590609 3505599 3624136 3583242 3650932 3614828 3497978 3491531 3473993 3462254 3454749 3379408
6179 3379408 3365662 3311986 3103513 3070141 3086030 3025489 3094717 3180020 3228550 3221190 3207188
6168 3207188 3206634 3294017 3266175 3107680 3213017 3461610 3487585 3486364 3497023 3379559 3396809
6157 3396809 3294205 3191076 3275307 3318296 3406944 3251420 3257559 3191310 3185615 3265091 3226367
6146 3226367 3236434 3327044 3443954 3451874 3480915 3539214 3443505 3511655 3517366 3504185 3408810 3459096
6134 3459096 3427370 3570089 3736380 3777268 3793105 3881162 4096610 4216001 4354828 4414471
6124 4414471 4453876 4337537 4245462 4168177 4138757 4354222 4400506 4350315 4417575 4457532 4500537
6113 4500537 4635727 4487330 4693499 4836762 4846656 4878795 4967276 4943777 4920762 4890743 4847894
6102 4847894 4896955 4991906 5245888 5249445 5402291 5602234 5696280 5836533 6025185 6099303 6384472
6091 6384472 6727884 6958644 7277194 7671024 8149602 8937814 9757187 10338926 10640393 10509333
6081 10509333 10121527 9683195 9203795 9088649 9047391 9218464 9479749 9667687 9703079 9717033
6071 9717033 9841120 9756252 9728409 9825512 10111851 10598401 11128474 11892987 12696437 13292213
6061 13292213 13438988 13395077 12964093 12530717 12265123 11989353 11966878 12058793 12097918 12187830
6051 12187830 12211171 12409578 12640594 12986220 13051421 13222805 13574014 13790297 13890769 14342529
6041 14342529 14855737 15216113 15919711 16439928 16991989 17855113 18710679 19687549 20797637
6032 20797637 22253823 23991024 26000496 28485173 31769961 35716800 40905616 47538325
6024 47538325 54997146 62780890 69983331 75898894 80158638 82648605 83461112 82645384
6016 82645384 80869251 78008185 74907536 72246629 70562230 69901007 70144994 71165097
6008 71165097 72437318 73505871 74069392 74127625 73817753 73799299 74397957 76644310 81187866
5999 81187866 88077222 96601304 105066360 111472601 115525106 117016480 116027540 111792952
5991 111792952 104658362 96120720 87589779 80714427 76032408 72773418 70989646 70325259
5983 70325259 70210254 69502247 67831370 64342129 59471572 53740654 47943931 42523518
5975 42523518 37841291 34254851 31390021 29017427 26892674 24946452 23188797 21398478
5967 21398478 19858663 18483947 17204085 16192766 15241348 14458411 13796440 13184831 12696600
5958 12696600 12288265 11943142 11674171 11566445 11533113 11335067 11244920 11285711 11313077 11440599
5948 11440599 11457772 11371684 11138972 10834617 10616496 10114975 9746184 9544526 9322125 9061547
5938 9061547 8672562 8452578 8237025 8108821 8016546 7831530 7937977 8039921 8153389 8303072
5928 8303072 8325249 8298207 8313956 8115636 7869553 7813443 7713007 7635544 7729318 7766701 7928528
5917 7928528 8185994 8413393 8623899 9087421 9323510 9322932 9411753 9645774 10040408 10295545
5907 10295545 10755969 11524134 12136659 12509264 12682111 12602346 12459352 12218251 11934456 11673427
5897 11673427 11362047 11157788 10966552 10877125 10997034 11255043 11820362 12499940 13294306 14331988
5887 14331988 15460148 16744497 18128683 19486703 20413833 20848617 20696681 20608480 20129178
5878 20129178 19880128 19700715 19386457 19254090 19180372 19325942 19776664 20336795 20799995 21304089
5868 21304089 21837380 22549415 23288212 23943879 24420961 24873705 25002444 25331925 25972453
5859 25972453 26560969 26771478 26635709 26394575 26175679 26060455 25936234 26134661 26677395
5850 26677395 27463736 28326879 29172349 29549629 29253814 28694038 28477903 28214725 28036794
5841 28036794 28099323 27725032 26890381 26056140 25450441 24794149 24492398 24219594 24088636 24239431
5831 24239431 24633139 25204549 25647478 26008335 26275554 26630072 26834800 26905920 26763091 26203070
5821 26203070 25061859 23687951 22173272 20876191 19780535 18877256 18097721 17418766 16942404
5812 16942404 16590362 16406622 16156139 16138486 16260376 16461388 16677577 16988767 16904016 16546215
5802 16546215 16002245 15293779 14646953 14066756 13442805 12843952 12221239 11562294 11219408
5793 11219408 10784864 10273110 9876605 9286857 8746560 8248625 7887196 7692501 7437075
5784 7437075 7217944 7181733 7193699 7216322 7027755 6842741 6615141 6210610 5764989 5316008
5774 5316008 5110745 4990125 4872960 4728907 4704307 4740706 4755442 4729903 4421163 4201426
5764 4201426 4008794 3883256 3718224 3438346 3257650 3178494 3171203 3121323 3045624 2942422
5754 2942422 2733712 2817308 2876633 2835735 2854152 2822063 2675807 2593727 2615943 2681328 2555667
5743 2555667 2576546 2562746 2482524 2486478 2439518 2326940 2253521 2224199 2191998 2277663 2337989
5732 2337989 2310704 2206645 2161427 2137592 2106462 2083259 2122092 2108938 2203512 2238366 2127507
5721 2127507 2099528 2262483 2181966 2114955 2132224 2111303 2021745 2052855 2019186 2103795 2232255
5710 2232255 2277835 2319751 2441775 2483221 2460957 2356210 2295207 2409965 2466022 2358919 2325607
5699 2325607 2336450 2232511 2258983 2305842 2259368 2132250 2146962 2264699 2089791 2095028 2000431
5688 2000431 2128287 2184132 2116993 2152384 2194929 2259401 2182264 2176931 2363741 2333213 2231785
5677 2231785 2143526 1911279 1928514 1945901 2086578 2058135 2004035 1913678 1933629 2054576 2063178
5666 2063178 2120344 2124104 1987990 2025165 1937231 1964944 2015679 2248838 2130882 1973781 2008719
5655 2008719 2023311 1955109 2024391 2132720 2107147 2017407 1930074 2039604 1963721 2044588 2030694
5644 2030694 2119141 2008868 1957780 1915819 1999646 2132980 1952744 1922473 2038889 2105643 2151140
5633 2151140 2023814 2034003 1989712 1903126 1892542 1919681 1906260 1789349 1935127 1881173 1974468
5622 1974468 1968209 1940781 1866264 1808679 1845151 1824665 1922934 1968460 1991115 1960797 1911795 1971027
5610 1971027 1895780 1854348 1973250 1863185 1981220 1968977 1998862 1943954 2027147 2120209 1972112
5599 1972112 1959837 1982376 2219048 2192460 2168049 2175573 2086289 2109814 2073355 1975113 2034981
5588 2034981 2034946 2074723 2094113 2021689 1976375 1852376 1890247 1920513 2005687 2009139 2050176 1973612
5576 1973612 2059843 2252245 2326539 2235130 2241965 2398850 2426165 2373482 2331703 2431468 2210765
5565 2210765 1958767 1945678 2095086 2207207 2264829 2151384 2108554 2171008 2161628 2161081 2209973
5554 2209973 2144608 2239294 2161198 2002980 2007286 2028898 2130005 2179923 2061319 2128240 1987068
5543 1987068 2089933 2160648 2070724 2229645 2271758 2221055 2266850 2235646 2188401 2198513 2222788
5532 2222788 2262013 2207857 2163653 2225578 2346399 2306169 2244053 2399243 2450655 2220517 2247619
5521 2247619 2319950 2324640 2440557 2241387 2154770 2206839 2132092 2258320 2216511 2109337 2163407
5510 2163407 2238000 2232628 2344611 2298723 2386845 2390734 2408770 2312265 2289865 2396422 2477846
5499 2477846 2342752 2495126 2430405 2306955 2336093 2254003 2120148 2181810 2308861 2293313
5489 2293313 2216478 2194830 2304956 2231864 2176653 2068675 2231630 2387080 2456027 2412494 2290198
5478 2290198 2271444 2235055 2241285 2178621 2177995 2082473 2115834 2054138 2000369 2166501 2151025 2114585
5466 2114585 2036947 2032130 2041770 2011670 2108340 2127014 2036974 2121555 1947504 1987977 2025097 1901832
5454 1901832 1860870 1893310 1948316 2012402 1951762 1877452 1914448 2003080 2093126 2010455 2012482 2111836
5442 2111836 2119403 2144747 2137333 2197984 2017154 2038521 2060543 2075623 2097026 1923249 2086923
5431 2086923 2072629 2016760 1965312 1878875 1915355 2003730 2075592 2061502 1996068 2026193 2084029
5420 2084029 2010562 2041376 2043878 2174114 2107324 2202122 2287075 2053583 2057529 2299567 2197590
5409 2197590 2116635 2101194 2117979 2079001 2180516 2086110 2128489 2304680 2361211 2330236 2229640
5398 2229640 2208446 2329160 2539138 2404289 2309363 2226604 2253079 2288199 2267840 2268593 2441430
5387 2441430 2388787 2322440 2283021 2386203 2395105 2322666 2365720 2396191 2362911 2335922 2397209
5376 2397209 2491866 2456354 2529137 2521887 2444523 2449693 2533767 2504987 2419409 2476554 2457992 2287410
5364 2287410 2325579 2273778 2271561 2241180 2178167 2267527 2417094 2315860 2279357 2274741 2324205
5353 2324205 2337673 2355577 2398973 2365746 2478959 2550332 2517961 2527679 2610352 2640338 2642040 2688607
5341 2688607 2686158 2657421 2655837 2661355 2622713 2643741 2735561 2734875 2711093 2706216 2787483 2656116
5329 2656116 2672062 2908519 2926877 2920068 2931712 3055386 3189104 3169347 3114764 3141187 3112974
5318 3112974 3216877 3204536 3133881 3112273 3149639 3193336 2964105 2991397 2972004 3099134 3130727
5307 3130727 2983337 2894145 2857111 2982803 3038793 3038993 3224373 3215344 3421164 3627541 3650965
5296 3650965 3639529 3526499 3412534 3374222 3276705 3304531 3229681 3108896 3184697 3301030 3429238
5285 3429238 3295960 3232713 3161037 3293240 3324367 3326026 3303401 3339437 3425189 3466498 3700303
5274 3700303 3746288 3851907 4012719 4121231 4325241 4481709 4329159 4256901 4140914 4020966
5264 4020966 4067830 4021862 3898068 4016140 4249413 4456534 4814272 5212023 5233478 5224759
5254 5224759 5147342 5095818 5242852 5326175 5199092 5239596 5174790 5115355 5032512 5053260 5221735
5243 5221735 5314593 5408190 5405748 5589407 5815613 6045992 6187828 6313168 6246417 5995170
5233 5995170 5829801 5767603 5684944 5481509 5326083 5257433 5203601 5129957 5290811 5115251
5223 5115251 5176535 5147501 5034153 5100878 5168188 5229887 5153506 5004857 4879295 4621637 4251597
5212 4251597 4059937 3965822 4000397 3815734 3658757 3609420 3791293 3872170 3966595 3921705 3941711
5201 3941711 3773444 3505523 3344717 3339118 3215182 3255621 3210434 3150215 3085720 3013493 3054628
5190 3054628 3061488 3031544 3004832 2969616 3003894 3000967 3051272 3078471 3090736 3254510 3202547 3118031
5178 3118031 3047777 3032000 3026557 3035073 3136836 3136585 3134896 3212982 3264028 3202861 3229810 3238873
5166 3238873 3309611 3340662 3246519 3208228 3294101 3248162 3309779 3336871 3364370 3351974 3230559
5155 3230559 3271599 3308687 3281698 3331120 3437399 3483536 3454790 3417556 3442902 3474189 3432840
5144 3432840 3559574 3667347 3533625 3509168 3512553 3572662 3559041 3587529 3562874 3619307 3721932
5133 3721932 3796975 3839692 3839457 3731854 3699229 3724783 3824808 3764097 3764467 3819836 3885549 3868705
5121 3868705 3869017 3891476 3757515 3760952 3901839 3936678 3880301 3912954 3926795 4077208 4036164
5110 4036164 3835020 4002912 4079907 4025829 3955264 3890951 3997058 3900665 3950461 4129494 4167092
5099 4167092 4269743 4295826 4424572 4581879 4598921 4580031 4477333 4381264 4211634 4314650
5089 4314650 4370174 4369186 4331146 4372540 4387836 4446138 4648661 4653369 4697924 4773622 4755101 4740704
5077 4740704 4816285 4814598 4825727 4785836 4904777 4919625 4819155 4920424 5033385 4974886 5052921
5066 5052921 5155329 5211921 5324598 5400278 5452736 5470146 5355747 5347898 5360802 5435775 5390086
5055 5390086 5246839 5232406 5351552 5471715 5553653 5561859 5558720 5599541 5650807 5650165 5551598 5632919
5043 5632919 5896182 5931393 5957036 5771421 5723381 5775151 5884314 5825510 5688912 5763816 5795749
5032 5795749 5844897 5925124 5840121 5654857 5759418 5891354 5800046 5849656 6043669 5976780 5978016
5021 5978016 6139308 6167820 6067978 6002021 6153507 6320367 6416688 6364378 6358059 6364766 6415803
5010 6415803 6533058 6484118 6759762 6924682 7018667 7126429 7304569 7621964 7967683 8111747
5000 8111747 8536457 9022526 9531819 10242873 11263255 12549863 14163605 15781877 16968834
4991 16968834 17475186 17004844 15961485 14832946 13872902 12952837 12252431 11734689 11395108
4982 11395108 11263375 11426694 11588629 12030760 12858000 13863571 15094671 16562375 17773482
4973 17773482 18303893 18195806 17274933 16293644 15123221 14095467 13338186 12934881 12941146
4964 12941146 13231988 13543496 14211968 14787089 15187702 14946084 14445255 14031793 13623671
4955 13623671 13372475 13053021 13060609 13075141 13187908 13428694 13709571 14252967 15043710 15959883
4945 15959883 17084087 18372248 19808507 21001498 22142427 23175743 24601156 26106325
4937 26106325 27242661 27421709 26728728 25337621 23627643 22009510 20611306 19588999
4929 19588999 18886887 18534107 18464662 18551659 18840522 19459349 20552206 22149298 23891114
4920 23891114 25848892 27428659 28318609 28010780 26776550 25242741 23730150 22331118
4912 22331118 21336538 20565176 20254995 20228170 20582984 21187819 21927746 22592182 22924149 22794915
4902 22794915 22191247 21430413 20667015 20366606 20232940 20017334 20048465 20246340 20444184 20959884
4892 20959884 21522543 22407388 23554290 24915894 26393908 27922876 28915280 29560795 30312231
4883 30312231 30984867 31827038 32868579 33880189 34624178 35453666 36500541 37451463 38547867
4874 38547867 39894596 41525350 43108582 44665692 46328488 48044347 49399612 50475328
4866 50475328 51365111 52123195 53064827 54187669 55545584 56599863 57412847 58150115 59078563
4857 59078563 60238814 61477719 63109570 65080754 67174288 69607372 72384899 75197234
4849 75197234 77931149 80688728 83330021 85403456 86740900 87089162 87012698 86583326 86485523
4840 86485523 86368536 86380127 86692409 87154274 87643134 88185710 88680002 88688803 88543356 88129975
4830 88129975 87620556 87097255 86406831 85445899 84103440 82890492 81886419 80546359 78861117
4821 78861117 77290603 76009480 75205738 75058251 75229172 75523646 75901705 75950895 75642021
4812 75642021 75241277 75069233 75125222 75331234 75684731 76121681 76535798 76631923 76268523 75718437
4802 75718437 75339616 75273477 75537287 76057848 76785615 77447417 78090613 78730606 79321193 80069935
4792 80069935 80868805 81762735 82263210 82263863 81826161 81092195 80439875 79930197 79667674 79759490
4782 79759490 80571257 82116523 84539668 87467667 90388591 92434383 93628183 94303128
4774 94303128 95222907 96560227 98726912 101641701 105142671 109018784 113304510 117713005
4766 117713005 122467821 127044189 131139751 134054717 135820134 136512578 135618501 133368669
4758 133368669 129559188 124570865 118680269 112449356 106439730 101080102 96271292 92228164
4750 92228164 89253491 86894076 85295096 84365839 83891389 83522435 83091202 82904202 82623447
4741 82623447 82230559 81973787 81732859 81370096 80714607 79483562 77543753 75206910 72558133
4732 72558133 70140697 68181947 66779762 65927882 65143474 63821294 61563236 58428312
4724 58428312 54481561 50463990 46911649 43537009 40697572 38496718 36572984 35218268
4716 35218268 34366400 33897261 33299921 32464180 31141569 29718518 28203348 26628386 25231317
4707 25231317 24084337 23038237 22285684 21820212 21480880 21292485 21178466 21276534 21645629
4698 21645629 22181846 22860976 23937699 25592738 27593943 29573277 31054016 31560535 30985388
4689 30985388 29737920 28027737 26589554 25316723 24594322 24482665 24904685 25702779 26777556
4680 26777556 27797927 28283092 28376890 27663769 26553593 25279902 24214280 23666273 23368135
4671 23368135 23049908 22554483 21653685 20590002 19623637 18810301 18291876 18261252 18208110 18550935
4661 18550935 19325396 20510581 22168082 24336728 26552507 28075486 28583993 27858656 26386059
4652 26386059 24358468 22698469 21406288 20384453 19643207 19430625 19553074 19812091 19970703
4643 19970703 19893684 19455219 18909521 18499959 18142341 18323911 18786952 19139776 19025464 18480166
4633 18480166 17835106 17246556 16558554 16294858 16435468 17059623 18187651 19617456 21320401
4624 21320401 23179104 25093120 26720325 27787464 27623454 26463393 24363780 21975917
4616 21975917 19673192 17671397 15988217 14585833 13751802 13004763 12535997 12104604 11909167
4607 11909167 11942835 12135238 12620087 13375659 14361585 15759623 16822201 17586663 17558423
4598 17558423 16592930 15621606 14351793 13235431 12561087 11979482 11798361 11844438 11975565
4589 11975565 12333265 12334163 12124120 11689279 10929608 10275861 9752338 9263923 9071684 8816792
4579 8816792 8538696 8508284 8529676 8500972 8667359 8770313 9009992 9412658 10072116 10973630
4569 10973630 12104526 13810121 15817253 17803166 18823785 18502120 17342603 15680816
4561 15680816 13935939 12454090 11412913 10686005 10257073 10354354 10774395 10921485 10824592
4552 10824592 10401597 9707164 9021539 8582871 8192038 8120304 8566180 8928456 9274571 9340677
4542 9340677 9067071 8475763 7974055 7444156 7143098 7101681 7151684 7259483 7617808 8209116
4532 8209116 8437533 8375643 7987097 7297710 6741393 6310030 6146700 5705654 5373560 5285062
4522 5285062 5107006 5083692 5123025 4996936 5047196 4966271 4798854 4773707 4668282 4724185 4697306
4511 4697306 4635671 4534693 4526079 4563169 4548847 4536132 4441967 4380675 4431435 4383546 4529127
4500 4529127 4513122 4442457 4507707 4455772 4278268 4262615 4297427 4252573 4272613 4427109 4332960
4489 4332960 4362173 4367028 4317148 4318030 4331537 4418540 4595756 4719819 4623790 4555342 4459411 4604985
4477 4604985 4638363 4698179 4695984 4592773 4669269 4639099 4557260 4581414 4704643 4704004 4622872 4596419
4465 4596419 4544549 4599765 4560673 4596585 4546697 4488929 4549222 4616512 4767411 4950710 5061768
4454 5061768 5099823 5126206 4986315 4746501 4572762 4719643 4678585 4605006 4549439 4576368 4590049
4443 4590049 4506616 4626124 4607819 4737440 4600027 4573353 4687629 4587460 4563710 4584143
4433 4584143 4697844 4677896 4614351 4598394 4526885 4602978 4631849 4680696 4691429 4773491 4727513
4422 4727513 4772666 4736770 4640571 4659711 4693180 4785825 4865077 4913282 4947712 5026641 4990457
4411 4990457 5007110 5053602 5074652 5231710 5356244 5349603 5245367 5253015 5280376 5361037 5618760
4400 5618760 5939818 6064879 6040495 5970992 5900751 5738193 5740135 5822267 5853860 5885769 5883675
4389 5883675 5989988 6013301 6125835 6176937 6353797 6321179 6350801 6406221 6542867 6679332
4379 6679332 6959728 7068951 7185468 7468431 7704771 7872830 8182688 8513572 8952936 9481723
4369 9481723 10143452 11080577 12307526 13901004 16024801 18112784 20011625 21489571 22382323
4360 22382323 22735323 22576888 22420832 22375301 22425477 22672819 22738794 22391164 21363756 19881638
4350 19881638 17996528 15935163 14109764 12471808 11111386 9952565 9190480 8737232
4342 8737232 8245361 8042169 7794799 7458023 7398525 7252562 7137887 7220815 7348094 7404306
4332 7404306 7442480 7381312 7304093 7172493 7147940 7211862 7354540 7251703 7249176 7351228 7218066
4321 7218066 7268184 7369509 7316762 7418051 7491675 7527892 7582534 7840566 8255300 8896928
4311 8896928 9657534 10230534 10253222 9781850 9037848 8466200 8208474 8144527 8193231 8034877
4301 8034877 7957027 8049278 8030011 8062699 7977067 8084750 8108141 8126541 8102858 8247304 8342318
4290 8342318 8418954 8466323 8492358 8716164 8817397 8810637 8778234 8904200 9040158 9166744 9248633
4279 9248633 9370034 9521264 9614623 9708380 9657415 9820859 9920426 9969747 10076434 10253793
4269 10253793 10232111 10287317 10502812 10422167 10449717 10603223 10811189 11065910 11310899 11486545
4259 11486545 11747676 11951575 12242677 12569734 13058894 13639070 14090048 14666205 15291131
4250 15291131 16126525 16947784 18009965 19296942 20771498 22652107 24994192 27883885
4242 27883885 31374816 35867875 40937099 45926804 50403648 54370989 57758596 60951747
4234 60951747 64254315 66790859 68199049 68298585 67157913 65150721 62598228 59912515
4226 59912515 56981320 53408190 48815323 43788431 38557514 33532731 29461984 26167574
4218 26167574 23518326 21352801 19695853 18353291 17169363 16366363 15676793 15138077 14565402
4209 14565402 14081635 13781283 13557941 13313672 13050509 12928968 12864671 12672016 12655149 12586104
4199 12586104 12531212 12607640 12736635 12666790 12592937 12462808 12590531 12675228 12615153 12678597 12733077
4188 12733077 12926004 12896776 12923778 13017880 13106702 13242216 13307730 13411284 13652110 13946204
4178 13946204 14221538 14396457 14542786 14759480 14948127 15337046 15838304 16345779 16788946
4169 16788946 17065658 17420519 17792014 18340287 19101453 19987172 20849896 21665990 22405963
4160 22405963 23310475 24612949 25890190 27463282 29644538 32283254 35756232 40949049
4152 40949049 49727502 63938830 84684997 104230903 108471881 99432013 84476918 69856083
4144 69856083 59286975 51982191 47082515 43516355 41323207 40180985 40151307 40606523
4136 40606523 41290368 42442835 43601510 44603266 45517548 46238764 46855347 47367486 47954596
4127 47954596 48533374 48828080 49106532 49438781 49523398 49505471 49433440 49519877 49439591 49655209
4117 49655209 50072495 50932451 51474847 52029015 52551034 53299472 54450538 56090151 58089682
4108 58089682 60310778 62573685 64353380 65318034 65666714 65947441 66202286 66436662 66547247
4099 66547247 66798106 67047213 67264178 67598349 67957425 68596121 69306888 69971663 70757615
4090 70757615 71343441 71964408 72533554 73129972 73967668 74802625 76118300 77991168 80512315
4081 80512315 83805851 87426333 90999593 94187385 96660280 98727081 100701482 102582997
4073 102582997 104435083 105771130 106871331 107967539 108890740 109790789 110729614 111404606 111426509
4064 111426509 111186984 110747095 110364613 110244250 110493453 111186008 111940894 112599421 112837065
4055 112837065 112930447 112834176 112485246 112041184 111247595 110282991 109794118 109681984 110025567 110995862
4045 110995862 112256036 113548046 114482064 115018278 115294037 115201812 114613901 113379758 111640911
4036 111640911 109526696 107399577 105855054 104403567 102560422 99754861 96149038 92068084
4028 92068084 88015157 84620839 82261775 80985974 80747123 81374150 82556882 83976429
4020 83976429 85155740 86081581 86583789 86769088 86701839 86377243 85848389 84977429 83883989
4011 83883989 82618621 80753806 78883069 77081164 75696393 74982750 74690795 74296743 73285010
4002 73285010 71649604 69825417 68278514 66883064 65815632 65265177 64759192 64005450 63120592
3993 63120592 61968116 60784525 59658793 58360545 56935390 55293908 53235432 50824741
3985 50824741 48284286 45950635 43998449 42314639 40753061 39605843 38622924 37489968
3977 37489968 36260862 34821495 33524112 32063093 30615137 29168410 28141664 27245753
3969 27245753 26428361 25847354 25239033 24607857 23793376 23095681 22402574 21834636 21480513
3960 21480513 21109121 20748083 20311637 19770336 19223305 18604278 18066940 17371908 16863270
3951 16863270 16363469 15704755 15348937 14974170 14599943 14220763 14030623 13801933 13752172 13688615
3941 13688615 13562956 13551299 13415534 13281153 13166425 13044112 13014406 12915857 12869890 12748836
3931 12748836 12745033 12841699 12887920 12827842 12826985 12863888 12863351 12989424 12882189 12802909 12639233 12545183
3919 12545183 12388094 12292656 12036947 11874363 11904911 11763977 11651207 11654891 11645436 11712539 11695611
3908 11695611 11766158 11769487 11579103 11576741 11443447 11503690 11584544 11444547 11430382 11527689 11664453
3897 11664453 11589816 11607983 11692857 11772989 11881566 11994404 12083890 12282584 12435912 12513190
3887 12513190 12603622 12772412 12886214 13104940 13310797 13333498 13503129 13697096 13956364 14434481
3877 14434481 14769408 14932931 14836488 14774152 14714180 14777549 15167509 15232020 15569572 16006542
3867 16006542 16406589 16710692 16873996 17256315 17683156 18474516 19103517 19718764 20568360
3858 20568360 21359893 22103974 22610251 23358536 24211094 24959846 25726030 26496841 27054746
3849 27054746 27703571 28316055 28838990 29177574 29295715 29352077 29529759 29695442 30013311 30687883
3839 30687883 31394065 31856728 32320028 32850023 33486805 34336604 35408603 36773889 38171101
3830 38171101 39457223 40966945 42461997 43818516 45183551 46388523 47729742 48882366
3822 48882366 50119709 51412468 52503888 53414389 54487775 55723072 57342126 59155598
3814 59155598 61188478 63062521 64668802 66191039 67482057 68519358 69402106 70223962
3806 70223962 70780271 71113617 71103598 71041351 70454232 69359019 67710203 65761294 63542927
3797 63542927 61383845 59527946 57890387 56460656 54843703 53224017 51700417 50274577
3789 50274577 48742682 47284541 45854766 44637946 43173676 41887079 40602080 39620926
3781 39620926 38826878 38344592 38104274 37961867 38231525 38902386 39887390 41006810 42501029
3772 42501029 43861352 45359477 46764257 47874277 48900830 49744726 50670381 51801710
3764 51801710 53071146 54501027 56162633 57845309 59459500 60613323 61346172 61818673
3756 61818673 61978013 62170946 62014689 61526941 60970507 60536478 60019132 59597414 59132674
3747 59132674 58416266 57605108 56897702 56252348 55345074 54108098 52499488 50753048 48789370
3738 48789370 46717037 45017704 43429440 42196191 40920327 39903380 38906997 37889299
3730 37889299 36754552 35759426 35266458 34671285 34263457 34220689 34170406 34317185 34677894 35108049
3720 35108049 35425893 36046809 36529455 36987292 37512602 37933586 38384409 38937581 39304753
3711 39304753 39590002 40161421 40591813 40902266 41296753 42002387 42731014 43324523 43926457
3702 43926457 44419833 44801569 45104391 45035877 44987841 44603559 44152694 43617211 42945610 42237612
3692 42237612 41589285 40914682 40302731 39943001 39459672 39041554 38594464 38105514 37427784
3683 37427784 36970428 36667324 36421653 35985685 35451455 34810700 34013125 33289563 33170994
3674 33170994 33090487 33091230 33650704 34404915 35170903 36031459 36964013 37417706 37549182 37482678
3664 37482678 37610213 37908321 38535714 39654796 41159660 42742695 44422909 45939204 47293532
3655 47293532 48346814 49412026 50270353 51215807 52441906 53557229 54911115 56079893
3647 56079893 56814167 57437982 57503961 56972290 56112784 55063140 53948466 53060769 52345539
3638 52345539 51982482 51783593 51608207 51320759 51111744 50731079 50211180 49870109 49610144
3629 49610144 49485933 49523610 49543723 49760172 50063184 50356057 50797019 50980947 51234947 51251343
3619 51251343 50786969 49931510 48970748 48096939 47569955 47135471 46754570 46619496 46627710 47244912
3609 47244912 48176684 49790195 51745401 53611386 55664365 57742311 59706807 61208968
3601 61208968 62116548 62703003 62730271 62619299 62442295 62005944 61432551 60858751 60626974 60678127
3591 60678127 60837359 60653580 59583519 57552119 55111714 52363618 49666178 47226415
3583 47226415 45205470 43546436 42550024 42356824 42915427 43970019 45569737 47369045 49299580
3574 49299580 51249649 53113009 54680062 55796666 56908511 57892142 58858944 59682141 60073473
3565 60073473 59740805 58677756 56907936 54383053 51775589 49499814 47697112 46507958
3557 46507958 46024792 46311603 47094005 48298911 49297208 49821452 49821737 49285896 48095087 46452874
3547 46452874 44130675 41259533 38280503 35401353 32936729 31153413 29967862 28933465
3539 28933465 28125233 27143493 26557965 26039950 25696250 25469098 25450759 25799272 26110318 26097578
3529 26097578 25777264 24992461 24371754 24106653 24020382 24072668 24450045 25007561 25555940 26145058
3519 26145058 26591425 27331480 28484547 29831456 31126799 32431287 33499792 34118907 34232160
3510 34232160 33949834 33634322 33503400 33590122 34153554 34785672 35683752 36514628 37387821 38519101
3500 38519101 39126619 39647602 40084470 40239972 40240611 39906117 39450562 38678729 37693264 36527950
3490 36527950 35439076 34533481 33641440 32700565 32030321 30920347 29614124 28417996 27216312
3481 27216312 26239085 25556436 25078644 24747830 24407592 24117519 23944603 23931462 23930650 24226115
3471 24226115 24570367 24982532 25700090 26224227 26775685 27218793 27418395 27374513 26939212 26354606
3461 26354606 25822471 25189855 24974182 24721749 24900565 25139042 25605618 25930384 26170967
3452 26170967 26153555 26139831 26237898 26567795 27224734 28266865 29338482 30061654 30523277 30766840
3442 30766840 30766299 30732682 30842143 31149716 31555326 31820756 32188816 32164038 31964660 31484667
3432 31484667 30765603 30080438 29477382 28900192 28355520 27798133 27462220 27274515 27336086 27903054
3422 27903054 28717324 29744079 31051988 32029078 32623270 32601015 32270231 31843466 31734851
3413 31734851 31954230 32482311 33371168 34298795 35245499 35822680 36218742 36420452 36339324 36199855
3403 36199855 36247708 36346140 36835504 37330560 37961005 38757596 39298193 39779918 40045565 40440183
3393 40440183 41368295 42906693 44900496 47262148 49276938 50302233 49987365 48492345
3385 48492345 46479145 44651419 43368656 42835643 42765173 43197114 43862443 44471052 44573222
3376 44573222 44294850 43721916 43238726 43147090 43580042 44463021 45049671 44867751 44009616 42416698
3366 42416698 40641083 39122940 38092943 37523833 37316369 37464452 37607052 37723039 37960657
3357 37960657 38264590 38586439 39131546 39732877 40682676 42042852 43556352 45148752 46671827
3348 46671827 48611007 50774327 53063932 55126389 56792254 57891207 58771315 60177132
3340 60177132 62545242 65882165 69882922 73124882 74882176 75180606 74235320 73011610
3332 73011610 71876580 71093896 70514047 69764264 68582782 67196872 65631248 64312054 63151599
3323 63151599 62308146 61839458 61709395 62016254 62621267 63099744 63425523 63830630 64608572
3314 64608572 65936639 68200382 71122580 74533632 78909344 84932380 92954311 104301443
3306 104301443 120748421 143272891 170755357 198376068 219007922 226804366 221126813
3299 221126813 206261402 187904924 170047815 154851603 143182291 134965532 128805646
3292 128805646 123672751 119027012 114860114 111235485 108647844 107991495 109197102 111787876
3284 111787876 115424646 119468081 123590565 128407537 135178688 145916148 162834632 186969158
3276 186969158 215761085 242625215 259000011 260281385 248123562 229495707 211466295
3269 211466295 198957882 192908395 191888965 192238483 191174888 187503324 182724964 178756999
3261 178756999 177120039 177930057 179959803 182108648 183928763 185245031 186293095 186075222
3253 186075222 182846842 175934928 165375612 153424137 142073451 133126316 127166800 124110033
3245 124110033 123914670 126534254 131946544 139929671 150706672 164477939 180501426 197837899
3237 197837899 215672563 234239279 255407632 281647436 313905601 348153187 376655919
3230 376655919 392501738 393968575 385249388 371637330 354708206 332843650 305314007
3223 305314007 273217613 240346483 210526595 185547845 165778587 151156409 141168799
3216 141168799 134902447 131028438 127929238 124093468 118925538 111986206 103999580 95936642
3208 95936642 88651024 82235593 76978949 72808579 69569935 67300745 66046486 65730831
3200 65730831 65989756 67041587 68751031 71538016 76044564 82732182 92747706 106783683
3192 106783683 124671590 143773693 160092029 168785199 167654204 157275278 140880155
3185 140880155 122601389 105867675 92093082 81522550 73564509 67346433 62337235
3178 62337235 58259010 54834655 51810587 49173761 46955702 45032497 43316816 41843641
3170 41843641 40345352 38952559 37332324 35721809 34483086 33605173 33126155 32843703 32726574
3161 32726574 32631133 32429391 32107107 31636763 31577937 31511485 31427883 31484616 31422944 31293965
3151 31293965 31178371 30912669 30542937 30358582 30267828 30333760 30695977 31262392 32187469 33132625
3141 33132625 34216371 35569381 37186502 39046771 41453855 44707588 48612342 53844316
3133 53844316 61015763 70840700 83998241 100434475 119080247 137012364 150678042
3126 150678042 156783715 154033584 143653492 128302915 111421178 95774875 82789389
3119 82789389 72913009 66424628 62651049 61677243 62766953 64667084 66160354 65829198
3111 65829198 63390375 58980444 53349579 47448204 42119409 37592896 34102284 31461118
3103 31461118 29521950 28116681 27103054 26232191 25533809 25002554 24692230 24359290 24091530
3094 24091530 24029488 24292780 24478003 24878407 25202836 25300421 25489267 25634444 25903765 26442082
3084 26442082 26974263 27895306 29029683 30326617 31926422 33869520 36003896 38481014
3076 38481014 41352869 44550424 48603361 53824229 60360923 69074437 80585002 95465657
3068 95465657 113401984 132729304 149831213 161419421 165118258 160724259 150874935 138590862
3060 138590862 127552135 119905226 117007512 119722099 127611119 138987250 150918181 159393212
3052 159393212 161217438 154848447 141846857 125008118 107197041 90927370 76989754
3045 76989754 65365275 56151408 48935526 43132074 38399062 34853020 31953314 29712689
3037 29712689 28106383 26822642 25870201 25158997 24679631 24481249 24713794 25157040 25685608
3028 25685608 26370573 27370963 28524164 29986999 32084420 35009630 39469975 46088148
3020 46088148 55037599 65700321 77004044 86280020 91211439 90674207 84832238 75222100
3012 75222100 64042182 53022519 43381237 35421608 29293158 24764968 21035503 18140680
3004 18140680 16110892 14644129 13368640 12242457 11307514 10519440 9955907 9549814 9184148
2995 9184148 8926175 8868060 8649118 8444800 8240194 7793381 7491886 7203733 6933886 6724336
2985 6724336 6627013 6338558 6009636 5799477 5691020 5440540 5330751 5108583 4857189 4659867
2975 4659867 4601411 4632100 4343073 4275560 4153132 4090998 4008932 3842430 3760456 3694367 3489057
2964 3489057 3333778 3202908 3005256 2860112 2847801 2730757 2702875 2769485 2700159 2648485
2954 2648485 2729461 3019274 2957228 2891113 2984911 3205452 3429468 3433921 3221422 3215072 3173728
2943 3173728 3087445 2923573 2676500 2707550 2414093 2165621 1999864 1808419 1710009 1829296
2933 1829296 1709349 1695408 1582627 1431707 1420639 1352757 1322371 1207510 1284281 1320342 1166371
2922 1166371 1081989 983232 1093743 944078 877175 931346 974581 998553 785143 780455 879997
2911 879997 897572 981734 1117260 1184280 1147726 1232910 1259405 1183628 1129439 1084342 987872
2900 987872 933440 807081 531703 508974 430139 369486 383654 402117 274854 130643 40703
2889 40703 136982 134132 197244 69522 61253 98731 219081 253262 140026 63053 107141 52962
2877 52962 135863 64664 -28413 -26623 108535 88229 111876 -57785 -212845 -242846 -147973
2866 -147973 -81465 -158504 -38630 -85858 -184724 -135059 -75776 -94992 32326 -10957 28596
2855 28596 -7763 47968 115689 145510 -127878 -207484 -81858 27334 -10152 6179 150383
2844 150383 264083 386799 456601 404396 402742 431375 300149 210461 233289 52680 -108114
2833 -108114 -99569 -113243 -145968 -15397 -87908 -105147 -85080 -113477 -12389 -92767 -101416 -171824
2821 -171824 -167931 -24305 -47342 -50582 -186176 -184214 -221540 -261028 -259979 -147664 -195387 -336276
2809 -336276 -185556 -11693 -21484 -35257 -88652 -201183 -240684 -320869 -242976 -196172 -251381
2798 -251381 -291370 -259120 -294140 -274671 -283731 -243987 -172492 -99676 -280432 -232809 -122068
2787 -122068 -59635 -37763 61507 233419 207402 282770 260870 443761 422171 187615 372877
2776 372877 368738 324559 209555 201804 286297 215893 222753 272628 296288 400864 185528 129099
2764 129099 65643 -1650 -38189 -99950 -71633 -192969 -177946 -340792 -377587 -368645 -301924
2753 -301924 -282361 -404125 -386480 -426119 -358142 -421920 -375177 -347855 -271822 -319271 -315332 -233911
2741 -233911 -271054 -330391 -491507 -269189 -74367 -60479 -178546 -272557 -171985 43034
2731 43034 793 4763 -189571 -290559 -241886 -262162 -235705 -281772 -267128 -376984 -398976
2720 -398976 -302770 -400514 -561537 -577618 -529341 -494347 -351434 -402688 -453069 -603701 -627656
2709 -627656 -631584 -572612 -487397 -537513 -479937 -497525 -515956 -496076 -428011 -490373 -366645 -298347
2697 -298347 -422669 -445768 -407627 -419511 -606842 -520743 -512809 -484324 -417572 -570706 -723447
2686 -723447 -682542 -541338 -460368 -485404 -390015 -376844 -421127 -436932 -551700 -425618 -340859
2675 -340859 -449134 -406731 -467763 -522160 -444149 -486255 -470142 -568373 -718017 -578348 -483135
2664 -483135 -514734 -516796 -422382 -520240 -398433 -393283 -387682 -295177 -461339 -482020 -312638 -389861
2652 -389861 -486233 -382171 -317380 -417474 -490780 -393957 -387809 -354643 -388970 -485870 -412539
2641 -412539 -355470 -594023 -631541 -582774 -543707 -472535 -354871 -393348 -509502 -494182 -497115
2630 -497115 -600583 -539247 -600532 -467877 -367298 -539513 -503918 -495760 -377137 -247464 -208836
2619 -208836 84407 213250 333131 404289 339533 243992 160704 44981 78641 -53732 -232288
2608 -232288 -255956 -149619 -189994 -291851 -382840 -335500 -298828 -313204 -143337 -316381 -396648
2597 -396648 -399068 -438264 -356820 -415748 -432018 -449969 -309386 -281971 -296706 -421602 -480836
2586 -480836 -509129 -507638 -400763 -298403 -331992 -431220 -364311 -283813 -377264 -549405 -441086
2575 -441086 -432751 -366912 -354399 -333291 -310154 -238963 -307712 -307737 -372377 -456273 -481377 -447957
2563 -447957 -323458 -295479 -299267 -382231 -366656 -296580 -337866 -489224 -472751 -367330 -213760
2552 -213760 -250306 -427763 -335496 -399157 -364056 -220942 -236177 -268934 -299603 -259129 -238319
2541 -238319 -210557 -234689 -256368 -279475 -275597 -282043 -318075 -306268 -216538 -318326 -254681 -215716
2529 -215716 -229752 -135185 -232670 -238807 -148220 -148083 -145587 -153673 -148421 -103020 -27156 -67140 -97761
2516 -97761 -108176 -73335 103323 -101484 -134834 -194060 -125973 -94200 -291343 -343452 -216664
2505 -216664 -257596 -167128 -194378 -242262 -148854 -192405 -244295 -369632 -436870 -344809 -161070
2494 -161070 -107936 -48676 -96100 -160218 -184224 -185895 -317118 -110486 -24147 -101350 -23340
2483 -23340 -42386 -53333 -243355 -108366 -7386 -127931 -164080 -158662 -103533 -195840 -133556
2472 -133556 -82985 -7201 -83436 -96108 4380 62931 -1481 -10237 -42573 37942 112152 17100
2460 17100 89398 134787 170241 159642 281786 298156 363750 267966 270538 328212 361156 315630
2448 315630 253095 201621 276228 244123 156183 -5874 113650 284423 393041 276959 383618
2437 383618 400077 325089 348720 355399 416645 520420 638616 692774 669833 626125 604963
2426 604963 519868 569868 558902 689964 806050 804982 833157 942738 908600 941058 909936
2415 909936 948238 963619 939917 1161926 1229785 1190814 1129661 1222642 1263496 1367168 1386033
2404 1386033 1449680 1391388 1387385 1416042 1364667 1539141 1715956 1784169 1801328 1933257 1979407
2393 1979407 2150025 2288692 2416557 2411292 2400342 2679497 2912801 2979846 2979484 2988997 3256911
2382 3256911 3578779 3607230 3726380 3801266 3944264 4150076 4349416 4694846 4993594 5260897
2372 5260897 5633656 6035601 6382370 7163173 7985924 9148642 10796139 12736983 14000249
2363 14000249 14589589 14758506 15227885 15916238 17138766 19044937 21989289 25758903 31373934
2354 31373934 38944698 52394551 77765880 122983561 170249710 187610245 167930604
2347 167930604 131772736 96818262 70623661 53564774 40761178 31233321 24029058
2340 24029058 19116848 15455417 13236027 11984232 11826697 12030196 11826278 10698354 9461221
2331 9461221 7965621 7101238 6272704 5761830 5231866 4759721 4321998 3993904 3766184
2322 3766184 3545707 3345104 3249236 2940179 2606056 2585571 2470973 2221822 2274304 2192059
2312 2192059 2237518 2042928 1863380 1757260 1662533 1515986 1527128 1539645 1433721 1281988
2302 1281988 1397402 1304968 1188936 1267088 1182275 1145853 1087976 936464 820584 710130
2292 710130 705333 620982 645404 655184 644760 601011 515745 506747 431012 280478 321185 307351
2280 307351 235109 258198 230536 213892 338445 238966 203663 248207 134843 30728 41256
2269 41256 -111875 -122324 -40011 27568 -50842 -94675 -48666 -75101 -22551 -41187 50611 97104
2257 97104 -23287 -89898 28049 -107175 -180636 -165747 -242368 -305815 -255585 -286494 -301335
2246 -301335 -364076 -409429 -412981 -440661 -469744 -512193 -505005 -481909 -494367 -439958 -404572 -319697
2234 -319697 -302538 -324732 -322277 -230005 -371177 -546420 -504836 -453697 -415420 -342777 -381636
2223 -381636 -418425 -420907 -529441 -647820 -627726 -594217 -610808 -533870 -419018 -420868 -470217
2212 -470217 -547163 -545136 -573709 -631741 -517610 -511555 -575037 -457189 -445894 -460122 -680590
2201 -680590 -648273 -563302 -574404 -519215 -375203 -538275 -589039 -567213 -543596 -662111 -686125
2190 -686125 -673502 -641543 -680762 -751211 -666570 -712443 -672289 -654360 -704898 -598068 -510738
2179 -510738 -568914 -541298 -682736 -730355 -578100 -547427 -575393 -515307 -617719 -835945 -799047
2168 -799047 -765157 -747608 -670316 -581574 -765371 -682782 -675051 -678219 -800347 -825335 -774852 -800486
2156 -800486 -864219 -767894 -718690 -693938 -811634 -696745 -563683 -649803 -553594 -719509 -576781
2145 -576781 -620757 -625754 -677526 -775081 -665392 -620973 -717150 -674086 -654065 -683753 -641031 -661892
2133 -661892 -797078 -707741 -733389 -690159 -665413 -838151 -787778 -804463 -770745 -674673 -655900
2122 -655900 -678574 -560900 -609225 -461311 -614472 -863731 -730683 -805499 -696639 -653372
2112 -653372 -530883 -531692 -711647 -630008 -633934 -551784 -515685 -575983 -698725 -726891 -644817 -572850
2100 -572850 -437076 -543942 -448142 -518755 -569586 -548093 -483429 -590111 -559001 -656717 -635892
2089 -635892 -643921 -656977 -726488 -569565 -426048 -328570 -350102 -238476 6397 81812 158028
2078 158028 70406 -146039 -235557 -334543 -509592 -661125 -738045 -770482 -745351 -759950 -739596
2067 -739596 -714586 -549715 -645827 -609853 -726714 -791423 -665019 -716714 -713869 -691997 -617884
2056 -617884 -543595 -732482 -800614 -785683 -825253 -677107 -704116 -647527 -602984 -687670 -722315
2045 -722315 -725649 -699027 -717221 -748284 -746977 -706104 -746710 -874781 -855205 -873879 -774641 -594719
2033 -594719 -592082 -703594 -678386 -767279 -666484 -780686 -739064 -826673 -803701 -721656 -718121
2022 -718121 -648182 -571344 -640578 -499281 -470949 -522891 -708656 -780348 -666920 -601049 -605008
2011 -605008 -674971 -588042 -725755 -760654 -696212 -634652 -757204 -822432 -680218 -817452 -916633
2000 -916633 -858787 -501760 -593665 -637433 -658553 -663045 -683818 -637643 -552005 -674855 -688608
1989 -688608 -769263 -741539 -729052 -741713 -701199 -819100 -930595 -884115 -859500 -838393 -701212
1978 -701212 -852706 -813741 -661097 -771573 -780758 -678212 -606236 -656642 -567713 -621683 -668246
1967 -668246 -701095 -608271 -706569 -728290 -605531 -580084 -634102 -675448 -675540 -768161 -736532 -670134
1955 -670134 -643605 -703215 -660016 -608665 -707220 -749846 -768601 -683581 -766876 -807327 -684017
1944 -684017 -752012 -782342 -798589 -789904 -811116 -711911 -715099 -634711 -687847 -631652 -706309 -794807
1932 -794807 -668068 -751482 -714052 -730022 -573920 -457649 -403484 -523362 -610637 -523781 -539362
1921 -539362 -738775 -712991 -661409 -703090 -684216 -726421 -747049 -733824 -764040 -776687 -768856 -584196
1909 -584196 -556040 -617127 -619806 -721399 -701867 -662415 -630288 -727572 -780314 -746835 -720128 -683800
1897 -683800 -639487 -683804 -590480 -549864 -527473 -597340 -780516 -680229 -578114 -611202 -649383
1886 -649383 -655300 -653434 -633813 -692948 -627357 -628258 -588495 -676129 -590586 -511995 -566449 -683514
1874 -683514 -599813 -528480 -599658 -691006 -624623 -535818 -642597 -717688 -671871 -823005 -831437
1863 -831437 -689191 -781078 -824727 -732406 -717547 -657245 -688027 -561355 -629183 -692333 -628774
1852 -628774 -588492 -684871 -677635 -636233 -771183 -675396 -592492 -499883 -544310 -597891 -669506 -735186
1840 -735186 -683510 -728334 -637070 -621422 -786471 -655462 -607573 -806004 -793506 -835763 -788483
1829 -788483 -859833 -881308 -819679 -914583 -712211 -686157 -640714 -791489 -876281 -838599 -645475
1818 -645475 -658073 -741418 -615514 -587382 -814275 -838138 -826816 -766405 -667087 -642761 -625182
1807 -625182 -690284 -799253 -735956 -708362 -742198 -875266 -741218 -724230 -820474 -660568 -660168
1796 -660168 -759428 -768861 -704171 -612378 -516717 -526592 -773984 -753276 -780378 -818138 -808540 -755345
1784 -755345 -751850 -668757 -615999 -812627 -890597 -855702 -781911 -741245 -665889 -677983 -633089 -571379
1772 -571379 -596228 -649947 -662150 -692081 -639804 -621832 -705503 -744664 -732080 -727455 -719301 -828348
1760 -828348 -679410 -523761 -446853 -657891 -786557 -703902 -635205 -636086 -700854 -633750 -704408
1749 -704408 -834313 -931257 -929137 -859590 -750884 -673611 -560795 -480715 -489036 -442532 -584061
1738 -584061 -631212 -660751 -695013 -794583 -592383 -594307 -656241 -653186 -630407 -556921 -658512 -637876
1726 -637876 -767432 -665531 -651106 -685448 -638819 -572025 -655775 -639034 -617608 -733587 -795639
1715 -795639 -724680 -686504 -751153 -647317 -717327 -664773 -737689 -806201 -684309 -822741 -660665
1704 -660665 -501747 -491902 -498991 -572373 -735629 -683738 -640886 -679579 -551330 -635766 -600154
1693 -600154 -652870 -690613 -593849 -646725 -607200 -601341 -667040 -567141 -658719 -755984 -831510 -898145
1681 -898145 -759973 -750834 -733545 -673727 -581486 -580978 -641765 -642618 -571076 -562836 -663579 -732085
1669 -732085 -720828 -733478 -566751 -507612 -547616 -496103 -547221 -560641 -682389 -594158 -616606
1658 -616606 -600152 -588718 -618541 -696819 -721434 -679491 -668075 -727650 -648848 -577779 -594546 -622196
1646 -622196 -681592 -651676 -837187 -897621 -857146 -733770 -619458 -646152 -797822 -814301 -816809
1635 -816809 -769387 -754777 -846574 -696517 -643306 -624666 -635609 -571894 -686013 -763957 -653134
1624 -653134 -693820 -805972 -696759 -637177 -568157 -658035 -684397 -637002 -689442 -563388 -653569
1613 -653569 -670054 -632806 -625179 -687523 -773573 -634833 -530603 -603111 -557420 -621143 -689939
1602 -689939 -781101 -847528 -855758 -723965 -574324 -557598 -648841 -595524 -589950 -631841 -587189 -611993
1590 -611993 -712451 -689401 -622539 -635145 -693158 -659929 -535538 -610692 -672094 -767392 -762864
1579 -762864 -602717 -741774 -655283 -638395 -587686 -557277 -678090 -591917 -701444 -647491 -595172
1568 -595172 -552174 -633575 -661614 -575801 -626307 -808199 -727758 -570699 -670377 -713148 -737333
1557 -737333 -669509 -584324 -634346 -618187 -668580 -602636 -492564 -551041 -687233 -714488 -662718
1546 -662718 -767145 -803587 -551394 -574238 -627695 -672119 -759785 -795900 -796169 -818990 -776484 -802324
1534 -802324 -690939 -569562 -671472 -670441 -771758 -713778 -727581 -625338 -572746 -654615 -653603
1523 -653603 -696311 -679904 -648071 -635292 -703453 -693922 -505356 -436471 -525852 -641406 -672209
1512 -672209 -731489 -670146 -639433 -529238 -451597 -552097 -788060 -732141 -809828 -744766 -647267
1501 -647267 -667123 -667938 -689623 -692016 -748284 -723693 -659478 -561301 -654130 -776957 -655850 -742072
1489 -742072 -740094 -583391 -518601 -426807 -518719 -569574 -646264 -472789 -553333 -591636 -433592
1478 -433592 -387275 -513618 -621464 -433681 -595943 -652568 -626433 -644803 -622008 -489916 -626426
1467 -626426 -713161 -715827 -763185 -778518 -734802 -725012 -667276 -496923 -468595 -573209 -754485
1456 -754485 -750980 -817516 -787283 -779361 -690844 -691304 -690357 -730254 -702411 -694047 -737349 -732841 -629498
1443 -629498 -628774 -713392 -665265 -629836 -583437 -562670 -720343 -588523 -654252 -632569 -612636 -748422
1431 -748422 -660308 -695751 -614693 -740740 -764029 -627330 -674144 -711552 -589159 -678580 -607593
1420 -607593 -599974 -721476 -561651 -628771 -699118 -785540 -765628 -724842 -594043 -482578 -506729
1409 -506729 -601233 -635783 -686202 -676825 -654307 -555408 -671583 -702562 -638520 -650594 -753111
1398 -753111 -717120 -698977 -757522 -775408 -604940 -508693 -573593 -706102 -654823 -513852 -542514
1387 -542514 -639042 -686866 -630480 -677250 -580799 -667802 -674018 -716658 -678942 -627726 -645507 -540750
1375 -540750 -582112 -527020 -544601 -638088 -611321 -656516 -736386 -722825 -560510 -600021 -499412
1364 -499412 -466149 -529045 -685495 -738525 -647042 -605597 -673478 -782390 -742426 -611338 -443096
1353 -443096 -504699 -626523 -615219 -704658 -782539 -812899 -665729 -654919 -604057 -494872 -536707
1342 -536707 -636921 -583711 -596597 -534746 -553794 -574206 -623580 -642254 -655331 -596371 -676674
1331 -676674 -624824 -619481 -726422 -653807 -704036 -663580 -574522 -606421 -637273 -673244 -717429 -757078
1319 -757078 -707413 -784413 -732909 -669676 -768624 -808635 -787886 -819572 -736309 -652231 -642236 -492021
1307 -492021 -481144 -550160 -721712 -792578 -707580 -714479 -737634 -699517 -517327 -493676 -662128
1296 -662128 -633976 -669009 -633587 -642423 -468920 -619479 -612375 -615922 -624771 -588664 -654093 -575919
1284 -575919 -548225 -644572 -631507 -649719 -715357 -781721 -589857 -608977 -659297 -611553 -568449
1273 -568449 -604243 -481209 -439316 -480891 -533296 -613917 -658370 -621281 -486184 -529937 -580537
1262 -580537 -602078 -604384 -651549 -504657 -568836 -554989 -576619 -596517 -585620 -438487 -428441
1251 -428441 -459391 -575163 -606241 -654534 -666258 -590297 -505202 -585499 -608253 -500512 -473201
1240 -473201 -495043 -634011 -677553 -651230 -614649 -501281 -430070 -336315 -427421 -634890 -682988
1229 -682988 -664073 -607740 -616691 -569025 -539277 -580955 -606727 -658294 -842635 -702025 -617166
1218 -617166 -593761 -617510 -640842 -693211 -601402 -619477 -590513 -548531 -613640 -742350 -621634
1207 -621634 -525131 -565560 -680025 -488426 -364641 -610465 -529012 -449847 -575209 -639049 -670801
1196 -670801 -629923 -540535 -659333 -640773 -622671 -649831 -692796 -623002 -646225 -600547 -632918
1185 -632918 -776276 -784528 -721060 -739397 -682103 -626412 -730159 -726738 -702362 -616117 -630410 -518466
1173 -518466 -462721 -475459 -377275 -480470 -576865 -610016 -620874 -650982 -652323 -672317 -654013 -639144
1161 -639144 -546907 -430020 -438318 -464734 -532649 -590676 -599471 -659926 -613341 -554722 -682815 -661724
1149 -661724 -517351 -638150 -568231 -642390 -584874 -542437 -510778 -596530 -804821 -761085 -672768
1138 -672768 -567468 -491155 -528725 -619333 -664486 -642349 -715651 -688564 -622079 -598315 -527419
1127 -527419 -603474 -656480 -664012 -576459 -654331 -668516 -602075 -524608 -652535 -674298 -628252 -617684
1115 -617684 -536934 -608797 -735799 -723365 -624438 -650155 -609106 -622772 -677006 -634971 -617129
1104 -617129 -455984 -423466 -590231 -547728 -516203 -531295 -644018 -614280 -504607 -543175 -564264
1093 -564264 -673300 -708963 -789496 -701898 -662669 -608034 -587661 -733121 -734676 -683947 -714486
1082 -714486 -750939 -782897 -712446 -644354 -734685 -778134 -760121 -638723 -640662 -650304 -634387 -750430
1070 -750430 -810199 -675858 -638364 -627538 -626404 -595765 -603875 -614120 -791970 -723217 -617214
1059 -617214 -679881 -766046 -597853 -525350 -615482 -676866 -734759 -656931 -630183 -476418 -436675
1048 -436675 -494224 -480919 -510182 -656335 -598191 -615214 -673342 -673040 -685705 -565895 -616105 -638829
1036 -638829 -589302 -695315 -636360 -632622 -561922 -522612 -488427 -587926 -610226 -584162 -520270 -450874
1024 -450874 -452114 -513215 -549828 -540411 -547517 -538317 -529203 -621162 -531963 -557737 -536906 -494921 -511133
1011 -511133 -499877 -547821 -566649 -763908 -699851 -614267 -595726 -606536 -592255 -643092 -681063
1000 -681063 -633650 -512684 -578253 -734553 -826929 -683872 -565320 -587809 -490204 -490785 -417645
989 -417645 -489480 -580667 -582312 -694167 -808139 -591936 -479971 -467254 -504406 -525462 -628919
978 -628919 -645116 -653667 -627786 -570503 -558728 -509969 -529220 -440190 -508481 -488205 -538806 -534007
966 -534007 -516103 -565808 -670505 -555665 -401571 -418524 -437468 -608235 -594661 -588561 -564479
955 -564479 -484564 -557584 -583398 -492729 -420986 -510274 -586426 -615014 -659385 -678861 -527400 -633487
943 -633487 -752743 -665343 -695903 -787586 -760279 -647413 -627528 -513356 -527078 -616072 -580737
932 -580737 -527880 -571618 -659258 -679977 -721606 -802751 -925525 -817598 -771054 -800506 -668393
921 -668393 -763126 -773691 -612950 -558809 -479669 -459460 -436131 -585461 -521123 -476211 -582915
910 -582915 -532860 -668643 -588565 -408018 -458438 -492219 -496149 -540858 -592217 -692222 -708949
899 -708949 -590801 -494589 -592279 -625611 -617508 -508455 -336718 -539939 -456856 -412628 -515701
888 -515701 -590441 -540572 -519877 -554576 -648371 -626751 -564236 -677551 -674454 -578477 -575208 -517709
876 -517709 -526318 -463901 -492128 -489191 -482487 -515468 -535535 -504609 -548254 -625064 -616838 -732162
864 -732162 -628321 -590363 -551430 -508146 -627693 -531800 -501314 -591379 -598115 -586273 -671002 -693879
852 -693879 -537846 -591676 -573774 -552400 -505884 -468084 -450914 -480042 -544886 -488929 -501278 -523802
840 -523802 -547803 -557478 -543868 -528114 -494376 -559376 -492292 -410703 -497295 -602300 -565838 -613466
828 -613466 -554395 -673755 -607930 -667367 -604143 -554578 -538457 -637895 -512876 -424651 -513094
817 -513094 -560533 -661185 -685070 -715416 -746019 -698430 -687401 -721028 -594600 -563105 -592341
806 -592341 -586960 -625118 -660976 -713959 -605985 -634553 -527370 -305185 -454945 -534978 -550702
795 -550702 -587491 -604831 -604769 -597373 -520242 -534209 -467627 -526298 -643942 -670380 -672174 -662416 -678766
782 -678766 -713552 -580676 -515672 -523265 -693107 -594375 -588650 -629590 -731874 -701300 -503180
771 -503180 -585223 -491250 -534976 -512860 -559739 -516700 -593327 -476878 -330579 -499596 -504967
760 -504967 -559952 -581254 -506542 -597074 -541315 -498042 -624257 -559302 -561600 -522426 -573251 -609673
748 -609673 -563995 -503601 -646382 -602321 -543479 -473782 -450069 -413167 -406918 -526977 -601317 -626298
736 -626298 -598879 -588596 -608805 -567547 -656275 -585016 -475654 -577787 -647545 -496880 -593840
725 -593840 -618045 -548633 -510939 -468156 -650427 -635079 -620745 -503560 -528686 -574056 -611108
714 -611108 -624085 -569202 -525372 -613264 -632978 -594821 -598046 -697473 -722962 -662188 -651893 -612423
702 -612423 -677446 -634089 -638730 -653256 -717706 -626998 -574977 -628591 -658689 -673203 -586067 -439929
690 -439929 -575012 -504764 -537860 -773947 -742212 -684099 -652853 -646876 -543176 -460627 -468221 -611478
678 -611478 -597069 -480874 -389624 -340342 -503028 -590167 -511231 -510906 -583248 -551669 -646199 -560255
666 -560255 -495542 -572462 -361738 -411904 -345052 -452018 -482722 -444164 -572351 -593225 -622301
655 -622301 -629284 -616138 -589408 -555641 -518178 -543746 -575035 -560600 -540218 -593989 -637458 -531820
643 -531820 -642809 -653702 -549893 -491287 -648670 -612682 -570389 -516729 -321945 -337123 -439367
632 -439367 -558234 -528311 -523332 -486122 -349863 -377593 -437426 -527452 -606417 -662319 -691443 -640087
620 -640087 -502881 -451641 -437508 -473546 -652180 -633768 -444734 -363796 -391638 -346497 -372846
609 -372846 -531289 -575769 -522375 -616017 -609588 -489939 -520851 -642003 -472950 -447769 -478108
598 -478108 -409075 -500443 -624096 -586510 -554917 -500757 -610499 -675137 -677931 -692475 -654961 -642148
586 -642148 -600065 -601532 -557920 -633648 -581747 -552019 -694428 -626952 -523546 -562500 -577664 -546155
574 -546155 -437201 -548706 -519099 -532737 -450811 -506540 -663311 -633089 -710588 -693788 -502995
563 -502995 -497883 -549235 -568012 -552752 -470962 -467313 -582065 -697997 -584939 -561464 -654210 -685572
551 -685572 -605436 -652667 -671466 -628046 -507592 -385913 -411388 -498421 -519693 -485495 -449866
540 -449866 -428555 -546440 -490294 -425572 -456165 -500896 -582942 -703959 -678110 -522478 -594522
529 -594522 -652751 -678281 -630736 -540883 -511430 -532759 -506781 -510064 -516181 -658644 -701456 -624223
517 -624223 -560477 -552853 -511977 -512292 -520385 -549331 -546650 -632716 -634486 -612495 -696648 -653753 -532199
504 -532199 -602972 -574500 -468494 -366503 -492649 -617464 -638502 -576694 -570687 -651148 -577438
493 -577438 -610904 -612472 -601086 -563281 -500796 -318211 -498517 -633790 -609130 -564155 -477642
482 -477642 -488941 -468981 -521115 -620272 -548580 -407898 -434179 -487876 -472043 -417932 -534712
471 -534712 -559973 -506905 -479390 -527229 -517083 -553679 -621259 -479600 -460015 -440451 -424679 -522659
459 -522659 -465761 -443377 -373639 -456362 -623286 -672152 -565284 -614143 -632523 -602751 -650094
448 -650094 -551201 -434562 -375472 -417959 -438587 -697605 -624577 -615297 -588382 -588117 -569273 -609475
436 -609475 -677767 -630190 -589707 -573623 -441594 -513631 -529918 -435200 -535896 -564764 -494264
425 -494264 -520068 -580740 -504776 -392192 -379526 -511581 -522808 -519063 -566742 -528542 -579649 -513191
413 -513191 -566740 -699605 -671247 -679303 -693864 -698363 -612315 -618668 -641795 -528588 -463552 -394638
401 -394638 -418477 -497887 -520460 -562919 -624268 -700034 -607779 -489474 -540095 -669899 -639058
390 -639058 -614759 -516963 -537937 -618110 -649875 -653701 -588650 -464138 -437481 -416275 -524831 -482769
378 -482769 -554079 -639043 -598581 -667462 -611399 -423788 -423475 -476997 -448171 -560868 -575949 -614883
366 -614883 -471409 -440355 -507944 -566968 -592719 -536621 -473602 -571349 -469107 -484171 -505563
355 -505563 -395704 -363860 -386363 -353550 -498154 -422323 -304093 -296988 -452027 -591790 -521896
344 -521896 -452919 -516104 -563876 -547740 -579628 -493973 -545984 -600780 -769307 -595041 -471809
333 -471809 -508216 -561969 -558651 -469133 -499104 -518634 -539188 -461636 -447710 -454628 -512767 -640035
321 -640035 -642177 -767821 -567004 -526235 -376453 -344097 -434576 -442437 -457605 -591462 -623948
310 -623948 -591126 -469123 -519341 -600706 -571602 -536784 -435180 -502937 -546154 -567373 -584904
299 -584904 -627555 -503330 -357188 -300228 -541422 -536656 -494197 -506690 -498138 -515979 -457611 -332199
287 -332199 -335490 -480148 -498472 -512088 -443357 -488839 -482074 -481045 -513790 -550891 -596977 -636128
275 -636128 -618114 -511107 -515090 -479929 -533480 -535461 -666583 -722245 -640852 -535472 -573650 -661184
263 -661184 -641835 -583798 -485673 -479765 -484920 -553876 -484798 -426590 -629238 -655295 -534861 -534032
251 -534032 -389987 -461118 -491758 -513196 -589515 -585453 -539468 -633516 -571284 -502027 -443973 -502493
239 -502493 -570885 -681010 -610836 -485009 -600804 -627014 -703687 -753922 -820458 -640927 -596789
228 -596789 -587717 -577177 -625124 -557255 -523581 -644586 -621518 -572425 -587346 -586107 -490566 -521887
216 -521887 -684018 -670072 -526061 -553408 -501889 -368942 -378886 -478036 -596982 -631054 -470056
205 -470056 -522385 -574035 -528847 -404536 -403564 -636740 -586513 -544481 -567357 -623625 -652303 -533340
193 -533340 -579307 -528741 -536207 -614943 -660883 -592375 -439167 -487619 -587939 -510162 -543326 -567260
181 -567260 -696298 -713603 -596456 -514238 -505014 -443138 -502289 -589488 -548043 -554361 -447193 -454340
169 -454340 -489604 -537880 -485676 -547459 -670959 -607364 -611440 -552044 -513530 -484869 -581011 -664458
157 -664458 -588503 -688272 -739201 -757737 -661193 -738287 -745846 -673925 -729042 -628661 -587029 -541114
145 -541114 -540928 -516082 -427699 -592016 -597828 -573037 -639595 -656248 -615463 -553131 -572318 -609749
133 -609749 -483820 -507024 -535502 -579034 -532899 -506246 -542110 -548946 -610549 -684467 -630413 -621276
121 -621276 -602089 -528976 -478296 -511037 -527974 -566145 -553101 -534543 -605953 -601464 -554849 -488314
109 -488314 -519641 -494350 -503580 -713525 -721221 -691962 -623577 -583248 -603789 -576646 -624737 -683706
97 -683706 -677072 -614748 -611688 -611789 -648465 -523990 -547025 -617810 -729262 -676021 -605925 -625717
85 -625717 -582483 -651480 -658411 -699570 -690295 -693955 -679325 -659843 -642097 -701847 -674869 -611640 -720887
72 -720887 -782290 -716045 -665358 -659917 -634968 -597468 -640899 -618932 -649184 -721433 -742267 -672505
60 -672505 -692379 -755313 -779087 -778186 -709305 -628163 -696395 -698675 -554755 -647977 -624381 -591705
48 -591705 -544309 -638739 -703050 -675778 -604962 -594942 -574386 -562581 -586259 -639695 -604696 -645711
36 -645711 -728432 -714567 -714094 -756177 -742143 -687580 -621340 -667276 -774649 -706045 -652089 -686663
24 -686663 -604589 -583501 -614957 -723498 -803227 -772315 -651211 -584495 -623338 -623800 -565511 -631630
12 -631630 -710620 -741423 -777983 -786484 -811087 -669469 -682008 -828127 -791710 -723906 -728886 -766431
0 -766431
$$ Imaginary data points
##PAGE= N=2
##DATA TABLE= (X++(I..I)), XYDATA
16383 -2933721 -2850928 -2826865 -2853774 -2750474 -2724415 -2717882 -2737701 -2637972 -2651756 -2593740 -2536145
16372 -2536145 -2463734 -2370188 -2399788 -2316939 -2198392 -2242488 -2241247 -2169750 -2218078 -2200374 -2090508
16361 -2090508 -2001754 -1970287 -2006858 -1980822 -1919198 -1847538 -1818569 -1643316 -1673892 -1722733 -1693390
16350 -1693390 -1636323 -1613405 -1528366 -1441558 -1487956 -1485209 -1502048 -1386116 -1255213 -1287504 -1291192
16339 -1291192 -1119840 -1152458 -1127210 -995711 -935263 -903942 -916256 -983085 -1015725 -939016 -874789
16328 -874789 -839924 -788189 -790246 -683145 -629863 -637878 -574894 -493169 -579105 -542373 -524620 -456310
16316 -456310 -349225 -228376 -279722 -352834 -388420 -366330 -222369 -92172 -92049 -26886 59134
16305 59134 42459 99222 115985 80198 156739 242479 259128 230735 230538 332000 411738 443067
16293 443067 477512 517470 566974 581787 547234 558155 616913 649837 779313 772784 744345
16282 744345 852024 782489 715529 771219 808856 902122 993412 959321 917254 899838 974236
16271 974236 959937 1124147 1186605 1148945 1103311 1079495 1189392 1214980 1229795 1269131 1344527
16260 1344527 1363312 1310129 1364509 1413388 1437392 1506511 1598716 1539573 1512249 1493682 1567332
16249 1567332 1657054 1583347 1598211 1696628 1710177 1669093 1692500 1706035 1696258 1759345 1795517
16238 1795517 1776127 1808628 1835315 1833516 1793792 1848488 1971461 1953273 1986885 1942043 1953541
16227 1953541 2011159 2076346 2164121 2157816 2194703 2075188 2042764 2221311 2203845 2275742 2273028
16216 2273028 2223261 2277158 2313399 2280247 2279339 2294640 2219388 2331136 2407368 2386633 2398070
16205 2398070 2369612 2367692 2451432 2382398 2594527 2608343 2680861 2644989 2545278 2625620 2544498
16194 2544498 2451692 2418173 2569184 2583831 2597254 2639879 2521719 2574470 2765818 2816733 2854907
16183 2854907 2790301 2680040 2734609 2782846 2758693 2816236 2745711 2798165 2820944 2794505 2889593
16172 2889593 2944429 2948975 2997153 2922405 2903718 2885817 2780589 2762380 2824282 2785972 2818278
16161 2818278 2814661 2896007 3058269 3151768 3084353 3105132 3038249 2989005 3130111 3057348 3066038
16150 3066038 2986843 2968093 2955423 2985605 3035995 3109378 3143428 3218441 3177600 3099221 3154024
16139 3154024 3219508 3259472 3243666 3129271 3112718 3041997 3142409 3125375 3047709 3137302 3215529
16128 3215529 3276210 3215019 3199548 3195166 3198047 3186249 3016670 3002632 3217009 3202269 3167924
16117 3167924 3082953 3076758 3218711 3345938 3358548 3297737 3231184 3288843 3342361 3137573 3188034
16106 3188034 3292168 3288615 3178295 3228580 3327429 3312928 3380358 3357079 3334333 3345174 3291473
16095 3291473 3170094 3145960 3246366 3280214 3259989 3391239 3311948 3224090 3322669 3228819 3201909
16084 3201909 3228397 3280039 3344955 3332047 3283764 3235985 3378310 3448903 3290685 3242372 3198183
16073 3198183 3289237 3313532 3274011 3286469 3341550 3379230 3398519 3437885 3331570 3306305 3430439
16062 3430439 3326609 3323417 3402397 3396584 3378989 3318323 3350672 3231854 3148407 3299614 3309627
16051 3309627 3247417 3305489 3331473 3374494 3366276 3470374 3352191 3396894 3229091 3305057 3393430
16040 3393430 3450139 3367596 3271817 3242723 3308594 3486996 3275981 3406505 3439006 3320721
16030 3320721 3256813 3215084 3237902 3285267 3329185 3279495 3322785 3293905 3274428 3285231 3363539
16019 3363539 3476623 3472788 3406289 3427715 3343474 3400661 3464866 3392730 3311883 3288834 3280960
16008 3280960 3325239 3435496 3428484 3416940 3378874 3365267 3307569 3224871 3261742 3410339 3468642
15997 3468642 3269631 3329055 3393823 3441578 3460672 3404716 3452238 3374276 3396916 3483188 3509891
15986 3509891 3425955 3444432 3317530 3468750 3468892 3355776 3326855 3409200 3499919 3539822 3486068
15975 3486068 3474058 3458052 3352060 3407300 3479517 3424856 3407354 3450717 3375983 3354469 3404782
15964 3404782 3442698 3454824 3478253 3393868 3342410 3443983 3457155 3547300 3467583 3370117 3287343
15953 3287343 3418997 3317529 3283829 3436664 3533045 3551835 3460499 3323917 3347411 3314901
15943 3314901 3417027 3414039 3405137 3595975 3557906 3497960 3417886 3424572 3337774 3362621 3347873
15932 3347873 3432387 3467345 3413596 3401212 3445813 3459597 3367461 3325427 3516963 3567511 3495882
15921 3495882 3560989 3433534 3411250 3486412 3546676 3447499 3461684 3570985 3411832 3432883 3424272
15910 3424272 3564888 3418735 3580478 3699546 3604662 3514448 3405110 3378901 3416605 3453034
15900 3453034 3412167 3464843 3491447 3407111 3383360 3351794 3307101 3330062 3408724 3472416 3325665
15889 3325665 3317681 3223490 3293820 3337120 3315285 3473465 3606902 3605773 3408850 3435296 3584240
15878 3584240 3561878 3493254 3486493 3397928 3482830 3479934 3471540 3503009 3456165 3533091 3506089 3483814
15866 3483814 3420109 3334252 3410887 3452688 3506345 3480553 3380071 3596828 3546248 3437434 3463232
15855 3463232 3379572 3420111 3436240 3382909 3410765 3459918 3464512 3430074 3340452 3378561 3428323
15844 3428323 3331309 3379650 3394729 3425103 3481729 3432851 3460326 3489389 3407269 3375136 3474408
15833 3474408 3452695 3517448 3413099 3339819 3459984 3463136 3338542 3364733 3387512 3517411 3494713
15822 3494713 3433358 3373567 3411521 3540898 3526933 3454789 3362006 3387677 3350864 3454954 3516218
15811 3516218 3561064 3527288 3471645 3373667 3491904 3391622 3440101 3371018 3366469 3371433 3477289
15800 3477289 3462312 3462479 3434569 3488510 3511678 3328657 3423927 3446014 3442671 3482864 3423065 3464352
15788 3464352 3368738 3254143 3348180 3487170 3473030 3426567 3615135 3646009 3544141 3519260
15778 3519260 3476634 3423524 3532758 3591305 3585545 3592629 3601593 3467455 3394787 3453737 3491917
15767 3491917 3524167 3514076 3316144 3347491 3316684 3341910 3301337 3539887 3594875 3575915 3635577
15756 3635577 3573727 3530142 3490433 3396289 3452718 3442400 3556157 3698523 3558453 3453108
15746 3453108 3542771 3648882 3657376 3587923 3528731 3539117 3503980 3524179 3453351 3405378 3474019
15735 3474019 3462172 3388800 3453676 3575185 3562881 3511889 3569382 3581390 3454589 3376368 3447859
15724 3447859 3526242 3545122 3593676 3463124 3430021 3522522 3489424 3463209 3495647 3405244 3433435
15713 3433435 3670813 3615748 3521639 3477702 3459919 3451887 3491194 3493822 3503216 3564627 3483472 3533461
15701 3533461 3457958 3415427 3454444 3421622 3447674 3472426 3575200 3537698 3456463 3422167 3449971
15690 3449971 3445052 3481372 3433659 3418953 3418709 3468061 3408628 3491206 3508836 3632385 3567870 3391712
15678 3391712 3491117 3539669 3333237 3354763 3420824 3412179 3391597 3390664 3322599 3479032 3626840
15667 3626840 3646575 3648565 3569872 3566602 3617920 3513901 3490078 3452193 3502094 3543270 3477621
15656 3477621 3514463 3412416 3564610 3607035 3553194 3513896 3590576 3559875 3611239 3574223 3608255
15645 3608255 3635642 3539801 3650142 3744416 3617079 3518327 3671784 3630899 3603599 3491330
15635 3491330 3515843 3539175 3590085 3588296 3508538 3506871 3402636 3504894 3482414 3551304 3640012
15624 3640012 3657010 3629939 3755585 3739815 3488122 3394484 3600230 3673700 3615837 3517683 3617049
15613 3617049 3576023 3501233 3511366 3557072 3558904 3652063 3563953 3499021 3465015 3627056 3632384
15602 3632384 3516730 3475268 3483695 3438733 3380963 3360059 3431055 3661411 3681273 3603624 3562474
15591 3562474 3674124 3576071 3504804 3520875 3461177 3515879 3520450 3573037 3656335 3516147 3579236
15580 3579236 3655327 3511501 3510559 3563243 3397841 3470250 3445523 3482917 3567248 3588960 3555043
15569 3555043 3615396 3621451 3614436 3619585 3529877 3402832 3498254 3465302 3457024 3560818 3603808 3609872
15557 3609872 3566981 3407610 3397111 3527678 3413057 3246218 3365595 3392957 3497008 3588101
15547 3588101 3539339 3573530 3600741 3515454 3394793 3392783 3500812 3530072 3339303 3410144 3594514
15536 3594514 3549504 3532810 3628986 3598525 3490841 3460083 3360588 3370303 3484338 3534661 3520748
15525 3520748 3485709 3533506 3579833 3645580 3751926 3788228 3720253 3582548 3464821 3522995 3428277
15514 3428277 3451791 3518659 3428834 3494450 3676888 3691407 3710772 3614496 3716305 3562595 3588530
15503 3588530 3571457 3544149 3708720 3578286 3468808 3549046 3491853 3473268 3487199 3434446 3480731
15492 3480731 3392178 3560331 3744791 3694901 3628153 3555338 3676750 3738602 3590320 3577632
15482 3577632 3624833 3644133 3631315 3657808 3600950 3563778 3646819 3580862 3650465 3662425 3579745
15471 3579745 3646341 3683896 3662926 3662426 3591676 3553786 3537434 3452016 3473381 3594694 3685713
15460 3685713 3773763 3609218 3501068 3525354 3617371 3620719 3583805 3648944 3533087 3695741 3604106
15449 3604106 3609954 3528401 3630042 3595297 3556491 3526289 3444007 3428747 3534675 3590406 3628685
15438 3628685 3608096 3500595 3643404 3644117 3476437 3494932 3602652 3580777 3477371 3478941 3481240
15427 3481240 3489659 3472871 3489607 3400800 3305035 3473375 3550924 3569186 3546541 3582329 3609445
15416 3609445 3517541 3630582 3742066 3652073 3737422 3750872 3703540 3754278 3624866 3448466
15406 3448466 3577914 3617310 3663670 3624584 3570650 3547705 3563079 3658377 3709832 3750589 3676121
15395 3676121 3525783 3537943 3488953 3483406 3462553 3545130 3687094 3631122 3586254 3637535 3675770
15384 3675770 3633033 3502122 3406791 3392226 3434461 3615631 3716924 3724368 3724526 3683114 3593921
15373 3593921 3431394 3393772 3406229 3542085 3534072 3494621 3486485 3591990 3629400 3579114 3558466
15362 3558466 3597393 3589906 3645907 3657456 3660872 3609643 3504709 3597924 3608818 3808617 3814153
15351 3814153 3651133 3555739 3561914 3640389 3778349 3600797 3361497 3585706 3604581 3558112
15341 3558112 3524996 3549884 3511991 3492107 3673257 3695812 3697576 3649191 3556509 3645893 3756727
15330 3756727 3722239 3661779 3691055 3668623 3622715 3711991 3702131 3687919 3566303 3567904 3635591
15319 3635591 3551177 3584804 3591435 3592875 3685949 3555888 3535039 3613351 3571771 3494777 3497685 3594102
15307 3594102 3575668 3652115 3621410 3475021 3539858 3599994 3754397 3541547 3518182 3688978
15297 3688978 3681174 3616844 3644059 3545374 3686656 3838547 3768570 3832838 3836762 3676482 3648522
15286 3648522 3636839 3591811 3737391 3768617 3690427 3630791 3751357 3590909 3581192 3593941 3569268
15275 3569268 3460570 3561233 3646825 3621252 3643522 3548971 3566612 3648539 3646319 3683705 3684596
15264 3684596 3660780 3664550 3615752 3576659 3594668 3735984 3638754 3660022 3694128 3625439 3508227
15253 3508227 3501200 3606115 3684074 3655935 3658819 3617932 3498651 3553529 3682560 3690238 3603323
15242 3603323 3644068 3631488 3646421 3644357 3591160 3610683 3712510 3598173 3657101 3691406 3616083
15231 3616083 3586004 3592423 3733231 3662076 3605323 3666653 3505737 3529920 3660488 3700668 3622153
15220 3622153 3554764 3610019 3660132 3655186 3691096 3776516 3861266 3909821 3742011 3625100 3635228
15209 3635228 3809742 3787768 3680581 3728637 3677885 3660883 3590155 3631541 3705426 3763371 3834305
15198 3834305 3677670 3740467 3660499 3587844 3595311 3625495 3692572 3668754 3523749 3514225 3573539
15187 3573539 3691641 3761795 3716876 3673749 3613030 3628700 3625629 3636936 3734111 3698848 3724442
15176 3724442 3690249 3600982 3581342 3537815 3589462 3559183 3577572 3551396 3521203 3549038 3573535
15165 3573535 3645698 3612868 3669605 3536766 3517140 3658088 3673209 3646320 3612451 3717654 3736723
15154 3736723 3659314 3629910 3689214 3612741 3611069 3603971 3660325 3638000 3654372 3713776 3722271 3609558
15142 3609558 3602395 3657896 3679083 3686634 3818182 3728403 3602840 3566170 3544321 3637356 3718280
15131 3718280 3664883 3815039 3769090 3615072 3715413 3744268 3593662 3688578 3657196 3661675 3733540
15120 3733540 3730776 3792038 3762663 3724174 3772170 3920336 3829040 3738047 3720180 3724127 3711084
15109 3711084 3717818 3672714 3742795 3753440 3681239 3680177 3723342 3679685 3836644 3723563 3637660
15098 3637660 3586715 3578737 3781503 3786266 3703137 3641241 3635028 3739330 3644741 3780617 3876391
15087 3876391 3820211 3739119 3626572 3638987 3636445 3699216 3804553 3805014 3940976 3791054 3686643
15076 3686643 3808201 3748929 3676259 3728185 3599996 3660714 3748775 3721318 3766526 3775492 3852642
15065 3852642 3819509 3608041 3681236 3730189 3717550 3674391 3728404 3748825 3658426 3658845 3653101 3822754
15053 3822754 3623738 3613240 3520525 3595206 3701060 3599202 3602752 3633863 3594428 3660214 3778756
15042 3778756 3810533 3758023 3736514 3784600 3762151 3672707 3659021 3795432 3761878 3704412 3882118
15031 3882118 3762426 3758535 3765491 3745590 3631427 3727844 3921963 3916077 3903895 3828276 3757698
15020 3757698 3725492 3659670 3783749 3846807 3749953 3699348 3780413 3759969 3849981 3847089 3889898
15009 3889898 3862162 3720857 3776331 3823074 3819372 3731828 3754474 3731412 3680913 3673593 3650976
14998 3650976 3607939 3580874 3618994 3600474 3587718 3676738 3755867 3763149 3945571 3880140 3716701
14987 3716701 3804741 3684395 3705783 3595097 3702058 3715407 3768807 3748357 3861936 3794171
14977 3794171 3695912 3674358 3759523 3706908 3727191 3806921 3782038 3825384 3868997 3988079 3967071
14966 3967071 3951065 3938444 3824887 3677467 3596587 3560261 3569195 3725585 3800969 3766881 3812232
14955 3812232 3772509 3751583 3736397 3887472 3781713 3776596 3761913 3648625 3789512 3917509
14945 3917509 3685569 3620874 3922974 3847529 3750450 3804840 3926700 3939857 3753824 3679758
14935 3679758 3769750 3811998 3762283 3689281 3679605 3679103 3792478 3755978 3644503 3634186 3796437
14924 3796437 3732807 3766729 3855327 3773547 3722328 3777249 3800858 3923483 3818803 3590131 3569791
14913 3569791 3604154 3770698 3788278 3789084 3750575 3660241 3627186 3716603 3677887 3738576 3693752
14902 3693752 3769808 3788047 3821649 3717492 3732707 3749445 3715442 3734794 3840886 3970181 3946971
14891 3946971 3799215 3795254 3844010 3775013 3799063 3907055 3944167 3942192 3805759 3952484 3883356
14880 3883356 3739205 3828740 3774742 3898631 3998961 3951349 3857641 3942152 3972191 3875152 3805427
14869 3805427 3796171 3794312 3705562 3640601 3535910 3592328 3682359 3622727 3613961 3606576 3644734 3625042
14857 3625042 3747282 3749092 3753210 3779347 3785253 3700363 3772417 3843166 3711033 3769859 3792760
14846 3792760 3808382 3780912 3722608 3725056 3673442 3771828 3829828 3812284 3816971 3796135 3868909 3829177
14834 3829177 3946020 3842179 3851867 3863035 3871077 3923244 3897300 3870633 3720090 3876358 3934706
14823 3934706 3905378 3852838 3784616 3779779 3891662 3724666 3724879 3837625 3898316 3908718 3814735
14812 3814735 3846012 3887111 3823920 3812570 3773913 3680895 3694660 3811816 3740400 3737907 3805605
14801 3805605 3813232 3843106 3788430 3862390 3857532 3777734 3773743 3827020 3990795 3986160 3904536 3973486
14789 3973486 3939072 3806252 3830217 3946369 4004240 3970155 3944761 3811223 3651609 3705310
14779 3705310 3719925 3748901 3815361 3864974 3856978 3771642 3749487 3796068 3711727 3679019 3815971
14768 3815971 3958148 3883241 3771732 3785168 3763761 3759596 3783358 3741289 3845844 3914806 3883667
14757 3883667 3982609 3763517 3692709 3903404 3778887 3693262 3835805 3776118 3824513 3914947
14747 3914947 4019077 3957807 3911231 3773764 3801124 3718677 3643854 3675030 3654274 3752664 3809492
14736 3809492 3602861 3477920 3692167 3723972 3724187 3741301 3688281 3643370 3877542 3834152 3702469
14725 3702469 3778222 3797578 3654730 3803951 3791192 3694614 3731212 3628990 3658879 3801461
14715 3801461 3848091 3955266 3905955 3918536 3927614 3927827 3853154 3911790 3906147 3782278 3704590 3687193
14703 3687193 3789777 3869699 3879432 3867986 3832868 3884791 3962911 3861030 3865497 3856985 3734220
14692 3734220 3806440 3879762 4037192 4044610 3930518 3895021 3955112 4029872 3842653 3757969 3793716
14681 3793716 3755796 3811579 3852774 3831084 3910632 3849924 3845240 3944579 3919523 3922765 3849856 3802830
14669 3802830 3883070 3912042 3902624 3821811 3964779 3917602 3881789 3877232 3853561 3955791 3946599
14658 3946599 4001829 4030459 3992871 3923632 3854209 3765128 3691986 3765460 3781802 3859395 3881175
14647 3881175 3771609 3805163 3911411 3895961 3837448 3754520 3810927 3936230 3865577 3702497
14637 3702497 3795802 3799273 3727100 3812311 3750239 3874180 3960984 3784574 3803444 3909171 3837434
14626 3837434 3779496 3867209 3918325 3958380 4019650 4021140 3993296 3982636 3965753 3906059 3937986
14615 3937986 4020041 3991134 4039184 4121820 4094948 3938253 3893500 3715340 3801111 3849341 3859814
14604 3859814 4004741 3895381 3890523 3952529 3852984 4046039 4077982 4000197 3923299 3962721 4004406
14593 4004406 4022741 4002668 3978197 4023601 3998523 4064191 3996491 3995183 3965122 3993136 3848874
14582 3848874 3911918 4014081 3989281 3981167 3930143 3883570 3864903 3905003 3931677 3837136 3846032
14571 3846032 3918905 3987811 3912206 3749681 3724482 3771875 3819058 3905986 3952508 3918184 3837753
14560 3837753 3823977 3737932 3835468 3830480 3927376 3973875 3899422 3922728 3975748 4007604 3829631
14549 3829631 3824542 3938220 3963390 3936229 4010607 3959277 3868228 3874605 3962208 3972329 3978098 3954181
14537 3954181 3775198 3879768 3974560 3911917 3984126 3918344 3836069 3772353 3867038 3901496 3922401
14526 3922401 3987220 3823991 3895333 3912468 3848402 3933121 3961816 3832758 3901503 3995748 4046849
14515 4046849 4060752 4093404 3978188 3896860 3941414 3992156 3952800 4047654 4107763 3994807 3924146
14504 3924146 3858531 3860514 3777394 3768321 3737655 3869574 3971491 3987043 3859578 3908686 3874191
14493 3874191 3874957 3853323 3896624 3935990 3901968 3997870 3952197 3881462 3932826 3982554 3997872 3901081
14481 3901081 3943947 3956993 3989433 4108940 4081757 3962274 3980215 4025106 4069019 4179013 4161156
14470 4161156 4126884 4074346 4227944 4155228 4093248 3949093 3873518 4020891 4032961 4000136 3932113
14459 3932113 4008742 3920226 3927065 3938399 3780673 3763540 3881220 3982609 3962315 4076875 4205033
14448 4205033 4081553 4044665 4103148 3915126 3928772 3959656 3927233 3952993 4028050 4102604 4037383
14437 4037383 4054829 4005739 3800072 3844079 3868883 3923022 3889441 3960927 4064684 4081620 3915471
14426 3915471 3764602 3927040 3934261 3788745 3705707 3874431 4006295 3987778 4088576 4135139
14416 4135139 4180760 4118204 4054583 4038485 3865329 3831381 3939218 3950486 3970811 3978856 4009329
14405 4009329 4077505 4020286 3874682 3792512 3884013 3886377 3869795 3895912 3884470 3862088 3796911
14394 3796911 3840396 3923264 3808581 3927069 4031398 3999679 3948595 4055593 3997986 4045160
14384 4045160 4207154 4257805 4216198 4109096 3955797 3977308 4061162 4024722 4089663 4078494 3993707
14373 3993707 4022550 3980366 3926586 3968484 4000343 3918863 4006068 3983686 3947296 3859866 3936240
$$ [...]
##END NTUPLES=NMR SPECTRUM
##END=
